module github.com/onosproject/onos-e2t

go 1.16

require (
	github.com/atomix/atomix-go-client v0.6.2
	github.com/atomix/atomix-go-framework v0.10.1
	github.com/cenkalti/backoff v2.2.1+incompatible
	github.com/envoyproxy/protoc-gen-validate v0.6.7
	github.com/gogo/protobuf v1.3.2
	github.com/google/uuid v1.2.0
	github.com/onosproject/helmit v0.6.19
	github.com/onosproject/onos-api/go v0.9.3
	github.com/onosproject/onos-e2-sm/servicemodels/e2sm_kpm_v2_go v0.8.6
	github.com/onosproject/onos-e2-sm/servicemodels/e2sm_rc_pre_go v0.8.6
	github.com/onosproject/onos-lib-go v0.8.15
	github.com/onosproject/onos-ric-sdk-go v0.8.8
	github.com/onosproject/onos-test v0.6.4
	github.com/prometheus/common v0.26.0
	github.com/stretchr/testify v1.7.0
	google.golang.org/grpc v1.41.0
	google.golang.org/protobuf v1.27.1
	gotest.tools v2.2.0+incompatible
	k8s.io/api v0.22.1
	k8s.io/apimachinery v0.22.1
	k8s.io/utils v0.0.0-20210707171843-4b05e18ac7d9
)

replace github.com/docker/docker => github.com/docker/engine v1.4.2-0.20200229013735-71373c6105e3
