module github.com/onosproject/onos-e2-sm/servicemodels/e2smkpmv2

go 1.16

require (
	github.com/envoyproxy/protoc-gen-validate v0.6.7
	github.com/gogo/protobuf v1.3.2
	github.com/onosproject/onos-api/go v0.7.110
	github.com/onosproject/onos-e2-sm/servicemodels/e2sm_kpm_v2_go v0.8.7
	github.com/onosproject/onos-lib-go v0.8.15
	google.golang.org/protobuf v1.27.1
	gotest.tools v2.2.0+incompatible
)
