EESchema Schematic File Version 4
EELAYER 30 0
EELAYER END
$Descr A4 11693 8268
encoding utf-8
Sheet 6 39
Title ""
Date ""
Rev ""
Comp ""
Comment1 ""
Comment2 ""
Comment3 ""
Comment4 ""
$EndDescr
$Comp
L POWDER_RF:MAAL-011078 U?
U 1 1 5E0A72B1
P 6100 3500
AR Path="/5E0A72B1" Ref="U?"  Part="1" 
AR Path="/5E073A72/5E0A72B1" Ref="U1001"  Part="1" 
AR Path="/5D562501/60655681/5E0A72B1" Ref="U?"  Part="1" 
AR Path="/5D587C46/60655681/5E0A72B1" Ref="U?"  Part="1" 
AR Path="/60664CFF/606A08BE/5E0A72B1" Ref="U?"  Part="1" 
F 0 "U1001" H 5850 4000 50  0000 R CNN
F 1 "MAAL-011078" H 5650 3000 50  0000 R CNN
F 2 "Package_DFN_QFN:DFN-8-1EP_2x2mm_P0.5mm_EP1.05x1.75mm" H 6100 3500 50  0001 C CNN
F 3 "" H 6100 3500 50  0001 C CNN
F 4 "M/A-Com Technology Solutions" H 6100 3500 50  0001 C CNN "Manufacturer"
F 5 "MAAL-011078-TR1000" H 6100 3500 50  0001 C CNN "PartNumber"
F 6 "3000-0000000077" H 6100 3500 50  0001 C CNN "PartSpecification"
	1    6100 3500
	-1   0    0    -1  
$EndComp
$Comp
L Device:C C?
U 1 1 5E0A72B7
P 8200 3750
AR Path="/5E0A72B7" Ref="C?"  Part="1" 
AR Path="/5E073A72/5E0A72B7" Ref="C1015"  Part="1" 
AR Path="/5D562501/60655681/5E0A72B7" Ref="C?"  Part="1" 
AR Path="/5D587C46/60655681/5E0A72B7" Ref="C?"  Part="1" 
AR Path="/60664CFF/606A08BE/5E0A72B7" Ref="C?"  Part="1" 
F 0 "C1015" H 8315 3796 50  0000 L CNN
F 1 "DNP" H 8315 3705 50  0000 L CNN
F 2 "Capacitor_SMD:C_0201_0603Metric" H 8238 3600 50  0001 C CNN
F 3 "~" H 8200 3750 50  0001 C CNN
	1    8200 3750
	1    0    0    -1  
$EndComp
$Comp
L Device:L L?
U 1 1 5E0A72BF
P 7950 3500
AR Path="/5E0A72BF" Ref="L?"  Part="1" 
AR Path="/5E073A72/5E0A72BF" Ref="L1005"  Part="1" 
AR Path="/5D562501/60655681/5E0A72BF" Ref="L?"  Part="1" 
AR Path="/5D587C46/60655681/5E0A72BF" Ref="L?"  Part="1" 
AR Path="/60664CFF/606A08BE/5E0A72BF" Ref="L?"  Part="1" 
F 0 "L1005" V 8140 3500 50  0000 C CNN
F 1 "0 ohms" V 8049 3500 50  0000 C CNN
F 2 "Inductor_SMD:L_0201_0603Metric" H 7950 3500 50  0001 C CNN
F 3 "~" H 7950 3500 50  0001 C CNN
F 4 "Delta Electronics/Cyntec" H 7950 3500 50  0001 C CNN "Manufacturer"
F 5 "PFR03S-000-XNH" H 7950 3500 50  0001 C CNN "PartNumber"
F 6 "3000-0000000141" H 7950 3500 50  0001 C CNN "PartSpecification"
	1    7950 3500
	0    -1   -1   0   
$EndComp
$Comp
L Device:L L?
U 1 1 5E0A72C7
P 7450 3500
AR Path="/5E0A72C7" Ref="L?"  Part="1" 
AR Path="/5E073A72/5E0A72C7" Ref="L1004"  Part="1" 
AR Path="/5D562501/60655681/5E0A72C7" Ref="L?"  Part="1" 
AR Path="/5D587C46/60655681/5E0A72C7" Ref="L?"  Part="1" 
AR Path="/60664CFF/606A08BE/5E0A72C7" Ref="L?"  Part="1" 
F 0 "L1004" V 7640 3500 50  0000 C CNN
F 1 "10pF" V 7549 3500 50  0000 C CNN
F 2 "Inductor_SMD:L_0201_0603Metric" H 7450 3500 50  0001 C CNN
F 3 "~" H 7450 3500 50  0001 C CNN
F 4 "Murata Electronics" H 7450 3500 50  0001 C CNN "Manufacturer"
F 5 "GJM0336C1E100GB01D" H 7450 3500 50  0001 C CNN "PartNumber"
F 6 "3000-0000000126" H 7450 3500 50  0001 C CNN "PartSpecification"
	1    7450 3500
	0    -1   -1   0   
$EndComp
$Comp
L Device:C C?
U 1 1 5E0A72CD
P 7700 3750
AR Path="/5E0A72CD" Ref="C?"  Part="1" 
AR Path="/5E073A72/5E0A72CD" Ref="C1014"  Part="1" 
AR Path="/5D562501/60655681/5E0A72CD" Ref="C?"  Part="1" 
AR Path="/5D587C46/60655681/5E0A72CD" Ref="C?"  Part="1" 
AR Path="/60664CFF/606A08BE/5E0A72CD" Ref="C?"  Part="1" 
F 0 "C1014" H 7815 3796 50  0000 L CNN
F 1 "DNP" H 7815 3705 50  0000 L CNN
F 2 "Capacitor_SMD:C_0201_0603Metric" H 7738 3600 50  0001 C CNN
F 3 "~" H 7700 3750 50  0001 C CNN
	1    7700 3750
	1    0    0    -1  
$EndComp
$Comp
L Device:C C?
U 1 1 5E0A72D5
P 7200 3750
AR Path="/5E0A72D5" Ref="C?"  Part="1" 
AR Path="/5E073A72/5E0A72D5" Ref="C1012"  Part="1" 
AR Path="/5D562501/60655681/5E0A72D5" Ref="C?"  Part="1" 
AR Path="/5D587C46/60655681/5E0A72D5" Ref="C?"  Part="1" 
AR Path="/60664CFF/606A08BE/5E0A72D5" Ref="C?"  Part="1" 
F 0 "C1012" H 7315 3796 50  0000 L CNN
F 1 "0.6pF" H 7315 3705 50  0000 L CNN
F 2 "Capacitor_SMD:C_0201_0603Metric" H 7238 3600 50  0001 C CNN
F 3 "~" H 7200 3750 50  0001 C CNN
F 4 "Murata Electronics" H 7200 3750 50  0001 C CNN "Manufacturer"
F 5 "GJM0335C1HR60WB01D" H 7200 3750 50  0001 C CNN "PartNumber"
F 6 "3000-0000000160" H 7200 3750 50  0001 C CNN "PartSpecification"
	1    7200 3750
	1    0    0    -1  
$EndComp
$Comp
L Device:C C?
U 1 1 5E0A72DD
P 6950 3500
AR Path="/5E0A72DD" Ref="C?"  Part="1" 
AR Path="/5E073A72/5E0A72DD" Ref="C1011"  Part="1" 
AR Path="/5D562501/60655681/5E0A72DD" Ref="C?"  Part="1" 
AR Path="/5D587C46/60655681/5E0A72DD" Ref="C?"  Part="1" 
AR Path="/60664CFF/606A08BE/5E0A72DD" Ref="C?"  Part="1" 
F 0 "C1011" V 6698 3500 50  0000 C CNN
F 1 "2.4nH" V 6789 3500 50  0000 C CNN
F 2 "Capacitor_SMD:C_0201_0603Metric" H 6988 3350 50  0001 C CNN
F 3 "~" H 6950 3500 50  0001 C CNN
F 4 "Murata Electronics" H 6950 3500 50  0001 C CNN "Manufacturer"
F 5 "LQP03HQ2N4B02D" H 6950 3500 50  0001 C CNN "PartNumber"
F 6 "3000-0000000118" H 6950 3500 50  0001 C CNN "PartSpecification"
	1    6950 3500
	0    1    1    0   
$EndComp
$Comp
L power:GND #PWR?
U 1 1 5E0A72E3
P 8200 4000
AR Path="/5E0A72E3" Ref="#PWR?"  Part="1" 
AR Path="/5E073A72/5E0A72E3" Ref="#PWR?"  Part="1" 
AR Path="/5D562501/60655681/5E0A72E3" Ref="#PWR?"  Part="1" 
AR Path="/5D587C46/60655681/5E0A72E3" Ref="#PWR?"  Part="1" 
AR Path="/60664CFF/606A08BE/5E0A72E3" Ref="#PWR?"  Part="1" 
F 0 "#PWR?" H 8200 3750 50  0001 C CNN
F 1 "GND" H 8205 3827 50  0000 C CNN
F 2 "" H 8200 4000 50  0001 C CNN
F 3 "" H 8200 4000 50  0001 C CNN
	1    8200 4000
	1    0    0    -1  
$EndComp
Wire Wire Line
	8200 4000 8200 3900
$Comp
L power:GND #PWR?
U 1 1 5E0A72EA
P 7700 4000
AR Path="/5E0A72EA" Ref="#PWR?"  Part="1" 
AR Path="/5E073A72/5E0A72EA" Ref="#PWR?"  Part="1" 
AR Path="/5D562501/60655681/5E0A72EA" Ref="#PWR?"  Part="1" 
AR Path="/5D587C46/60655681/5E0A72EA" Ref="#PWR?"  Part="1" 
AR Path="/60664CFF/606A08BE/5E0A72EA" Ref="#PWR?"  Part="1" 
F 0 "#PWR?" H 7700 3750 50  0001 C CNN
F 1 "GND" H 7705 3827 50  0000 C CNN
F 2 "" H 7700 4000 50  0001 C CNN
F 3 "" H 7700 4000 50  0001 C CNN
	1    7700 4000
	1    0    0    -1  
$EndComp
$Comp
L power:GND #PWR?
U 1 1 5E0A72F0
P 7200 4000
AR Path="/5E0A72F0" Ref="#PWR?"  Part="1" 
AR Path="/5E073A72/5E0A72F0" Ref="#PWR?"  Part="1" 
AR Path="/5D562501/60655681/5E0A72F0" Ref="#PWR?"  Part="1" 
AR Path="/5D587C46/60655681/5E0A72F0" Ref="#PWR?"  Part="1" 
AR Path="/60664CFF/606A08BE/5E0A72F0" Ref="#PWR?"  Part="1" 
F 0 "#PWR?" H 7200 3750 50  0001 C CNN
F 1 "GND" H 7205 3827 50  0000 C CNN
F 2 "" H 7200 4000 50  0001 C CNN
F 3 "" H 7200 4000 50  0001 C CNN
	1    7200 4000
	1    0    0    -1  
$EndComp
Wire Wire Line
	7200 4000 7200 3900
Wire Wire Line
	6800 3500 6700 3500
Wire Wire Line
	7100 3500 7200 3500
Wire Wire Line
	7200 3600 7200 3500
Connection ~ 7200 3500
Wire Wire Line
	7200 3500 7300 3500
Wire Wire Line
	7600 3500 7700 3500
Wire Wire Line
	7700 3500 7700 3600
Connection ~ 7700 3500
Wire Wire Line
	7700 3500 7800 3500
Wire Wire Line
	7700 3900 7700 4000
Wire Wire Line
	8100 3500 8200 3500
Wire Wire Line
	8200 3500 8200 3600
Connection ~ 8200 3500
Wire Wire Line
	8200 3500 8500 3500
$Comp
L power:GND #PWR?
U 1 1 5E0A7305
P 6200 3950
AR Path="/5E0A7305" Ref="#PWR?"  Part="1" 
AR Path="/5E073A72/5E0A7305" Ref="#PWR?"  Part="1" 
AR Path="/5D562501/60655681/5E0A7305" Ref="#PWR?"  Part="1" 
AR Path="/5D587C46/60655681/5E0A7305" Ref="#PWR?"  Part="1" 
AR Path="/60664CFF/606A08BE/5E0A7305" Ref="#PWR?"  Part="1" 
F 0 "#PWR?" H 6200 3700 50  0001 C CNN
F 1 "GND" H 6205 3777 50  0000 C CNN
F 2 "" H 6200 3950 50  0001 C CNN
F 3 "" H 6200 3950 50  0001 C CNN
	1    6200 3950
	1    0    0    -1  
$EndComp
Wire Wire Line
	6200 3850 6200 3950
$Comp
L 000_PreferredParts:C_0_1uF C?
U 1 1 5E0A730E
P 6550 2300
AR Path="/5E0A730E" Ref="C?"  Part="1" 
AR Path="/5E073A72/5E0A730E" Ref="C1009"  Part="1" 
AR Path="/5D562501/60655681/5E0A730E" Ref="C?"  Part="1" 
AR Path="/5D587C46/60655681/5E0A730E" Ref="C?"  Part="1" 
AR Path="/60664CFF/606A08BE/5E0A730E" Ref="C?"  Part="1" 
F 0 "C1009" H 6665 2346 50  0000 L CNN
F 1 "C_0_1uF" H 6575 2200 50  0001 L CNN
F 2 "Capacitor_SMD:C_0402_1005Metric" H 6588 2150 50  0001 C CNN
F 3 "~" H 6550 2300 50  0001 C CNN
F 4 "Murata Electronics" H 6550 2300 50  0001 C CNN "Manufacturer"
F 5 "GRM155R62A104KE14D" H 6550 2300 50  0001 C CNN "PartNumber"
F 6 "0.1uF" H 6700 2200 50  0000 C CNN "DisplayValue"
F 7 "3000-0000000125" H 6550 2300 50  0001 C CNN "PartSpecification"
	1    6550 2300
	1    0    0    -1  
$EndComp
$Comp
L power:GND #PWR?
U 1 1 5E0A7314
P 6550 2600
AR Path="/5E0A7314" Ref="#PWR?"  Part="1" 
AR Path="/5E073A72/5E0A7314" Ref="#PWR?"  Part="1" 
AR Path="/5D562501/60655681/5E0A7314" Ref="#PWR?"  Part="1" 
AR Path="/5D587C46/60655681/5E0A7314" Ref="#PWR?"  Part="1" 
AR Path="/60664CFF/606A08BE/5E0A7314" Ref="#PWR?"  Part="1" 
F 0 "#PWR?" H 6550 2350 50  0001 C CNN
F 1 "GND" H 6555 2427 50  0000 C CNN
F 2 "" H 6550 2600 50  0001 C CNN
F 3 "" H 6550 2600 50  0001 C CNN
	1    6550 2600
	1    0    0    -1  
$EndComp
Wire Wire Line
	6550 2450 6550 2600
$Comp
L power:GND #PWR?
U 1 1 5E0A731B
P 6950 2600
AR Path="/5E0A731B" Ref="#PWR?"  Part="1" 
AR Path="/5E073A72/5E0A731B" Ref="#PWR?"  Part="1" 
AR Path="/5D562501/60655681/5E0A731B" Ref="#PWR?"  Part="1" 
AR Path="/5D587C46/60655681/5E0A731B" Ref="#PWR?"  Part="1" 
AR Path="/60664CFF/606A08BE/5E0A731B" Ref="#PWR?"  Part="1" 
F 0 "#PWR?" H 6950 2350 50  0001 C CNN
F 1 "GND" H 6955 2427 50  0000 C CNN
F 2 "" H 6950 2600 50  0001 C CNN
F 3 "" H 6950 2600 50  0001 C CNN
	1    6950 2600
	1    0    0    -1  
$EndComp
Wire Wire Line
	6950 2450 6950 2600
Wire Wire Line
	6550 2150 6550 2000
Wire Wire Line
	6550 2000 6950 2000
Wire Wire Line
	6950 2000 6950 2150
Wire Wire Line
	6200 2000 6550 2000
Connection ~ 6550 2000
$Comp
L 000_PreferredParts:C_10pF C?
U 1 1 5E0A7329
P 7400 2300
AR Path="/5E0A7329" Ref="C?"  Part="1" 
AR Path="/5E073A72/5E0A7329" Ref="C1013"  Part="1" 
AR Path="/5D562501/60655681/5E0A7329" Ref="C?"  Part="1" 
AR Path="/5D587C46/60655681/5E0A7329" Ref="C?"  Part="1" 
AR Path="/60664CFF/606A08BE/5E0A7329" Ref="C?"  Part="1" 
F 0 "C1013" H 7515 2346 50  0000 L CNN
F 1 "C_10pF" H 7425 2200 50  0000 L CNN
F 2 "Capacitor_SMD:C_0402_1005Metric" H 7438 2150 50  0001 C CNN
F 3 "~" H 7400 2300 50  0001 C CNN
F 4 "Murata Electronics" H 7400 2300 50  0001 C CNN "Manufacturer"
F 5 "GJM0336C1E100GB01D" H 7400 2300 50  0001 C CNN "PartNumber"
F 6 "3000-0000000582" H 7400 2300 50  0001 C CNN "PartSpecification"
	1    7400 2300
	1    0    0    -1  
$EndComp
$Comp
L power:GND #PWR?
U 1 1 5E0A732F
P 7400 2600
AR Path="/5E0A732F" Ref="#PWR?"  Part="1" 
AR Path="/5E073A72/5E0A732F" Ref="#PWR?"  Part="1" 
AR Path="/5D562501/60655681/5E0A732F" Ref="#PWR?"  Part="1" 
AR Path="/5D587C46/60655681/5E0A732F" Ref="#PWR?"  Part="1" 
AR Path="/60664CFF/606A08BE/5E0A732F" Ref="#PWR?"  Part="1" 
F 0 "#PWR?" H 7400 2350 50  0001 C CNN
F 1 "GND" H 7405 2427 50  0000 C CNN
F 2 "" H 7400 2600 50  0001 C CNN
F 3 "" H 7400 2600 50  0001 C CNN
	1    7400 2600
	1    0    0    -1  
$EndComp
Wire Wire Line
	7400 2450 7400 2600
Wire Wire Line
	7400 2000 7400 2150
Wire Wire Line
	7400 2000 6950 2000
Connection ~ 6950 2000
$Comp
L Device:R R?
U 1 1 5E0A733B
P 6200 2850
AR Path="/5E0A733B" Ref="R?"  Part="1" 
AR Path="/5E073A72/5E0A733B" Ref="R1002"  Part="1" 
AR Path="/5D562501/60655681/5E0A733B" Ref="R?"  Part="1" 
AR Path="/5D587C46/60655681/5E0A733B" Ref="R?"  Part="1" 
AR Path="/60664CFF/606A08BE/5E0A733B" Ref="R?"  Part="1" 
F 0 "R1002" H 6270 2896 50  0000 L CNN
F 1 "100" H 6270 2805 50  0000 L CNN
F 2 "Resistor_SMD:R_0402_1005Metric" V 6130 2850 50  0001 C CNN
F 3 "~" H 6200 2850 50  0001 C CNN
F 4 "Delta Electronics/Cyntec" H 6200 2850 50  0001 C CNN "Manufacturer"
F 5 "PFR05S-101-FNH" H 6200 2850 50  0001 C CNN "PartNumber"
F 6 "3000-0000000149" H 6200 2850 50  0001 C CNN "PartSpecification"
	1    6200 2850
	1    0    0    -1  
$EndComp
Wire Wire Line
	6200 3150 6200 3100
Wire Wire Line
	6200 2700 6200 2000
$Comp
L 000_PreferredParts:C_0_1uF C?
U 1 1 5E0A7345
P 4250 2300
AR Path="/5E0A7345" Ref="C?"  Part="1" 
AR Path="/5E073A72/5E0A7345" Ref="C1002"  Part="1" 
AR Path="/5D562501/60655681/5E0A7345" Ref="C?"  Part="1" 
AR Path="/5D587C46/60655681/5E0A7345" Ref="C?"  Part="1" 
AR Path="/60664CFF/606A08BE/5E0A7345" Ref="C?"  Part="1" 
F 0 "C1002" H 4365 2346 50  0000 L CNN
F 1 "C_0_1uF" H 4275 2200 50  0001 L CNN
F 2 "Capacitor_SMD:C_0402_1005Metric" H 4288 2150 50  0001 C CNN
F 3 "~" H 4250 2300 50  0001 C CNN
F 4 "Murata Electronics" H 4250 2300 50  0001 C CNN "Manufacturer"
F 5 "GRM155R62A104KE14D" H 4250 2300 50  0001 C CNN "PartNumber"
F 6 "0.1uF" H 4400 2200 50  0000 C CNN "DisplayValue"
F 7 "3000-0000000125" H 4250 2300 50  0001 C CNN "PartSpecification"
	1    4250 2300
	1    0    0    -1  
$EndComp
$Comp
L power:GND #PWR?
U 1 1 5E0A734B
P 4250 2600
AR Path="/5E0A734B" Ref="#PWR?"  Part="1" 
AR Path="/5E073A72/5E0A734B" Ref="#PWR?"  Part="1" 
AR Path="/5D562501/60655681/5E0A734B" Ref="#PWR?"  Part="1" 
AR Path="/5D587C46/60655681/5E0A734B" Ref="#PWR?"  Part="1" 
AR Path="/60664CFF/606A08BE/5E0A734B" Ref="#PWR?"  Part="1" 
F 0 "#PWR?" H 4250 2350 50  0001 C CNN
F 1 "GND" H 4255 2427 50  0000 C CNN
F 2 "" H 4250 2600 50  0001 C CNN
F 3 "" H 4250 2600 50  0001 C CNN
	1    4250 2600
	1    0    0    -1  
$EndComp
Wire Wire Line
	4250 2450 4250 2600
$Comp
L power:GND #PWR?
U 1 1 5E0A7352
P 4650 2600
AR Path="/5E0A7352" Ref="#PWR?"  Part="1" 
AR Path="/5E073A72/5E0A7352" Ref="#PWR?"  Part="1" 
AR Path="/5D562501/60655681/5E0A7352" Ref="#PWR?"  Part="1" 
AR Path="/5D587C46/60655681/5E0A7352" Ref="#PWR?"  Part="1" 
AR Path="/60664CFF/606A08BE/5E0A7352" Ref="#PWR?"  Part="1" 
F 0 "#PWR?" H 4650 2350 50  0001 C CNN
F 1 "GND" H 4655 2427 50  0000 C CNN
F 2 "" H 4650 2600 50  0001 C CNN
F 3 "" H 4650 2600 50  0001 C CNN
	1    4650 2600
	1    0    0    -1  
$EndComp
Wire Wire Line
	4650 2450 4650 2600
Wire Wire Line
	4250 2150 4250 2000
Wire Wire Line
	4250 2000 4650 2000
Wire Wire Line
	4650 2000 4650 2150
$Comp
L 000_PreferredParts:C_10pF C?
U 1 1 5E0A735E
P 5150 2300
AR Path="/5E0A735E" Ref="C?"  Part="1" 
AR Path="/5E073A72/5E0A735E" Ref="C1006"  Part="1" 
AR Path="/5D562501/60655681/5E0A735E" Ref="C?"  Part="1" 
AR Path="/5D587C46/60655681/5E0A735E" Ref="C?"  Part="1" 
AR Path="/60664CFF/606A08BE/5E0A735E" Ref="C?"  Part="1" 
F 0 "C1006" H 5265 2346 50  0000 L CNN
F 1 "C_10pF" H 5175 2200 50  0000 L CNN
F 2 "Capacitor_SMD:C_0402_1005Metric" H 5188 2150 50  0001 C CNN
F 3 "~" H 5150 2300 50  0001 C CNN
F 4 "Murata Electronics" H 5150 2300 50  0001 C CNN "Manufacturer"
F 5 "GJM0336C1E100GB01D" H 5150 2300 50  0001 C CNN "PartNumber"
F 6 "3000-0000000582" H 5150 2300 50  0001 C CNN "PartSpecification"
	1    5150 2300
	1    0    0    -1  
$EndComp
$Comp
L power:GND #PWR?
U 1 1 5E0A7364
P 5150 2600
AR Path="/5E0A7364" Ref="#PWR?"  Part="1" 
AR Path="/5E073A72/5E0A7364" Ref="#PWR?"  Part="1" 
AR Path="/5D562501/60655681/5E0A7364" Ref="#PWR?"  Part="1" 
AR Path="/5D587C46/60655681/5E0A7364" Ref="#PWR?"  Part="1" 
AR Path="/60664CFF/606A08BE/5E0A7364" Ref="#PWR?"  Part="1" 
F 0 "#PWR?" H 5150 2350 50  0001 C CNN
F 1 "GND" H 5155 2427 50  0000 C CNN
F 2 "" H 5150 2600 50  0001 C CNN
F 3 "" H 5150 2600 50  0001 C CNN
	1    5150 2600
	1    0    0    -1  
$EndComp
Wire Wire Line
	5150 2450 5150 2600
Wire Wire Line
	5150 2000 5150 2150
Wire Wire Line
	5150 2000 4650 2000
Connection ~ 4650 2000
$Comp
L Device:R R?
U 1 1 5E0A736E
P 5800 2700
AR Path="/5E0A736E" Ref="R?"  Part="1" 
AR Path="/5E073A72/5E0A736E" Ref="R1001"  Part="1" 
AR Path="/5D562501/60655681/5E0A736E" Ref="R?"  Part="1" 
AR Path="/5D587C46/60655681/5E0A736E" Ref="R?"  Part="1" 
AR Path="/60664CFF/606A08BE/5E0A736E" Ref="R?"  Part="1" 
F 0 "R1001" H 5870 2746 50  0000 L CNN
F 1 "DNP" H 5870 2655 50  0000 L CNN
F 2 "Resistor_SMD:R_0402_1005Metric" V 5730 2700 50  0001 C CNN
F 3 "~" H 5800 2700 50  0001 C CNN
	1    5800 2700
	1    0    0    -1  
$EndComp
Wire Wire Line
	5800 2000 5800 2550
Wire Wire Line
	5150 2000 5500 2000
Connection ~ 5150 2000
Wire Wire Line
	5800 2850 5800 3100
Wire Wire Line
	5800 3100 6200 3100
Connection ~ 6200 3100
Wire Wire Line
	6200 3100 6200 3000
$Comp
L Device:L L?
U 1 1 5E0A737D
P 5500 2650
AR Path="/5E0A737D" Ref="L?"  Part="1" 
AR Path="/5E073A72/5E0A737D" Ref="L1003"  Part="1" 
AR Path="/5D562501/60655681/5E0A737D" Ref="L?"  Part="1" 
AR Path="/5D587C46/60655681/5E0A737D" Ref="L?"  Part="1" 
AR Path="/60664CFF/606A08BE/5E0A737D" Ref="L?"  Part="1" 
F 0 "L1003" H 5553 2696 50  0000 L CNN
F 1 "2.7 nH" H 5553 2605 50  0000 L CNN
F 2 "Inductor_SMD:L_0201_0603Metric" H 5500 2650 50  0001 C CNN
F 3 "~" H 5500 2650 50  0001 C CNN
F 4 "Murata Electronics" H 5500 2650 50  0001 C CNN "Manufacturer"
F 5 "LQP03HQ2N7B02D" H 5500 2650 50  0001 C CNN "PartNumber"
F 6 "3000-0000000101" H 5500 2650 50  0001 C CNN "PartSpecification"
	1    5500 2650
	1    0    0    -1  
$EndComp
Wire Wire Line
	5500 2500 5500 2000
Connection ~ 5500 2000
Wire Wire Line
	5500 2000 5800 2000
Wire Wire Line
	5500 3500 5600 3500
$Comp
L Device:C C?
U 1 1 5E0A7387
P 5500 3750
AR Path="/5E0A7387" Ref="C?"  Part="1" 
AR Path="/5E073A72/5E0A7387" Ref="C1008"  Part="1" 
AR Path="/5D562501/60655681/5E0A7387" Ref="C?"  Part="1" 
AR Path="/5D587C46/60655681/5E0A7387" Ref="C?"  Part="1" 
AR Path="/60664CFF/606A08BE/5E0A7387" Ref="C?"  Part="1" 
F 0 "C1008" H 5615 3796 50  0000 L CNN
F 1 "DNP" H 5615 3705 50  0000 L CNN
F 2 "Capacitor_SMD:C_0201_0603Metric" H 5538 3600 50  0001 C CNN
F 3 "~" H 5500 3750 50  0001 C CNN
	1    5500 3750
	1    0    0    -1  
$EndComp
$Comp
L Device:C C?
U 1 1 5E0A738F
P 5250 3500
AR Path="/5E0A738F" Ref="C?"  Part="1" 
AR Path="/5E073A72/5E0A738F" Ref="C1007"  Part="1" 
AR Path="/5D562501/60655681/5E0A738F" Ref="C?"  Part="1" 
AR Path="/5D587C46/60655681/5E0A738F" Ref="C?"  Part="1" 
AR Path="/60664CFF/606A08BE/5E0A738F" Ref="C?"  Part="1" 
F 0 "C1007" V 4998 3500 50  0000 C CNN
F 1 "1.5pF" V 5089 3500 50  0000 C CNN
F 2 "Capacitor_SMD:C_0201_0603Metric" H 5288 3350 50  0001 C CNN
F 3 "~" H 5250 3500 50  0001 C CNN
F 4 "Murata Electronics" H 5250 3500 50  0001 C CNN "Manufacturer"
F 5 "GJM0335C1E1R5WB01D" H 5250 3500 50  0001 C CNN "PartNumber"
F 6 "3000-0000000147" H 5250 3500 50  0001 C CNN "PartSpecification"
	1    5250 3500
	0    1    1    0   
$EndComp
$Comp
L power:GND #PWR?
U 1 1 5E0A7395
P 5500 4000
AR Path="/5E0A7395" Ref="#PWR?"  Part="1" 
AR Path="/5E073A72/5E0A7395" Ref="#PWR?"  Part="1" 
AR Path="/5D562501/60655681/5E0A7395" Ref="#PWR?"  Part="1" 
AR Path="/5D587C46/60655681/5E0A7395" Ref="#PWR?"  Part="1" 
AR Path="/60664CFF/606A08BE/5E0A7395" Ref="#PWR?"  Part="1" 
F 0 "#PWR?" H 5500 3750 50  0001 C CNN
F 1 "GND" H 5505 3827 50  0000 C CNN
F 2 "" H 5500 4000 50  0001 C CNN
F 3 "" H 5500 4000 50  0001 C CNN
	1    5500 4000
	1    0    0    -1  
$EndComp
Wire Wire Line
	5500 4000 5500 3900
Wire Wire Line
	5500 3600 5500 3500
Connection ~ 5500 3500
Wire Wire Line
	5500 2800 5500 3500
Wire Wire Line
	5400 3500 5500 3500
$Comp
L Device:C C?
U 1 1 5E0A73A2
P 5000 3750
AR Path="/5E0A73A2" Ref="C?"  Part="1" 
AR Path="/5E073A72/5E0A73A2" Ref="C1005"  Part="1" 
AR Path="/5D562501/60655681/5E0A73A2" Ref="C?"  Part="1" 
AR Path="/5D587C46/60655681/5E0A73A2" Ref="C?"  Part="1" 
AR Path="/60664CFF/606A08BE/5E0A73A2" Ref="C?"  Part="1" 
F 0 "C1005" H 5115 3796 50  0000 L CNN
F 1 "0.5pF" H 5115 3705 50  0000 L CNN
F 2 "Capacitor_SMD:C_0201_0603Metric" H 5038 3600 50  0001 C CNN
F 3 "~" H 5000 3750 50  0001 C CNN
F 4 "Murata Electronics" H 5000 3750 50  0001 C CNN "Manufacturer"
F 5 "GJM0335C1HR50WB01D" H 5000 3750 50  0001 C CNN "PartNumber"
F 6 "3000-0000000143" H 5000 3750 50  0001 C CNN "PartSpecification"
	1    5000 3750
	1    0    0    -1  
$EndComp
$Comp
L power:GND #PWR?
U 1 1 5E0A73A8
P 5000 4000
AR Path="/5E0A73A8" Ref="#PWR?"  Part="1" 
AR Path="/5E073A72/5E0A73A8" Ref="#PWR?"  Part="1" 
AR Path="/5D562501/60655681/5E0A73A8" Ref="#PWR?"  Part="1" 
AR Path="/5D587C46/60655681/5E0A73A8" Ref="#PWR?"  Part="1" 
AR Path="/60664CFF/606A08BE/5E0A73A8" Ref="#PWR?"  Part="1" 
F 0 "#PWR?" H 5000 3750 50  0001 C CNN
F 1 "GND" H 5005 3827 50  0000 C CNN
F 2 "" H 5000 4000 50  0001 C CNN
F 3 "" H 5000 4000 50  0001 C CNN
	1    5000 4000
	1    0    0    -1  
$EndComp
Wire Wire Line
	5000 4000 5000 3900
Wire Wire Line
	5000 3600 5000 3500
Wire Wire Line
	5000 3500 5100 3500
$Comp
L Device:L L?
U 1 1 5E0A73B3
P 4250 3500
AR Path="/5E0A73B3" Ref="L?"  Part="1" 
AR Path="/5E073A72/5E0A73B3" Ref="L1001"  Part="1" 
AR Path="/5D562501/60655681/5E0A73B3" Ref="L?"  Part="1" 
AR Path="/5D587C46/60655681/5E0A73B3" Ref="L?"  Part="1" 
AR Path="/60664CFF/606A08BE/5E0A73B3" Ref="L?"  Part="1" 
F 0 "L1001" V 4440 3500 50  0000 C CNN
F 1 "0 ohms" V 4349 3500 50  0000 C CNN
F 2 "Inductor_SMD:L_0201_0603Metric" H 4250 3500 50  0001 C CNN
F 3 "~" H 4250 3500 50  0001 C CNN
F 4 "Delta Electronics/Cyntec" H 4250 3500 50  0001 C CNN "Manufacturer"
F 5 "PFR03S-000-XNH" H 4250 3500 50  0001 C CNN "PartNumber"
F 6 "3000-0000000141" H 4250 3500 50  0001 C CNN "PartSpecification"
	1    4250 3500
	0    -1   -1   0   
$EndComp
$Comp
L Device:C C?
U 1 1 5E0A73B9
P 4500 3750
AR Path="/5E0A73B9" Ref="C?"  Part="1" 
AR Path="/5E073A72/5E0A73B9" Ref="C1003"  Part="1" 
AR Path="/5D562501/60655681/5E0A73B9" Ref="C?"  Part="1" 
AR Path="/5D587C46/60655681/5E0A73B9" Ref="C?"  Part="1" 
AR Path="/60664CFF/606A08BE/5E0A73B9" Ref="C?"  Part="1" 
F 0 "C1003" H 4615 3796 50  0000 L CNN
F 1 "DNP" H 4615 3705 50  0000 L CNN
F 2 "Capacitor_SMD:C_0201_0603Metric" H 4538 3600 50  0001 C CNN
F 3 "~" H 4500 3750 50  0001 C CNN
	1    4500 3750
	1    0    0    -1  
$EndComp
$Comp
L Device:C C?
U 1 1 5E0A73BF
P 4000 3750
AR Path="/5E0A73BF" Ref="C?"  Part="1" 
AR Path="/5E073A72/5E0A73BF" Ref="C1001"  Part="1" 
AR Path="/5D562501/60655681/5E0A73BF" Ref="C?"  Part="1" 
AR Path="/5D587C46/60655681/5E0A73BF" Ref="C?"  Part="1" 
AR Path="/60664CFF/606A08BE/5E0A73BF" Ref="C?"  Part="1" 
F 0 "C1001" H 4115 3796 50  0000 L CNN
F 1 "DNP" H 4115 3705 50  0000 L CNN
F 2 "Capacitor_SMD:C_0201_0603Metric" H 4038 3600 50  0001 C CNN
F 3 "~" H 4000 3750 50  0001 C CNN
	1    4000 3750
	1    0    0    -1  
$EndComp
$Comp
L power:GND #PWR?
U 1 1 5E0A73C5
P 4500 4000
AR Path="/5E0A73C5" Ref="#PWR?"  Part="1" 
AR Path="/5E073A72/5E0A73C5" Ref="#PWR?"  Part="1" 
AR Path="/5D562501/60655681/5E0A73C5" Ref="#PWR?"  Part="1" 
AR Path="/5D587C46/60655681/5E0A73C5" Ref="#PWR?"  Part="1" 
AR Path="/60664CFF/606A08BE/5E0A73C5" Ref="#PWR?"  Part="1" 
F 0 "#PWR?" H 4500 3750 50  0001 C CNN
F 1 "GND" H 4505 3827 50  0000 C CNN
F 2 "" H 4500 4000 50  0001 C CNN
F 3 "" H 4500 4000 50  0001 C CNN
	1    4500 4000
	1    0    0    -1  
$EndComp
$Comp
L power:GND #PWR?
U 1 1 5E0A73CB
P 4000 4000
AR Path="/5E0A73CB" Ref="#PWR?"  Part="1" 
AR Path="/5E073A72/5E0A73CB" Ref="#PWR?"  Part="1" 
AR Path="/5D562501/60655681/5E0A73CB" Ref="#PWR?"  Part="1" 
AR Path="/5D587C46/60655681/5E0A73CB" Ref="#PWR?"  Part="1" 
AR Path="/60664CFF/606A08BE/5E0A73CB" Ref="#PWR?"  Part="1" 
F 0 "#PWR?" H 4000 3750 50  0001 C CNN
F 1 "GND" H 4005 3827 50  0000 C CNN
F 2 "" H 4000 4000 50  0001 C CNN
F 3 "" H 4000 4000 50  0001 C CNN
	1    4000 4000
	1    0    0    -1  
$EndComp
Wire Wire Line
	4000 4000 4000 3900
Wire Wire Line
	4000 3600 4000 3500
Wire Wire Line
	4000 3500 4100 3500
Wire Wire Line
	4400 3500 4500 3500
Wire Wire Line
	4500 3500 4500 3600
Connection ~ 4500 3500
Wire Wire Line
	4500 3500 4600 3500
Wire Wire Line
	4500 3900 4500 4000
$Comp
L Device:L L?
U 1 1 5E0A73DB
P 4750 3500
AR Path="/5E0A73DB" Ref="L?"  Part="1" 
AR Path="/5E073A72/5E0A73DB" Ref="L1002"  Part="1" 
AR Path="/5D562501/60655681/5E0A73DB" Ref="L?"  Part="1" 
AR Path="/5D587C46/60655681/5E0A73DB" Ref="L?"  Part="1" 
AR Path="/60664CFF/606A08BE/5E0A73DB" Ref="L?"  Part="1" 
F 0 "L1002" V 4940 3500 50  0000 C CNN
F 1 "47pF" V 4849 3500 50  0000 C CNN
F 2 "Inductor_SMD:L_0201_0603Metric" H 4750 3500 50  0001 C CNN
F 3 "~" H 4750 3500 50  0001 C CNN
F 4 "Murata Electronics" H 4750 3500 50  0001 C CNN "Manufacturer"
F 5 "GRM0335C1H470GA01D" H 4750 3500 50  0001 C CNN "PartNumber"
F 6 "3000-0000000161" H 4750 3500 50  0001 C CNN "PartSpecification"
	1    4750 3500
	0    -1   -1   0   
$EndComp
Wire Wire Line
	4900 3500 5000 3500
Connection ~ 5000 3500
Text Label 7000 2000 0    50   ~ 0
lna_v_bias
Text Label 5850 3100 0    50   ~ 0
lna_bias
Text Label 4000 3500 1    50   ~ 0
lna_matched_out
Text Label 5500 3350 1    50   ~ 0
lna_out
Text Label 5000 3500 1    50   ~ 0
lna_out_match_1
Text Label 4500 3500 1    50   ~ 0
lna_out_match_2
Text Label 6750 3500 1    50   ~ 0
lna_in
Text Label 7200 3500 1    50   ~ 0
lna_match_in_1
Text Label 7700 3500 1    50   ~ 0
lna_match_in_2
Text Label 8200 3500 1    50   ~ 0
lna_matched_in
$Comp
L power:GND #PWR?
U 1 1 5E0A73ED
P 6300 4000
AR Path="/5E0A73ED" Ref="#PWR?"  Part="1" 
AR Path="/5E073A72/5E0A73ED" Ref="#PWR?"  Part="1" 
AR Path="/5D562501/60655681/5E0A73ED" Ref="#PWR?"  Part="1" 
AR Path="/5D587C46/60655681/5E0A73ED" Ref="#PWR?"  Part="1" 
AR Path="/60664CFF/606A08BE/5E0A73ED" Ref="#PWR?"  Part="1" 
F 0 "#PWR?" H 6300 3750 50  0001 C CNN
F 1 "GND" H 6305 3827 50  0000 C CNN
F 2 "" H 6300 4000 50  0001 C CNN
F 3 "" H 6300 4000 50  0001 C CNN
	1    6300 4000
	1    0    0    -1  
$EndComp
Wire Wire Line
	6300 4000 6300 3900
$Comp
L power:GND #PWR?
U 1 1 5E0A73F4
P 6400 4050
AR Path="/5E0A73F4" Ref="#PWR?"  Part="1" 
AR Path="/5E073A72/5E0A73F4" Ref="#PWR?"  Part="1" 
AR Path="/5D562501/60655681/5E0A73F4" Ref="#PWR?"  Part="1" 
AR Path="/5D587C46/60655681/5E0A73F4" Ref="#PWR?"  Part="1" 
AR Path="/60664CFF/606A08BE/5E0A73F4" Ref="#PWR?"  Part="1" 
F 0 "#PWR?" H 6400 3800 50  0001 C CNN
F 1 "GND" H 6405 3877 50  0000 C CNN
F 2 "" H 6400 4050 50  0001 C CNN
F 3 "" H 6400 4050 50  0001 C CNN
	1    6400 4050
	1    0    0    -1  
$EndComp
Wire Wire Line
	6400 4050 6400 3950
$Comp
L power:GND #PWR?
U 1 1 5E0A73FB
P 6500 4100
AR Path="/5E0A73FB" Ref="#PWR?"  Part="1" 
AR Path="/5E073A72/5E0A73FB" Ref="#PWR?"  Part="1" 
AR Path="/5D562501/60655681/5E0A73FB" Ref="#PWR?"  Part="1" 
AR Path="/5D587C46/60655681/5E0A73FB" Ref="#PWR?"  Part="1" 
AR Path="/60664CFF/606A08BE/5E0A73FB" Ref="#PWR?"  Part="1" 
F 0 "#PWR?" H 6500 3850 50  0001 C CNN
F 1 "GND" H 6505 3927 50  0000 C CNN
F 2 "" H 6500 4100 50  0001 C CNN
F 3 "" H 6500 4100 50  0001 C CNN
	1    6500 4100
	1    0    0    -1  
$EndComp
Wire Wire Line
	6500 4100 6500 4000
$Comp
L power:GND #PWR?
U 1 1 5E0A7402
P 6100 3900
AR Path="/5E0A7402" Ref="#PWR?"  Part="1" 
AR Path="/5E073A72/5E0A7402" Ref="#PWR?"  Part="1" 
AR Path="/5D562501/60655681/5E0A7402" Ref="#PWR?"  Part="1" 
AR Path="/5D587C46/60655681/5E0A7402" Ref="#PWR?"  Part="1" 
AR Path="/60664CFF/606A08BE/5E0A7402" Ref="#PWR?"  Part="1" 
F 0 "#PWR?" H 6100 3650 50  0001 C CNN
F 1 "GND" H 6105 3727 50  0000 C CNN
F 2 "" H 6100 3900 50  0001 C CNN
F 3 "" H 6100 3900 50  0001 C CNN
	1    6100 3900
	1    0    0    -1  
$EndComp
Wire Wire Line
	6100 3900 6100 3800
$Comp
L power:GND #PWR?
U 1 1 5E0A7409
P 6000 3850
AR Path="/5E0A7409" Ref="#PWR?"  Part="1" 
AR Path="/5E073A72/5E0A7409" Ref="#PWR?"  Part="1" 
AR Path="/5D562501/60655681/5E0A7409" Ref="#PWR?"  Part="1" 
AR Path="/5D587C46/60655681/5E0A7409" Ref="#PWR?"  Part="1" 
AR Path="/60664CFF/606A08BE/5E0A7409" Ref="#PWR?"  Part="1" 
F 0 "#PWR?" H 6000 3600 50  0001 C CNN
F 1 "GND" H 6005 3677 50  0000 C CNN
F 2 "" H 6000 3850 50  0001 C CNN
F 3 "" H 6000 3850 50  0001 C CNN
	1    6000 3850
	1    0    0    -1  
$EndComp
Wire Wire Line
	6000 3850 6000 3750
$Comp
L 000_PreferredParts:C_1nF C?
U 1 1 5E0A7413
P 4650 2300
AR Path="/5E0A7413" Ref="C?"  Part="1" 
AR Path="/5E073A72/5E0A7413" Ref="C1004"  Part="1" 
AR Path="/5D562501/60655681/5E0A7413" Ref="C?"  Part="1" 
AR Path="/5D587C46/60655681/5E0A7413" Ref="C?"  Part="1" 
AR Path="/60664CFF/606A08BE/5E0A7413" Ref="C?"  Part="1" 
F 0 "C1004" H 4765 2346 50  0000 L CNN
F 1 "C_1nF" H 4765 2255 50  0000 L CNN
F 2 "Capacitor_SMD:C_0402_1005Metric" H 4688 2150 50  0001 C CNN
F 3 "~" H 4650 2300 50  0001 C CNN
F 4 "Wurth Electronics Inc." H 4650 2300 50  0001 C CNN "Manufacturer"
F 5 "885012205061" H 4650 2300 50  0001 C CNN "PartNumber"
F 6 "3000-0000000128" H 0   0   50  0001 C CNN "PartSpecification"
	1    4650 2300
	1    0    0    -1  
$EndComp
$Comp
L 000_PreferredParts:C_1nF C?
U 1 1 5E0A741B
P 6950 2300
AR Path="/5E0A741B" Ref="C?"  Part="1" 
AR Path="/5E073A72/5E0A741B" Ref="C1010"  Part="1" 
AR Path="/5D562501/60655681/5E0A741B" Ref="C?"  Part="1" 
AR Path="/5D587C46/60655681/5E0A741B" Ref="C?"  Part="1" 
AR Path="/60664CFF/606A08BE/5E0A741B" Ref="C?"  Part="1" 
F 0 "C1010" H 7065 2346 50  0000 L CNN
F 1 "C_1nF" H 7065 2255 50  0000 L CNN
F 2 "Capacitor_SMD:C_0402_1005Metric" H 6988 2150 50  0001 C CNN
F 3 "~" H 6950 2300 50  0001 C CNN
F 4 "Wurth Electronics Inc." H 6950 2300 50  0001 C CNN "Manufacturer"
F 5 "885012205061" H 6950 2300 50  0001 C CNN "PartNumber"
F 6 "3000-0000000128" H 0   0   50  0001 C CNN "PartSpecification"
	1    6950 2300
	1    0    0    -1  
$EndComp
$Comp
L Connector:TestPoint TP?
U 1 1 5E0A742B
P 5150 2000
AR Path="/5E0A742B" Ref="TP?"  Part="1" 
AR Path="/5E073A72/5E0A742B" Ref="TP1001"  Part="1" 
AR Path="/5D562501/60655681/5E0A742B" Ref="TP?"  Part="1" 
AR Path="/5D587C46/60655681/5E0A742B" Ref="TP?"  Part="1" 
AR Path="/60664CFF/606A08BE/5E0A742B" Ref="TP?"  Part="1" 
F 0 "TP1001" H 5208 2118 50  0000 L CNN
F 1 "TestPoint" H 5208 2027 50  0000 L CNN
F 2 "TestPoint:TestPoint_Pad_D1.0mm" H 5350 2000 50  0001 C CNN
F 3 "~" H 5350 2000 50  0001 C CNN
	1    5150 2000
	1    0    0    -1  
$EndComp
Text Label 5800 2150 0    50   ~ 0
VDD_LNA_meas
Wire Wire Line
	5800 2000 5800 1500
Wire Wire Line
	5800 1500 5700 1500
Connection ~ 5800 2000
Connection ~ 6200 2000
Text HLabel 5700 1500 0    50   Input ~ 0
VDD
Text HLabel 5700 1400 0    50   Input ~ 0
VBIAS
Wire Wire Line
	5700 1400 6200 1400
Wire Wire Line
	6200 1400 6200 2000
Text HLabel 8500 3500 2    50   Input ~ 0
RF_IN
Text HLabel 3500 3500 0    50   Output ~ 0
RF_OUT
Wire Wire Line
	3500 3500 4000 3500
Connection ~ 4000 3500
$Comp
L POWDER_Misc:LMT70 U601
U 1 1 605930D0
P 5750 5750
F 0 "U601" H 5900 5450 50  0000 L CNN
F 1 "LMT70" H 5850 6050 50  0000 L CNN
F 2 "Package_BGA:WLP-4_0.86x0.86mm_P0.4mm" H 6650 5375 50  0001 C CNN
F 3 "" H 5750 5750 50  0001 C CNN
F 4 "3000-0000001308" H 5750 5750 50  0001 C CNN "PartSpecification"
	1    5750 5750
	1    0    0    -1  
$EndComp
$Comp
L POWDER_PowerGlobals:+2V5_A #PWR?
U 1 1 605930D6
P 5750 5300
AR Path="/5D949534/605930D6" Ref="#PWR?"  Part="1" 
AR Path="/5D96ADB0/605930D6" Ref="#PWR?"  Part="1" 
AR Path="/5E073A72/605930D6" Ref="#PWR?"  Part="1" 
F 0 "#PWR?" H 5750 5150 50  0001 C CNN
F 1 "+2V5_A" H 5765 5473 50  0000 C CNN
F 2 "" H 5750 5300 50  0001 C CNN
F 3 "" H 5750 5300 50  0001 C CNN
	1    5750 5300
	1    0    0    -1  
$EndComp
Wire Wire Line
	5750 5400 5750 5350
$Comp
L 000_PreferredParts:C_1nF C606
U 1 1 605930DE
P 5000 5250
F 0 "C606" H 5115 5296 50  0000 L CNN
F 1 "C_1nF" H 5115 5205 50  0000 L CNN
F 2 "Capacitor_SMD:C_0402_1005Metric" H 5038 5100 50  0001 C CNN
F 3 "~" H 5000 5250 50  0001 C CNN
F 4 "3000-0000000128" H 5000 5250 50  0001 C CNN "PartSpecification"
	1    5000 5250
	1    0    0    -1  
$EndComp
$Comp
L 000_PreferredParts:C_10pF C605
U 1 1 605930E5
P 4500 5250
F 0 "C605" H 4615 5296 50  0000 L CNN
F 1 "C_10pF" H 4615 5205 50  0000 L CNN
F 2 "Capacitor_SMD:C_0402_1005Metric" H 4538 5100 50  0001 C CNN
F 3 "~" H 4500 5250 50  0001 C CNN
F 4 "3000-0000000582" H 4500 5250 50  0001 C CNN "PartSpecification"
	1    4500 5250
	1    0    0    -1  
$EndComp
$Comp
L POWDER_PowerGlobals:+2V5_A #PWR?
U 1 1 605930EB
P 5000 5000
AR Path="/5D949534/605930EB" Ref="#PWR?"  Part="1" 
AR Path="/5D96ADB0/605930EB" Ref="#PWR?"  Part="1" 
AR Path="/5E073A72/605930EB" Ref="#PWR?"  Part="1" 
F 0 "#PWR?" H 5000 4850 50  0001 C CNN
F 1 "+2V5_A" H 5015 5173 50  0000 C CNN
F 2 "" H 5000 5000 50  0001 C CNN
F 3 "" H 5000 5000 50  0001 C CNN
	1    5000 5000
	1    0    0    -1  
$EndComp
$Comp
L POWDER_PowerGlobals:+2V5_A #PWR?
U 1 1 605930F1
P 4500 5000
AR Path="/5D949534/605930F1" Ref="#PWR?"  Part="1" 
AR Path="/5D96ADB0/605930F1" Ref="#PWR?"  Part="1" 
AR Path="/5E073A72/605930F1" Ref="#PWR?"  Part="1" 
F 0 "#PWR?" H 4500 4850 50  0001 C CNN
F 1 "+2V5_A" H 4515 5173 50  0000 C CNN
F 2 "" H 4500 5000 50  0001 C CNN
F 3 "" H 4500 5000 50  0001 C CNN
	1    4500 5000
	1    0    0    -1  
$EndComp
$Comp
L power:GND #PWR?
U 1 1 605930F7
P 4500 5500
F 0 "#PWR?" H 4500 5250 50  0001 C CNN
F 1 "GND" H 4505 5327 50  0000 C CNN
F 2 "" H 4500 5500 50  0001 C CNN
F 3 "" H 4500 5500 50  0001 C CNN
	1    4500 5500
	1    0    0    -1  
$EndComp
$Comp
L power:GND #PWR?
U 1 1 605930FD
P 5000 5500
F 0 "#PWR?" H 5000 5250 50  0001 C CNN
F 1 "GND" H 5005 5327 50  0000 C CNN
F 2 "" H 5000 5500 50  0001 C CNN
F 3 "" H 5000 5500 50  0001 C CNN
	1    5000 5500
	1    0    0    -1  
$EndComp
Wire Wire Line
	5400 5750 5350 5750
Wire Wire Line
	5350 5750 5350 5350
Wire Wire Line
	5350 5350 5750 5350
Connection ~ 5750 5350
Wire Wire Line
	5750 5350 5750 5300
$Comp
L power:GND #PWR?
U 1 1 60593108
P 5750 6200
F 0 "#PWR?" H 5750 5950 50  0001 C CNN
F 1 "GND" H 5755 6027 50  0000 C CNN
F 2 "" H 5750 6200 50  0001 C CNN
F 3 "" H 5750 6200 50  0001 C CNN
	1    5750 6200
	1    0    0    -1  
$EndComp
Wire Wire Line
	5750 6200 5750 6100
Wire Wire Line
	5000 5500 5000 5400
Wire Wire Line
	5000 5100 5000 5000
Wire Wire Line
	4500 5000 4500 5100
Wire Wire Line
	4500 5400 4500 5500
Text HLabel 6200 5750 2    50   Output ~ 0
TEMP_SENSE
Wire Wire Line
	6200 5750 6100 5750
$Comp
L Mechanical:Heatsink HS?
U 1 1 62831161
P 7000 5000
AR Path="/5D96ADB0/62831161" Ref="HS?"  Part="1" 
AR Path="/5E073A72/62831161" Ref="HS601"  Part="1" 
F 0 "HS601" H 7000 5200 50  0000 C CNN
F 1 "Heatsink" H 7000 4950 50  0000 C CNN
F 2 "POWDER_Heatsink:ATS-CPX025025025-168-C1-R0" H 7012 5000 50  0001 C CNN
F 3 "~" H 7012 5000 50  0001 C CNN
F 4 "3000-0000000204" H 7000 5000 50  0001 C CNN "PartSpecification"
	1    7000 5000
	1    0    0    -1  
$EndComp
$EndSCHEMATC
