EESchema Schematic File Version 4
LIBS:updated_gpsdo_buffer-cache
EELAYER 29 0
EELAYER END
$Descr A4 11693 8268
encoding utf-8
Sheet 1 8
Title ""
Date ""
Rev ""
Comp ""
Comment1 ""
Comment2 ""
Comment3 ""
Comment4 ""
$EndDescr
$Comp
L Connector:Conn_Coaxial J2
U 1 1 5C4FA82E
P 5350 4750
F 0 "J2" H 5449 4726 50  0000 L CNN
F 1 "Conn_Coaxial" H 5449 4635 50  0000 L CNN
F 2 "RF:SMA_endlaunch_SD-73251-115" H 5350 4750 50  0001 C CNN
F 3 " ~" H 5350 4750 50  0001 C CNN
F 4 "Molex" H 0   0   50  0001 C CNN "Manufacturer"
F 5 "0732511150" H 0   0   50  0001 C CNN "PartNumber"
	1    5350 4750
	1    0    0    -1  
$EndComp
Text Label 5050 4750 2    50   ~ 0
ANT_INPUT
Wire Wire Line
	5100 4650 5100 4850
Connection ~ 5100 4850
Wire Wire Line
	5100 4850 5100 5050
Text Label 5050 4650 2    50   ~ 0
GND
Text Label 5050 4850 2    50   ~ 0
GND
Wire Wire Line
	5350 4950 5350 5050
$Comp
L power:GND #PWR?
U 1 1 5C4FACF5
P 5100 5050
F 0 "#PWR?" H 5100 4800 50  0001 C CNN
F 1 "GND" H 5105 4877 50  0000 C CNN
F 2 "" H 5100 5050 50  0001 C CNN
F 3 "" H 5100 5050 50  0001 C CNN
	1    5100 5050
	1    0    0    -1  
$EndComp
$Comp
L power:GND #PWR?
U 1 1 5C4FAD38
P 5350 5050
F 0 "#PWR?" H 5350 4800 50  0001 C CNN
F 1 "GND" H 5355 4877 50  0000 C CNN
F 2 "" H 5350 5050 50  0001 C CNN
F 3 "" H 5350 5050 50  0001 C CNN
	1    5350 5050
	1    0    0    -1  
$EndComp
Text Label 5050 4550 2    50   ~ 0
NMEA_TXD
Text Label 5050 4450 2    50   ~ 0
ENTER_ISP#
Text Label 5050 4350 2    50   ~ 0
SER_INPUT
Text Label 5050 4250 2    50   ~ 0
SER_OUTPUT
Wire Wire Line
	4550 4650 5100 4650
Wire Wire Line
	4550 4750 5150 4750
Wire Wire Line
	4550 4850 5100 4850
Wire Wire Line
	4550 4450 5050 4450
Wire Wire Line
	4550 4350 5050 4350
Wire Wire Line
	4550 4250 5050 4250
Wire Wire Line
	3250 4450 2750 4450
Text Label 2750 4250 0    50   ~ 0
GND
Text Label 2750 4450 0    50   ~ 0
LOCK_OK
Text Label 2750 4650 0    50   ~ 0
1PPS_IN
Text Label 2750 4750 0    50   ~ 0
5V_OUTPUT
Text Label 2750 4850 0    50   ~ 0
GND
Text Label 2750 4950 0    50   ~ 0
3.3V_VDD_IN
Wire Wire Line
	2700 4250 2700 4850
Wire Wire Line
	2700 4250 3250 4250
Wire Wire Line
	2700 4850 3250 4850
$Comp
L power:GND #PWR?
U 1 1 5C4FE0A4
P 2700 5450
F 0 "#PWR?" H 2700 5200 50  0001 C CNN
F 1 "GND" H 2705 5277 50  0000 C CNN
F 2 "" H 2700 5450 50  0001 C CNN
F 3 "" H 2700 5450 50  0001 C CNN
	1    2700 5450
	1    0    0    -1  
$EndComp
$Comp
L power:GND #PWR?
U 1 1 5C4FEBBF
P 950 5450
F 0 "#PWR?" H 950 5200 50  0001 C CNN
F 1 "GND" H 955 5277 50  0000 C CNN
F 2 "" H 950 5450 50  0001 C CNN
F 3 "" H 950 5450 50  0001 C CNN
	1    950  5450
	1    0    0    -1  
$EndComp
$Comp
L power:GND #PWR?
U 1 1 5C4FEF16
P 2350 5450
F 0 "#PWR?" H 2350 5200 50  0001 C CNN
F 1 "GND" H 2355 5277 50  0000 C CNN
F 2 "" H 2350 5450 50  0001 C CNN
F 3 "" H 2350 5450 50  0001 C CNN
	1    2350 5450
	1    0    0    -1  
$EndComp
$Sheet
S 6950 1550 900  750 
U 5C53436C
F0 "Buffer_Section_1" 50
F1 "Buffer_Section.sch" 50
F2 "NMEA_TXD" I L 6950 1700 50 
F3 "LOCK_OK" I L 6950 1850 50 
F4 "10MHz" I L 6950 2000 50 
F5 "1PPS" I L 6950 2150 50 
$EndSheet
$Comp
L power:+3.3V #PWR?
U 1 1 5C52A0BC
P 10400 2250
F 0 "#PWR?" H 10400 2100 50  0001 C CNN
F 1 "+3.3V" H 10415 2423 50  0000 C CNN
F 2 "" H 10400 2250 50  0001 C CNN
F 3 "" H 10400 2250 50  0001 C CNN
	1    10400 2250
	1    0    0    -1  
$EndComp
Wire Wire Line
	10300 2450 10400 2450
$Comp
L power:GND #PWR?
U 1 1 5C52A4C1
P 9500 3250
F 0 "#PWR?" H 9500 3000 50  0001 C CNN
F 1 "GND" H 9505 3077 50  0000 C CNN
F 2 "" H 9500 3250 50  0001 C CNN
F 3 "" H 9500 3250 50  0001 C CNN
	1    9500 3250
	1    0    0    -1  
$EndComp
Wire Wire Line
	9500 3050 9600 3050
Wire Wire Line
	10400 2250 10400 2450
Wire Wire Line
	9500 3050 9500 3250
Text Label 9050 2450 0    50   ~ 0
LOCK_OK
Text Label 9050 2750 0    50   ~ 0
LOCK_OK_1
Text Label 9050 4250 0    50   ~ 0
NMEA_TXD_1
Text Label 9050 2950 0    50   ~ 0
LOCK_OK_2
$Comp
L power:+3.3V #PWR?
U 1 1 5C54FA8A
P 10400 3750
F 0 "#PWR?" H 10400 3600 50  0001 C CNN
F 1 "+3.3V" H 10415 3923 50  0000 C CNN
F 2 "" H 10400 3750 50  0001 C CNN
F 3 "" H 10400 3750 50  0001 C CNN
	1    10400 3750
	1    0    0    -1  
$EndComp
Wire Wire Line
	10300 3950 10400 3950
$Comp
L power:GND #PWR?
U 1 1 5C54FA91
P 9500 4750
F 0 "#PWR?" H 9500 4500 50  0001 C CNN
F 1 "GND" H 9505 4577 50  0000 C CNN
F 2 "" H 9500 4750 50  0001 C CNN
F 3 "" H 9500 4750 50  0001 C CNN
	1    9500 4750
	1    0    0    -1  
$EndComp
Wire Wire Line
	9500 4550 9600 4550
Wire Wire Line
	9600 4050 9550 4050
Wire Wire Line
	9550 4050 9550 4150
Wire Wire Line
	9550 4150 9600 4150
Wire Wire Line
	9550 4650 10350 4650
Wire Wire Line
	10350 4650 10350 4450
Wire Wire Line
	10350 4450 10300 4450
Wire Wire Line
	10400 3750 10400 3950
Wire Wire Line
	9500 4550 9500 4750
Text Label 9050 3950 0    50   ~ 0
NMEA_TXD
Text Label 9050 4450 0    50   ~ 0
NMEA_TXD_2
Wire Wire Line
	10300 4550 10850 4550
Wire Wire Line
	10300 4350 10850 4350
Text Label 10850 3050 2    50   ~ 0
LOCK_OK_3
Wire Wire Line
	9050 2750 9600 2750
Wire Wire Line
	9050 2450 9600 2450
Wire Wire Line
	9050 3950 9600 3950
Wire Wire Line
	9050 4250 9600 4250
Text Label 10850 4550 2    50   ~ 0
NMEA_TXD_3
Text Label 10850 2850 2    50   ~ 0
LOCK_OK_4
Text Label 10850 4350 2    50   ~ 0
NMEA_TXD_4
$Sheet
S 6950 2600 900  750 
U 5C566284
F0 "Buffer_Section_2" 50
F1 "Buffer_Section.sch" 50
F2 "NMEA_TXD" I L 6950 2750 50 
F3 "LOCK_OK" I L 6950 2900 50 
F4 "10MHz" I L 6950 3050 50 
F5 "1PPS" I L 6950 3200 50 
$EndSheet
$Sheet
S 6950 3650 900  750 
U 5C5662B1
F0 "Buffer_Section_3" 50
F1 "Buffer_Section.sch" 50
F2 "NMEA_TXD" I L 6950 3800 50 
F3 "LOCK_OK" I L 6950 3950 50 
F4 "10MHz" I L 6950 4100 50 
F5 "1PPS" I L 6950 4250 50 
$EndSheet
$Sheet
S 6950 4700 900  750 
U 5C5662C4
F0 "Buffer_Section_4" 50
F1 "Buffer_Section.sch" 50
F2 "NMEA_TXD" I L 6950 4850 50 
F3 "LOCK_OK" I L 6950 5000 50 
F4 "10MHz" I L 6950 5150 50 
F5 "1PPS" I L 6950 5300 50 
$EndSheet
Wire Wire Line
	6950 1700 6450 1700
Wire Wire Line
	6950 1850 6450 1850
Text Label 6450 1700 0    50   ~ 0
NMEA_TXD_1
Text Label 6450 1850 0    50   ~ 0
LOCK_OK_1
Wire Wire Line
	6950 2750 6450 2750
Wire Wire Line
	6950 2900 6450 2900
Text Label 6450 2750 0    50   ~ 0
NMEA_TXD_2
Text Label 6450 2900 0    50   ~ 0
LOCK_OK_2
Wire Wire Line
	6950 3800 6450 3800
Wire Wire Line
	6950 3950 6450 3950
Text Label 6450 3800 0    50   ~ 0
NMEA_TXD_3
Text Label 6450 3950 0    50   ~ 0
LOCK_OK_3
Wire Wire Line
	6950 4850 6450 4850
Wire Wire Line
	6950 5000 6450 5000
Text Label 6450 4850 0    50   ~ 0
NMEA_TXD_4
Text Label 6450 5000 0    50   ~ 0
LOCK_OK_4
$Comp
L power:GND #PWR?
U 1 1 5C55509D
P 1950 5450
F 0 "#PWR?" H 1950 5200 50  0001 C CNN
F 1 "GND" H 1955 5277 50  0000 C CNN
F 2 "" H 1950 5450 50  0001 C CNN
F 3 "" H 1950 5450 50  0001 C CNN
	1    1950 5450
	1    0    0    -1  
$EndComp
$Comp
L Device:R_Small R1
U 1 1 5C55800E
P 1950 5150
F 0 "R1" H 2009 5196 50  0000 L CNN
F 1 "4.7k" H 2009 5105 50  0000 L CNN
F 2 "Resistors_SMD:R_0603_HandSoldering" H 1950 5150 50  0001 C CNN
F 3 "~" H 1950 5150 50  0001 C CNN
F 4 "Yageo" H 0   0   50  0001 C CNN "Manufacturer"
F 5 "RC0603JR-074K7L" H 0   0   50  0001 C CNN "PartNumber"
	1    1950 5150
	1    0    0    -1  
$EndComp
$Comp
L Jumper:Jumper_2_Open JP1
U 1 1 5C564FDD
P 3900 6150
F 0 "JP1" V 3854 6248 50  0000 L CNN
F 1 "Jumper_2_Open" V 3945 6248 50  0000 L CNN
F 2 "Pin_Headers:Pin_Header_Straight_1x02_Pitch2.54mm" H 3900 6150 50  0001 C CNN
F 3 "~" H 3900 6150 50  0001 C CNN
F 4 "Amphenol ICC (FCI)" H 0   0   50  0001 C CNN "Manufacturer"
F 5 "77311-118-02LF" H 0   0   50  0001 C CNN "PartNumber"
	1    3900 6150
	0    1    -1   0   
$EndComp
Wire Wire Line
	3900 5950 3900 5850
Text Label 3400 5850 0    50   ~ 0
ENTER_ISP#
Wire Wire Line
	3400 5850 3900 5850
$Comp
L power:GND #PWR?
U 1 1 5C56E910
P 3900 6450
F 0 "#PWR?" H 3900 6200 50  0001 C CNN
F 1 "GND" H 3905 6277 50  0000 C CNN
F 2 "" H 3900 6450 50  0001 C CNN
F 3 "" H 3900 6450 50  0001 C CNN
	1    3900 6450
	1    0    0    -1  
$EndComp
Wire Wire Line
	3900 6350 3900 6450
Wire Wire Line
	4550 4550 5050 4550
$Comp
L Connector_Generic:Conn_01x03 J1
U 1 1 5C5785AB
P 1350 1000
F 0 "J1" H 1430 1042 50  0000 L CNN
F 1 "Conn_01x03" H 1430 951 50  0000 L CNN
F 2 "Pin_Headers:Pin_Header_Straight_1x03_Pitch2.54mm" H 1350 1000 50  0001 C CNN
F 3 "~" H 1350 1000 50  0001 C CNN
F 4 "Amphenol ICC (FCI)" H 0   0   50  0001 C CNN "Manufacturer"
F 5 "77311-118-03LF" H 0   0   50  0001 C CNN "PartNumber"
	1    1350 1000
	1    0    0    1   
$EndComp
Wire Wire Line
	1150 900  650  900 
Wire Wire Line
	1150 1000 650  1000
Wire Wire Line
	1150 1100 1050 1100
Wire Wire Line
	1050 1100 1050 1200
$Comp
L power:GND #PWR?
U 1 1 5C584FB2
P 1050 1200
F 0 "#PWR?" H 1050 950 50  0001 C CNN
F 1 "GND" H 1055 1027 50  0000 C CNN
F 2 "" H 1050 1200 50  0001 C CNN
F 3 "" H 1050 1200 50  0001 C CNN
	1    1050 1200
	1    0    0    -1  
$EndComp
Text Label 650  900  0    50   ~ 0
SER_OUTPUT
Text Label 650  1000 0    50   ~ 0
SER_INPUT
$Comp
L Device:C_Small C4
U 1 1 5C59BB9E
P 8250 2650
AR Path="/5C59BB9E" Ref="C4"  Part="1" 
AR Path="/5C53436C/5C59BB9E" Ref="C?"  Part="1" 
AR Path="/5C536099/5C59BB9E" Ref="C?"  Part="1" 
AR Path="/5C566284/5C59BB9E" Ref="C?"  Part="1" 
AR Path="/5C5662B1/5C59BB9E" Ref="C?"  Part="1" 
AR Path="/5C5662C4/5C59BB9E" Ref="C?"  Part="1" 
F 0 "C4" H 8342 2696 50  0000 L CNN
F 1 "1uF" H 8342 2605 50  0000 L CNN
F 2 "Capacitors_SMD:C_0603_HandSoldering" H 8250 2650 50  0001 C CNN
F 3 "~" H 8250 2650 50  0001 C CNN
F 4 "Samsung Electro-Mechanics" H 0   0   50  0001 C CNN "Manufacturer"
F 5 "CL10A105KA8NNNC" H 0   0   50  0001 C CNN "PartNumber"
	1    8250 2650
	1    0    0    -1  
$EndComp
$Comp
L Device:C_Small C6
U 1 1 5C59BBA5
P 8600 2650
AR Path="/5C59BBA5" Ref="C6"  Part="1" 
AR Path="/5C53436C/5C59BBA5" Ref="C?"  Part="1" 
AR Path="/5C536099/5C59BBA5" Ref="C?"  Part="1" 
AR Path="/5C566284/5C59BBA5" Ref="C?"  Part="1" 
AR Path="/5C5662B1/5C59BBA5" Ref="C?"  Part="1" 
AR Path="/5C5662C4/5C59BBA5" Ref="C?"  Part="1" 
F 0 "C6" H 8692 2696 50  0000 L CNN
F 1 "10nF" H 8692 2605 50  0000 L CNN
F 2 "Capacitors_SMD:C_0603_HandSoldering" H 8600 2650 50  0001 C CNN
F 3 "~" H 8600 2650 50  0001 C CNN
F 4 "Samsung Electro-Mechanics" H 0   0   50  0001 C CNN "Manufacturer"
F 5 "CL10B103KB8NCNC" H 0   0   50  0001 C CNN "PartNumber"
	1    8600 2650
	1    0    0    -1  
$EndComp
Wire Wire Line
	8250 2550 8250 2450
Wire Wire Line
	8250 2850 8250 2750
$Comp
L power:+3.3V #PWR?
U 1 1 5C59BBAE
P 8250 2350
AR Path="/5C59BBAE" Ref="#PWR?"  Part="1" 
AR Path="/5C53436C/5C59BBAE" Ref="#PWR?"  Part="1" 
AR Path="/5C536099/5C59BBAE" Ref="#PWR?"  Part="1" 
AR Path="/5C566284/5C59BBAE" Ref="#PWR?"  Part="1" 
AR Path="/5C5662B1/5C59BBAE" Ref="#PWR?"  Part="1" 
AR Path="/5C5662C4/5C59BBAE" Ref="#PWR?"  Part="1" 
F 0 "#PWR?" H 8250 2200 50  0001 C CNN
F 1 "+3.3V" H 8265 2523 50  0000 C CNN
F 2 "" H 8250 2350 50  0001 C CNN
F 3 "" H 8250 2350 50  0001 C CNN
	1    8250 2350
	1    0    0    -1  
$EndComp
Wire Wire Line
	8250 2350 8250 2450
Connection ~ 8250 2450
$Comp
L power:GND #PWR?
U 1 1 5C59BBB6
P 8250 2950
AR Path="/5C59BBB6" Ref="#PWR?"  Part="1" 
AR Path="/5C53436C/5C59BBB6" Ref="#PWR?"  Part="1" 
AR Path="/5C536099/5C59BBB6" Ref="#PWR?"  Part="1" 
AR Path="/5C566284/5C59BBB6" Ref="#PWR?"  Part="1" 
AR Path="/5C5662B1/5C59BBB6" Ref="#PWR?"  Part="1" 
AR Path="/5C5662C4/5C59BBB6" Ref="#PWR?"  Part="1" 
F 0 "#PWR?" H 8250 2700 50  0001 C CNN
F 1 "GND" H 8255 2777 50  0000 C CNN
F 2 "" H 8250 2950 50  0001 C CNN
F 3 "" H 8250 2950 50  0001 C CNN
	1    8250 2950
	1    0    0    -1  
$EndComp
Wire Wire Line
	8250 2850 8250 2950
Connection ~ 8250 2850
Wire Wire Line
	8250 2450 8600 2450
Wire Wire Line
	8600 2850 8250 2850
Wire Wire Line
	8600 2750 8600 2850
Wire Wire Line
	8600 2450 8600 2550
$Comp
L Device:C_Small C5
U 1 1 5C5A3DD0
P 8250 4150
AR Path="/5C5A3DD0" Ref="C5"  Part="1" 
AR Path="/5C53436C/5C5A3DD0" Ref="C?"  Part="1" 
AR Path="/5C536099/5C5A3DD0" Ref="C?"  Part="1" 
AR Path="/5C566284/5C5A3DD0" Ref="C?"  Part="1" 
AR Path="/5C5662B1/5C5A3DD0" Ref="C?"  Part="1" 
AR Path="/5C5662C4/5C5A3DD0" Ref="C?"  Part="1" 
F 0 "C5" H 8342 4196 50  0000 L CNN
F 1 "1uF" H 8342 4105 50  0000 L CNN
F 2 "Capacitors_SMD:C_0603_HandSoldering" H 8250 4150 50  0001 C CNN
F 3 "~" H 8250 4150 50  0001 C CNN
F 4 "Samsung Electro-Mechanics" H 0   0   50  0001 C CNN "Manufacturer"
F 5 "CL10A105KA8NNNC" H 0   0   50  0001 C CNN "PartNumber"
	1    8250 4150
	1    0    0    -1  
$EndComp
$Comp
L Device:C_Small C7
U 1 1 5C5A3DD7
P 8600 4150
AR Path="/5C5A3DD7" Ref="C7"  Part="1" 
AR Path="/5C53436C/5C5A3DD7" Ref="C?"  Part="1" 
AR Path="/5C536099/5C5A3DD7" Ref="C?"  Part="1" 
AR Path="/5C566284/5C5A3DD7" Ref="C?"  Part="1" 
AR Path="/5C5662B1/5C5A3DD7" Ref="C?"  Part="1" 
AR Path="/5C5662C4/5C5A3DD7" Ref="C?"  Part="1" 
F 0 "C7" H 8692 4196 50  0000 L CNN
F 1 "10nF" H 8692 4105 50  0000 L CNN
F 2 "Capacitors_SMD:C_0603_HandSoldering" H 8600 4150 50  0001 C CNN
F 3 "~" H 8600 4150 50  0001 C CNN
F 4 "Samsung Electro-Mechanics" H 0   0   50  0001 C CNN "Manufacturer"
F 5 "CL10B103KB8NCNC" H 0   0   50  0001 C CNN "PartNumber"
	1    8600 4150
	1    0    0    -1  
$EndComp
Wire Wire Line
	8250 4050 8250 3950
Wire Wire Line
	8250 4350 8250 4250
$Comp
L power:+3.3V #PWR?
U 1 1 5C5A3DE0
P 8250 3850
AR Path="/5C5A3DE0" Ref="#PWR?"  Part="1" 
AR Path="/5C53436C/5C5A3DE0" Ref="#PWR?"  Part="1" 
AR Path="/5C536099/5C5A3DE0" Ref="#PWR?"  Part="1" 
AR Path="/5C566284/5C5A3DE0" Ref="#PWR?"  Part="1" 
AR Path="/5C5662B1/5C5A3DE0" Ref="#PWR?"  Part="1" 
AR Path="/5C5662C4/5C5A3DE0" Ref="#PWR?"  Part="1" 
F 0 "#PWR?" H 8250 3700 50  0001 C CNN
F 1 "+3.3V" H 8265 4023 50  0000 C CNN
F 2 "" H 8250 3850 50  0001 C CNN
F 3 "" H 8250 3850 50  0001 C CNN
	1    8250 3850
	1    0    0    -1  
$EndComp
Wire Wire Line
	8250 3850 8250 3950
Connection ~ 8250 3950
$Comp
L power:GND #PWR?
U 1 1 5C5A3DE8
P 8250 4450
AR Path="/5C5A3DE8" Ref="#PWR?"  Part="1" 
AR Path="/5C53436C/5C5A3DE8" Ref="#PWR?"  Part="1" 
AR Path="/5C536099/5C5A3DE8" Ref="#PWR?"  Part="1" 
AR Path="/5C566284/5C5A3DE8" Ref="#PWR?"  Part="1" 
AR Path="/5C5662B1/5C5A3DE8" Ref="#PWR?"  Part="1" 
AR Path="/5C5662C4/5C5A3DE8" Ref="#PWR?"  Part="1" 
F 0 "#PWR?" H 8250 4200 50  0001 C CNN
F 1 "GND" H 8255 4277 50  0000 C CNN
F 2 "" H 8250 4450 50  0001 C CNN
F 3 "" H 8250 4450 50  0001 C CNN
	1    8250 4450
	1    0    0    -1  
$EndComp
Wire Wire Line
	8250 4350 8250 4450
Connection ~ 8250 4350
Wire Wire Line
	8250 3950 8600 3950
Wire Wire Line
	8600 4350 8250 4350
Wire Wire Line
	8600 4250 8600 4350
Wire Wire Line
	8600 3950 8600 4050
$Comp
L GPSDO:SN74AC14-Q1 U2
U 1 1 5C5CB4E6
P 9950 2750
F 0 "U2" H 9950 3275 50  0000 C CNN
F 1 "SN74AC14-Q1" H 9950 3184 50  0000 C CNN
F 2 "GPSDO:SN74AC14-Q1" H 9950 2400 50  0001 C CNN
F 3 "" H 9950 2400 50  0001 C CNN
F 4 "Texas Instruments" H 0   0   50  0001 C CNN "Manufacturer"
F 5 "SN74AC14QPWRQ1" H 0   0   50  0001 C CNN "PartNumber"
	1    9950 2750
	1    0    0    -1  
$EndComp
$Comp
L GPSDO:SN74AC14-Q1 U3
U 1 1 5C5CB54C
P 9950 4250
F 0 "U3" H 9950 4775 50  0000 C CNN
F 1 "SN74AC14-Q1" H 9950 4684 50  0000 C CNN
F 2 "GPSDO:SN74AC14-Q1" H 9950 3900 50  0001 C CNN
F 3 "" H 9950 3900 50  0001 C CNN
F 4 "Texas Instruments" H 0   0   50  0001 C CNN "Manufacturer"
F 5 "SN74AC14QPWRQ1" H 0   0   50  0001 C CNN "PartNumber"
	1    9950 4250
	1    0    0    -1  
$EndComp
$Comp
L GPSDO:XO_GPSDO U1
U 1 1 5C5CD91E
P 3900 4600
F 0 "U1" H 3900 5175 50  0000 C CNN
F 1 "XO_GPSDO" H 3900 5084 50  0000 C CNN
F 2 "GPSDO:XO_GPSDO" H 4000 4250 50  0001 C CNN
F 3 "" H 4000 4250 50  0001 C CNN
F 4 "Samtec Inc." H 0   0   50  0001 C CNN "Manufacturer"
F 5 "SL-107-G-12,SL-108-G-12" H 0   0   50  0001 C CNN "PartNumber"
	1    3900 4600
	1    0    0    -1  
$EndComp
Wire Wire Line
	9600 2550 9550 2550
Wire Wire Line
	9550 2650 9600 2650
Wire Wire Line
	9550 2550 9550 2650
Wire Wire Line
	9550 2650 9550 2850
Wire Wire Line
	9550 2850 9600 2850
Connection ~ 9550 2650
Wire Wire Line
	9050 2950 9600 2950
Wire Wire Line
	9550 2850 9550 3150
Wire Wire Line
	9550 3150 10350 3150
Wire Wire Line
	10350 3150 10350 2950
Wire Wire Line
	10350 2950 10300 2950
Connection ~ 9550 2850
Wire Wire Line
	10850 3050 10300 3050
Wire Wire Line
	10350 2950 10350 2750
Wire Wire Line
	10350 2750 10300 2750
Connection ~ 10350 2950
Wire Wire Line
	10300 2850 10850 2850
Wire Wire Line
	10400 2450 10400 2550
Wire Wire Line
	10400 2550 10300 2550
Connection ~ 10400 2450
NoConn ~ 10300 2650
Wire Wire Line
	9550 4150 9550 4350
Wire Wire Line
	9550 4350 9600 4350
Connection ~ 9550 4150
Wire Wire Line
	9550 4350 9550 4650
Connection ~ 9550 4350
Wire Wire Line
	9600 4450 9050 4450
NoConn ~ 10300 4150
Wire Wire Line
	10300 4050 10400 4050
Wire Wire Line
	10400 4050 10400 3950
Connection ~ 10400 3950
Wire Wire Line
	10300 4250 10350 4250
Wire Wire Line
	10350 4250 10350 4450
Connection ~ 10350 4450
$Comp
L Device:Ferrite_Bead_Small FB1
U 1 1 5C5F842B
P 950 4750
F 0 "FB1" H 1050 4796 50  0000 L CNN
F 1 "MI1206K601R−10" H 1050 4705 50  0000 L CNN
F 2 "Choke_SMD:Choke_SMD_1206_Handsoldering" V 880 4750 50  0001 C CNN
F 3 "~" H 950 4750 50  0001 C CNN
F 4 "Laird-Signal Integrity Products" H 0   0   50  0001 C CNN "Manufacturer"
F 5 "MI1206K601R-10" H 0   0   50  0001 C CNN "PartNumber"
	1    950  4750
	1    0    0    -1  
$EndComp
$Comp
L Device:C_Small C2
U 1 1 5C5FE7E3
P 1350 5150
F 0 "C2" H 1442 5196 50  0000 L CNN
F 1 "0.1uF" H 1442 5105 50  0000 L CNN
F 2 "Capacitors_SMD:C_0603_HandSoldering" H 1350 5150 50  0001 C CNN
F 3 "~" H 1350 5150 50  0001 C CNN
F 4 "Samsung Electro-Mechanics" H 0   0   50  0001 C CNN "Manufacturer"
F 5 "CL10B104KB8NNNC" H 0   0   50  0001 C CNN "PartNumber"
	1    1350 5150
	1    0    0    -1  
$EndComp
Wire Wire Line
	950  4850 950  4950
Wire Wire Line
	950  4950 1350 4950
Wire Wire Line
	1350 4950 1350 5050
Connection ~ 950  4950
Wire Wire Line
	950  4950 950  5050
Wire Wire Line
	950  5250 950  5350
Wire Wire Line
	950  5350 1350 5350
Wire Wire Line
	1350 5350 1350 5250
Connection ~ 950  5350
Wire Wire Line
	950  5350 950  5450
$Comp
L power:+3.3V #PWR?
U 1 1 5C61A9BA
P 950 4550
F 0 "#PWR?" H 950 4400 50  0001 C CNN
F 1 "+3.3V" H 965 4723 50  0000 C CNN
F 2 "" H 950 4550 50  0001 C CNN
F 3 "" H 950 4550 50  0001 C CNN
	1    950  4550
	1    0    0    -1  
$EndComp
Wire Wire Line
	950  4550 950  4650
Wire Wire Line
	2350 4750 3250 4750
Wire Wire Line
	1950 4650 3250 4650
Wire Wire Line
	1950 5250 1950 5450
Wire Wire Line
	2350 5250 2350 5450
Wire Wire Line
	2700 5450 2700 4850
Connection ~ 2700 4850
Wire Wire Line
	2350 4750 2350 5050
Wire Wire Line
	1950 4650 1950 5050
Wire Wire Line
	1350 4950 3250 4950
Connection ~ 1350 4950
$Comp
L Device:C_Small C1
U 1 1 5C67E137
P 950 5150
F 0 "C1" H 1042 5196 50  0000 L CNN
F 1 "22uF" H 1042 5105 50  0000 L CNN
F 2 "Capacitors_SMD:C_0603_HandSoldering" H 950 5150 50  0001 C CNN
F 3 "~" H 950 5150 50  0001 C CNN
F 4 "Murata Electronics North America" H 0   0   50  0001 C CNN "Manufacturer"
F 5 "GRM188R61A226ME15D" H 0   0   50  0001 C CNN "PartNumber"
	1    950  5150
	1    0    0    -1  
$EndComp
$Comp
L Device:C_Small C3
U 1 1 5C67E192
P 2350 5150
F 0 "C3" H 2442 5196 50  0000 L CNN
F 1 "47uF" H 2442 5105 50  0000 L CNN
F 2 "Capacitors_SMD:C_0603_HandSoldering" H 2350 5150 50  0001 C CNN
F 3 "~" H 2350 5150 50  0001 C CNN
F 4 "Murata Electronics North America" H 0   0   50  0001 C CNN "Manufacturer"
F 5 "GRM188R60J476ME15D" H 0   0   50  0001 C CNN "PartNumber"
	1    2350 5150
	1    0    0    -1  
$EndComp
$Sheet
S 700  2300 1050 700 
U 5C5DFD72
F0 "voltage_regulator" 50
F1 "voltage_regulator.sch" 50
$EndSheet
Text Label 2750 4350 0    50   ~ 0
10MHz_OUT
Text Label 2750 4550 0    50   ~ 0
1PPS_OUTPUT
Text Label 5100 1650 2    50   ~ 0
10MHz_1
Text Label 5100 1750 2    50   ~ 0
10MHz_2
Text Label 5100 1850 2    50   ~ 0
10MHz_3
Text Label 5100 1950 2    50   ~ 0
10MHz_4
Wire Wire Line
	6950 5150 6450 5150
Wire Wire Line
	6450 5300 6950 5300
Wire Wire Line
	6950 4100 6450 4100
Wire Wire Line
	6450 4250 6950 4250
Wire Wire Line
	6450 3050 6950 3050
Wire Wire Line
	6450 3200 6950 3200
Wire Wire Line
	6950 2000 6450 2000
Wire Wire Line
	6450 2150 6950 2150
Text Label 6450 2000 0    50   ~ 0
10MHz_1
Text Label 6450 2150 0    50   ~ 0
1PPS_1
Text Label 6450 3050 0    50   ~ 0
10MHz_2
Text Label 6450 3200 0    50   ~ 0
1PPS_2
Text Label 6450 4100 0    50   ~ 0
10MHz_3
Text Label 6450 4250 0    50   ~ 0
1PPS_3
Text Label 6450 5150 0    50   ~ 0
10MHz_4
Text Label 6450 5300 0    50   ~ 0
1PPS_4
Wire Wire Line
	2750 4350 3250 4350
Wire Wire Line
	3250 4550 2750 4550
$Comp
L power:GND #PWR?
U 1 1 5D2BD3C4
P 1150 6700
F 0 "#PWR?" H 1150 6450 50  0001 C CNN
F 1 "GND" H 1155 6527 50  0000 C CNN
F 2 "" H 1150 6700 50  0001 C CNN
F 3 "" H 1150 6700 50  0001 C CNN
	1    1150 6700
	1    0    0    -1  
$EndComp
$Comp
L Mechanical:MountingHole_Pad H1
U 1 1 5D2BE4EB
P 1150 6500
F 0 "H1" H 1250 6549 50  0000 L CNN
F 1 "MountingHole_Pad" H 1250 6458 50  0000 L CNN
F 2 "MountingHole:MountingHole_3.2mm_M3_Pad" H 1150 6500 50  0001 C CNN
F 3 "~" H 1150 6500 50  0001 C CNN
	1    1150 6500
	1    0    0    -1  
$EndComp
Wire Wire Line
	1150 6600 1150 6700
$Comp
L power:GND #PWR?
U 1 1 5D2C8AF7
P 2050 6700
F 0 "#PWR?" H 2050 6450 50  0001 C CNN
F 1 "GND" H 2055 6527 50  0000 C CNN
F 2 "" H 2050 6700 50  0001 C CNN
F 3 "" H 2050 6700 50  0001 C CNN
	1    2050 6700
	1    0    0    -1  
$EndComp
$Comp
L Mechanical:MountingHole_Pad H3
U 1 1 5D2C8B01
P 2050 6500
F 0 "H3" H 2150 6549 50  0000 L CNN
F 1 "MountingHole_Pad" H 2150 6458 50  0000 L CNN
F 2 "MountingHole:MountingHole_3.2mm_M3_Pad" H 2050 6500 50  0001 C CNN
F 3 "~" H 2050 6500 50  0001 C CNN
	1    2050 6500
	1    0    0    -1  
$EndComp
Wire Wire Line
	2050 6600 2050 6700
$Comp
L power:GND #PWR?
U 1 1 5D2D3A5F
P 1150 7400
F 0 "#PWR?" H 1150 7150 50  0001 C CNN
F 1 "GND" H 1155 7227 50  0000 C CNN
F 2 "" H 1150 7400 50  0001 C CNN
F 3 "" H 1150 7400 50  0001 C CNN
	1    1150 7400
	1    0    0    -1  
$EndComp
$Comp
L Mechanical:MountingHole_Pad H2
U 1 1 5D2D3A69
P 1150 7200
F 0 "H2" H 1250 7249 50  0000 L CNN
F 1 "MountingHole_Pad" H 1250 7158 50  0000 L CNN
F 2 "MountingHole:MountingHole_3.2mm_M3_Pad" H 1150 7200 50  0001 C CNN
F 3 "~" H 1150 7200 50  0001 C CNN
	1    1150 7200
	1    0    0    -1  
$EndComp
Wire Wire Line
	1150 7300 1150 7400
$Comp
L power:GND #PWR?
U 1 1 5D2D3A74
P 2050 7400
F 0 "#PWR?" H 2050 7150 50  0001 C CNN
F 1 "GND" H 2055 7227 50  0000 C CNN
F 2 "" H 2050 7400 50  0001 C CNN
F 3 "" H 2050 7400 50  0001 C CNN
	1    2050 7400
	1    0    0    -1  
$EndComp
$Comp
L Mechanical:MountingHole_Pad H4
U 1 1 5D2D3A7E
P 2050 7200
F 0 "H4" H 2150 7249 50  0000 L CNN
F 1 "MountingHole_Pad" H 2150 7158 50  0000 L CNN
F 2 "MountingHole:MountingHole_3.2mm_M3_Pad" H 2050 7200 50  0001 C CNN
F 3 "~" H 2050 7200 50  0001 C CNN
	1    2050 7200
	1    0    0    -1  
$EndComp
Wire Wire Line
	2050 7300 2050 7400
$Sheet
S 9900 1200 700  500 
U 5D5C23C1
F0 "IRIS_Buffer" 50
F1 "IRIS_Buffer.sch" 50
F2 "CLK_In" I L 9900 1450 50 
$EndSheet
$Sheet
S 3600 1550 1000 1350
U 5D753A3E
F0 "Pre_Buffer" 50
F1 "Pre_Buffer.sch" 50
F2 "10MHz_1" I R 4600 1650 50 
F3 "10MHz_2" I R 4600 1750 50 
F4 "1PPS_2" I R 4600 2250 50 
F5 "1PPS_1" I R 4600 2150 50 
F6 "10MHz_4" I R 4600 1950 50 
F7 "1PPS_4" I R 4600 2450 50 
F8 "1PPS_3" I R 4600 2350 50 
F9 "10MHz" I L 3600 2050 50 
F10 "1PPS" I L 3600 2250 50 
F11 "1PPS_IRIS_1" I R 4600 2700 50 
F12 "1PPS_IRIS_2" I R 4600 2800 50 
F13 "10MHz_IRIS" I R 4600 2600 50 
F14 "10MHz_3" I R 4600 1850 50 
$EndSheet
Wire Wire Line
	4600 1650 5100 1650
Wire Wire Line
	4600 1750 5100 1750
Wire Wire Line
	4600 1850 5100 1850
Wire Wire Line
	4600 1950 5100 1950
Wire Wire Line
	4600 2150 5100 2150
Wire Wire Line
	3100 2050 3600 2050
Wire Wire Line
	3100 2250 3600 2250
Wire Wire Line
	5100 2250 4600 2250
Wire Wire Line
	4600 2600 5100 2600
Wire Wire Line
	4600 2700 5100 2700
Wire Wire Line
	4600 2800 5100 2800
Text Label 5100 2150 2    50   ~ 0
1PPS_1
Text Label 5100 2250 2    50   ~ 0
1PPS_2
Wire Wire Line
	4600 2350 5100 2350
Wire Wire Line
	5100 2450 4600 2450
Text Label 5100 2350 2    50   ~ 0
1PPS_3
Text Label 5100 2450 2    50   ~ 0
1PPS_4
$EndSCHEMATC
