EESchema Schematic File Version 4
EELAYER 30 0
EELAYER END
$Descr A4 11693 8268
encoding utf-8
Sheet 1 1
Title ""
Date ""
Rev ""
Comp ""
Comment1 ""
Comment2 ""
Comment3 ""
Comment4 ""
$EndDescr
Text Label 4500 3600 0    50   ~ 0
bus_power_present
Text Label 4500 3700 0    50   ~ 0
mdp_25_output_voltage
$Comp
L power:GND #PWR?
U 1 1 5E6BF06E
P 4000 4600
F 0 "#PWR?" H 4000 4350 50  0001 C CNN
F 1 "GND" H 4000 4450 50  0000 C CNN
F 2 "" H 4000 4600 50  0001 C CNN
F 3 "" H 4000 4600 50  0001 C CNN
	1    4000 4600
	1    0    0    -1  
$EndComp
$Comp
L power:GND #PWR?
U 1 1 5E6BF22C
P 3900 4600
F 0 "#PWR?" H 3900 4350 50  0001 C CNN
F 1 "GND" H 3900 4450 50  0000 C CNN
F 2 "" H 3900 4600 50  0001 C CNN
F 3 "" H 3900 4600 50  0001 C CNN
	1    3900 4600
	1    0    0    -1  
$EndComp
Wire Wire Line
	3900 4600 3900 4500
Wire Wire Line
	4000 4500 4000 4600
$Comp
L Device:R R102
U 1 1 5E6BF8B7
P 5500 3350
F 0 "R102" V 5580 3350 50  0000 C CNN
F 1 "470k" V 5500 3350 50  0000 C CNN
F 2 "Resistor_SMD:R_0603_1608Metric_Pad1.05x0.95mm_HandSolder" V 5430 3350 50  0001 C CNN
F 3 "~" H 5500 3350 50  0001 C CNN
	1    5500 3350
	1    0    0    -1  
$EndComp
$Comp
L Device:R R106
U 1 1 5E6C07DA
P 6000 3950
F 0 "R106" V 6080 3950 50  0000 C CNN
F 1 "100k" V 6000 3950 50  0000 C CNN
F 2 "Resistor_SMD:R_0603_1608Metric_Pad1.05x0.95mm_HandSolder" V 5930 3950 50  0001 C CNN
F 3 "~" H 6000 3950 50  0001 C CNN
	1    6000 3950
	1    0    0    -1  
$EndComp
Wire Wire Line
	6000 3700 6000 3800
Wire Wire Line
	4400 3700 6000 3700
Wire Wire Line
	6000 3500 6000 3700
Connection ~ 6000 3700
$Comp
L 000_PreferredParts:C_0_1uF C101
U 1 1 5E6C10B5
P 6250 3950
F 0 "C101" H 6275 4050 50  0000 L CNN
F 1 "C_0_1uF" H 6275 3850 50  0001 L CNN
F 2 "Capacitor_SMD:C_0402_1005Metric" H 6288 3800 50  0001 C CNN
F 3 "~" H 6250 3950 50  0001 C CNN
F 4 "0.1uF" H 6400 3850 50  0000 C CNN "DisplayValue"
F 5 "3000-0000000125" H 6250 3950 50  0001 C CNN "PartSpecification"
F 6 "100V" H 6250 3950 50  0001 C CNN "Voltage"
	1    6250 3950
	1    0    0    -1  
$EndComp
Wire Wire Line
	6250 3800 6250 3700
Wire Wire Line
	6250 3700 6000 3700
$Comp
L Device:R R105
U 1 1 5E6C1749
P 6000 3350
F 0 "R105" V 6080 3350 50  0000 C CNN
F 1 "100k" V 6000 3350 50  0000 C CNN
F 2 "Resistor_SMD:R_0603_1608Metric_Pad1.05x0.95mm_HandSolder" V 5930 3350 50  0001 C CNN
F 3 "~" H 6000 3350 50  0001 C CNN
	1    6000 3350
	1    0    0    -1  
$EndComp
$Comp
L Device:R R104
U 1 1 5E6C189F
P 6000 2950
F 0 "R104" V 6080 2950 50  0000 C CNN
F 1 "100k" V 6000 2950 50  0000 C CNN
F 2 "Resistor_SMD:R_0603_1608Metric_Pad1.05x0.95mm_HandSolder" V 5930 2950 50  0001 C CNN
F 3 "~" H 6000 2950 50  0001 C CNN
	1    6000 2950
	1    0    0    -1  
$EndComp
Wire Wire Line
	6000 3100 6000 3200
$Comp
L power:GND #PWR?
U 1 1 5E6C1C01
P 6000 4200
F 0 "#PWR?" H 6000 3950 50  0001 C CNN
F 1 "GND" H 6000 4050 50  0000 C CNN
F 2 "" H 6000 4200 50  0001 C CNN
F 3 "" H 6000 4200 50  0001 C CNN
	1    6000 4200
	1    0    0    -1  
$EndComp
$Comp
L power:GND #PWR?
U 1 1 5E6C1DD2
P 6250 4200
F 0 "#PWR?" H 6250 3950 50  0001 C CNN
F 1 "GND" H 6250 4050 50  0000 C CNN
F 2 "" H 6250 4200 50  0001 C CNN
F 3 "" H 6250 4200 50  0001 C CNN
	1    6250 4200
	1    0    0    -1  
$EndComp
Wire Wire Line
	6250 4200 6250 4100
Wire Wire Line
	6000 4100 6000 4200
Wire Wire Line
	6000 2500 6000 2800
Wire Wire Line
	5500 2400 5500 2800
Wire Wire Line
	5500 3100 5500 3200
Wire Wire Line
	5500 3500 5500 3600
$Comp
L power:GND #PWR?
U 1 1 5E6C37FD
P 5500 4200
F 0 "#PWR?" H 5500 3950 50  0001 C CNN
F 1 "GND" H 5500 4050 50  0000 C CNN
F 2 "" H 5500 4200 50  0001 C CNN
F 3 "" H 5500 4200 50  0001 C CNN
	1    5500 4200
	1    0    0    -1  
$EndComp
Wire Wire Line
	5500 4200 5500 4100
$Comp
L Device:R R101
U 1 1 5E6C47ED
P 5500 2950
F 0 "R101" V 5580 2950 50  0000 C CNN
F 1 "470k" V 5500 2950 50  0000 C CNN
F 2 "Resistor_SMD:R_0603_1608Metric_Pad1.05x0.95mm_HandSolder" V 5430 2950 50  0001 C CNN
F 3 "~" H 5500 2950 50  0001 C CNN
	1    5500 2950
	1    0    0    -1  
$EndComp
$Comp
L Device:R R103
U 1 1 5E6C4BA7
P 5500 3950
F 0 "R103" V 5580 3950 50  0000 C CNN
F 1 "470k" V 5500 3950 50  0000 C CNN
F 2 "Resistor_SMD:R_0603_1608Metric_Pad1.05x0.95mm_HandSolder" V 5430 3950 50  0001 C CNN
F 3 "~" H 5500 3950 50  0001 C CNN
	1    5500 3950
	1    0    0    -1  
$EndComp
Wire Wire Line
	4400 3600 5500 3600
Connection ~ 5500 3600
Wire Wire Line
	5500 3600 5500 3800
$Comp
L power:GND #PWR?
U 1 1 5E6C5EDD
P 5350 2400
F 0 "#PWR?" H 5350 2150 50  0001 C CNN
F 1 "GND" H 5350 2250 50  0000 C CNN
F 2 "" H 5350 2400 50  0001 C CNN
F 3 "" H 5350 2400 50  0001 C CNN
	1    5350 2400
	1    0    0    -1  
$EndComp
Wire Wire Line
	5350 2400 5350 2300
$Comp
L MCU_Module:Arduino_UNO_R3 A101
U 1 1 5E6C8108
P 3900 3400
F 0 "A101" H 3700 4450 50  0000 R CNN
F 1 "Arduino_UNO_R3" H 3700 4350 50  0000 R CNN
F 2 "Module:Arduino_UNO_R3" H 4050 2350 50  0001 L CNN
F 3 "https://www.arduino.cc/en/Main/arduinoBoardUno" H 3700 4450 50  0001 C CNN
	1    3900 3400
	1    0    0    -1  
$EndComp
$Comp
L power:GND #PWR?
U 1 1 5E6CCBE8
P 3800 4600
F 0 "#PWR?" H 3800 4350 50  0001 C CNN
F 1 "GND" H 3800 4450 50  0000 C CNN
F 2 "" H 3800 4600 50  0001 C CNN
F 3 "" H 3800 4600 50  0001 C CNN
	1    3800 4600
	1    0    0    -1  
$EndComp
Wire Wire Line
	3800 4600 3800 4500
$Comp
L Connector:RJ45 J101
U 1 1 5E6CD3E9
P 6900 1700
F 0 "J101" H 6700 2250 50  0000 R CNN
F 1 "RJ45" H 7000 2250 50  0000 L CNN
F 2 "POWDER_Misc:MTJ-88TX1-FSD-PGB" V 6900 1725 50  0001 C CNN
F 3 "~" V 6900 1725 50  0001 C CNN
	1    6900 1700
	0    1    1    0   
$EndComp
$Comp
L Connector:Screw_Terminal_01x02 J102
U 1 1 5E6CE4C8
P 7200 2400
F 0 "J102" H 7200 2500 50  0000 C CNN
F 1 "Screw_Terminal_01x02" H 7200 2200 50  0000 C CNN
F 2 "TerminalBlock:TerminalBlock_bornier-2_P5.08mm" H 7200 2400 50  0001 C CNN
F 3 "~" H 7200 2400 50  0001 C CNN
	1    7200 2400
	1    0    0    -1  
$EndComp
Wire Wire Line
	6000 2500 7000 2500
Wire Wire Line
	6900 2100 6900 2300
Wire Wire Line
	5350 2300 6900 2300
Wire Wire Line
	6800 2100 6800 2400
Wire Wire Line
	5500 2400 6800 2400
$Comp
L power:GND #PWR?
U 1 1 5E6CFF53
P 6900 2700
F 0 "#PWR?" H 6900 2450 50  0001 C CNN
F 1 "GND" H 6900 2550 50  0000 C CNN
F 2 "" H 6900 2700 50  0001 C CNN
F 3 "" H 6900 2700 50  0001 C CNN
	1    6900 2700
	1    0    0    -1  
$EndComp
Wire Wire Line
	6900 2700 6900 2400
Wire Wire Line
	6900 2400 7000 2400
$Comp
L Device:D D101
U 1 1 5F0DF90F
P 5250 5500
F 0 "D101" H 5250 5600 50  0000 C CNN
F 1 "D" H 5250 5400 50  0000 C CNN
F 2 "Diode_SMD:D_SOD-128" H 5250 5500 50  0001 C CNN
F 3 "~" H 5250 5500 50  0001 C CNN
	1    5250 5500
	-1   0    0    1   
$EndComp
$Comp
L Device:D D102
U 1 1 5F0E1A1C
P 5250 6000
F 0 "D102" H 5250 6100 50  0000 C CNN
F 1 "D" H 5250 5900 50  0000 C CNN
F 2 "Diode_SMD:D_SOD-128" H 5250 6000 50  0001 C CNN
F 3 "~" H 5250 6000 50  0001 C CNN
	1    5250 6000
	-1   0    0    1   
$EndComp
$Comp
L Connector:Screw_Terminal_01x02 J105
U 1 1 5F0E20E4
P 6700 5600
F 0 "J105" H 6700 5700 50  0000 C CNN
F 1 "Screw_Terminal_01x02" H 6700 5400 50  0000 C CNN
F 2 "TerminalBlock:TerminalBlock_bornier-2_P5.08mm" H 6700 5600 50  0001 C CNN
F 3 "~" H 6700 5600 50  0001 C CNN
	1    6700 5600
	1    0    0    1   
$EndComp
$Comp
L Connector:Screw_Terminal_01x02 J103
U 1 1 5F0E3238
P 4300 5600
F 0 "J103" H 4300 5700 50  0000 C CNN
F 1 "Screw_Terminal_01x02" H 4300 5400 50  0000 C CNN
F 2 "TerminalBlock:TerminalBlock_bornier-2_P5.08mm" H 4300 5600 50  0001 C CNN
F 3 "~" H 4300 5600 50  0001 C CNN
	1    4300 5600
	-1   0    0    1   
$EndComp
$Comp
L Connector:Screw_Terminal_01x02 J104
U 1 1 5F0E4779
P 4300 6100
F 0 "J104" H 4300 6200 50  0000 C CNN
F 1 "Screw_Terminal_01x02" H 4300 5900 50  0000 C CNN
F 2 "TerminalBlock:TerminalBlock_bornier-2_P5.08mm" H 4300 6100 50  0001 C CNN
F 3 "~" H 4300 6100 50  0001 C CNN
	1    4300 6100
	-1   0    0    1   
$EndComp
$Comp
L 000_PreferredParts:C_0_1uF C104
U 1 1 5F0E5CB8
P 5650 5750
F 0 "C104" H 5675 5850 50  0000 L CNN
F 1 "C_0_1uF" H 5675 5650 50  0001 L CNN
F 2 "Capacitor_SMD:C_0402_1005Metric" H 5688 5600 50  0001 C CNN
F 3 "~" H 5650 5750 50  0001 C CNN
F 4 "0.1uF" H 5800 5650 50  0000 C CNN "DisplayValue"
F 5 "3000-0000000125" H 5650 5750 50  0001 C CNN "PartSpecification"
F 6 "100V" H 5650 5750 50  0001 C CNN "Voltage"
	1    5650 5750
	1    0    0    -1  
$EndComp
$Comp
L 000_PreferredParts:C_10uF_0805 C105
U 1 1 5F0E705E
P 6000 5750
F 0 "C105" H 6025 5850 50  0000 L CNN
F 1 "C_10uF_0805" H 6025 5650 50  0001 L CNN
F 2 "Capacitor_SMD:C_0805_2012Metric" H 6038 5600 50  0001 C CNN
F 3 "~" H 6000 5750 50  0001 C CNN
F 4 "10uF" H 6150 5650 50  0000 C CNN "DisplayValue"
F 5 "0805" H 6150 5550 50  0000 C CNN "DisplayFootprint"
F 6 "3000-0000000134" H 6000 5750 50  0001 C CNN "PartSpecification"
	1    6000 5750
	1    0    0    -1  
$EndComp
Wire Wire Line
	6500 5500 6000 5500
$Comp
L power:GND #PWR?
U 1 1 5F0E96C7
P 6400 5700
F 0 "#PWR?" H 6400 5450 50  0001 C CNN
F 1 "GND" H 6400 5550 50  0000 C CNN
F 2 "" H 6400 5700 50  0001 C CNN
F 3 "" H 6400 5700 50  0001 C CNN
	1    6400 5700
	1    0    0    -1  
$EndComp
Wire Wire Line
	6400 5700 6400 5600
Wire Wire Line
	6400 5600 6500 5600
$Comp
L power:GND #PWR?
U 1 1 5F0EA216
P 6000 6000
F 0 "#PWR?" H 6000 5750 50  0001 C CNN
F 1 "GND" H 6000 5850 50  0000 C CNN
F 2 "" H 6000 6000 50  0001 C CNN
F 3 "" H 6000 6000 50  0001 C CNN
	1    6000 6000
	1    0    0    -1  
$EndComp
$Comp
L power:GND #PWR?
U 1 1 5F0EA3E4
P 5650 6000
F 0 "#PWR?" H 5650 5750 50  0001 C CNN
F 1 "GND" H 5650 5850 50  0000 C CNN
F 2 "" H 5650 6000 50  0001 C CNN
F 3 "" H 5650 6000 50  0001 C CNN
	1    5650 6000
	1    0    0    -1  
$EndComp
Wire Wire Line
	5650 6000 5650 5900
Wire Wire Line
	6000 6000 6000 5900
Wire Wire Line
	6000 5600 6000 5500
Connection ~ 6000 5500
Wire Wire Line
	6000 5500 5650 5500
Wire Wire Line
	5650 5600 5650 5500
Connection ~ 5650 5500
Wire Wire Line
	5650 5500 5500 5500
Wire Wire Line
	5400 6000 5500 6000
Wire Wire Line
	5500 6000 5500 5500
Connection ~ 5500 5500
Wire Wire Line
	5500 5500 5400 5500
Wire Wire Line
	4500 6000 5000 6000
Wire Wire Line
	5100 5500 4800 5500
$Comp
L power:GND #PWR?
U 1 1 5F0EEE44
P 4600 5700
F 0 "#PWR?" H 4600 5450 50  0001 C CNN
F 1 "GND" H 4600 5550 50  0000 C CNN
F 2 "" H 4600 5700 50  0001 C CNN
F 3 "" H 4600 5700 50  0001 C CNN
	1    4600 5700
	1    0    0    -1  
$EndComp
Wire Wire Line
	4600 5700 4600 5600
Wire Wire Line
	4600 5600 4500 5600
$Comp
L power:GND #PWR?
U 1 1 5F0EFD4D
P 4600 6200
F 0 "#PWR?" H 4600 5950 50  0001 C CNN
F 1 "GND" H 4600 6050 50  0000 C CNN
F 2 "" H 4600 6200 50  0001 C CNN
F 3 "" H 4600 6200 50  0001 C CNN
	1    4600 6200
	1    0    0    -1  
$EndComp
Wire Wire Line
	4600 6200 4600 6100
Wire Wire Line
	4600 6100 4500 6100
$Comp
L Device:R R110
U 1 1 5F0F3027
P 5000 6250
F 0 "R110" V 5080 6250 50  0000 C CNN
F 1 "470k" V 5000 6250 50  0000 C CNN
F 2 "Resistor_SMD:R_0603_1608Metric_Pad1.05x0.95mm_HandSolder" V 4930 6250 50  0001 C CNN
F 3 "~" H 5000 6250 50  0001 C CNN
	1    5000 6250
	1    0    0    -1  
$EndComp
$Comp
L Device:R R111
U 1 1 5F0F3A75
P 5000 6750
F 0 "R111" V 5080 6750 50  0000 C CNN
F 1 "470k" V 5000 6750 50  0000 C CNN
F 2 "Resistor_SMD:R_0603_1608Metric_Pad1.05x0.95mm_HandSolder" V 4930 6750 50  0001 C CNN
F 3 "~" H 5000 6750 50  0001 C CNN
	1    5000 6750
	1    0    0    -1  
$EndComp
$Comp
L Device:R R112
U 1 1 5F0F3DB9
P 5000 7250
F 0 "R112" V 5080 7250 50  0000 C CNN
F 1 "470k" V 5000 7250 50  0000 C CNN
F 2 "Resistor_SMD:R_0603_1608Metric_Pad1.05x0.95mm_HandSolder" V 4930 7250 50  0001 C CNN
F 3 "~" H 5000 7250 50  0001 C CNN
	1    5000 7250
	1    0    0    -1  
$EndComp
$Comp
L power:GND #PWR?
U 1 1 5F0F4210
P 5000 7500
F 0 "#PWR?" H 5000 7250 50  0001 C CNN
F 1 "GND" H 5000 7350 50  0000 C CNN
F 2 "" H 5000 7500 50  0001 C CNN
F 3 "" H 5000 7500 50  0001 C CNN
	1    5000 7500
	1    0    0    -1  
$EndComp
Wire Wire Line
	5000 7500 5000 7400
Wire Wire Line
	5000 6900 5000 7000
Wire Wire Line
	5000 6600 5000 6400
Wire Wire Line
	5000 6100 5000 6000
Connection ~ 5000 6000
Wire Wire Line
	5000 6000 5100 6000
$Comp
L Device:R R107
U 1 1 5F0FA30C
P 4800 6250
F 0 "R107" V 4880 6250 50  0000 C CNN
F 1 "470k" V 4800 6250 50  0000 C CNN
F 2 "Resistor_SMD:R_0603_1608Metric_Pad1.05x0.95mm_HandSolder" V 4730 6250 50  0001 C CNN
F 3 "~" H 4800 6250 50  0001 C CNN
	1    4800 6250
	1    0    0    -1  
$EndComp
$Comp
L Device:R R108
U 1 1 5F0FA312
P 4800 6750
F 0 "R108" V 4880 6750 50  0000 C CNN
F 1 "470k" V 4800 6750 50  0000 C CNN
F 2 "Resistor_SMD:R_0603_1608Metric_Pad1.05x0.95mm_HandSolder" V 4730 6750 50  0001 C CNN
F 3 "~" H 4800 6750 50  0001 C CNN
	1    4800 6750
	1    0    0    -1  
$EndComp
$Comp
L Device:R R109
U 1 1 5F0FA318
P 4800 7250
F 0 "R109" V 4880 7250 50  0000 C CNN
F 1 "470k" V 4800 7250 50  0000 C CNN
F 2 "Resistor_SMD:R_0603_1608Metric_Pad1.05x0.95mm_HandSolder" V 4730 7250 50  0001 C CNN
F 3 "~" H 4800 7250 50  0001 C CNN
	1    4800 7250
	1    0    0    -1  
$EndComp
$Comp
L power:GND #PWR?
U 1 1 5F0FA31E
P 4800 7500
F 0 "#PWR?" H 4800 7250 50  0001 C CNN
F 1 "GND" H 4800 7350 50  0000 C CNN
F 2 "" H 4800 7500 50  0001 C CNN
F 3 "" H 4800 7500 50  0001 C CNN
	1    4800 7500
	1    0    0    -1  
$EndComp
Wire Wire Line
	4800 7500 4800 7400
Wire Wire Line
	4800 6900 4800 7000
Wire Wire Line
	4800 6600 4800 6400
Wire Wire Line
	4800 5500 4800 6100
Connection ~ 4800 5500
Wire Wire Line
	4800 5500 4500 5500
Text Label 4850 5500 0    50   ~ 0
batt1
Text Label 4850 6000 0    50   ~ 0
batt2
Wire Wire Line
	5000 7000 5300 7000
Connection ~ 5000 7000
Wire Wire Line
	5000 7000 5000 7100
Connection ~ 4800 7000
Wire Wire Line
	4800 7000 4800 7100
Text Label 4300 7000 0    50   ~ 0
batt1_mon
Wire Wire Line
	4300 7000 4500 7000
Text Label 5200 7000 0    50   ~ 0
batt2_mon
Text Label 4500 3400 0    50   ~ 0
batt1_mon
Text Label 4500 3500 0    50   ~ 0
batt2_mon
Wire Wire Line
	4500 3500 4400 3500
Wire Wire Line
	4500 3400 4400 3400
$Comp
L 000_PreferredParts:C_0_1uF C103
U 1 1 5F108194
P 5300 7250
F 0 "C103" H 5325 7350 50  0000 L CNN
F 1 "C_0_1uF" H 5325 7150 50  0001 L CNN
F 2 "Capacitor_SMD:C_0402_1005Metric" H 5338 7100 50  0001 C CNN
F 3 "~" H 5300 7250 50  0001 C CNN
F 4 "0.1uF" H 5450 7150 50  0000 C CNN "DisplayValue"
F 5 "3000-0000000125" H 5300 7250 50  0001 C CNN "PartSpecification"
F 6 "100V" H 5300 7250 50  0001 C CNN "Voltage"
	1    5300 7250
	1    0    0    -1  
$EndComp
$Comp
L power:GND #PWR?
U 1 1 5F108F92
P 5300 7500
F 0 "#PWR?" H 5300 7250 50  0001 C CNN
F 1 "GND" H 5300 7350 50  0000 C CNN
F 2 "" H 5300 7500 50  0001 C CNN
F 3 "" H 5300 7500 50  0001 C CNN
	1    5300 7500
	1    0    0    -1  
$EndComp
Wire Wire Line
	5300 7500 5300 7400
Wire Wire Line
	5300 7100 5300 7000
$Comp
L 000_PreferredParts:C_0_1uF C102
U 1 1 5F10CA93
P 4500 7250
F 0 "C102" H 4525 7350 50  0000 L CNN
F 1 "C_0_1uF" H 4525 7150 50  0001 L CNN
F 2 "Capacitor_SMD:C_0402_1005Metric" H 4538 7100 50  0001 C CNN
F 3 "~" H 4500 7250 50  0001 C CNN
F 4 "0.1uF" H 4650 7150 50  0000 C CNN "DisplayValue"
F 5 "3000-0000000125" H 4500 7250 50  0001 C CNN "PartSpecification"
F 6 "100V" H 4500 7250 50  0001 C CNN "Voltage"
	1    4500 7250
	1    0    0    -1  
$EndComp
$Comp
L power:GND #PWR?
U 1 1 5F10CA99
P 4500 7500
F 0 "#PWR?" H 4500 7250 50  0001 C CNN
F 1 "GND" H 4500 7350 50  0000 C CNN
F 2 "" H 4500 7500 50  0001 C CNN
F 3 "" H 4500 7500 50  0001 C CNN
	1    4500 7500
	1    0    0    -1  
$EndComp
Wire Wire Line
	4500 7500 4500 7400
Wire Wire Line
	4500 7100 4500 7000
Connection ~ 4500 7000
Wire Wire Line
	4500 7000 4800 7000
Text Label 6050 5500 0    50   ~ 0
batt_diode
$EndSCHEMATC
