EESchema Schematic File Version 4
EELAYER 30 0
EELAYER END
$Descr A4 11693 8268
encoding utf-8
Sheet 16 27
Title ""
Date ""
Rev ""
Comp ""
Comment1 ""
Comment2 ""
Comment3 ""
Comment4 ""
$EndDescr
Text Notes 2650 2950 0    50   ~ 0
connection for moisture sensor 1 analog input
$Comp
L Connector:Conn_01x03_Male J?
U 1 1 5E19DF7A
P 2000 3300
AR Path="/5E1922DE/5E19DF7A" Ref="J?"  Part="1" 
AR Path="/5E1922DE/5E19C22F/5E19DF7A" Ref="J1802"  Part="1" 
F 0 "J1802" H 2000 3500 50  0000 C CNN
F 1 "Conn_01x03_Male" H 2000 3100 50  0000 C CNN
F 2 "Connector_PinHeader_2.54mm:PinHeader_1x03_P2.54mm_Vertical" H 2000 3300 50  0001 C CNN
F 3 "~" H 2000 3300 50  0001 C CNN
F 4 "3000-0000000487" H 2000 3300 50  0001 C CNN "PartSpecification"
	1    2000 3300
	1    0    0    -1  
$EndComp
Wire Wire Line
	2500 2950 2500 3300
Wire Wire Line
	2500 3300 2200 3300
$Comp
L power:GND #PWR?
U 1 1 5E19DF8A
P 2500 3500
AR Path="/5E1922DE/5E19DF8A" Ref="#PWR?"  Part="1" 
AR Path="/5E1922DE/5E19C22F/5E19DF8A" Ref="#PWR?"  Part="1" 
F 0 "#PWR?" H 2500 3250 50  0001 C CNN
F 1 "GND" H 2500 3350 50  0000 C CNN
F 2 "" H 2500 3500 50  0001 C CNN
F 3 "" H 2500 3500 50  0001 C CNN
	1    2500 3500
	1    0    0    -1  
$EndComp
Wire Wire Line
	2500 3500 2500 3400
Wire Wire Line
	2500 3400 2200 3400
$Comp
L Connector:Conn_01x02_Male J?
U 1 1 5E19DF92
P 2000 4700
AR Path="/5E1922DE/5E19DF92" Ref="J?"  Part="1" 
AR Path="/5E1922DE/5E19C22F/5E19DF92" Ref="J1803"  Part="1" 
F 0 "J1803" H 2000 4800 50  0000 C CNN
F 1 "Conn_01x02_Male" H 2000 4500 50  0000 C CNN
F 2 "TerminalBlock:TerminalBlock_bornier-2_P5.08mm" H 2000 4700 50  0001 C CNN
F 3 "~" H 2000 4700 50  0001 C CNN
F 4 "3000-0000000184" H 2000 4700 50  0001 C CNN "PartSpecification"
	1    2000 4700
	1    0    0    -1  
$EndComp
$Comp
L power:GND #PWR?
U 1 1 5E19DF98
P 2500 5000
AR Path="/5E1922DE/5E19DF98" Ref="#PWR?"  Part="1" 
AR Path="/5E1922DE/5E19C22F/5E19DF98" Ref="#PWR?"  Part="1" 
F 0 "#PWR?" H 2500 4750 50  0001 C CNN
F 1 "GND" H 2500 4850 50  0000 C CNN
F 2 "" H 2500 5000 50  0001 C CNN
F 3 "" H 2500 5000 50  0001 C CNN
	1    2500 5000
	1    0    0    -1  
$EndComp
Wire Wire Line
	2500 5000 2500 4800
Wire Wire Line
	2500 4800 2200 4800
$Comp
L Device:R R?
U 1 1 5E19DFA0
P 3000 4450
AR Path="/5E1922DE/5E19DFA0" Ref="R?"  Part="1" 
AR Path="/5E1922DE/5E19C22F/5E19DFA0" Ref="R1801"  Part="1" 
F 0 "R1801" V 3080 4450 50  0000 C CNN
F 1 "10k" V 3000 4450 50  0000 C CNN
F 2 "Resistor_SMD:R_0402_1005Metric" V 2930 4450 50  0001 C CNN
F 3 "~" H 3000 4450 50  0001 C CNN
F 4 "3000-0000000131" H 3000 4450 50  0001 C CNN "PartSpecification"
	1    3000 4450
	1    0    0    -1  
$EndComp
$Comp
L power:+3.3V #PWR?
U 1 1 5E19DFA6
P 3000 4200
AR Path="/5E1922DE/5E19DFA6" Ref="#PWR?"  Part="1" 
AR Path="/5E1922DE/5E19C22F/5E19DFA6" Ref="#PWR?"  Part="1" 
F 0 "#PWR?" H 3000 4050 50  0001 C CNN
F 1 "+3.3V" H 3000 4340 50  0000 C CNN
F 2 "" H 3000 4200 50  0001 C CNN
F 3 "" H 3000 4200 50  0001 C CNN
	1    3000 4200
	1    0    0    -1  
$EndComp
Wire Wire Line
	3000 4200 3000 4300
Wire Wire Line
	3000 4600 3000 4700
Wire Wire Line
	3000 4700 2200 4700
Text Label 2400 4700 0    50   ~ 0
cooler_fault
$Comp
L Connector:Conn_01x04_Male J?
U 1 1 5E19EA59
P 1800 6250
AR Path="/5E1922DE/5E19EA59" Ref="J?"  Part="1" 
AR Path="/5E1922DE/5E19C22F/5E19EA59" Ref="J1801"  Part="1" 
F 0 "J1801" H 1800 6450 50  0000 C CNN
F 1 "Conn_01x04_Male" H 1800 5950 50  0000 C CNN
F 2 "Connector_PinHeader_2.54mm:PinHeader_1x04_P2.54mm_Vertical" H 1800 6250 50  0001 C CNN
F 3 "~" H 1800 6250 50  0001 C CNN
F 4 "MCP9808" H 1800 5850 50  0000 C CNN "Connection"
F 5 "0011xxx" H 1800 5750 50  0000 C CNN "I2C_Address"
F 6 "3000-0000000489" H 1800 6250 50  0001 C CNN "PartSpecification"
	1    1800 6250
	1    0    0    -1  
$EndComp
$Comp
L power:GND #PWR?
U 1 1 5E19EA5F
P 2500 6500
AR Path="/5E1922DE/5E19EA5F" Ref="#PWR?"  Part="1" 
AR Path="/5E1922DE/5E19C22F/5E19EA5F" Ref="#PWR?"  Part="1" 
F 0 "#PWR?" H 2500 6250 50  0001 C CNN
F 1 "GND" H 2500 6350 50  0000 C CNN
F 2 "" H 2500 6500 50  0001 C CNN
F 3 "" H 2500 6500 50  0001 C CNN
	1    2500 6500
	1    0    0    -1  
$EndComp
Wire Wire Line
	2500 6500 2500 6250
Wire Wire Line
	2500 6250 2000 6250
$Comp
L power:+3.3V #PWR?
U 1 1 5E19EA67
P 2200 6000
AR Path="/5E1922DE/5E19EA67" Ref="#PWR?"  Part="1" 
AR Path="/5E1922DE/5E19C22F/5E19EA67" Ref="#PWR?"  Part="1" 
F 0 "#PWR?" H 2200 5850 50  0001 C CNN
F 1 "+3.3V" H 2200 6140 50  0000 C CNN
F 2 "" H 2200 6000 50  0001 C CNN
F 3 "" H 2200 6000 50  0001 C CNN
	1    2200 6000
	1    0    0    -1  
$EndComp
Wire Wire Line
	2200 6000 2200 6150
Wire Wire Line
	2200 6150 2000 6150
Text Label 2050 6350 0    50   ~ 0
SCL
Text Label 2050 6450 0    50   ~ 0
SDA
Text Notes 3000 1250 0    50   ~ 0
humidity sensor (Si7006-A20) I2C 1000000
Text Notes 6500 2850 0    50   ~ 0
9 IMU (BMX160) 110100x
Text Notes 5300 4850 0    50   ~ 0
input from power conditioner (12V, DB9, LM7321)
Text HLabel 3800 3200 2    50   Output ~ 0
moisture
Wire Wire Line
	2200 3200 3000 3200
Text HLabel 3500 4700 2    50   Output ~ 0
cooler_fault
Text Label 2900 3200 2    50   ~ 0
moisture_sense
Wire Wire Line
	3000 4700 3500 4700
Connection ~ 3000 4700
Text HLabel 3000 6350 2    50   Input ~ 0
SCL
Text HLabel 3000 6450 2    50   BiDi ~ 0
SDA
Wire Wire Line
	2000 6450 3000 6450
Wire Wire Line
	2000 6350 3000 6350
$Comp
L POWDER_Power:EL3H7-G U1805
U 1 1 5E1A92FF
P 9200 1550
F 0 "U1805" H 9150 1700 50  0000 C CNN
F 1 "EL3H7-G" H 9200 1400 50  0000 C CNN
F 2 "POWDER_Power:EL3H7-G" H 9200 1250 50  0001 C CNN
F 3 "" H 9200 1550 50  0001 C CNN
F 4 "3000-0000000432" H 9200 1550 50  0001 C CNN "PartSpecification"
	1    9200 1550
	1    0    0    -1  
$EndComp
$Comp
L POWDER_Power:LM3724 U1804
U 1 1 5E1A9D1F
P 8050 1600
F 0 "U1804" H 8350 1950 50  0000 C CNN
F 1 "LM3724" H 8050 1600 50  0000 C CNN
F 2 "Package_TO_SOT_SMD:SOT-23-5" H 8250 1850 50  0001 C CNN
F 3 "" H 8050 1600 50  0001 C CNN
F 4 "3000-0000000529" H 8050 1600 50  0001 C CNN "PartSpecification"
	1    8050 1600
	1    0    0    -1  
$EndComp
$Comp
L Device:R R1805
U 1 1 5E1AAE56
P 8800 1600
F 0 "R1805" V 8880 1600 50  0000 C CNN
F 1 "1k" V 8800 1600 50  0000 C CNN
F 2 "Resistor_SMD:R_0402_1005Metric" V 8730 1600 50  0001 C CNN
F 3 "~" H 8800 1600 50  0001 C CNN
F 4 "3000-0000000156" H 8800 1600 50  0001 C CNN "PartSpecification"
	1    8800 1600
	0    1    1    0   
$EndComp
Wire Wire Line
	8650 1600 8600 1600
Wire Wire Line
	8950 1600 9000 1600
$Comp
L Connector_Generic:Conn_02x06_Odd_Even J1805
U 1 1 5E1ABF1B
P 10200 1450
F 0 "J1805" H 10250 1750 50  0000 C CNN
F 1 "Conn_02x06_Odd_Even" H 10250 1050 50  0000 C CNN
F 2 "Connector_PinHeader_2.00mm:PinHeader_2x06_P2.00mm_Vertical_SMD" H 10200 1450 50  0001 C CNN
F 3 "~" H 10200 1450 50  0001 C CNN
F 4 "3000-0000000516" H 10200 1450 50  0001 C CNN "PartSpecification"
	1    10200 1450
	1    0    0    -1  
$EndComp
Wire Wire Line
	10000 1450 9650 1450
Wire Wire Line
	9650 1450 9650 1600
Wire Wire Line
	9650 1600 9400 1600
Wire Wire Line
	9400 1500 9750 1500
Wire Wire Line
	9750 1500 9750 1550
Wire Wire Line
	9750 1550 10000 1550
NoConn ~ 10000 1350
NoConn ~ 10000 1250
NoConn ~ 10000 1650
NoConn ~ 10000 1750
NoConn ~ 10500 1250
NoConn ~ 10500 1350
NoConn ~ 10500 1450
NoConn ~ 10500 1550
NoConn ~ 10500 1650
NoConn ~ 10500 1750
$Comp
L power:GND #PWR?
U 1 1 5E1AFB62
P 8000 2350
F 0 "#PWR?" H 8000 2100 50  0001 C CNN
F 1 "GND" H 8000 2200 50  0000 C CNN
F 2 "" H 8000 2350 50  0001 C CNN
F 3 "" H 8000 2350 50  0001 C CNN
	1    8000 2350
	1    0    0    -1  
$EndComp
Wire Wire Line
	8000 2000 8000 2200
Wire Wire Line
	8100 2000 8100 2200
Wire Wire Line
	8100 2200 8000 2200
Connection ~ 8000 2200
Wire Wire Line
	8000 2200 8000 2350
$Comp
L power:+3.3V #PWR?
U 1 1 5E1B0894
P 8050 1000
F 0 "#PWR?" H 8050 850 50  0001 C CNN
F 1 "+3.3V" H 8050 1140 50  0000 C CNN
F 2 "" H 8050 1000 50  0001 C CNN
F 3 "" H 8050 1000 50  0001 C CNN
	1    8050 1000
	1    0    0    -1  
$EndComp
Wire Wire Line
	8050 1000 8050 1200
Wire Wire Line
	7000 1600 7500 1600
Text HLabel 7000 1600 0    50   Input ~ 0
NUC_reset
$Comp
L POWDER_Misc:SI7006-A20 U1801
U 1 1 5E2DC0CF
P 2750 1750
F 0 "U1801" H 2500 2050 50  0000 L CNN
F 1 "SI7006-A20" H 2750 1450 50  0000 C CNN
F 2 "POWDER_RF:DFN-6-1EP_3x3mm_P1mm_EP1.6x2.5mm" H 2750 1350 50  0001 C CNN
F 3 "" H 2750 2600 50  0001 C CNN
F 4 "3000-0000000526" H 2750 1750 50  0001 C CNN "PartSpecification"
	1    2750 1750
	1    0    0    -1  
$EndComp
Wire Wire Line
	2400 1700 2100 1700
Wire Wire Line
	2100 1800 2400 1800
Text Label 2100 1800 0    50   ~ 0
SCL
Text Label 2100 1700 0    50   ~ 0
SDA
$Comp
L power:+3.3V #PWR?
U 1 1 5E2E0A4A
P 2750 1400
AR Path="/5E1922DE/5E2E0A4A" Ref="#PWR?"  Part="1" 
AR Path="/5E1922DE/5E19C22F/5E2E0A4A" Ref="#PWR?"  Part="1" 
F 0 "#PWR?" H 2750 1250 50  0001 C CNN
F 1 "+3.3V" H 2750 1540 50  0000 C CNN
F 2 "" H 2750 1400 50  0001 C CNN
F 3 "" H 2750 1400 50  0001 C CNN
	1    2750 1400
	1    0    0    -1  
$EndComp
$Comp
L power:GND #PWR?
U 1 1 5E2E0DAC
P 2750 2100
F 0 "#PWR?" H 2750 1850 50  0001 C CNN
F 1 "GND" H 2750 1950 50  0000 C CNN
F 2 "" H 2750 2100 50  0001 C CNN
F 3 "" H 2750 2100 50  0001 C CNN
	1    2750 2100
	1    0    0    -1  
$EndComp
$Comp
L power:+3.3V #PWR?
U 1 1 5E2FDA6B
P 2500 2550
AR Path="/5E1922DE/5E2FDA6B" Ref="#PWR?"  Part="1" 
AR Path="/5E1922DE/5E19C22F/5E2FDA6B" Ref="#PWR?"  Part="1" 
F 0 "#PWR?" H 2500 2400 50  0001 C CNN
F 1 "+3.3V" H 2500 2690 50  0000 C CNN
F 2 "" H 2500 2550 50  0001 C CNN
F 3 "" H 2500 2550 50  0001 C CNN
	1    2500 2550
	1    0    0    -1  
$EndComp
$Comp
L POWDER_Misc:BMX160 U1802
U 1 1 5E2FF92B
P 5950 3550
F 0 "U1802" H 5500 4150 50  0000 C CNN
F 1 "BMX160" H 6400 2950 50  0000 C CNN
F 2 "POWDER_RF:BMX160" H 5900 4500 50  0001 C CNN
F 3 "" H 5900 4500 50  0001 C CNN
F 4 "3000-0000000527" H 5950 3550 50  0001 C CNN "PartSpecification"
	1    5950 3550
	1    0    0    -1  
$EndComp
$Comp
L POWDER_Digital:CD4050B U1803
U 1 1 5E327A65
P 7500 5400
F 0 "U1803" H 7700 6000 100 0000 C CNN
F 1 "CD4050B" H 7950 4800 100 0000 C CNN
F 2 "Package_SO:SOIC-16_3.9x9.9mm_P1.27mm" H 7500 5400 100 0001 C CNN
F 3 "" H 7500 5400 100 0001 C CNN
F 4 "3000-0000000420" H 7500 5400 50  0001 C CNN "PartSpecification"
	1    7500 5400
	1    0    0    -1  
$EndComp
$Comp
L power:GND #PWR?
U 1 1 5E3288CF
P 7500 6100
AR Path="/5E1922DE/5E3288CF" Ref="#PWR?"  Part="1" 
AR Path="/5E1922DE/5E19C22F/5E3288CF" Ref="#PWR?"  Part="1" 
F 0 "#PWR?" H 7500 5850 50  0001 C CNN
F 1 "GND" H 7500 5950 50  0000 C CNN
F 2 "" H 7500 6100 50  0001 C CNN
F 3 "" H 7500 6100 50  0001 C CNN
	1    7500 6100
	1    0    0    -1  
$EndComp
Wire Wire Line
	7500 6100 7500 6000
$Comp
L power:+3.3V #PWR?
U 1 1 5E32D94D
P 7500 4800
F 0 "#PWR?" H 7500 4650 50  0001 C CNN
F 1 "+3.3V" H 7500 4940 50  0000 C CNN
F 2 "" H 7500 4800 50  0001 C CNN
F 3 "" H 7500 4800 50  0001 C CNN
	1    7500 4800
	1    0    0    -1  
$EndComp
$Comp
L Device:R R1804
U 1 1 5E36896C
P 5250 4000
F 0 "R1804" V 5330 4000 50  0000 C CNN
F 1 "100" V 5250 4000 50  0000 C CNN
F 2 "Resistor_SMD:R_0402_1005Metric" V 5180 4000 50  0001 C CNN
F 3 "~" H 5250 4000 50  0001 C CNN
F 4 "3000-0000000149" H 5250 4000 50  0001 C CNN "PartSpecification"
	1    5250 4000
	1    0    0    -1  
$EndComp
$Comp
L power:GND #PWR?
U 1 1 5E369046
P 5250 4250
F 0 "#PWR?" H 5250 4000 50  0001 C CNN
F 1 "GND" H 5250 4100 50  0000 C CNN
F 2 "" H 5250 4250 50  0001 C CNN
F 3 "" H 5250 4250 50  0001 C CNN
	1    5250 4250
	1    0    0    -1  
$EndComp
Wire Wire Line
	5250 4250 5250 4150
Wire Wire Line
	5400 3750 5250 3750
Wire Wire Line
	5250 3750 5250 3850
Wire Wire Line
	5400 3550 5100 3550
Wire Wire Line
	5100 3650 5400 3650
Text Label 5100 3650 0    50   ~ 0
SCL
Text Label 5100 3550 0    50   ~ 0
SDA
Wire Wire Line
	5750 2900 5750 2800
$Comp
L power:+3.3V #PWR?
U 1 1 5E371025
P 5750 2750
F 0 "#PWR?" H 5750 2600 50  0001 C CNN
F 1 "+3.3V" H 5750 2890 50  0000 C CNN
F 2 "" H 5750 2750 50  0001 C CNN
F 3 "" H 5750 2750 50  0001 C CNN
	1    5750 2750
	1    0    0    -1  
$EndComp
$Comp
L Device:R R1803
U 1 1 5E3719D4
P 5250 3100
F 0 "R1803" V 5330 3100 50  0000 C CNN
F 1 "100" V 5250 3100 50  0000 C CNN
F 2 "Resistor_SMD:R_0402_1005Metric" V 5180 3100 50  0001 C CNN
F 3 "~" H 5250 3100 50  0001 C CNN
F 4 "3000-0000000149" H 5250 3100 50  0001 C CNN "PartSpecification"
	1    5250 3100
	1    0    0    -1  
$EndComp
Wire Wire Line
	5400 3350 5250 3350
Wire Wire Line
	5250 3350 5250 3250
Wire Wire Line
	5250 2950 5250 2800
Wire Wire Line
	5250 2800 5750 2800
Connection ~ 5750 2800
Wire Wire Line
	5750 2800 5750 2750
$Comp
L power:+3.3V #PWR?
U 1 1 5E374500
P 6150 2750
F 0 "#PWR?" H 6150 2600 50  0001 C CNN
F 1 "+3.3V" H 6150 2890 50  0000 C CNN
F 2 "" H 6150 2750 50  0001 C CNN
F 3 "" H 6150 2750 50  0001 C CNN
	1    6150 2750
	1    0    0    -1  
$EndComp
Wire Wire Line
	6150 2750 6150 2900
$Comp
L power:GND #PWR?
U 1 1 5E375B0D
P 5750 4300
F 0 "#PWR?" H 5750 4050 50  0001 C CNN
F 1 "GND" H 5750 4150 50  0000 C CNN
F 2 "" H 5750 4300 50  0001 C CNN
F 3 "" H 5750 4300 50  0001 C CNN
	1    5750 4300
	1    0    0    -1  
$EndComp
$Comp
L power:GND #PWR?
U 1 1 5E375C6B
P 5850 4300
F 0 "#PWR?" H 5850 4050 50  0001 C CNN
F 1 "GND" H 5850 4150 50  0000 C CNN
F 2 "" H 5850 4300 50  0001 C CNN
F 3 "" H 5850 4300 50  0001 C CNN
	1    5850 4300
	1    0    0    -1  
$EndComp
$Comp
L power:GND #PWR?
U 1 1 5E375DFD
P 5950 4300
F 0 "#PWR?" H 5950 4050 50  0001 C CNN
F 1 "GND" H 5950 4150 50  0000 C CNN
F 2 "" H 5950 4300 50  0001 C CNN
F 3 "" H 5950 4300 50  0001 C CNN
	1    5950 4300
	1    0    0    -1  
$EndComp
$Comp
L power:GND #PWR?
U 1 1 5E375EEA
P 6150 4300
F 0 "#PWR?" H 6150 4050 50  0001 C CNN
F 1 "GND" H 6150 4150 50  0000 C CNN
F 2 "" H 6150 4300 50  0001 C CNN
F 3 "" H 6150 4300 50  0001 C CNN
	1    6150 4300
	1    0    0    -1  
$EndComp
Wire Wire Line
	6150 4300 6150 4200
Wire Wire Line
	5950 4200 5950 4300
Wire Wire Line
	5850 4300 5850 4200
Wire Wire Line
	5750 4200 5750 4300
Text HLabel 6650 3350 2    50   Output ~ 0
imu_int1
Text HLabel 6650 3450 2    50   Output ~ 0
imu_int2
Wire Wire Line
	6650 3350 6500 3350
Wire Wire Line
	6500 3450 6650 3450
Text HLabel 6050 5000 0    50   Input ~ 0
fan_tach_12[0..4]
Text HLabel 9650 5000 2    50   Output ~ 0
fan_tach_3_3[0..4]
Text Label 7050 5650 2    50   ~ 0
fan_tach_120
Text Label 8500 5650 2    50   ~ 0
fan_tach_3_30
$Comp
L 000_PreferredParts:C_0_1uF C1803
U 1 1 5E3FE98C
P 5350 2250
F 0 "C1803" H 5375 2350 50  0000 L CNN
F 1 "C_0_1uF" H 5375 2150 50  0001 L CNN
F 2 "Capacitor_SMD:C_0402_1005Metric" H 5388 2100 50  0001 C CNN
F 3 "~" H 5350 2250 50  0001 C CNN
F 4 "0.1uF" H 5500 2150 50  0000 C CNN "DisplayValue"
F 5 "3000-0000000125" H 5350 2250 50  0001 C CNN "PartSpecification"
	1    5350 2250
	1    0    0    -1  
$EndComp
$Comp
L 000_PreferredParts:C_0_1uF C1802
U 1 1 5E3FF5F4
P 5000 2250
F 0 "C1802" H 5025 2350 50  0000 L CNN
F 1 "C_0_1uF" H 5025 2150 50  0001 L CNN
F 2 "Capacitor_SMD:C_0402_1005Metric" H 5038 2100 50  0001 C CNN
F 3 "~" H 5000 2250 50  0001 C CNN
F 4 "0.1uF" H 5150 2150 50  0000 C CNN "DisplayValue"
F 5 "3000-0000000125" H 5000 2250 50  0001 C CNN "PartSpecification"
	1    5000 2250
	1    0    0    -1  
$EndComp
$Comp
L power:+3.3V #PWR?
U 1 1 5E3FF8F5
P 5350 2000
F 0 "#PWR?" H 5350 1850 50  0001 C CNN
F 1 "+3.3V" H 5350 2140 50  0000 C CNN
F 2 "" H 5350 2000 50  0001 C CNN
F 3 "" H 5350 2000 50  0001 C CNN
	1    5350 2000
	1    0    0    -1  
$EndComp
$Comp
L power:+3.3V #PWR?
U 1 1 5E3FFC5F
P 5000 2000
F 0 "#PWR?" H 5000 1850 50  0001 C CNN
F 1 "+3.3V" H 5000 2140 50  0000 C CNN
F 2 "" H 5000 2000 50  0001 C CNN
F 3 "" H 5000 2000 50  0001 C CNN
	1    5000 2000
	1    0    0    -1  
$EndComp
$Comp
L power:GND #PWR?
U 1 1 5E400898
P 5350 2500
F 0 "#PWR?" H 5350 2250 50  0001 C CNN
F 1 "GND" H 5350 2350 50  0000 C CNN
F 2 "" H 5350 2500 50  0001 C CNN
F 3 "" H 5350 2500 50  0001 C CNN
	1    5350 2500
	1    0    0    -1  
$EndComp
$Comp
L power:GND #PWR?
U 1 1 5E400F14
P 5000 2500
F 0 "#PWR?" H 5000 2250 50  0001 C CNN
F 1 "GND" H 5000 2350 50  0000 C CNN
F 2 "" H 5000 2500 50  0001 C CNN
F 3 "" H 5000 2500 50  0001 C CNN
	1    5000 2500
	1    0    0    -1  
$EndComp
Wire Wire Line
	5000 2500 5000 2400
Wire Wire Line
	5350 2500 5350 2400
Wire Wire Line
	5350 2100 5350 2000
Wire Wire Line
	5000 2100 5000 2000
$Comp
L Device:Polyfuse F1801
U 1 1 5E422A4D
P 2500 2800
F 0 "F1801" V 2400 2800 50  0000 C CNN
F 1 "Polyfuse" V 2600 2800 50  0000 C CNN
F 2 "Fuse:Fuse_1206_3216Metric" H 2550 2600 50  0001 L CNN
F 3 "~" H 2500 2800 50  0001 C CNN
F 4 "0ZCJ0005FF2E" V 2500 2800 50  0001 C CNN "PartNumber"
F 5 "3000-0000000483" H 2500 2800 50  0001 C CNN "PartSpecification"
	1    2500 2800
	1    0    0    -1  
$EndComp
Wire Wire Line
	2500 2550 2500 2650
$Comp
L 000_PreferredParts:C_0_1uF C1801
U 1 1 5E425501
P 2750 3450
F 0 "C1801" H 2775 3550 50  0000 L CNN
F 1 "C_0_1uF" H 2775 3350 50  0001 L CNN
F 2 "Capacitor_SMD:C_0402_1005Metric" H 2788 3300 50  0001 C CNN
F 3 "~" H 2750 3450 50  0001 C CNN
F 4 "0.1uF" H 2900 3350 50  0000 C CNN "DisplayValue"
F 5 "3000-0000000125" H 2750 3450 50  0001 C CNN "PartSpecification"
	1    2750 3450
	1    0    0    -1  
$EndComp
$Comp
L power:GND #PWR?
U 1 1 5E42592E
P 2750 3700
AR Path="/5E1922DE/5E42592E" Ref="#PWR?"  Part="1" 
AR Path="/5E1922DE/5E19C22F/5E42592E" Ref="#PWR?"  Part="1" 
F 0 "#PWR?" H 2750 3450 50  0001 C CNN
F 1 "GND" H 2750 3550 50  0000 C CNN
F 2 "" H 2750 3700 50  0001 C CNN
F 3 "" H 2750 3700 50  0001 C CNN
	1    2750 3700
	1    0    0    -1  
$EndComp
Wire Wire Line
	2750 3700 2750 3600
Wire Wire Line
	2750 3300 2500 3300
Connection ~ 2500 3300
$Comp
L Device:R R1802
U 1 1 5E65FC0A
P 3150 3200
F 0 "R1802" V 3230 3200 50  0000 C CNN
F 1 "1k" V 3150 3200 50  0000 C CNN
F 2 "Resistor_SMD:R_0402_1005Metric" V 3080 3200 50  0001 C CNN
F 3 "~" H 3150 3200 50  0001 C CNN
F 4 "3000-0000000156" H 3150 3200 50  0001 C CNN "PartSpecification"
	1    3150 3200
	0    1    1    0   
$EndComp
$Comp
L power:GND #PWR?
U 1 1 5E662445
P 3500 3750
AR Path="/5E1922DE/5E662445" Ref="#PWR?"  Part="1" 
AR Path="/5E1922DE/5E19C22F/5E662445" Ref="#PWR?"  Part="1" 
F 0 "#PWR?" H 3500 3500 50  0001 C CNN
F 1 "GND" H 3500 3600 50  0000 C CNN
F 2 "" H 3500 3750 50  0001 C CNN
F 3 "" H 3500 3750 50  0001 C CNN
	1    3500 3750
	1    0    0    -1  
$EndComp
$Comp
L power:+3.3V #PWR?
U 1 1 5E662837
P 3500 2700
AR Path="/5E1922DE/5E662837" Ref="#PWR?"  Part="1" 
AR Path="/5E1922DE/5E19C22F/5E662837" Ref="#PWR?"  Part="1" 
F 0 "#PWR?" H 3500 2550 50  0001 C CNN
F 1 "+3.3V" H 3500 2840 50  0000 C CNN
F 2 "" H 3500 2700 50  0001 C CNN
F 3 "" H 3500 2700 50  0001 C CNN
	1    3500 2700
	1    0    0    -1  
$EndComp
Wire Wire Line
	3500 2700 3500 2800
Wire Wire Line
	3500 3650 3500 3750
Wire Wire Line
	3500 3100 3500 3200
Connection ~ 3500 3200
Wire Wire Line
	3500 3200 3500 3350
Wire Wire Line
	3300 3200 3500 3200
Wire Wire Line
	3500 3200 3800 3200
$Comp
L power:GND #PWR?
U 1 1 5EB78CF5
P 5750 5800
AR Path="/5E1922DE/5EB78CF5" Ref="#PWR?"  Part="1" 
AR Path="/5E1922DE/5E19C22F/5EB78CF5" Ref="#PWR?"  Part="1" 
F 0 "#PWR?" H 5750 5550 50  0001 C CNN
F 1 "GND" H 5750 5650 50  0000 C CNN
F 2 "" H 5750 5800 50  0001 C CNN
F 3 "" H 5750 5800 50  0001 C CNN
	1    5750 5800
	1    0    0    -1  
$EndComp
Wire Bus Line
	6050 5000 6100 5000
Entry Wire Line
	6100 5550 6200 5650
Entry Wire Line
	6100 5050 6200 5150
Entry Wire Line
	6100 5150 6200 5250
Wire Wire Line
	6200 5650 7200 5650
Wire Wire Line
	6200 5150 7200 5150
Wire Wire Line
	6200 5250 7200 5250
Text Label 7050 5150 2    50   ~ 0
fan_tach_121
Text Label 7050 5250 2    50   ~ 0
fan_tach_122
Text Label 8500 5150 2    50   ~ 0
fan_tach_3_31
Text Label 8500 5250 2    50   ~ 0
fan_tach_3_32
Wire Bus Line
	9650 5000 9550 5000
Entry Wire Line
	9550 5150 9450 5250
Entry Wire Line
	9550 5050 9450 5150
Entry Wire Line
	9550 5550 9450 5650
Wire Wire Line
	7800 5650 9450 5650
Wire Wire Line
	7800 5150 9450 5150
Wire Wire Line
	7800 5250 9450 5250
$Comp
L 000_PreferredDiodes:D_Schottky_60V_1A D1802
U 1 1 5F890E7D
P 3500 3500
F 0 "D1802" H 3500 3600 50  0000 C CNN
F 1 "D_Schottky_60V_1A" H 3500 3400 50  0001 C CNN
F 2 "Diode_SMD:D_SOD-123F" H 3500 3500 50  0001 C CNN
F 3 "~" H 3500 3500 50  0001 C CNN
F 4 "DSS16UTR" H 3500 3500 50  0001 C CNN "PartNumber"
F 5 "Schottky" H 3500 3400 50  0000 C CNN "DisplayValue"
F 6 "60V_1A" H 3500 3300 50  0000 C CNN "DisplayValue2"
F 7 "3000-0000000481" H 3500 3500 50  0001 C CNN "PartSpecification"
	1    3500 3500
	0    1    1    0   
$EndComp
$Comp
L 000_PreferredDiodes:D_Schottky_60V_1A D1801
U 1 1 5F891455
P 3500 2950
F 0 "D1801" H 3500 3050 50  0000 C CNN
F 1 "D_Schottky_60V_1A" H 3500 2850 50  0001 C CNN
F 2 "Diode_SMD:D_SOD-123F" H 3500 2950 50  0001 C CNN
F 3 "~" H 3500 2950 50  0001 C CNN
F 4 "DSS16UTR" H 3500 2950 50  0001 C CNN "PartNumber"
F 5 "Schottky" H 3500 2850 50  0000 C CNN "DisplayValue"
F 6 "60V_1A" H 3500 2750 50  0000 C CNN "DisplayValue2"
F 7 "3000-0000000481" H 3500 2950 50  0001 C CNN "PartSpecification"
	1    3500 2950
	0    1    1    0   
$EndComp
$Comp
L Connector:RJ45_Shielded J1804
U 1 1 5E3F3FFA
P 5050 5650
F 0 "J1804" H 4850 6200 50  0000 R CNN
F 1 "RJ45" H 5150 6200 50  0000 L CNN
F 2 "POWDER_Misc:MTJ-88TX1-FSD-PGB" V 5050 5675 50  0001 C CNN
F 3 "~" V 5050 5675 50  0001 C CNN
F 4 "3000-0000000491" H 5050 5650 50  0001 C CNN "PartSpecification"
	1    5050 5650
	1    0    0    -1  
$EndComp
Wire Wire Line
	5750 5650 5750 5800
Wire Wire Line
	5450 5750 6300 5750
$Comp
L power:GND #PWR?
U 1 1 5E4014CD
P 5050 6250
AR Path="/5E1922DE/5E4014CD" Ref="#PWR?"  Part="1" 
AR Path="/5E1922DE/5E19C22F/5E4014CD" Ref="#PWR?"  Part="1" 
F 0 "#PWR?" H 5050 6000 50  0001 C CNN
F 1 "GND" H 5050 6100 50  0000 C CNN
F 2 "" H 5050 6250 50  0001 C CNN
F 3 "" H 5050 6250 50  0001 C CNN
	1    5050 6250
	1    0    0    -1  
$EndComp
Wire Wire Line
	5050 6250 5050 6150
NoConn ~ 5450 5950
NoConn ~ 5450 5550
NoConn ~ 5450 5450
NoConn ~ 5450 5350
NoConn ~ 5450 5250
Wire Wire Line
	5450 5650 5750 5650
NoConn ~ 5450 5850
Entry Wire Line
	6100 5450 6200 5550
Entry Wire Line
	6100 5250 6200 5350
Wire Wire Line
	6200 5550 7200 5550
Wire Wire Line
	6200 5350 7200 5350
Text Label 7050 5550 2    50   ~ 0
fan_tach_123
Text Label 7050 5350 2    50   ~ 0
fan_tach_124
Text Label 8500 5550 2    50   ~ 0
fan_tach_3_33
Entry Wire Line
	9550 5450 9450 5550
Wire Wire Line
	7800 5550 9450 5550
Text Label 8500 5350 2    50   ~ 0
fan_tach_3_34
Entry Wire Line
	9550 5250 9450 5350
Wire Wire Line
	7800 5350 9450 5350
Text HLabel 8650 5450 2    50   Output ~ 0
charge_~discharge
Wire Wire Line
	7800 5450 8650 5450
Text Label 7950 5450 0    50   ~ 0
charge_~discharge
Wire Wire Line
	6300 5450 7200 5450
Text Label 6350 5450 0    50   ~ 0
charge_~discharge~_12
Wire Wire Line
	6300 5450 6300 5750
$Comp
L 000_PreferredParts:C_0_1uF C1804
U 1 1 5E374650
P 7000 4300
F 0 "C1804" H 7025 4400 50  0000 L CNN
F 1 "C_0_1uF" H 7025 4200 50  0001 L CNN
F 2 "Capacitor_SMD:C_0402_1005Metric" H 7038 4150 50  0001 C CNN
F 3 "~" H 7000 4300 50  0001 C CNN
F 4 "0.1uF" H 7150 4200 50  0000 C CNN "DisplayValue"
F 5 "3000-0000000125" H 7000 4300 50  0001 C CNN "PartSpecification"
	1    7000 4300
	1    0    0    -1  
$EndComp
$Comp
L power:+3.3V #PWR?
U 1 1 5E374656
P 7000 4050
F 0 "#PWR?" H 7000 3900 50  0001 C CNN
F 1 "+3.3V" H 7000 4190 50  0000 C CNN
F 2 "" H 7000 4050 50  0001 C CNN
F 3 "" H 7000 4050 50  0001 C CNN
	1    7000 4050
	1    0    0    -1  
$EndComp
$Comp
L power:GND #PWR?
U 1 1 5E37465C
P 7000 4550
F 0 "#PWR?" H 7000 4300 50  0001 C CNN
F 1 "GND" H 7000 4400 50  0000 C CNN
F 2 "" H 7000 4550 50  0001 C CNN
F 3 "" H 7000 4550 50  0001 C CNN
	1    7000 4550
	1    0    0    -1  
$EndComp
Wire Wire Line
	7000 4550 7000 4450
Wire Wire Line
	7000 4150 7000 4050
Text Label 9450 1600 0    50   ~ 0
NUC_GND
Text Label 9450 1500 0    50   ~ 0
NUC_RST
Text Label 2250 3300 0    50   ~ 0
moisture_3_3
Text Label 8650 1600 1    50   ~ 0
nuc_rst_ic
$Comp
L power:+3.3V #PWR?
U 1 1 5E38C769
P 8900 1350
F 0 "#PWR?" H 8900 1200 50  0001 C CNN
F 1 "+3.3V" H 8900 1490 50  0000 C CNN
F 2 "" H 8900 1350 50  0001 C CNN
F 3 "" H 8900 1350 50  0001 C CNN
	1    8900 1350
	1    0    0    -1  
$EndComp
Wire Wire Line
	8900 1350 8900 1500
Wire Wire Line
	8900 1500 9000 1500
$Comp
L 000_PreferredParts:C_0_1uF C1806
U 1 1 5E394DBA
P 7300 1000
F 0 "C1806" H 7325 1100 50  0000 L CNN
F 1 "C_0_1uF" H 7325 900 50  0001 L CNN
F 2 "Capacitor_SMD:C_0402_1005Metric" H 7338 850 50  0001 C CNN
F 3 "~" H 7300 1000 50  0001 C CNN
F 4 "0.1uF" H 7450 900 50  0000 C CNN "DisplayValue"
F 5 "3000-0000000125" H 7300 1000 50  0001 C CNN "PartSpecification"
	1    7300 1000
	1    0    0    -1  
$EndComp
$Comp
L power:+3.3V #PWR?
U 1 1 5E394DC0
P 7300 750
F 0 "#PWR?" H 7300 600 50  0001 C CNN
F 1 "+3.3V" H 7300 890 50  0000 C CNN
F 2 "" H 7300 750 50  0001 C CNN
F 3 "" H 7300 750 50  0001 C CNN
	1    7300 750 
	1    0    0    -1  
$EndComp
$Comp
L power:GND #PWR?
U 1 1 5E394DC6
P 7300 1250
F 0 "#PWR?" H 7300 1000 50  0001 C CNN
F 1 "GND" H 7300 1100 50  0000 C CNN
F 2 "" H 7300 1250 50  0001 C CNN
F 3 "" H 7300 1250 50  0001 C CNN
	1    7300 1250
	1    0    0    -1  
$EndComp
Wire Wire Line
	7300 1250 7300 1150
Wire Wire Line
	7300 850  7300 750 
$Comp
L 000_PreferredParts:C_0_1uF C1805
U 1 1 5E398778
P 2150 1100
F 0 "C1805" H 2175 1200 50  0000 L CNN
F 1 "C_0_1uF" H 2175 1000 50  0001 L CNN
F 2 "Capacitor_SMD:C_0402_1005Metric" H 2188 950 50  0001 C CNN
F 3 "~" H 2150 1100 50  0001 C CNN
F 4 "0.1uF" H 2300 1000 50  0000 C CNN "DisplayValue"
F 5 "3000-0000000125" H 2150 1100 50  0001 C CNN "PartSpecification"
	1    2150 1100
	1    0    0    -1  
$EndComp
$Comp
L power:+3.3V #PWR?
U 1 1 5E39877E
P 2150 850
F 0 "#PWR?" H 2150 700 50  0001 C CNN
F 1 "+3.3V" H 2150 990 50  0000 C CNN
F 2 "" H 2150 850 50  0001 C CNN
F 3 "" H 2150 850 50  0001 C CNN
	1    2150 850 
	1    0    0    -1  
$EndComp
$Comp
L power:GND #PWR?
U 1 1 5E398784
P 2150 1350
F 0 "#PWR?" H 2150 1100 50  0001 C CNN
F 1 "GND" H 2150 1200 50  0000 C CNN
F 2 "" H 2150 1350 50  0001 C CNN
F 3 "" H 2150 1350 50  0001 C CNN
	1    2150 1350
	1    0    0    -1  
$EndComp
Wire Wire Line
	2150 1350 2150 1250
Wire Wire Line
	2150 950  2150 850 
Text Label 9000 1600 3    50   ~ 0
nuc_rst_opto
Text Label 5250 3350 0    50   ~ 0
CSB
Text Label 5250 3850 0    50   ~ 0
SDO
$Comp
L POWDER_Digital:TCA9539-Q1 U1806
U 1 1 5E3C0496
P 9050 3500
F 0 "U1806" H 8600 4450 50  0000 C CNN
F 1 "TCA9539-Q1" H 9050 3500 50  0000 C CNN
F 2 "Package_SO:TSSOP-24_4.4x7.8mm_P0.65mm" H 10100 2500 50  0001 C CNN
F 3 "" H 8550 4400 50  0001 C CNN
F 4 "3000-0000000531" H 9050 3500 50  0001 C CNN "PartSpecification"
	1    9050 3500
	1    0    0    -1  
$EndComp
$Comp
L 000_PreferredParts:C_0_1uF C1807
U 1 1 5E3C81A2
P 10950 2000
F 0 "C1807" H 10975 2100 50  0000 L CNN
F 1 "C_0_1uF" H 10975 1900 50  0001 L CNN
F 2 "Capacitor_SMD:C_0402_1005Metric" H 10988 1850 50  0001 C CNN
F 3 "~" H 10950 2000 50  0001 C CNN
F 4 "0.1uF" H 11100 1900 50  0000 C CNN "DisplayValue"
F 5 "3000-0000000125" H 10950 2000 50  0001 C CNN "PartSpecification"
	1    10950 2000
	1    0    0    -1  
$EndComp
$Comp
L power:+3.3V #PWR?
U 1 1 5E3C81A8
P 10950 1750
F 0 "#PWR?" H 10950 1600 50  0001 C CNN
F 1 "+3.3V" H 10950 1890 50  0000 C CNN
F 2 "" H 10950 1750 50  0001 C CNN
F 3 "" H 10950 1750 50  0001 C CNN
	1    10950 1750
	1    0    0    -1  
$EndComp
$Comp
L power:GND #PWR?
U 1 1 5E3C81AE
P 10950 2250
F 0 "#PWR?" H 10950 2000 50  0001 C CNN
F 1 "GND" H 10950 2100 50  0000 C CNN
F 2 "" H 10950 2250 50  0001 C CNN
F 3 "" H 10950 2250 50  0001 C CNN
	1    10950 2250
	1    0    0    -1  
$EndComp
Wire Wire Line
	10950 2250 10950 2150
Wire Wire Line
	10950 1850 10950 1750
$Comp
L power:+3.3V #PWR?
U 1 1 5E3CAFF2
P 9050 2300
F 0 "#PWR?" H 9050 2150 50  0001 C CNN
F 1 "+3.3V" H 9050 2440 50  0000 C CNN
F 2 "" H 9050 2300 50  0001 C CNN
F 3 "" H 9050 2300 50  0001 C CNN
	1    9050 2300
	1    0    0    -1  
$EndComp
Wire Wire Line
	9050 2400 9050 2300
Wire Wire Line
	8350 2700 8050 2700
Wire Wire Line
	8050 2800 8350 2800
Text Label 8050 2800 0    50   ~ 0
SCL
Text Label 8050 2700 0    50   ~ 0
SDA
$Comp
L power:GND #PWR?
U 1 1 5E3D8F6E
P 9050 4700
F 0 "#PWR?" H 9050 4450 50  0001 C CNN
F 1 "GND" H 9050 4550 50  0000 C CNN
F 2 "" H 9050 4700 50  0001 C CNN
F 3 "" H 9050 4700 50  0001 C CNN
	1    9050 4700
	1    0    0    -1  
$EndComp
Wire Wire Line
	9050 4700 9050 4600
$Comp
L Device:R R1810
U 1 1 5E389595
P 8250 4500
F 0 "R1810" V 8330 4500 50  0000 C CNN
F 1 "100" V 8250 4500 50  0000 C CNN
F 2 "Resistor_SMD:R_0402_1005Metric" V 8180 4500 50  0001 C CNN
F 3 "~" H 8250 4500 50  0001 C CNN
F 4 "3000-0000000149" H 8250 4500 50  0001 C CNN "PartSpecification"
	1    8250 4500
	1    0    0    -1  
$EndComp
$Comp
L Device:R R1807
U 1 1 5E38A02F
P 8050 4500
F 0 "R1807" V 8130 4500 50  0000 C CNN
F 1 "100" V 8050 4500 50  0000 C CNN
F 2 "Resistor_SMD:R_0402_1005Metric" V 7980 4500 50  0001 C CNN
F 3 "~" H 8050 4500 50  0001 C CNN
F 4 "3000-0000000149" H 8050 4500 50  0001 C CNN "PartSpecification"
	1    8050 4500
	1    0    0    -1  
$EndComp
$Comp
L Device:R R1806
U 1 1 5E38A42B
P 8050 3950
F 0 "R1806" V 8130 3950 50  0000 C CNN
F 1 "DNP" V 8050 3950 50  0000 C CNN
F 2 "Resistor_SMD:R_0402_1005Metric" V 7980 3950 50  0001 C CNN
F 3 "~" H 8050 3950 50  0001 C CNN
	1    8050 3950
	1    0    0    -1  
$EndComp
$Comp
L Device:R R1809
U 1 1 5E38A7C5
P 8250 3950
F 0 "R1809" V 8330 3950 50  0000 C CNN
F 1 "DNP" V 8250 3950 50  0000 C CNN
F 2 "Resistor_SMD:R_0402_1005Metric" V 8180 3950 50  0001 C CNN
F 3 "~" H 8250 3950 50  0001 C CNN
	1    8250 3950
	1    0    0    -1  
$EndComp
Wire Wire Line
	8350 4200 8050 4200
Wire Wire Line
	8050 4200 8050 4350
Wire Wire Line
	8350 4300 8250 4300
Wire Wire Line
	8250 4300 8250 4350
Wire Wire Line
	8250 4100 8250 4300
Connection ~ 8250 4300
Wire Wire Line
	8050 4100 8050 4200
Connection ~ 8050 4200
$Comp
L power:+3.3V #PWR?
U 1 1 5E395984
P 8050 3700
F 0 "#PWR?" H 8050 3550 50  0001 C CNN
F 1 "+3.3V" H 8050 3840 50  0000 C CNN
F 2 "" H 8050 3700 50  0001 C CNN
F 3 "" H 8050 3700 50  0001 C CNN
	1    8050 3700
	1    0    0    -1  
$EndComp
$Comp
L power:+3.3V #PWR?
U 1 1 5E3961B2
P 8250 3700
F 0 "#PWR?" H 8250 3550 50  0001 C CNN
F 1 "+3.3V" H 8250 3840 50  0000 C CNN
F 2 "" H 8250 3700 50  0001 C CNN
F 3 "" H 8250 3700 50  0001 C CNN
	1    8250 3700
	1    0    0    -1  
$EndComp
$Comp
L power:GND #PWR?
U 1 1 5E3964E0
P 8050 4750
F 0 "#PWR?" H 8050 4500 50  0001 C CNN
F 1 "GND" H 8050 4600 50  0000 C CNN
F 2 "" H 8050 4750 50  0001 C CNN
F 3 "" H 8050 4750 50  0001 C CNN
	1    8050 4750
	1    0    0    -1  
$EndComp
$Comp
L power:GND #PWR?
U 1 1 5E3969F3
P 8250 4750
F 0 "#PWR?" H 8250 4500 50  0001 C CNN
F 1 "GND" H 8250 4600 50  0000 C CNN
F 2 "" H 8250 4750 50  0001 C CNN
F 3 "" H 8250 4750 50  0001 C CNN
	1    8250 4750
	1    0    0    -1  
$EndComp
Wire Wire Line
	8250 4650 8250 4750
Wire Wire Line
	8050 4650 8050 4750
Wire Wire Line
	8250 3800 8250 3700
Wire Wire Line
	8050 3700 8050 3800
Wire Wire Line
	8350 2900 8050 2900
Wire Wire Line
	8050 3000 8150 3000
Text HLabel 8050 2900 0    50   Output ~ 0
GPIO_INT_B
Text HLabel 8050 3000 0    50   Input ~ 0
GPIO_RESET_B
$Comp
L Device:R R1808
U 1 1 5E3B1335
P 8150 3250
F 0 "R1808" V 8230 3250 50  0000 C CNN
F 1 "1k" V 8150 3250 50  0000 C CNN
F 2 "Resistor_SMD:R_0402_1005Metric" V 8080 3250 50  0001 C CNN
F 3 "~" H 8150 3250 50  0001 C CNN
F 4 "3000-0000000156" H 8150 3250 50  0001 C CNN "PartSpecification"
	1    8150 3250
	-1   0    0    1   
$EndComp
$Comp
L power:GND #PWR?
U 1 1 5E3B3339
P 8150 3500
F 0 "#PWR?" H 8150 3250 50  0001 C CNN
F 1 "GND" H 8150 3350 50  0000 C CNN
F 2 "" H 8150 3500 50  0001 C CNN
F 3 "" H 8150 3500 50  0001 C CNN
	1    8150 3500
	1    0    0    -1  
$EndComp
Wire Wire Line
	8150 3500 8150 3400
Wire Wire Line
	8150 3100 8150 3000
Connection ~ 8150 3000
Wire Wire Line
	8150 3000 8350 3000
$Comp
L Connector_Generic:Conn_02x10_Odd_Even J1806
U 1 1 5E4188BD
P 10500 3100
F 0 "J1806" H 10550 3600 50  0000 C CNN
F 1 "Conn_02x10_Odd_Even" H 10550 2500 50  0000 C CNN
F 2 "Connector_PinHeader_1.27mm:PinHeader_2x10_P1.27mm_Vertical_SMD" H 10500 3100 50  0001 C CNN
F 3 "~" H 10500 3100 50  0001 C CNN
F 4 "3000-0000000519" H 10500 3100 50  0001 C CNN "PartSpecification"
	1    10500 3100
	1    0    0    1   
$EndComp
$Comp
L power:GND #PWR?
U 1 1 5E4476AC
P 10000 2500
F 0 "#PWR?" H 10000 2250 50  0001 C CNN
F 1 "GND" H 10000 2350 50  0000 C CNN
F 2 "" H 10000 2500 50  0001 C CNN
F 3 "" H 10000 2500 50  0001 C CNN
	1    10000 2500
	1    0    0    -1  
$EndComp
Wire Wire Line
	10000 2500 10300 2500
Wire Wire Line
	10300 2500 10300 2600
$Comp
L power:+3.3V #PWR?
U 1 1 5E44F1BD
P 10900 2500
F 0 "#PWR?" H 10900 2350 50  0001 C CNN
F 1 "+3.3V" H 10900 2640 50  0000 C CNN
F 2 "" H 10900 2500 50  0001 C CNN
F 3 "" H 10900 2500 50  0001 C CNN
	1    10900 2500
	1    0    0    -1  
$EndComp
Wire Wire Line
	10900 2500 10900 2600
Wire Wire Line
	10900 2600 10800 2600
$Comp
L power:GND #PWR?
U 1 1 5E45366E
P 10200 3550
F 0 "#PWR?" H 10200 3300 50  0001 C CNN
F 1 "GND" H 10200 3400 50  0000 C CNN
F 2 "" H 10200 3550 50  0001 C CNN
F 3 "" H 10200 3550 50  0001 C CNN
	1    10200 3550
	1    0    0    -1  
$EndComp
Wire Wire Line
	10300 3500 10200 3500
Wire Wire Line
	10200 3500 10200 3550
Wire Wire Line
	10900 2600 10900 3500
Wire Wire Line
	10900 3500 10800 3500
Connection ~ 10900 2600
Wire Wire Line
	10300 2700 9750 2700
Wire Wire Line
	9750 2800 10300 2800
Wire Wire Line
	10300 2900 9750 2900
Wire Wire Line
	9750 3000 10300 3000
Wire Wire Line
	10300 3100 9750 3100
Wire Wire Line
	9750 3200 10300 3200
Wire Wire Line
	10300 3300 9750 3300
Wire Wire Line
	9750 3400 10300 3400
Wire Wire Line
	11000 3600 11000 3400
Wire Wire Line
	11000 3400 10800 3400
Wire Wire Line
	11050 3700 11050 3300
Wire Wire Line
	11050 3300 10800 3300
Wire Wire Line
	11100 3800 11100 3200
Wire Wire Line
	11100 3200 10800 3200
Wire Wire Line
	11150 3900 11150 3100
Wire Wire Line
	11150 3100 10800 3100
Wire Wire Line
	11200 4000 11200 3000
Wire Wire Line
	11200 3000 10800 3000
Wire Wire Line
	11250 4100 11250 2900
Wire Wire Line
	11250 2900 10800 2900
Wire Wire Line
	10800 2800 11300 2800
Wire Wire Line
	11300 2800 11300 4200
Wire Wire Line
	11350 4300 11350 2700
Wire Wire Line
	11350 2700 10800 2700
Text Label 8300 4300 0    50   ~ 0
A0
Text Label 8300 4200 0    50   ~ 0
A1
Text Label 9750 2700 0    50   ~ 0
I2C_G_0_0
Text Label 9750 2800 0    50   ~ 0
I2C_G_0_1
Text Label 9750 2900 0    50   ~ 0
I2C_G_0_2
Text Label 9750 3000 0    50   ~ 0
I2C_G_0_3
Text Label 9750 3100 0    50   ~ 0
I2C_G_0_4
Text Label 9750 3200 0    50   ~ 0
I2C_G_0_5
Text Label 9750 3300 0    50   ~ 0
I2C_G_0_6
Text Label 9750 3400 0    50   ~ 0
I2C_G_0_7
Text Label 9750 3600 0    50   ~ 0
I2C_G_1_0
Text Label 9750 3700 0    50   ~ 0
I2C_G_1_1
Text Label 9750 3800 0    50   ~ 0
I2C_G_1_2
Text Label 9750 3900 0    50   ~ 0
I2C_G_1_3
Text Label 9750 4000 0    50   ~ 0
I2C_G_1_4
Text Label 9750 4100 0    50   ~ 0
I2C_G_1_5
Text Label 9750 4200 0    50   ~ 0
I2C_G_1_6
Text Label 9750 4300 0    50   ~ 0
I2C_G_1_7
Wire Wire Line
	9750 3600 11000 3600
Wire Wire Line
	9750 3700 11050 3700
Wire Wire Line
	9750 3800 11100 3800
Wire Wire Line
	9750 3900 11150 3900
Wire Wire Line
	9750 4000 11200 4000
Wire Wire Line
	9750 4100 11250 4100
Wire Wire Line
	9750 4200 11300 4200
Wire Wire Line
	9750 4300 11350 4300
Wire Bus Line
	6100 5000 6100 5550
Wire Bus Line
	9550 5000 9550 5550
$EndSCHEMATC
