EESchema Schematic File Version 4
EELAYER 30 0
EELAYER END
$Descr A4 11693 8268
encoding utf-8
Sheet 19 39
Title ""
Date ""
Rev ""
Comp ""
Comment1 ""
Comment2 ""
Comment3 ""
Comment4 ""
$EndDescr
Text HLabel 3050 2050 0    50   Input ~ 0
EN
Text HLabel 3050 2150 0    50   Input ~ 0
PS_SYNC
Text HLabel 5050 1900 2    50   Output ~ 0
DCDC_PG
Wire Wire Line
	5050 1900 4900 1900
$Comp
L power:GND #PWR?
U 1 1 5D56C9B4
P 4200 2450
AR Path="/5D562501/5D56C9B4" Ref="#PWR?"  Part="1" 
AR Path="/5D587C46/5D56C9B4" Ref="#PWR?"  Part="1" 
AR Path="/5D591ABD/5D56C9B4" Ref="#PWR?"  Part="1" 
AR Path="/60664CFF/5D56C9B4" Ref="#PWR?"  Part="1" 
AR Path="/605A4C0E/5D56C9B4" Ref="#PWR?"  Part="1" 
F 0 "#PWR?" H 4200 2200 50  0001 C CNN
F 1 "GND" H 4205 2277 50  0000 C CNN
F 2 "" H 4200 2450 50  0001 C CNN
F 3 "" H 4200 2450 50  0001 C CNN
	1    4200 2450
	1    0    0    -1  
$EndComp
$Comp
L power:GND #PWR?
U 1 1 5D56C9C9
P 4400 2450
AR Path="/5D562501/5D56C9C9" Ref="#PWR?"  Part="1" 
AR Path="/5D587C46/5D56C9C9" Ref="#PWR?"  Part="1" 
AR Path="/5D591ABD/5D56C9C9" Ref="#PWR?"  Part="1" 
AR Path="/60664CFF/5D56C9C9" Ref="#PWR?"  Part="1" 
AR Path="/605A4C0E/5D56C9C9" Ref="#PWR?"  Part="1" 
F 0 "#PWR?" H 4400 2200 50  0001 C CNN
F 1 "GND" H 4405 2277 50  0000 C CNN
F 2 "" H 4400 2450 50  0001 C CNN
F 3 "" H 4400 2450 50  0001 C CNN
	1    4400 2450
	1    0    0    -1  
$EndComp
Wire Wire Line
	4400 2450 4400 2300
Wire Wire Line
	4200 2300 4200 2450
$Comp
L 000_PreferredParts:C_100nF C204
U 1 1 5D56CA4A
P 2550 1850
AR Path="/5D562501/5D56CA4A" Ref="C204"  Part="1" 
AR Path="/5D587C46/5D56CA4A" Ref="C304"  Part="1" 
AR Path="/5D591ABD/5D56CA4A" Ref="C?"  Part="1" 
AR Path="/60664CFF/5D56CA4A" Ref="C?"  Part="1" 
AR Path="/605A4C0E/5D56CA4A" Ref="C1909"  Part="1" 
F 0 "C1909" H 2665 1896 50  0000 L CNN
F 1 "C_100nF" H 2575 1750 50  0001 L CNN
F 2 "Capacitor_SMD:C_0402_1005Metric" H 2588 1700 50  0001 C CNN
F 3 "~" H 2550 1850 50  0001 C CNN
F 4 "Murata Electronics" H 2550 1850 50  0001 C CNN "Manufacturer"
F 5 "GRM155R62A104KE14D" H 2550 1850 50  0001 C CNN "PartNumber"
F 6 "100nF" H 2700 1750 50  0000 C CNN "DisplayValue"
F 7 "3000-0000000125" H 2550 1850 50  0001 C CNN "PartSpecification"
	1    2550 1850
	1    0    0    -1  
$EndComp
Wire Wire Line
	2550 1700 2550 1550
$Comp
L power:GND #PWR?
U 1 1 60577FC1
P 2550 2150
AR Path="/5D562501/60577FC1" Ref="#PWR?"  Part="1" 
AR Path="/5D587C46/60577FC1" Ref="#PWR?"  Part="1" 
AR Path="/5D591ABD/60577FC1" Ref="#PWR?"  Part="1" 
AR Path="/60664CFF/60577FC1" Ref="#PWR?"  Part="1" 
AR Path="/605A4C0E/60577FC1" Ref="#PWR?"  Part="1" 
F 0 "#PWR?" H 2550 1900 50  0001 C CNN
F 1 "GND" H 2555 1977 50  0000 C CNN
F 2 "" H 2550 2150 50  0001 C CNN
F 3 "" H 2550 2150 50  0001 C CNN
	1    2550 2150
	1    0    0    -1  
$EndComp
Wire Wire Line
	2550 2150 2550 2000
$Comp
L Device:C C203
U 1 1 5D67CCCF
P 2150 1650
AR Path="/5D562501/5D67CCCF" Ref="C203"  Part="1" 
AR Path="/5D587C46/5D67CCCF" Ref="C303"  Part="1" 
AR Path="/5D591ABD/5D67CCCF" Ref="C?"  Part="1" 
AR Path="/60664CFF/5D67CCCF" Ref="C?"  Part="1" 
AR Path="/605A4C0E/5D67CCCF" Ref="C1908"  Part="1" 
F 0 "C1908" H 2265 1696 50  0000 L CNN
F 1 "10uF" H 2265 1605 50  0000 L CNN
F 2 "Capacitor_SMD:C_0603_1608Metric" H 2188 1500 50  0001 C CNN
F 3 "~" H 2150 1650 50  0001 C CNN
F 4 "Murata Electronics" H 2150 1650 50  0001 C CNN "Manufacturer"
F 5 "GRM188R6YA106MA73D" H 2150 1650 50  0001 C CNN "PartNumber"
F 6 "3000-0000000135" H 2150 1650 50  0001 C CNN "PartSpecification"
	1    2150 1650
	1    0    0    -1  
$EndComp
$Comp
L Device:C C202
U 1 1 60577FC2
P 1700 1650
AR Path="/5D562501/60577FC2" Ref="C202"  Part="1" 
AR Path="/5D587C46/60577FC2" Ref="C302"  Part="1" 
AR Path="/5D591ABD/60577FC2" Ref="C?"  Part="1" 
AR Path="/60664CFF/60577FC2" Ref="C?"  Part="1" 
AR Path="/605A4C0E/60577FC2" Ref="C1907"  Part="1" 
F 0 "C1907" H 1815 1696 50  0000 L CNN
F 1 "10uF" H 1815 1605 50  0000 L CNN
F 2 "Capacitor_SMD:C_0805_2012Metric" H 1738 1500 50  0001 C CNN
F 3 "~" H 1700 1650 50  0001 C CNN
F 4 "Murata Electronics" H 1700 1650 50  0001 C CNN "Manufacturer"
F 5 "GRM21BC8YA106ME11L" H 1700 1650 50  0001 C CNN "PartNumber"
F 6 "3000-0000000134" H 1700 1650 50  0001 C CNN "PartSpecification"
	1    1700 1650
	1    0    0    -1  
$EndComp
$Comp
L Device:C C201
U 1 1 5D56CC27
P 1250 1650
AR Path="/5D562501/5D56CC27" Ref="C201"  Part="1" 
AR Path="/5D587C46/5D56CC27" Ref="C301"  Part="1" 
AR Path="/5D591ABD/5D56CC27" Ref="C?"  Part="1" 
AR Path="/60664CFF/5D56CC27" Ref="C?"  Part="1" 
AR Path="/605A4C0E/5D56CC27" Ref="C1906"  Part="1" 
F 0 "C1906" H 1365 1696 50  0000 L CNN
F 1 "10uF" H 1365 1605 50  0000 L CNN
F 2 "Capacitor_SMD:C_0805_2012Metric" H 1288 1500 50  0001 C CNN
F 3 "~" H 1250 1650 50  0001 C CNN
F 4 "Murata Electronics" H 1250 1650 50  0001 C CNN "Manufacturer"
F 5 "GRM21BC8YA106ME11L" H 1250 1650 50  0001 C CNN "PartNumber"
F 6 "3000-0000000134" H 1250 1650 50  0001 C CNN "PartSpecification"
	1    1250 1650
	1    0    0    -1  
$EndComp
$Comp
L power:GND #PWR?
U 1 1 60577FC6
P 2150 1900
AR Path="/5D562501/60577FC6" Ref="#PWR?"  Part="1" 
AR Path="/5D587C46/60577FC6" Ref="#PWR?"  Part="1" 
AR Path="/5D591ABD/60577FC6" Ref="#PWR?"  Part="1" 
AR Path="/60664CFF/60577FC6" Ref="#PWR?"  Part="1" 
AR Path="/605A4C0E/60577FC6" Ref="#PWR?"  Part="1" 
F 0 "#PWR?" H 2150 1650 50  0001 C CNN
F 1 "GND" H 2155 1727 50  0000 C CNN
F 2 "" H 2150 1900 50  0001 C CNN
F 3 "" H 2150 1900 50  0001 C CNN
	1    2150 1900
	1    0    0    -1  
$EndComp
$Comp
L power:GND #PWR?
U 1 1 60577FC7
P 1700 1900
AR Path="/5D562501/60577FC7" Ref="#PWR?"  Part="1" 
AR Path="/5D587C46/60577FC7" Ref="#PWR?"  Part="1" 
AR Path="/5D591ABD/60577FC7" Ref="#PWR?"  Part="1" 
AR Path="/60664CFF/60577FC7" Ref="#PWR?"  Part="1" 
AR Path="/605A4C0E/60577FC7" Ref="#PWR?"  Part="1" 
F 0 "#PWR?" H 1700 1650 50  0001 C CNN
F 1 "GND" H 1705 1727 50  0000 C CNN
F 2 "" H 1700 1900 50  0001 C CNN
F 3 "" H 1700 1900 50  0001 C CNN
	1    1700 1900
	1    0    0    -1  
$EndComp
$Comp
L power:GND #PWR?
U 1 1 5D67CCD4
P 1250 1900
AR Path="/5D562501/5D67CCD4" Ref="#PWR?"  Part="1" 
AR Path="/5D587C46/5D67CCD4" Ref="#PWR?"  Part="1" 
AR Path="/5D591ABD/5D67CCD4" Ref="#PWR?"  Part="1" 
AR Path="/60664CFF/5D67CCD4" Ref="#PWR?"  Part="1" 
AR Path="/605A4C0E/5D67CCD4" Ref="#PWR?"  Part="1" 
F 0 "#PWR?" H 1250 1650 50  0001 C CNN
F 1 "GND" H 1255 1727 50  0000 C CNN
F 2 "" H 1250 1900 50  0001 C CNN
F 3 "" H 1250 1900 50  0001 C CNN
	1    1250 1900
	1    0    0    -1  
$EndComp
Wire Wire Line
	1250 1900 1250 1800
Wire Wire Line
	1700 1900 1700 1800
Wire Wire Line
	2150 1900 2150 1800
Wire Wire Line
	3700 1300 3500 1300
Wire Wire Line
	2150 1300 2150 1500
Wire Wire Line
	2150 1300 1700 1300
Wire Wire Line
	1700 1300 1700 1500
Connection ~ 2150 1300
Wire Wire Line
	1700 1300 1250 1300
Wire Wire Line
	1250 1300 1250 1500
Connection ~ 1700 1300
Wire Wire Line
	3700 1200 3500 1200
Wire Wire Line
	3500 1200 3500 1300
Connection ~ 3500 1300
Wire Wire Line
	1250 1300 900  1300
Connection ~ 1250 1300
Text HLabel 900  1300 0    50   Input ~ 0
V_12
$Comp
L Device:L L201
U 1 1 5D67CCD5
P 4300 800
AR Path="/5D562501/5D67CCD5" Ref="L201"  Part="1" 
AR Path="/5D587C46/5D67CCD5" Ref="L301"  Part="1" 
AR Path="/5D591ABD/5D67CCD5" Ref="L?"  Part="1" 
AR Path="/60664CFF/5D67CCD5" Ref="L?"  Part="1" 
AR Path="/605A4C0E/5D67CCD5" Ref="L1901"  Part="1" 
F 0 "L1901" V 4490 800 50  0000 C CNN
F 1 "1.5uH" V 4399 800 50  0000 C CNN
F 2 "Inductor_SMD:L_Taiyo-Yuden_MD-4040" H 4300 800 50  0001 C CNN
F 3 "~" H 4300 800 50  0001 C CNN
F 4 "ABRACON" H 4300 800 50  0001 C CNN "Manufacturer"
F 5 "ASPI-4030S-1R5N-T" H 4300 800 50  0001 C CNN "PartNumber"
F 6 "3000-0000000076" V 4300 800 50  0001 C CNN "PartSpecification"
	1    4300 800 
	0    -1   -1   0   
$EndComp
Wire Wire Line
	4150 800  4100 800 
Wire Wire Line
	4100 800  4100 950 
Wire Wire Line
	4450 800  4500 800 
Wire Wire Line
	4500 800  4500 950 
$Comp
L Device:C C205
U 1 1 5D67CCD6
P 6450 1500
AR Path="/5D562501/5D67CCD6" Ref="C205"  Part="1" 
AR Path="/5D587C46/5D67CCD6" Ref="C305"  Part="1" 
AR Path="/5D591ABD/5D67CCD6" Ref="C?"  Part="1" 
AR Path="/60664CFF/5D67CCD6" Ref="C?"  Part="1" 
AR Path="/605A4C0E/5D67CCD6" Ref="C1901"  Part="1" 
F 0 "C1901" H 6565 1546 50  0000 L CNN
F 1 "10uF" H 6565 1455 50  0000 L CNN
F 2 "Capacitor_SMD:C_0603_1608Metric" H 6488 1350 50  0001 C CNN
F 3 "~" H 6450 1500 50  0001 C CNN
F 4 "Murata Electronics" H 6450 1500 50  0001 C CNN "Manufacturer"
F 5 "GRM188R6YA106MA73D" H 6450 1500 50  0001 C CNN "PartNumber"
F 6 "3000-0000000135" H 6450 1500 50  0001 C CNN "PartSpecification"
	1    6450 1500
	1    0    0    -1  
$EndComp
$Comp
L Device:R R202
U 1 1 60577FD3
P 6000 1500
AR Path="/5D562501/60577FD3" Ref="R202"  Part="1" 
AR Path="/5D587C46/60577FD3" Ref="R302"  Part="1" 
AR Path="/5D591ABD/60577FD3" Ref="R?"  Part="1" 
AR Path="/60664CFF/60577FD3" Ref="R?"  Part="1" 
AR Path="/605A4C0E/60577FD3" Ref="R1901"  Part="1" 
F 0 "R1901" H 6070 1546 50  0000 L CNN
F 1 "1M" H 6070 1455 50  0000 L CNN
F 2 "Resistor_SMD:R_0402_1005Metric" V 5930 1500 50  0001 C CNN
F 3 "~" H 6000 1500 50  0001 C CNN
F 4 "" H 6000 1500 50  0001 C CNN "Manufacturer"
F 5 "" H 6000 1500 50  0001 C CNN "PartNumber"
F 6 "3000-0000000139" H 6000 1500 50  0001 C CNN "PartSpecification"
	1    6000 1500
	1    0    0    -1  
$EndComp
Wire Wire Line
	4900 1300 5100 1300
Wire Wire Line
	6000 1350 6000 1300
Connection ~ 6000 1300
$Comp
L Device:R R203
U 1 1 5D67CCD8
P 6000 1900
AR Path="/5D562501/5D67CCD8" Ref="R203"  Part="1" 
AR Path="/5D587C46/5D67CCD8" Ref="R303"  Part="1" 
AR Path="/5D591ABD/5D67CCD8" Ref="R?"  Part="1" 
AR Path="/60664CFF/5D67CCD8" Ref="R?"  Part="1" 
AR Path="/605A4C0E/5D67CCD8" Ref="R1902"  Part="1" 
F 0 "R1902" H 6070 1946 50  0000 L CNN
F 1 "150k" H 6070 1855 50  0000 L CNN
F 2 "Resistor_SMD:R_0402_1005Metric" V 5930 1900 50  0001 C CNN
F 3 "~" H 6000 1900 50  0001 C CNN
F 4 "Stackpole Electronics Inc" H 6000 1900 50  0001 C CNN "Manufacturer"
F 5 "" H 6000 1900 50  0001 C CNN "PartNumber"
F 6 "3000-0000000579" H 6000 1900 50  0001 C CNN "PartSpecification"
	1    6000 1900
	1    0    0    -1  
$EndComp
Wire Wire Line
	6000 1650 6000 1700
Wire Wire Line
	4900 1550 5650 1550
Connection ~ 6000 1700
Wire Wire Line
	6000 1700 6000 1750
Wire Wire Line
	5650 1700 5650 1550
Wire Wire Line
	5650 1700 6000 1700
$Comp
L power:GND #PWR?
U 1 1 60577FD9
P 6000 2150
AR Path="/5D562501/60577FD9" Ref="#PWR?"  Part="1" 
AR Path="/5D587C46/60577FD9" Ref="#PWR?"  Part="1" 
AR Path="/5D591ABD/60577FD9" Ref="#PWR?"  Part="1" 
AR Path="/60664CFF/60577FD9" Ref="#PWR?"  Part="1" 
AR Path="/605A4C0E/60577FD9" Ref="#PWR?"  Part="1" 
F 0 "#PWR?" H 6000 1900 50  0001 C CNN
F 1 "GND" H 6005 1977 50  0000 C CNN
F 2 "" H 6000 2150 50  0001 C CNN
F 3 "" H 6000 2150 50  0001 C CNN
	1    6000 2150
	1    0    0    -1  
$EndComp
Wire Wire Line
	6000 2150 6000 2050
Wire Wire Line
	6450 1350 6450 1300
Wire Wire Line
	6000 1300 6450 1300
$Comp
L power:GND #PWR?
U 1 1 60577FDA
P 6450 1750
AR Path="/5D562501/60577FDA" Ref="#PWR?"  Part="1" 
AR Path="/5D587C46/60577FDA" Ref="#PWR?"  Part="1" 
AR Path="/5D591ABD/60577FDA" Ref="#PWR?"  Part="1" 
AR Path="/60664CFF/60577FDA" Ref="#PWR?"  Part="1" 
AR Path="/605A4C0E/60577FDA" Ref="#PWR?"  Part="1" 
F 0 "#PWR?" H 6450 1500 50  0001 C CNN
F 1 "GND" H 6455 1577 50  0000 C CNN
F 2 "" H 6450 1750 50  0001 C CNN
F 3 "" H 6450 1750 50  0001 C CNN
	1    6450 1750
	1    0    0    -1  
$EndComp
Wire Wire Line
	6450 1750 6450 1650
$Comp
L power:GND #PWR?
U 1 1 60577FC9
P 6950 1750
AR Path="/5D562501/60577FC9" Ref="#PWR?"  Part="1" 
AR Path="/5D587C46/60577FC9" Ref="#PWR?"  Part="1" 
AR Path="/5D591ABD/60577FC9" Ref="#PWR?"  Part="1" 
AR Path="/60664CFF/60577FC9" Ref="#PWR?"  Part="1" 
AR Path="/605A4C0E/60577FC9" Ref="#PWR?"  Part="1" 
F 0 "#PWR?" H 6950 1500 50  0001 C CNN
F 1 "GND" H 6955 1577 50  0000 C CNN
F 2 "" H 6950 1750 50  0001 C CNN
F 3 "" H 6950 1750 50  0001 C CNN
	1    6950 1750
	1    0    0    -1  
$EndComp
Wire Wire Line
	6950 1750 6950 1650
Wire Wire Line
	6950 1350 6950 1300
Wire Wire Line
	6950 1300 6800 1300
Connection ~ 6450 1300
$Comp
L power:GND #PWR?
U 1 1 5D67CCDF
P 7750 1750
AR Path="/5D562501/5D67CCDF" Ref="#PWR?"  Part="1" 
AR Path="/5D587C46/5D67CCDF" Ref="#PWR?"  Part="1" 
AR Path="/5D591ABD/5D67CCDF" Ref="#PWR?"  Part="1" 
AR Path="/60664CFF/5D67CCDF" Ref="#PWR?"  Part="1" 
AR Path="/605A4C0E/5D67CCDF" Ref="#PWR?"  Part="1" 
F 0 "#PWR?" H 7750 1500 50  0001 C CNN
F 1 "GND" H 7755 1577 50  0000 C CNN
F 2 "" H 7750 1750 50  0001 C CNN
F 3 "" H 7750 1750 50  0001 C CNN
	1    7750 1750
	1    0    0    -1  
$EndComp
Wire Wire Line
	7750 1750 7750 1650
Wire Wire Line
	7750 1350 7750 1300
$Comp
L power:GND #PWR?
U 1 1 5D67CCE1
P 8550 1750
AR Path="/5D562501/5D67CCE1" Ref="#PWR?"  Part="1" 
AR Path="/5D587C46/5D67CCE1" Ref="#PWR?"  Part="1" 
AR Path="/5D591ABD/5D67CCE1" Ref="#PWR?"  Part="1" 
AR Path="/60664CFF/5D67CCE1" Ref="#PWR?"  Part="1" 
AR Path="/605A4C0E/5D67CCE1" Ref="#PWR?"  Part="1" 
F 0 "#PWR?" H 8550 1500 50  0001 C CNN
F 1 "GND" H 8555 1577 50  0000 C CNN
F 2 "" H 8550 1750 50  0001 C CNN
F 3 "" H 8550 1750 50  0001 C CNN
	1    8550 1750
	1    0    0    -1  
$EndComp
Wire Wire Line
	8550 1750 8550 1650
Wire Wire Line
	8550 1350 8550 1300
Wire Wire Line
	6950 1300 7750 1300
Connection ~ 6950 1300
Connection ~ 7750 1300
Wire Wire Line
	7750 1300 8550 1300
Text Label 2650 1550 0    50   ~ 0
V_AUX
Text Label 5100 1550 0    50   ~ 0
FB
Text Label 4100 800  0    50   ~ 0
L1
Text Label 4500 800  0    50   ~ 0
L2
$Comp
L 000_PreferredParts:C_10uF_0805 C206
U 1 1 5D72B746
P 6950 1500
AR Path="/5D562501/5D72B746" Ref="C206"  Part="1" 
AR Path="/5D587C46/5D72B746" Ref="C306"  Part="1" 
AR Path="/60664CFF/5D72B746" Ref="C?"  Part="1" 
AR Path="/605A4C0E/5D72B746" Ref="C1902"  Part="1" 
F 0 "C1902" H 7065 1546 50  0000 L CNN
F 1 "C_10uF_0805" H 7065 1455 50  0000 L CNN
F 2 "Capacitor_SMD:C_0805_2012Metric" H 6988 1350 50  0001 C CNN
F 3 "~" H 6950 1500 50  0001 C CNN
F 4 "Murata Electronics" H 6950 1500 50  0001 C CNN "Manufacturer"
F 5 "GRM21BC8YA106ME11L" H 6950 1500 50  0001 C CNN "PartNumber"
F 6 "3000-0000000134" H 6950 1500 50  0001 C CNN "PartSpecification"
	1    6950 1500
	1    0    0    -1  
$EndComp
$Comp
L 000_PreferredParts:C_10uF_0805 C208
U 1 1 5D72B7B9
P 7750 1500
AR Path="/5D562501/5D72B7B9" Ref="C208"  Part="1" 
AR Path="/5D587C46/5D72B7B9" Ref="C308"  Part="1" 
AR Path="/60664CFF/5D72B7B9" Ref="C?"  Part="1" 
AR Path="/605A4C0E/5D72B7B9" Ref="C1903"  Part="1" 
F 0 "C1903" H 7865 1546 50  0000 L CNN
F 1 "C_10uF_0805" H 7865 1455 50  0000 L CNN
F 2 "Capacitor_SMD:C_0805_2012Metric" H 7788 1350 50  0001 C CNN
F 3 "~" H 7750 1500 50  0001 C CNN
F 4 "Murata Electronics" H 7750 1500 50  0001 C CNN "Manufacturer"
F 5 "GRM21BC8YA106ME11L" H 7750 1500 50  0001 C CNN "PartNumber"
F 6 "3000-0000000134" H 7750 1500 50  0001 C CNN "PartSpecification"
	1    7750 1500
	1    0    0    -1  
$EndComp
$Comp
L 000_PreferredParts:C_10uF_0805 C210
U 1 1 60577FE3
P 8550 1500
AR Path="/5D562501/60577FE3" Ref="C210"  Part="1" 
AR Path="/5D587C46/60577FE3" Ref="C310"  Part="1" 
AR Path="/60664CFF/60577FE3" Ref="C?"  Part="1" 
AR Path="/605A4C0E/60577FE3" Ref="C1904"  Part="1" 
F 0 "C1904" H 8665 1546 50  0000 L CNN
F 1 "C_10uF_0805" H 8665 1455 50  0000 L CNN
F 2 "Capacitor_SMD:C_0805_2012Metric" H 8588 1350 50  0001 C CNN
F 3 "~" H 8550 1500 50  0001 C CNN
F 4 "Murata Electronics" H 8550 1500 50  0001 C CNN "Manufacturer"
F 5 "GRM21BC8YA106ME11L" H 8550 1500 50  0001 C CNN "PartNumber"
F 6 "3000-0000000134" H 8550 1500 50  0001 C CNN "PartSpecification"
	1    8550 1500
	1    0    0    -1  
$EndComp
$Comp
L power:GND #PWR?
U 1 1 60577FE4
P 6950 2500
AR Path="/5D562501/60577FE4" Ref="#PWR?"  Part="1" 
AR Path="/5D587C46/60577FE4" Ref="#PWR?"  Part="1" 
AR Path="/5D591ABD/60577FE4" Ref="#PWR?"  Part="1" 
AR Path="/60664CFF/60577FE4" Ref="#PWR?"  Part="1" 
AR Path="/605A4C0E/60577FE4" Ref="#PWR?"  Part="1" 
F 0 "#PWR?" H 6950 2250 50  0001 C CNN
F 1 "GND" H 6955 2327 50  0000 C CNN
F 2 "" H 6950 2500 50  0001 C CNN
F 3 "" H 6950 2500 50  0001 C CNN
	1    6950 2500
	1    0    0    -1  
$EndComp
Wire Wire Line
	6950 2500 6950 2400
Wire Wire Line
	6950 2100 6950 2050
Wire Wire Line
	6950 2050 6800 2050
$Comp
L power:GND #PWR?
U 1 1 60577FE5
P 7750 2500
AR Path="/5D562501/60577FE5" Ref="#PWR?"  Part="1" 
AR Path="/5D587C46/60577FE5" Ref="#PWR?"  Part="1" 
AR Path="/5D591ABD/60577FE5" Ref="#PWR?"  Part="1" 
AR Path="/60664CFF/60577FE5" Ref="#PWR?"  Part="1" 
AR Path="/605A4C0E/60577FE5" Ref="#PWR?"  Part="1" 
F 0 "#PWR?" H 7750 2250 50  0001 C CNN
F 1 "GND" H 7755 2327 50  0000 C CNN
F 2 "" H 7750 2500 50  0001 C CNN
F 3 "" H 7750 2500 50  0001 C CNN
	1    7750 2500
	1    0    0    -1  
$EndComp
Wire Wire Line
	7750 2500 7750 2400
Wire Wire Line
	7750 2100 7750 2050
$Comp
L power:GND #PWR?
U 1 1 5D72DE4B
P 9350 1750
AR Path="/5D562501/5D72DE4B" Ref="#PWR?"  Part="1" 
AR Path="/5D587C46/5D72DE4B" Ref="#PWR?"  Part="1" 
AR Path="/5D591ABD/5D72DE4B" Ref="#PWR?"  Part="1" 
AR Path="/60664CFF/5D72DE4B" Ref="#PWR?"  Part="1" 
AR Path="/605A4C0E/5D72DE4B" Ref="#PWR?"  Part="1" 
F 0 "#PWR?" H 9350 1500 50  0001 C CNN
F 1 "GND" H 9355 1577 50  0000 C CNN
F 2 "" H 9350 1750 50  0001 C CNN
F 3 "" H 9350 1750 50  0001 C CNN
	1    9350 1750
	1    0    0    -1  
$EndComp
Wire Wire Line
	9350 1750 9350 1650
Wire Wire Line
	9350 1350 9350 1300
Wire Wire Line
	6950 2050 7750 2050
Connection ~ 6950 2050
Wire Wire Line
	8550 1300 9350 1300
$Comp
L 000_PreferredParts:C_10uF_0805 C207
U 1 1 60577FE8
P 6950 2250
AR Path="/5D562501/60577FE8" Ref="C207"  Part="1" 
AR Path="/5D587C46/60577FE8" Ref="C307"  Part="1" 
AR Path="/60664CFF/60577FE8" Ref="C?"  Part="1" 
AR Path="/605A4C0E/60577FE8" Ref="C1910"  Part="1" 
F 0 "C1910" H 7065 2296 50  0000 L CNN
F 1 "C_10uF_0805" H 7065 2205 50  0000 L CNN
F 2 "Capacitor_SMD:C_0805_2012Metric" H 6988 2100 50  0001 C CNN
F 3 "~" H 6950 2250 50  0001 C CNN
F 4 "Murata Electronics" H 6950 2250 50  0001 C CNN "Manufacturer"
F 5 "GRM21BC8YA106ME11L" H 6950 2250 50  0001 C CNN "PartNumber"
F 6 "3000-0000000134" H 6950 2250 50  0001 C CNN "PartSpecification"
	1    6950 2250
	1    0    0    -1  
$EndComp
$Comp
L 000_PreferredParts:C_10uF_0805 C209
U 1 1 60577FEA
P 7750 2250
AR Path="/5D562501/60577FEA" Ref="C209"  Part="1" 
AR Path="/5D587C46/60577FEA" Ref="C309"  Part="1" 
AR Path="/60664CFF/60577FEA" Ref="C?"  Part="1" 
AR Path="/605A4C0E/60577FEA" Ref="C1911"  Part="1" 
F 0 "C1911" H 7865 2296 50  0000 L CNN
F 1 "C_10uF_0805" H 7865 2205 50  0000 L CNN
F 2 "Capacitor_SMD:C_0805_2012Metric" H 7788 2100 50  0001 C CNN
F 3 "~" H 7750 2250 50  0001 C CNN
F 4 "Murata Electronics" H 7750 2250 50  0001 C CNN "Manufacturer"
F 5 "GRM21BC8YA106ME11L" H 7750 2250 50  0001 C CNN "PartNumber"
F 6 "3000-0000000134" H 7750 2250 50  0001 C CNN "PartSpecification"
	1    7750 2250
	1    0    0    -1  
$EndComp
$Comp
L 000_PreferredParts:C_10uF_0805 C211
U 1 1 60577FEC
P 9350 1500
AR Path="/5D562501/60577FEC" Ref="C211"  Part="1" 
AR Path="/5D587C46/60577FEC" Ref="C311"  Part="1" 
AR Path="/60664CFF/60577FEC" Ref="C?"  Part="1" 
AR Path="/605A4C0E/60577FEC" Ref="C1905"  Part="1" 
F 0 "C1905" H 9465 1546 50  0000 L CNN
F 1 "C_10uF_0805" H 9465 1455 50  0000 L CNN
F 2 "Capacitor_SMD:C_0805_2012Metric" H 9388 1350 50  0001 C CNN
F 3 "~" H 9350 1500 50  0001 C CNN
F 4 "Murata Electronics" H 9350 1500 50  0001 C CNN "Manufacturer"
F 5 "GRM21BC8YA106ME11L" H 9350 1500 50  0001 C CNN "PartNumber"
F 6 "3000-0000000134" H 9350 1500 50  0001 C CNN "PartSpecification"
	1    9350 1500
	1    0    0    -1  
$EndComp
Wire Wire Line
	6800 1300 6800 2050
Connection ~ 6800 1300
Wire Wire Line
	6800 1300 6450 1300
Wire Wire Line
	2550 1550 3700 1550
Wire Wire Line
	3500 2150 3500 1900
Wire Wire Line
	3500 1900 3700 1900
Wire Wire Line
	3400 1800 3700 1800
Wire Wire Line
	4900 1200 5100 1200
Wire Wire Line
	5100 1200 5100 1300
Connection ~ 5100 1300
Wire Wire Line
	5100 1300 6000 1300
Text Label 7250 1300 0    50   ~ 0
DCDC_OUT
$Comp
L POWDER_Power:TPS7A92 U202
U 1 1 5E966B2C
P 5900 3450
AR Path="/5D562501/5E966B2C" Ref="U202"  Part="1" 
AR Path="/5D587C46/5E966B2C" Ref="U302"  Part="1" 
AR Path="/60664CFF/5E966B2C" Ref="U?"  Part="1" 
AR Path="/605A4C0E/5E966B2C" Ref="U1902"  Part="1" 
F 0 "U1902" H 6300 3900 50  0000 C CNN
F 1 "TPS7A92" H 5900 3700 50  0000 C CNN
F 2 "POWDER_Power:R-PWSON-N10" H 6650 2400 50  0001 C CNN
F 3 "" H 5900 3450 50  0001 C CNN
F 4 "3000-0000000193" H 5900 3450 50  0001 C CNN "PartSpecification"
	1    5900 3450
	1    0    0    -1  
$EndComp
Wire Wire Line
	5300 3350 5000 3350
Wire Wire Line
	5000 3350 5000 3250
Wire Wire Line
	5000 3250 5300 3250
Connection ~ 5000 3250
$Comp
L power:GND #PWR?
U 1 1 5E973332
P 5950 4100
AR Path="/5D562501/5E973332" Ref="#PWR?"  Part="1" 
AR Path="/5D587C46/5E973332" Ref="#PWR?"  Part="1" 
AR Path="/5D591ABD/5E973332" Ref="#PWR?"  Part="1" 
AR Path="/60664CFF/5E973332" Ref="#PWR?"  Part="1" 
AR Path="/605A4C0E/5E973332" Ref="#PWR?"  Part="1" 
F 0 "#PWR?" H 5950 3850 50  0001 C CNN
F 1 "GND" H 5955 3927 50  0000 C CNN
F 2 "" H 5950 4100 50  0001 C CNN
F 3 "" H 5950 4100 50  0001 C CNN
	1    5950 4100
	1    0    0    -1  
$EndComp
Wire Wire Line
	5950 4100 5950 3950
$Comp
L power:GND #PWR?
U 1 1 60577FF0
P 5850 4100
AR Path="/5D562501/60577FF0" Ref="#PWR?"  Part="1" 
AR Path="/5D587C46/60577FF0" Ref="#PWR?"  Part="1" 
AR Path="/5D591ABD/60577FF0" Ref="#PWR?"  Part="1" 
AR Path="/60664CFF/60577FF0" Ref="#PWR?"  Part="1" 
AR Path="/605A4C0E/60577FF0" Ref="#PWR?"  Part="1" 
F 0 "#PWR?" H 5850 3850 50  0001 C CNN
F 1 "GND" H 5855 3927 50  0000 C CNN
F 2 "" H 5850 4100 50  0001 C CNN
F 3 "" H 5850 4100 50  0001 C CNN
	1    5850 4100
	1    0    0    -1  
$EndComp
Wire Wire Line
	5850 4100 5850 3950
Wire Wire Line
	3150 3550 5300 3550
Connection ~ 3150 2050
Wire Wire Line
	3150 2050 3050 2050
Text HLabel 6800 3650 2    50   Output ~ 0
LDO_4_8_PG
$Comp
L 000_PreferredParts:C_1uF C213
U 1 1 5E9BB395
P 4500 3850
AR Path="/5D562501/5E9BB395" Ref="C213"  Part="1" 
AR Path="/5D587C46/5E9BB395" Ref="C313"  Part="1" 
AR Path="/60664CFF/5E9BB395" Ref="C?"  Part="1" 
AR Path="/605A4C0E/5E9BB395" Ref="C1920"  Part="1" 
F 0 "C1920" H 4525 3950 50  0000 L CNN
F 1 "C_1uF" H 4525 3750 50  0000 L CNN
F 2 "Capacitor_SMD:C_0603_1608Metric" H 4538 3700 50  0001 C CNN
F 3 "~" H 4500 3850 50  0001 C CNN
F 4 "3000-0000000136" H 4500 3850 50  0001 C CNN "PartSpecification"
	1    4500 3850
	1    0    0    -1  
$EndComp
Wire Wire Line
	4500 3700 4500 3450
Wire Wire Line
	4500 3450 5300 3450
$Comp
L power:GND #PWR?
U 1 1 60577FF3
P 4500 4150
AR Path="/5D562501/60577FF3" Ref="#PWR?"  Part="1" 
AR Path="/5D587C46/60577FF3" Ref="#PWR?"  Part="1" 
AR Path="/5D591ABD/60577FF3" Ref="#PWR?"  Part="1" 
AR Path="/60664CFF/60577FF3" Ref="#PWR?"  Part="1" 
AR Path="/605A4C0E/60577FF3" Ref="#PWR?"  Part="1" 
F 0 "#PWR?" H 4500 3900 50  0001 C CNN
F 1 "GND" H 4505 3977 50  0000 C CNN
F 2 "" H 4500 4150 50  0001 C CNN
F 3 "" H 4500 4150 50  0001 C CNN
	1    4500 4150
	1    0    0    -1  
$EndComp
Wire Wire Line
	4500 4150 4500 4000
$Comp
L power:GND #PWR?
U 1 1 60577FF4
P 5150 4050
AR Path="/5D562501/60577FF4" Ref="#PWR?"  Part="1" 
AR Path="/5D587C46/60577FF4" Ref="#PWR?"  Part="1" 
AR Path="/5D591ABD/60577FF4" Ref="#PWR?"  Part="1" 
AR Path="/60664CFF/60577FF4" Ref="#PWR?"  Part="1" 
AR Path="/605A4C0E/60577FF4" Ref="#PWR?"  Part="1" 
F 0 "#PWR?" H 5150 3800 50  0001 C CNN
F 1 "GND" H 5155 3877 50  0000 C CNN
F 2 "" H 5150 4050 50  0001 C CNN
F 3 "" H 5150 4050 50  0001 C CNN
	1    5150 4050
	1    0    0    -1  
$EndComp
Wire Wire Line
	5150 4050 5150 3650
Wire Wire Line
	5150 3650 5300 3650
$Comp
L 000_PreferredParts:C_10uF_0805 C212
U 1 1 60577FFA
P 3700 3800
AR Path="/5D562501/60577FFA" Ref="C212"  Part="1" 
AR Path="/5D587C46/60577FFA" Ref="C312"  Part="1" 
AR Path="/60664CFF/60577FFA" Ref="C?"  Part="1" 
AR Path="/605A4C0E/60577FFA" Ref="C1919"  Part="1" 
F 0 "C1919" H 3815 3846 50  0000 L CNN
F 1 "C_10uF_0805" H 3815 3755 50  0000 L CNN
F 2 "Capacitor_SMD:C_0805_2012Metric" H 3738 3650 50  0001 C CNN
F 3 "~" H 3700 3800 50  0001 C CNN
F 4 "Murata Electronics" H 3700 3800 50  0001 C CNN "Manufacturer"
F 5 "GRM21BC8YA106ME11L" H 3700 3800 50  0001 C CNN "PartNumber"
F 6 "3000-0000000134" H 3700 3800 50  0001 C CNN "PartSpecification"
	1    3700 3800
	1    0    0    -1  
$EndComp
Wire Wire Line
	3700 3650 3700 3250
Wire Wire Line
	3700 3250 5000 3250
$Comp
L power:GND #PWR?
U 1 1 60577FFB
P 3700 4150
AR Path="/5D562501/60577FFB" Ref="#PWR?"  Part="1" 
AR Path="/5D587C46/60577FFB" Ref="#PWR?"  Part="1" 
AR Path="/5D591ABD/60577FFB" Ref="#PWR?"  Part="1" 
AR Path="/60664CFF/60577FFB" Ref="#PWR?"  Part="1" 
AR Path="/605A4C0E/60577FFB" Ref="#PWR?"  Part="1" 
F 0 "#PWR?" H 3700 3900 50  0001 C CNN
F 1 "GND" H 3705 3977 50  0000 C CNN
F 2 "" H 3700 4150 50  0001 C CNN
F 3 "" H 3700 4150 50  0001 C CNN
	1    3700 4150
	1    0    0    -1  
$EndComp
Wire Wire Line
	3700 4150 3700 3950
$Comp
L power:GND #PWR?
U 1 1 60577FFE
P 7750 4300
AR Path="/5D562501/60577FFE" Ref="#PWR?"  Part="1" 
AR Path="/5D587C46/60577FFE" Ref="#PWR?"  Part="1" 
AR Path="/5D591ABD/60577FFE" Ref="#PWR?"  Part="1" 
AR Path="/60664CFF/60577FFE" Ref="#PWR?"  Part="1" 
AR Path="/605A4C0E/60577FFE" Ref="#PWR?"  Part="1" 
F 0 "#PWR?" H 7750 4050 50  0001 C CNN
F 1 "GND" H 7755 4127 50  0000 C CNN
F 2 "" H 7750 4300 50  0001 C CNN
F 3 "" H 7750 4300 50  0001 C CNN
	1    7750 4300
	1    0    0    -1  
$EndComp
Wire Wire Line
	7750 4300 7750 4200
$Comp
L Device:R R208
U 1 1 60578001
P 7750 4050
AR Path="/5D562501/60578001" Ref="R208"  Part="1" 
AR Path="/5D587C46/60578001" Ref="R308"  Part="1" 
AR Path="/60664CFF/60578001" Ref="R?"  Part="1" 
AR Path="/605A4C0E/60578001" Ref="R1906"  Part="1" 
F 0 "R1906" V 7830 4050 50  0000 C CNN
F 1 "1.69k" V 7750 4050 50  0000 C CNN
F 2 "Resistor_SMD:R_0402_1005Metric" V 7680 4050 50  0001 C CNN
F 3 "~" H 7750 4050 50  0001 C CNN
F 4 "3000-0000000224" V 7750 4050 50  0001 C CNN "PartSpecification"
	1    7750 4050
	1    0    0    -1  
$EndComp
$Comp
L Device:R R207
U 1 1 5EA44506
P 7750 3550
AR Path="/5D562501/5EA44506" Ref="R207"  Part="1" 
AR Path="/5D587C46/5EA44506" Ref="R307"  Part="1" 
AR Path="/60664CFF/5EA44506" Ref="R?"  Part="1" 
AR Path="/605A4C0E/5EA44506" Ref="R1903"  Part="1" 
F 0 "R1903" V 7830 3550 50  0000 C CNN
F 1 "8.45k" V 7750 3550 50  0000 C CNN
F 2 "Resistor_SMD:R_0402_1005Metric" V 7680 3550 50  0001 C CNN
F 3 "~" H 7750 3550 50  0001 C CNN
F 4 "3000-0000000133" V 7750 3550 50  0001 C CNN "PartSpecification"
	1    7750 3550
	1    0    0    -1  
$EndComp
Wire Wire Line
	6500 3350 7000 3350
Wire Wire Line
	6500 3250 7000 3250
Wire Wire Line
	7000 3250 7000 3350
Wire Wire Line
	7000 3250 7750 3250
Connection ~ 7000 3250
Wire Wire Line
	7750 3250 7750 3400
Wire Wire Line
	7750 3900 7750 3800
Wire Wire Line
	7750 3800 7500 3800
Connection ~ 7750 3800
Wire Wire Line
	7750 3800 7750 3700
Wire Wire Line
	7750 3800 8900 3800
$Comp
L POWDER_Power:TPS63070RNM U201
U 1 1 60577FCB
P 4300 1600
AR Path="/5D562501/60577FCB" Ref="U201"  Part="1" 
AR Path="/5D587C46/60577FCB" Ref="U301"  Part="1" 
AR Path="/5D591ABD/60577FCB" Ref="U?"  Part="1" 
AR Path="/60664CFF/60577FCB" Ref="U?"  Part="1" 
AR Path="/605A4C0E/60577FCB" Ref="U1901"  Part="1" 
F 0 "U1901" H 4650 2200 60  0000 C CNN
F 1 "TPS63070RNM" H 4300 1800 60  0000 C CNN
F 2 "POWDER_Power:TPS63070RNMR" H 4300 1540 60  0001 C CNN
F 3 "" H 4300 1600 60  0000 C CNN
F 4 "Texas Instruments" H 4300 1600 50  0001 C CNN "Manufacturer"
F 5 "TPS63070RNMR" H 4300 1600 50  0001 C CNN "PartNumber"
F 6 "3000-0000000079" H 4300 1600 50  0001 C CNN "PartSpecification"
	1    4300 1600
	1    0    0    -1  
$EndComp
Wire Wire Line
	2150 1300 3500 1300
Wire Wire Line
	3150 2050 3400 2050
Wire Wire Line
	3400 1800 3400 2050
Wire Wire Line
	3050 2150 3500 2150
Wire Wire Line
	6500 3500 7500 3500
Wire Wire Line
	7500 3500 7500 3800
$Comp
L Device:C C314
U 1 1 6057800B
P 8900 3500
AR Path="/5D587C46/6057800B" Ref="C314"  Part="1" 
AR Path="/5D562501/6057800B" Ref="C214"  Part="1" 
AR Path="/60664CFF/6057800B" Ref="C?"  Part="1" 
AR Path="/605A4C0E/6057800B" Ref="C1915"  Part="1" 
F 0 "C1915" H 8925 3600 50  0000 L CNN
F 1 "10nF" H 8925 3400 50  0000 L CNN
F 2 "Capacitor_SMD:C_0402_1005Metric" H 8938 3350 50  0001 C CNN
F 3 "~" H 8900 3500 50  0001 C CNN
F 4 "3000-0000000203" H 8900 3500 50  0001 C CNN "PartSpecification"
	1    8900 3500
	1    0    0    -1  
$EndComp
Wire Wire Line
	8900 3350 8900 3250
Wire Wire Line
	8900 3250 7750 3250
Connection ~ 7750 3250
Wire Wire Line
	8900 3650 8900 3800
$Comp
L 000_PreferredParts:C_10uF_0603 C316
U 1 1 6057800C
P 9500 3500
AR Path="/5D587C46/6057800C" Ref="C316"  Part="1" 
AR Path="/5D562501/6057800C" Ref="C216"  Part="1" 
AR Path="/60664CFF/6057800C" Ref="C?"  Part="1" 
AR Path="/605A4C0E/6057800C" Ref="C1916"  Part="1" 
F 0 "C1916" H 9525 3600 50  0000 L CNN
F 1 "C_10uF_0603" H 9525 3400 50  0001 L CNN
F 2 "Capacitor_SMD:C_0603_1608Metric" H 9538 3350 50  0001 C CNN
F 3 "~" H 9500 3500 50  0001 C CNN
F 4 "10uF" H 9650 3400 50  0000 C CNN "DisplayValue"
F 5 "0603" H 9650 3300 50  0000 C CNN "DisplayFootprint"
F 6 "3000-0000000135" H 0   -1200 50  0001 C CNN "PartSpecification"
	1    9500 3500
	1    0    0    -1  
$EndComp
Wire Wire Line
	9500 3350 9500 3250
Wire Wire Line
	9500 3250 8900 3250
Connection ~ 8900 3250
$Comp
L power:GND #PWR?
U 1 1 6057800E
P 9500 3800
AR Path="/5D562501/6057800E" Ref="#PWR?"  Part="1" 
AR Path="/5D587C46/6057800E" Ref="#PWR?"  Part="1" 
AR Path="/5D591ABD/6057800E" Ref="#PWR?"  Part="1" 
AR Path="/60664CFF/6057800E" Ref="#PWR?"  Part="1" 
AR Path="/605A4C0E/6057800E" Ref="#PWR?"  Part="1" 
F 0 "#PWR?" H 9500 3550 50  0001 C CNN
F 1 "GND" H 9505 3627 50  0000 C CNN
F 2 "" H 9500 3800 50  0001 C CNN
F 3 "" H 9500 3800 50  0001 C CNN
	1    9500 3800
	-1   0    0    -1  
$EndComp
Wire Wire Line
	9500 3800 9500 3650
$Comp
L 000_PreferredParts:C_10uF_0603 C318
U 1 1 5EB365CE
P 10000 3500
AR Path="/5D587C46/5EB365CE" Ref="C318"  Part="1" 
AR Path="/5D562501/5EB365CE" Ref="C218"  Part="1" 
AR Path="/60664CFF/5EB365CE" Ref="C?"  Part="1" 
AR Path="/605A4C0E/5EB365CE" Ref="C1917"  Part="1" 
F 0 "C1917" H 10025 3600 50  0000 L CNN
F 1 "C_10uF_0603" H 10025 3400 50  0001 L CNN
F 2 "Capacitor_SMD:C_0603_1608Metric" H 10038 3350 50  0001 C CNN
F 3 "~" H 10000 3500 50  0001 C CNN
F 4 "10uF" H 10150 3400 50  0000 C CNN "DisplayValue"
F 5 "0603" H 10150 3300 50  0000 C CNN "DisplayFootprint"
F 6 "3000-0000000135" H 0   -1200 50  0001 C CNN "PartSpecification"
	1    10000 3500
	1    0    0    -1  
$EndComp
Wire Wire Line
	10000 3350 10000 3250
Wire Wire Line
	10000 3250 9500 3250
$Comp
L power:GND #PWR?
U 1 1 5EB365D6
P 10000 3800
AR Path="/5D562501/5EB365D6" Ref="#PWR?"  Part="1" 
AR Path="/5D587C46/5EB365D6" Ref="#PWR?"  Part="1" 
AR Path="/5D591ABD/5EB365D6" Ref="#PWR?"  Part="1" 
AR Path="/60664CFF/5EB365D6" Ref="#PWR?"  Part="1" 
AR Path="/605A4C0E/5EB365D6" Ref="#PWR?"  Part="1" 
F 0 "#PWR?" H 10000 3550 50  0001 C CNN
F 1 "GND" H 10005 3627 50  0000 C CNN
F 2 "" H 10000 3800 50  0001 C CNN
F 3 "" H 10000 3800 50  0001 C CNN
	1    10000 3800
	-1   0    0    -1  
$EndComp
Wire Wire Line
	10000 3800 10000 3650
Connection ~ 9500 3250
$Comp
L 000_PreferredParts:C_10uF_0603 C320
U 1 1 5EB428FF
P 10500 3500
AR Path="/5D587C46/5EB428FF" Ref="C320"  Part="1" 
AR Path="/5D562501/5EB428FF" Ref="C220"  Part="1" 
AR Path="/60664CFF/5EB428FF" Ref="C?"  Part="1" 
AR Path="/605A4C0E/5EB428FF" Ref="C1918"  Part="1" 
F 0 "C1918" H 10525 3600 50  0000 L CNN
F 1 "C_10uF_0603" H 10525 3400 50  0001 L CNN
F 2 "Capacitor_SMD:C_0603_1608Metric" H 10538 3350 50  0001 C CNN
F 3 "~" H 10500 3500 50  0001 C CNN
F 4 "10uF" H 10650 3400 50  0000 C CNN "DisplayValue"
F 5 "0603" H 10650 3300 50  0000 C CNN "DisplayFootprint"
F 6 "3000-0000000135" H 0   -1200 50  0001 C CNN "PartSpecification"
	1    10500 3500
	1    0    0    -1  
$EndComp
Wire Wire Line
	10500 3350 10500 3250
Wire Wire Line
	10500 3250 10000 3250
$Comp
L power:GND #PWR?
U 1 1 5EB42907
P 10500 3800
AR Path="/5D562501/5EB42907" Ref="#PWR?"  Part="1" 
AR Path="/5D587C46/5EB42907" Ref="#PWR?"  Part="1" 
AR Path="/5D591ABD/5EB42907" Ref="#PWR?"  Part="1" 
AR Path="/60664CFF/5EB42907" Ref="#PWR?"  Part="1" 
AR Path="/605A4C0E/5EB42907" Ref="#PWR?"  Part="1" 
F 0 "#PWR?" H 10500 3550 50  0001 C CNN
F 1 "GND" H 10505 3627 50  0000 C CNN
F 2 "" H 10500 3800 50  0001 C CNN
F 3 "" H 10500 3800 50  0001 C CNN
	1    10500 3800
	-1   0    0    -1  
$EndComp
Wire Wire Line
	10500 3800 10500 3650
Connection ~ 10000 3250
$Comp
L 000_PreferredParts:C_10uF_0603 C315
U 1 1 60578014
P 9250 2500
AR Path="/5D587C46/60578014" Ref="C315"  Part="1" 
AR Path="/5D562501/60578014" Ref="C215"  Part="1" 
AR Path="/60664CFF/60578014" Ref="C?"  Part="1" 
AR Path="/605A4C0E/60578014" Ref="C1912"  Part="1" 
F 0 "C1912" H 9275 2600 50  0000 L CNN
F 1 "C_10uF_0603" H 9275 2400 50  0001 L CNN
F 2 "Capacitor_SMD:C_0603_1608Metric" H 9288 2350 50  0001 C CNN
F 3 "~" H 9250 2500 50  0001 C CNN
F 4 "10uF" H 9400 2400 50  0000 C CNN "DisplayValue"
F 5 "0603" H 9400 2300 50  0000 C CNN "DisplayFootprint"
F 6 "3000-0000000135" H -250 -1200 50  0001 C CNN "PartSpecification"
	1    9250 2500
	1    0    0    -1  
$EndComp
Wire Wire Line
	9250 2350 9250 2250
Wire Wire Line
	9250 2250 8900 2250
$Comp
L power:GND #PWR?
U 1 1 60578015
P 9250 2800
AR Path="/5D562501/60578015" Ref="#PWR?"  Part="1" 
AR Path="/5D587C46/60578015" Ref="#PWR?"  Part="1" 
AR Path="/5D591ABD/60578015" Ref="#PWR?"  Part="1" 
AR Path="/60664CFF/60578015" Ref="#PWR?"  Part="1" 
AR Path="/605A4C0E/60578015" Ref="#PWR?"  Part="1" 
F 0 "#PWR?" H 9250 2550 50  0001 C CNN
F 1 "GND" H 9255 2627 50  0000 C CNN
F 2 "" H 9250 2800 50  0001 C CNN
F 3 "" H 9250 2800 50  0001 C CNN
	1    9250 2800
	-1   0    0    -1  
$EndComp
Wire Wire Line
	9250 2800 9250 2650
$Comp
L 000_PreferredParts:C_10uF_0603 C317
U 1 1 60578016
P 9750 2500
AR Path="/5D587C46/60578016" Ref="C317"  Part="1" 
AR Path="/5D562501/60578016" Ref="C217"  Part="1" 
AR Path="/60664CFF/60578016" Ref="C?"  Part="1" 
AR Path="/605A4C0E/60578016" Ref="C1913"  Part="1" 
F 0 "C1913" H 9775 2600 50  0000 L CNN
F 1 "C_10uF_0603" H 9775 2400 50  0001 L CNN
F 2 "Capacitor_SMD:C_0603_1608Metric" H 9788 2350 50  0001 C CNN
F 3 "~" H 9750 2500 50  0001 C CNN
F 4 "10uF" H 9900 2400 50  0000 C CNN "DisplayValue"
F 5 "0603" H 9900 2300 50  0000 C CNN "DisplayFootprint"
F 6 "3000-0000000135" H -250 -1200 50  0001 C CNN "PartSpecification"
	1    9750 2500
	1    0    0    -1  
$EndComp
Wire Wire Line
	9750 2350 9750 2250
Wire Wire Line
	9750 2250 9250 2250
$Comp
L power:GND #PWR?
U 1 1 60578017
P 9750 2800
AR Path="/5D562501/60578017" Ref="#PWR?"  Part="1" 
AR Path="/5D587C46/60578017" Ref="#PWR?"  Part="1" 
AR Path="/5D591ABD/60578017" Ref="#PWR?"  Part="1" 
AR Path="/60664CFF/60578017" Ref="#PWR?"  Part="1" 
AR Path="/605A4C0E/60578017" Ref="#PWR?"  Part="1" 
F 0 "#PWR?" H 9750 2550 50  0001 C CNN
F 1 "GND" H 9755 2627 50  0000 C CNN
F 2 "" H 9750 2800 50  0001 C CNN
F 3 "" H 9750 2800 50  0001 C CNN
	1    9750 2800
	-1   0    0    -1  
$EndComp
Wire Wire Line
	9750 2800 9750 2650
Connection ~ 9250 2250
$Comp
L 000_PreferredParts:C_10uF_0603 C319
U 1 1 60578018
P 10250 2500
AR Path="/5D587C46/60578018" Ref="C319"  Part="1" 
AR Path="/5D562501/60578018" Ref="C219"  Part="1" 
AR Path="/60664CFF/60578018" Ref="C?"  Part="1" 
AR Path="/605A4C0E/60578018" Ref="C1914"  Part="1" 
F 0 "C1914" H 10275 2600 50  0000 L CNN
F 1 "C_10uF_0603" H 10275 2400 50  0001 L CNN
F 2 "Capacitor_SMD:C_0603_1608Metric" H 10288 2350 50  0001 C CNN
F 3 "~" H 10250 2500 50  0001 C CNN
F 4 "10uF" H 10400 2400 50  0000 C CNN "DisplayValue"
F 5 "0603" H 10400 2300 50  0000 C CNN "DisplayFootprint"
F 6 "3000-0000000135" H -250 -1200 50  0001 C CNN "PartSpecification"
	1    10250 2500
	1    0    0    -1  
$EndComp
Wire Wire Line
	10250 2350 10250 2250
Wire Wire Line
	10250 2250 9750 2250
$Comp
L power:GND #PWR?
U 1 1 60578019
P 10250 2800
AR Path="/5D562501/60578019" Ref="#PWR?"  Part="1" 
AR Path="/5D587C46/60578019" Ref="#PWR?"  Part="1" 
AR Path="/5D591ABD/60578019" Ref="#PWR?"  Part="1" 
AR Path="/60664CFF/60578019" Ref="#PWR?"  Part="1" 
AR Path="/605A4C0E/60578019" Ref="#PWR?"  Part="1" 
F 0 "#PWR?" H 10250 2550 50  0001 C CNN
F 1 "GND" H 10255 2627 50  0000 C CNN
F 2 "" H 10250 2800 50  0001 C CNN
F 3 "" H 10250 2800 50  0001 C CNN
	1    10250 2800
	-1   0    0    -1  
$EndComp
Wire Wire Line
	10250 2800 10250 2650
Connection ~ 9750 2250
Wire Wire Line
	8900 2250 8900 3250
Wire Wire Line
	11000 3250 10500 3250
Connection ~ 10500 3250
Text Label 8600 3800 0    50   ~ 0
LDO_FB
Text Label 4850 3450 0    50   ~ 0
NR_SS
$Comp
L power:GND #PWR?
U 1 1 605BC4D3
P 5000 1650
AR Path="/5D562501/605BC4D3" Ref="#PWR?"  Part="1" 
AR Path="/5D587C46/605BC4D3" Ref="#PWR?"  Part="1" 
AR Path="/5D591ABD/605BC4D3" Ref="#PWR?"  Part="1" 
AR Path="/60664CFF/605BC4D3" Ref="#PWR?"  Part="1" 
AR Path="/605A4C0E/605BC4D3" Ref="#PWR?"  Part="1" 
F 0 "#PWR?" H 5000 1400 50  0001 C CNN
F 1 "GND" H 5005 1477 50  0000 C CNN
F 2 "" H 5000 1650 50  0001 C CNN
F 3 "" H 5000 1650 50  0001 C CNN
	1    5000 1650
	1    0    0    -1  
$EndComp
Wire Wire Line
	5000 1650 4900 1650
Wire Wire Line
	6800 2050 6800 2750
Wire Wire Line
	6800 2750 3500 2750
Wire Wire Line
	3500 2750 3500 3250
Wire Wire Line
	3500 3250 3700 3250
Connection ~ 6800 2050
Connection ~ 3700 3250
$Comp
L POWDER_PowerGlobals:+4.8V #PWR?
U 1 1 605D4712
P 11000 3150
AR Path="/605A4C0E/605D4712" Ref="#PWR?"  Part="1" 
AR Path="/5D587C46/605D4712" Ref="#PWR?"  Part="1" 
F 0 "#PWR?" H 11000 3000 50  0001 C CNN
F 1 "+4.8V" H 11015 3323 50  0000 C CNN
F 2 "" H 11000 3150 50  0001 C CNN
F 3 "" H 11000 3150 50  0001 C CNN
	1    11000 3150
	1    0    0    -1  
$EndComp
Wire Wire Line
	11000 3150 11000 3250
$Comp
L POWDER_Power:TPS7A92 U?
U 1 1 60614337
P 5900 5450
AR Path="/5D562501/60614337" Ref="U?"  Part="1" 
AR Path="/5D587C46/60614337" Ref="U?"  Part="1" 
AR Path="/60664CFF/60614337" Ref="U?"  Part="1" 
AR Path="/605A4C0E/60614337" Ref="U1903"  Part="1" 
F 0 "U1903" H 6300 5900 50  0000 C CNN
F 1 "TPS7A92" H 5900 5700 50  0000 C CNN
F 2 "POWDER_Power:R-PWSON-N10" H 6650 4400 50  0001 C CNN
F 3 "" H 5900 5450 50  0001 C CNN
F 4 "3000-0000000193" H 5900 5450 50  0001 C CNN "PartSpecification"
	1    5900 5450
	1    0    0    -1  
$EndComp
Wire Wire Line
	5300 5350 5000 5350
Wire Wire Line
	5000 5350 5000 5250
Wire Wire Line
	5000 5250 5300 5250
Connection ~ 5000 5250
$Comp
L power:GND #PWR?
U 1 1 60614341
P 5950 6100
AR Path="/5D562501/60614341" Ref="#PWR?"  Part="1" 
AR Path="/5D587C46/60614341" Ref="#PWR?"  Part="1" 
AR Path="/5D591ABD/60614341" Ref="#PWR?"  Part="1" 
AR Path="/60664CFF/60614341" Ref="#PWR?"  Part="1" 
AR Path="/605A4C0E/60614341" Ref="#PWR?"  Part="1" 
F 0 "#PWR?" H 5950 5850 50  0001 C CNN
F 1 "GND" H 5955 5927 50  0000 C CNN
F 2 "" H 5950 6100 50  0001 C CNN
F 3 "" H 5950 6100 50  0001 C CNN
	1    5950 6100
	1    0    0    -1  
$EndComp
Wire Wire Line
	5950 6100 5950 5950
$Comp
L power:GND #PWR?
U 1 1 60614348
P 5850 6100
AR Path="/5D562501/60614348" Ref="#PWR?"  Part="1" 
AR Path="/5D587C46/60614348" Ref="#PWR?"  Part="1" 
AR Path="/5D591ABD/60614348" Ref="#PWR?"  Part="1" 
AR Path="/60664CFF/60614348" Ref="#PWR?"  Part="1" 
AR Path="/605A4C0E/60614348" Ref="#PWR?"  Part="1" 
F 0 "#PWR?" H 5850 5850 50  0001 C CNN
F 1 "GND" H 5855 5927 50  0000 C CNN
F 2 "" H 5850 6100 50  0001 C CNN
F 3 "" H 5850 6100 50  0001 C CNN
	1    5850 6100
	1    0    0    -1  
$EndComp
Wire Wire Line
	5850 6100 5850 5950
Wire Wire Line
	3150 5550 5300 5550
Text HLabel 6800 5650 2    50   Output ~ 0
LDO_3_3VRF_PG
$Comp
L 000_PreferredParts:C_1uF C?
U 1 1 60614354
P 4500 5850
AR Path="/5D562501/60614354" Ref="C?"  Part="1" 
AR Path="/5D587C46/60614354" Ref="C?"  Part="1" 
AR Path="/60664CFF/60614354" Ref="C?"  Part="1" 
AR Path="/605A4C0E/60614354" Ref="C1929"  Part="1" 
F 0 "C1929" H 4525 5950 50  0000 L CNN
F 1 "C_1uF" H 4525 5750 50  0000 L CNN
F 2 "Capacitor_SMD:C_0603_1608Metric" H 4538 5700 50  0001 C CNN
F 3 "~" H 4500 5850 50  0001 C CNN
F 4 "3000-0000000136" H 4500 5850 50  0001 C CNN "PartSpecification"
	1    4500 5850
	1    0    0    -1  
$EndComp
Wire Wire Line
	4500 5700 4500 5450
Wire Wire Line
	4500 5450 5300 5450
$Comp
L power:GND #PWR?
U 1 1 6061435C
P 4500 6150
AR Path="/5D562501/6061435C" Ref="#PWR?"  Part="1" 
AR Path="/5D587C46/6061435C" Ref="#PWR?"  Part="1" 
AR Path="/5D591ABD/6061435C" Ref="#PWR?"  Part="1" 
AR Path="/60664CFF/6061435C" Ref="#PWR?"  Part="1" 
AR Path="/605A4C0E/6061435C" Ref="#PWR?"  Part="1" 
F 0 "#PWR?" H 4500 5900 50  0001 C CNN
F 1 "GND" H 4505 5977 50  0000 C CNN
F 2 "" H 4500 6150 50  0001 C CNN
F 3 "" H 4500 6150 50  0001 C CNN
	1    4500 6150
	1    0    0    -1  
$EndComp
Wire Wire Line
	4500 6150 4500 6000
$Comp
L power:GND #PWR?
U 1 1 60614363
P 5150 6050
AR Path="/5D562501/60614363" Ref="#PWR?"  Part="1" 
AR Path="/5D587C46/60614363" Ref="#PWR?"  Part="1" 
AR Path="/5D591ABD/60614363" Ref="#PWR?"  Part="1" 
AR Path="/60664CFF/60614363" Ref="#PWR?"  Part="1" 
AR Path="/605A4C0E/60614363" Ref="#PWR?"  Part="1" 
F 0 "#PWR?" H 5150 5800 50  0001 C CNN
F 1 "GND" H 5155 5877 50  0000 C CNN
F 2 "" H 5150 6050 50  0001 C CNN
F 3 "" H 5150 6050 50  0001 C CNN
	1    5150 6050
	1    0    0    -1  
$EndComp
Wire Wire Line
	5150 6050 5150 5650
Wire Wire Line
	5150 5650 5300 5650
$Comp
L 000_PreferredParts:C_10uF_0805 C?
U 1 1 60614383
P 3700 5800
AR Path="/5D562501/60614383" Ref="C?"  Part="1" 
AR Path="/5D587C46/60614383" Ref="C?"  Part="1" 
AR Path="/60664CFF/60614383" Ref="C?"  Part="1" 
AR Path="/605A4C0E/60614383" Ref="C1928"  Part="1" 
F 0 "C1928" H 3815 5846 50  0000 L CNN
F 1 "C_10uF_0805" H 3815 5755 50  0000 L CNN
F 2 "Capacitor_SMD:C_0805_2012Metric" H 3738 5650 50  0001 C CNN
F 3 "~" H 3700 5800 50  0001 C CNN
F 4 "Murata Electronics" H 3700 5800 50  0001 C CNN "Manufacturer"
F 5 "GRM21BC8YA106ME11L" H 3700 5800 50  0001 C CNN "PartNumber"
F 6 "3000-0000000134" H 3700 5800 50  0001 C CNN "PartSpecification"
	1    3700 5800
	1    0    0    -1  
$EndComp
Wire Wire Line
	3700 5650 3700 5250
Wire Wire Line
	3700 5250 5000 5250
$Comp
L power:GND #PWR?
U 1 1 6061438B
P 3700 6150
AR Path="/5D562501/6061438B" Ref="#PWR?"  Part="1" 
AR Path="/5D587C46/6061438B" Ref="#PWR?"  Part="1" 
AR Path="/5D591ABD/6061438B" Ref="#PWR?"  Part="1" 
AR Path="/60664CFF/6061438B" Ref="#PWR?"  Part="1" 
AR Path="/605A4C0E/6061438B" Ref="#PWR?"  Part="1" 
F 0 "#PWR?" H 3700 5900 50  0001 C CNN
F 1 "GND" H 3705 5977 50  0000 C CNN
F 2 "" H 3700 6150 50  0001 C CNN
F 3 "" H 3700 6150 50  0001 C CNN
	1    3700 6150
	1    0    0    -1  
$EndComp
Wire Wire Line
	3700 6150 3700 5950
$Comp
L power:GND #PWR?
U 1 1 60614392
P 7750 6300
AR Path="/5D562501/60614392" Ref="#PWR?"  Part="1" 
AR Path="/5D587C46/60614392" Ref="#PWR?"  Part="1" 
AR Path="/5D591ABD/60614392" Ref="#PWR?"  Part="1" 
AR Path="/60664CFF/60614392" Ref="#PWR?"  Part="1" 
AR Path="/605A4C0E/60614392" Ref="#PWR?"  Part="1" 
F 0 "#PWR?" H 7750 6050 50  0001 C CNN
F 1 "GND" H 7755 6127 50  0000 C CNN
F 2 "" H 7750 6300 50  0001 C CNN
F 3 "" H 7750 6300 50  0001 C CNN
	1    7750 6300
	1    0    0    -1  
$EndComp
Wire Wire Line
	7750 6300 7750 6200
$Comp
L Device:R R?
U 1 1 6061439A
P 7750 6050
AR Path="/5D562501/6061439A" Ref="R?"  Part="1" 
AR Path="/5D587C46/6061439A" Ref="R?"  Part="1" 
AR Path="/60664CFF/6061439A" Ref="R?"  Part="1" 
AR Path="/605A4C0E/6061439A" Ref="R1912"  Part="1" 
F 0 "R1912" V 7830 6050 50  0000 C CNN
F 1 "1.69k" V 7750 6050 50  0000 C CNN
F 2 "Resistor_SMD:R_0402_1005Metric" V 7680 6050 50  0001 C CNN
F 3 "~" H 7750 6050 50  0001 C CNN
F 4 "3000-0000000224" V 7750 6050 50  0001 C CNN "PartSpecification"
	1    7750 6050
	1    0    0    -1  
$EndComp
$Comp
L Device:R R?
U 1 1 606143A1
P 7750 5550
AR Path="/5D562501/606143A1" Ref="R?"  Part="1" 
AR Path="/5D587C46/606143A1" Ref="R?"  Part="1" 
AR Path="/60664CFF/606143A1" Ref="R?"  Part="1" 
AR Path="/605A4C0E/606143A1" Ref="R1909"  Part="1" 
F 0 "R1909" V 7830 5550 50  0000 C CNN
F 1 "5.36k" V 7750 5550 50  0000 C CNN
F 2 "Resistor_SMD:R_0402_1005Metric" V 7680 5550 50  0001 C CNN
F 3 "~" H 7750 5550 50  0001 C CNN
F 4 "3000-0000000133" V 7750 5550 50  0001 C CNN "PartSpecification"
	1    7750 5550
	1    0    0    -1  
$EndComp
Wire Wire Line
	6500 5350 7000 5350
Wire Wire Line
	6500 5250 7000 5250
Wire Wire Line
	7000 5250 7000 5350
Wire Wire Line
	7000 5250 7750 5250
Connection ~ 7000 5250
Wire Wire Line
	7750 5250 7750 5400
Wire Wire Line
	7750 5900 7750 5800
Connection ~ 7750 5800
Wire Wire Line
	7750 5800 7750 5700
Wire Wire Line
	6500 5500 7500 5500
Wire Wire Line
	7500 5500 7500 5800
$Comp
L Device:C C?
U 1 1 606143B5
P 8000 5500
AR Path="/5D587C46/606143B5" Ref="C?"  Part="1" 
AR Path="/5D562501/606143B5" Ref="C?"  Part="1" 
AR Path="/60664CFF/606143B5" Ref="C?"  Part="1" 
AR Path="/605A4C0E/606143B5" Ref="C1924"  Part="1" 
F 0 "C1924" H 8025 5600 50  0000 L CNN
F 1 "10nF" H 8025 5400 50  0000 L CNN
F 2 "Capacitor_SMD:C_0402_1005Metric" H 8038 5350 50  0001 C CNN
F 3 "~" H 8000 5500 50  0001 C CNN
F 4 "3000-0000000203" H 8000 5500 50  0001 C CNN "PartSpecification"
	1    8000 5500
	1    0    0    -1  
$EndComp
Wire Wire Line
	8000 5350 8000 5250
Wire Wire Line
	8000 5250 7750 5250
Connection ~ 7750 5250
Wire Wire Line
	8000 5650 8000 5800
$Comp
L 000_PreferredParts:C_10uF_0603 C?
U 1 1 606143C2
P 8600 5500
AR Path="/5D587C46/606143C2" Ref="C?"  Part="1" 
AR Path="/5D562501/606143C2" Ref="C?"  Part="1" 
AR Path="/60664CFF/606143C2" Ref="C?"  Part="1" 
AR Path="/605A4C0E/606143C2" Ref="C1925"  Part="1" 
F 0 "C1925" H 8625 5600 50  0000 L CNN
F 1 "C_10uF_0603" H 8625 5400 50  0001 L CNN
F 2 "Capacitor_SMD:C_0603_1608Metric" H 8638 5350 50  0001 C CNN
F 3 "~" H 8600 5500 50  0001 C CNN
F 4 "10uF" H 8750 5400 50  0000 C CNN "DisplayValue"
F 5 "0603" H 8750 5300 50  0000 C CNN "DisplayFootprint"
F 6 "3000-0000000135" H -900 800 50  0001 C CNN "PartSpecification"
	1    8600 5500
	1    0    0    -1  
$EndComp
Wire Wire Line
	8600 5350 8600 5250
Wire Wire Line
	8600 5250 8000 5250
Connection ~ 8000 5250
$Comp
L power:GND #PWR?
U 1 1 606143CB
P 8600 5800
AR Path="/5D562501/606143CB" Ref="#PWR?"  Part="1" 
AR Path="/5D587C46/606143CB" Ref="#PWR?"  Part="1" 
AR Path="/5D591ABD/606143CB" Ref="#PWR?"  Part="1" 
AR Path="/60664CFF/606143CB" Ref="#PWR?"  Part="1" 
AR Path="/605A4C0E/606143CB" Ref="#PWR?"  Part="1" 
F 0 "#PWR?" H 8600 5550 50  0001 C CNN
F 1 "GND" H 8605 5627 50  0000 C CNN
F 2 "" H 8600 5800 50  0001 C CNN
F 3 "" H 8600 5800 50  0001 C CNN
	1    8600 5800
	-1   0    0    -1  
$EndComp
Wire Wire Line
	8600 5800 8600 5650
$Comp
L 000_PreferredParts:C_10uF_0603 C?
U 1 1 606143D5
P 9100 5500
AR Path="/5D587C46/606143D5" Ref="C?"  Part="1" 
AR Path="/5D562501/606143D5" Ref="C?"  Part="1" 
AR Path="/60664CFF/606143D5" Ref="C?"  Part="1" 
AR Path="/605A4C0E/606143D5" Ref="C1926"  Part="1" 
F 0 "C1926" H 9125 5600 50  0000 L CNN
F 1 "C_10uF_0603" H 9125 5400 50  0001 L CNN
F 2 "Capacitor_SMD:C_0603_1608Metric" H 9138 5350 50  0001 C CNN
F 3 "~" H 9100 5500 50  0001 C CNN
F 4 "10uF" H 9250 5400 50  0000 C CNN "DisplayValue"
F 5 "0603" H 9250 5300 50  0000 C CNN "DisplayFootprint"
F 6 "3000-0000000135" H -900 800 50  0001 C CNN "PartSpecification"
	1    9100 5500
	1    0    0    -1  
$EndComp
Wire Wire Line
	9100 5350 9100 5250
Wire Wire Line
	9100 5250 8600 5250
$Comp
L power:GND #PWR?
U 1 1 606143DD
P 9100 5800
AR Path="/5D562501/606143DD" Ref="#PWR?"  Part="1" 
AR Path="/5D587C46/606143DD" Ref="#PWR?"  Part="1" 
AR Path="/5D591ABD/606143DD" Ref="#PWR?"  Part="1" 
AR Path="/60664CFF/606143DD" Ref="#PWR?"  Part="1" 
AR Path="/605A4C0E/606143DD" Ref="#PWR?"  Part="1" 
F 0 "#PWR?" H 9100 5550 50  0001 C CNN
F 1 "GND" H 9105 5627 50  0000 C CNN
F 2 "" H 9100 5800 50  0001 C CNN
F 3 "" H 9100 5800 50  0001 C CNN
	1    9100 5800
	-1   0    0    -1  
$EndComp
Wire Wire Line
	9100 5800 9100 5650
Connection ~ 8600 5250
$Comp
L 000_PreferredParts:C_10uF_0603 C?
U 1 1 606143E8
P 9600 5500
AR Path="/5D587C46/606143E8" Ref="C?"  Part="1" 
AR Path="/5D562501/606143E8" Ref="C?"  Part="1" 
AR Path="/60664CFF/606143E8" Ref="C?"  Part="1" 
AR Path="/605A4C0E/606143E8" Ref="C1927"  Part="1" 
F 0 "C1927" H 9625 5600 50  0000 L CNN
F 1 "C_10uF_0603" H 9625 5400 50  0001 L CNN
F 2 "Capacitor_SMD:C_0603_1608Metric" H 9638 5350 50  0001 C CNN
F 3 "~" H 9600 5500 50  0001 C CNN
F 4 "10uF" H 9750 5400 50  0000 C CNN "DisplayValue"
F 5 "0603" H 9750 5300 50  0000 C CNN "DisplayFootprint"
F 6 "3000-0000000135" H -900 800 50  0001 C CNN "PartSpecification"
	1    9600 5500
	1    0    0    -1  
$EndComp
Wire Wire Line
	9600 5350 9600 5250
Wire Wire Line
	9600 5250 9100 5250
$Comp
L power:GND #PWR?
U 1 1 606143F0
P 9600 5800
AR Path="/5D562501/606143F0" Ref="#PWR?"  Part="1" 
AR Path="/5D587C46/606143F0" Ref="#PWR?"  Part="1" 
AR Path="/5D591ABD/606143F0" Ref="#PWR?"  Part="1" 
AR Path="/60664CFF/606143F0" Ref="#PWR?"  Part="1" 
AR Path="/605A4C0E/606143F0" Ref="#PWR?"  Part="1" 
F 0 "#PWR?" H 9600 5550 50  0001 C CNN
F 1 "GND" H 9605 5627 50  0000 C CNN
F 2 "" H 9600 5800 50  0001 C CNN
F 3 "" H 9600 5800 50  0001 C CNN
	1    9600 5800
	-1   0    0    -1  
$EndComp
Wire Wire Line
	9600 5800 9600 5650
Connection ~ 9100 5250
$Comp
L 000_PreferredParts:C_10uF_0603 C?
U 1 1 606143FB
P 8350 4500
AR Path="/5D587C46/606143FB" Ref="C?"  Part="1" 
AR Path="/5D562501/606143FB" Ref="C?"  Part="1" 
AR Path="/60664CFF/606143FB" Ref="C?"  Part="1" 
AR Path="/605A4C0E/606143FB" Ref="C1921"  Part="1" 
F 0 "C1921" H 8375 4600 50  0000 L CNN
F 1 "C_10uF_0603" H 8375 4400 50  0001 L CNN
F 2 "Capacitor_SMD:C_0603_1608Metric" H 8388 4350 50  0001 C CNN
F 3 "~" H 8350 4500 50  0001 C CNN
F 4 "10uF" H 8500 4400 50  0000 C CNN "DisplayValue"
F 5 "0603" H 8500 4300 50  0000 C CNN "DisplayFootprint"
F 6 "3000-0000000135" H -1150 800 50  0001 C CNN "PartSpecification"
	1    8350 4500
	1    0    0    -1  
$EndComp
Wire Wire Line
	8350 4350 8350 4250
Wire Wire Line
	8350 4250 8000 4250
$Comp
L power:GND #PWR?
U 1 1 60614403
P 8350 4800
AR Path="/5D562501/60614403" Ref="#PWR?"  Part="1" 
AR Path="/5D587C46/60614403" Ref="#PWR?"  Part="1" 
AR Path="/5D591ABD/60614403" Ref="#PWR?"  Part="1" 
AR Path="/60664CFF/60614403" Ref="#PWR?"  Part="1" 
AR Path="/605A4C0E/60614403" Ref="#PWR?"  Part="1" 
F 0 "#PWR?" H 8350 4550 50  0001 C CNN
F 1 "GND" H 8355 4627 50  0000 C CNN
F 2 "" H 8350 4800 50  0001 C CNN
F 3 "" H 8350 4800 50  0001 C CNN
	1    8350 4800
	-1   0    0    -1  
$EndComp
Wire Wire Line
	8350 4800 8350 4650
$Comp
L 000_PreferredParts:C_10uF_0603 C?
U 1 1 6061440D
P 8850 4500
AR Path="/5D587C46/6061440D" Ref="C?"  Part="1" 
AR Path="/5D562501/6061440D" Ref="C?"  Part="1" 
AR Path="/60664CFF/6061440D" Ref="C?"  Part="1" 
AR Path="/605A4C0E/6061440D" Ref="C1922"  Part="1" 
F 0 "C1922" H 8875 4600 50  0000 L CNN
F 1 "C_10uF_0603" H 8875 4400 50  0001 L CNN
F 2 "Capacitor_SMD:C_0603_1608Metric" H 8888 4350 50  0001 C CNN
F 3 "~" H 8850 4500 50  0001 C CNN
F 4 "10uF" H 9000 4400 50  0000 C CNN "DisplayValue"
F 5 "0603" H 9000 4300 50  0000 C CNN "DisplayFootprint"
F 6 "3000-0000000135" H -1150 800 50  0001 C CNN "PartSpecification"
	1    8850 4500
	1    0    0    -1  
$EndComp
Wire Wire Line
	8850 4350 8850 4250
Wire Wire Line
	8850 4250 8350 4250
$Comp
L power:GND #PWR?
U 1 1 60614415
P 8850 4800
AR Path="/5D562501/60614415" Ref="#PWR?"  Part="1" 
AR Path="/5D587C46/60614415" Ref="#PWR?"  Part="1" 
AR Path="/5D591ABD/60614415" Ref="#PWR?"  Part="1" 
AR Path="/60664CFF/60614415" Ref="#PWR?"  Part="1" 
AR Path="/605A4C0E/60614415" Ref="#PWR?"  Part="1" 
F 0 "#PWR?" H 8850 4550 50  0001 C CNN
F 1 "GND" H 8855 4627 50  0000 C CNN
F 2 "" H 8850 4800 50  0001 C CNN
F 3 "" H 8850 4800 50  0001 C CNN
	1    8850 4800
	-1   0    0    -1  
$EndComp
Wire Wire Line
	8850 4800 8850 4650
Connection ~ 8350 4250
$Comp
L 000_PreferredParts:C_10uF_0603 C?
U 1 1 60614420
P 9350 4500
AR Path="/5D587C46/60614420" Ref="C?"  Part="1" 
AR Path="/5D562501/60614420" Ref="C?"  Part="1" 
AR Path="/60664CFF/60614420" Ref="C?"  Part="1" 
AR Path="/605A4C0E/60614420" Ref="C1923"  Part="1" 
F 0 "C1923" H 9375 4600 50  0000 L CNN
F 1 "C_10uF_0603" H 9375 4400 50  0001 L CNN
F 2 "Capacitor_SMD:C_0603_1608Metric" H 9388 4350 50  0001 C CNN
F 3 "~" H 9350 4500 50  0001 C CNN
F 4 "10uF" H 9500 4400 50  0000 C CNN "DisplayValue"
F 5 "0603" H 9500 4300 50  0000 C CNN "DisplayFootprint"
F 6 "3000-0000000135" H -1150 800 50  0001 C CNN "PartSpecification"
	1    9350 4500
	1    0    0    -1  
$EndComp
Wire Wire Line
	9350 4350 9350 4250
Wire Wire Line
	9350 4250 8850 4250
$Comp
L power:GND #PWR?
U 1 1 60614428
P 9350 4800
AR Path="/5D562501/60614428" Ref="#PWR?"  Part="1" 
AR Path="/5D587C46/60614428" Ref="#PWR?"  Part="1" 
AR Path="/5D591ABD/60614428" Ref="#PWR?"  Part="1" 
AR Path="/60664CFF/60614428" Ref="#PWR?"  Part="1" 
AR Path="/605A4C0E/60614428" Ref="#PWR?"  Part="1" 
F 0 "#PWR?" H 9350 4550 50  0001 C CNN
F 1 "GND" H 9355 4627 50  0000 C CNN
F 2 "" H 9350 4800 50  0001 C CNN
F 3 "" H 9350 4800 50  0001 C CNN
	1    9350 4800
	-1   0    0    -1  
$EndComp
Wire Wire Line
	9350 4800 9350 4650
Connection ~ 8850 4250
Wire Wire Line
	8000 4250 8000 5250
Wire Wire Line
	9750 5250 9600 5250
Connection ~ 9600 5250
Text Label 7100 5500 0    50   ~ 0
LDO2_FB
Text Label 4850 5450 0    50   ~ 0
NR2_SS
Wire Wire Line
	3500 5250 3700 5250
Connection ~ 3700 5250
Wire Wire Line
	9750 5150 9750 5250
Connection ~ 8550 1300
Connection ~ 3150 3550
Wire Wire Line
	3150 3550 3150 5550
Wire Wire Line
	3150 2050 3150 3550
Wire Wire Line
	3500 3250 3500 5250
Connection ~ 3500 3250
$Comp
L POWDER_PowerGlobals:+3.3VRF #PWR?
U 1 1 60562CB6
P 9750 5150
F 0 "#PWR?" H 9750 5000 50  0001 C CNN
F 1 "+3.3VRF" H 9765 5323 50  0000 C CNN
F 2 "" H 9750 5150 50  0001 C CNN
F 3 "" H 9750 5150 50  0001 C CNN
	1    9750 5150
	1    0    0    -1  
$EndComp
$Comp
L power:GND #PWR?
U 1 1 605775D8
P 3600 2100
AR Path="/5D562501/605775D8" Ref="#PWR?"  Part="1" 
AR Path="/5D587C46/605775D8" Ref="#PWR?"  Part="1" 
AR Path="/5D591ABD/605775D8" Ref="#PWR?"  Part="1" 
AR Path="/60664CFF/605775D8" Ref="#PWR?"  Part="1" 
AR Path="/605A4C0E/605775D8" Ref="#PWR?"  Part="1" 
F 0 "#PWR?" H 3600 1850 50  0001 C CNN
F 1 "GND" H 3605 1927 50  0000 C CNN
F 2 "" H 3600 2100 50  0001 C CNN
F 3 "" H 3600 2100 50  0001 C CNN
	1    3600 2100
	1    0    0    -1  
$EndComp
Wire Wire Line
	3600 2100 3600 2000
Wire Wire Line
	3600 2000 3700 2000
$Comp
L Device:R R1904
U 1 1 606536C6
P 11000 3950
F 0 "R1904" V 11080 3950 50  0000 C CNN
F 1 "10k" V 11000 3950 50  0000 C CNN
F 2 "Resistor_SMD:R_0402_1005Metric" V 10930 3950 50  0001 C CNN
F 3 "~" H 11000 3950 50  0001 C CNN
F 4 "3000-0000000131" V 11000 3950 50  0001 C CNN "PartSpecification"
	1    11000 3950
	-1   0    0    -1  
$EndComp
$Comp
L Device:R R1907
U 1 1 606536CD
P 11000 4750
F 0 "R1907" V 11080 4750 50  0000 C CNN
F 1 "4.87k" V 11000 4750 50  0000 C CNN
F 2 "Resistor_SMD:R_0402_1005Metric" V 10930 4750 50  0001 C CNN
F 3 "~" H 11000 4750 50  0001 C CNN
F 4 "3000-0000000133" V 11000 4750 50  0001 C CNN "PartSpecification"
	1    11000 4750
	-1   0    0    -1  
$EndComp
$Comp
L power:GND #PWR?
U 1 1 606536D3
P 11000 5000
F 0 "#PWR?" H 11000 4750 50  0001 C CNN
F 1 "GND" H 11005 4827 50  0000 C CNN
F 2 "" H 11000 5000 50  0001 C CNN
F 3 "" H 11000 5000 50  0001 C CNN
	1    11000 5000
	-1   0    0    -1  
$EndComp
Wire Wire Line
	11000 4900 11000 5000
Wire Wire Line
	11000 4600 11000 4150
Connection ~ 11000 4150
Wire Wire Line
	11000 4150 11000 4100
Wire Wire Line
	11000 3250 11000 3800
Wire Wire Line
	11000 4150 10400 4150
Connection ~ 11000 3250
Text HLabel 10400 4150 0    50   Output ~ 0
VSENSE_4_8
Wire Wire Line
	7750 5800 8000 5800
$Comp
L Device:R R?
U 1 1 60695AB1
P 10000 5500
AR Path="/60695AB1" Ref="R?"  Part="1" 
AR Path="/605A4C0E/60695AB1" Ref="R1908"  Part="1" 
F 0 "R1908" V 10080 5500 50  0000 C CNN
F 1 "10k" V 10000 5500 50  0000 C CNN
F 2 "Resistor_SMD:R_0402_1005Metric" V 9930 5500 50  0001 C CNN
F 3 "~" H 10000 5500 50  0001 C CNN
F 4 "3000-0000000131" V 10000 5500 50  0001 C CNN "PartSpecification"
	1    10000 5500
	-1   0    0    -1  
$EndComp
$Comp
L Device:R R1910
U 1 1 60695AB8
P 10000 6000
F 0 "R1910" V 10080 6000 50  0000 C CNN
F 1 "4.87k" V 10000 6000 50  0000 C CNN
F 2 "Resistor_SMD:R_0402_1005Metric" V 9930 6000 50  0001 C CNN
F 3 "~" H 10000 6000 50  0001 C CNN
F 4 "3000-0000000133" V 10000 6000 50  0001 C CNN "PartSpecification"
	1    10000 6000
	-1   0    0    -1  
$EndComp
$Comp
L power:GND #PWR?
U 1 1 60695ABE
P 10000 6250
F 0 "#PWR?" H 10000 6000 50  0001 C CNN
F 1 "GND" H 10005 6077 50  0000 C CNN
F 2 "" H 10000 6250 50  0001 C CNN
F 3 "" H 10000 6250 50  0001 C CNN
	1    10000 6250
	-1   0    0    -1  
$EndComp
Wire Wire Line
	10000 6150 10000 6250
Wire Wire Line
	10000 5850 10000 5750
Connection ~ 10000 5750
Wire Wire Line
	10000 5750 10000 5650
Wire Wire Line
	10000 5250 10000 5350
Wire Wire Line
	10000 5750 10250 5750
Wire Wire Line
	7500 5800 7750 5800
Text HLabel 10250 5750 2    50   Output ~ 0
VSENSE_3_3VRF
Wire Wire Line
	10000 5250 9750 5250
Connection ~ 9750 5250
Wire Wire Line
	6500 3650 6800 3650
Wire Wire Line
	6500 5650 6800 5650
$Comp
L Device:R R?
U 1 1 60A2F06C
P 3150 5750
AR Path="/605746B5/5F853053/60A2F06C" Ref="R?"  Part="1" 
AR Path="/605746B5/61256AAD/60A2F06C" Ref="R?"  Part="1" 
AR Path="/605A4C0E/60A2F06C" Ref="R1905"  Part="1" 
F 0 "R1905" V 3230 5750 50  0000 C CNN
F 1 "10k" V 3150 5750 50  0000 C CNN
F 2 "Resistor_SMD:R_0402_1005Metric" V 3080 5750 50  0001 C CNN
F 3 "~" H 3150 5750 50  0001 C CNN
F 4 "3000-0000000131" H 3150 5750 50  0001 C CNN "PartSpecification"
	1    3150 5750
	1    0    0    -1  
$EndComp
$Comp
L power:GND #PWR?
U 1 1 60A2F072
P 3150 6000
AR Path="/605746B5/5F853053/60A2F072" Ref="#PWR?"  Part="1" 
AR Path="/605A4C0E/60A2F072" Ref="#PWR?"  Part="1" 
F 0 "#PWR?" H 3150 5750 50  0001 C CNN
F 1 "GND" H 3150 5850 50  0000 C CNN
F 2 "" H 3150 6000 50  0001 C CNN
F 3 "" H 3150 6000 50  0001 C CNN
	1    3150 6000
	1    0    0    -1  
$EndComp
Wire Wire Line
	3150 6000 3150 5900
Wire Wire Line
	3150 5600 3150 5550
Connection ~ 3150 5550
$EndSCHEMATC
