(module powder_logo_fancy (layer F.Cu) (tedit 0)
  (fp_text reference G*** (at 0 0) (layer F.SilkS) hide
    (effects (font (size 1.524 1.524) (thickness 0.3)))
  )
  (fp_text value LOGO (at 0.75 0) (layer F.SilkS) hide
    (effects (font (size 1.524 1.524) (thickness 0.3)))
  )
  (fp_poly (pts (xy 3.016925 -4.596382) (xy 3.066764 -4.509264) (xy 3.111928 -4.429235) (xy 3.151553 -4.357895)
    (xy 3.184772 -4.296847) (xy 3.210718 -4.247694) (xy 3.228525 -4.212037) (xy 3.237327 -4.191478)
    (xy 3.238075 -4.187339) (xy 3.232088 -4.175257) (xy 3.216918 -4.147539) (xy 3.193648 -4.106085)
    (xy 3.16336 -4.052795) (xy 3.127138 -3.98957) (xy 3.086065 -3.91831) (xy 3.041222 -3.840916)
    (xy 3.014377 -3.79476) (xy 2.795428 -3.41884) (xy 2.525983 -3.416136) (xy 2.256539 -3.413431)
    (xy 2.134501 -3.210396) (xy 2.012464 -3.007361) (xy 2.233052 -3.007329) (xy 2.312993 -3.006968)
    (xy 2.400012 -3.005984) (xy 2.487109 -3.004494) (xy 2.567283 -3.002617) (xy 2.628554 -3.000663)
    (xy 2.803469 -2.994028) (xy 2.925734 -2.774301) (xy 2.95942 -2.713438) (xy 2.989553 -2.65837)
    (xy 3.014792 -2.611601) (xy 3.033793 -2.575635) (xy 3.045214 -2.552978) (xy 3.048 -2.546197)
    (xy 3.043111 -2.535454) (xy 3.029358 -2.509609) (xy 3.008106 -2.471114) (xy 2.980721 -2.422423)
    (xy 2.948569 -2.365989) (xy 2.919453 -2.31539) (xy 2.790907 -2.09296) (xy 2.581633 -2.092941)
    (xy 2.510626 -2.09266) (xy 2.42522 -2.091882) (xy 2.331332 -2.090688) (xy 2.234873 -2.089159)
    (xy 2.141759 -2.087375) (xy 2.091279 -2.086247) (xy 1.810199 -2.079573) (xy 1.641075 -1.735118)
    (xy 1.603124 -1.657319) (xy 1.568309 -1.584979) (xy 1.537597 -1.520179) (xy 1.511953 -1.465)
    (xy 1.492344 -1.421524) (xy 1.479735 -1.391832) (xy 1.475092 -1.378005) (xy 1.475116 -1.377514)
    (xy 1.480858 -1.366303) (xy 1.496015 -1.339518) (xy 1.51951 -1.29899) (xy 1.550267 -1.246547)
    (xy 1.58721 -1.184018) (xy 1.629262 -1.113234) (xy 1.675348 -1.036024) (xy 1.709891 -0.978368)
    (xy 1.941503 -0.592371) (xy 2.141691 -0.585591) (xy 2.219647 -0.582955) (xy 2.305849 -0.580045)
    (xy 2.392448 -0.577127) (xy 2.471595 -0.574465) (xy 2.5146 -0.573022) (xy 2.68732 -0.567232)
    (xy 2.931236 -0.987196) (xy 3.175153 -1.40716) (xy 3.439236 -1.409833) (xy 3.70332 -1.412505)
    (xy 3.83032 -1.191651) (xy 3.865261 -1.130653) (xy 3.896761 -1.075214) (xy 3.923414 -1.027846)
    (xy 3.943812 -0.991059) (xy 3.956551 -0.967366) (xy 3.960273 -0.959559) (xy 3.95605 -0.948484)
    (xy 3.942737 -0.921842) (xy 3.921431 -0.881645) (xy 3.89323 -0.829908) (xy 3.859234 -0.768644)
    (xy 3.820541 -0.699867) (xy 3.778248 -0.625588) (xy 3.774853 -0.619662) (xy 3.732262 -0.545131)
    (xy 3.69304 -0.476071) (xy 3.658304 -0.414479) (xy 3.629168 -0.362349) (xy 3.606747 -0.321678)
    (xy 3.592157 -0.294461) (xy 3.586511 -0.282695) (xy 3.58648 -0.282482) (xy 3.596177 -0.280223)
    (xy 3.623426 -0.278411) (xy 3.665463 -0.277111) (xy 3.719522 -0.276388) (xy 3.78284 -0.276307)
    (xy 3.83231 -0.27668) (xy 4.078141 -0.2794) (xy 4.22093 -0.51816) (xy 4.36372 -0.75692)
    (xy 4.6736 -0.768591) (xy 4.759717 -0.771681) (xy 4.847054 -0.774538) (xy 4.931374 -0.777044)
    (xy 5.008441 -0.779079) (xy 5.074017 -0.780526) (xy 5.123867 -0.781266) (xy 5.12705 -0.781291)
    (xy 5.270621 -0.78232) (xy 5.721451 0.001372) (xy 5.644436 0.135306) (xy 5.61831 0.180685)
    (xy 5.584285 0.239701) (xy 5.544643 0.308401) (xy 5.501664 0.382835) (xy 5.457628 0.459052)
    (xy 5.417581 0.52832) (xy 5.267741 0.7874) (xy 4.814381 0.790043) (xy 4.361021 0.792687)
    (xy 4.249697 0.603391) (xy 5.141994 0.603391) (xy 5.169417 0.620992) (xy 5.191589 0.633498)
    (xy 5.206849 0.639133) (xy 5.207 0.639142) (xy 5.214229 0.630768) (xy 5.230297 0.606697)
    (xy 5.254002 0.568903) (xy 5.284144 0.519357) (xy 5.319523 0.460031) (xy 5.358938 0.392897)
    (xy 5.399193 0.323398) (xy 5.44114 0.250188) (xy 5.479677 0.182301) (xy 5.513661 0.121801)
    (xy 5.541949 0.070748) (xy 5.563398 0.031205) (xy 5.576866 0.005234) (xy 5.581226 -0.004966)
    (xy 5.576274 -0.017421) (xy 5.562358 -0.044543) (xy 5.540893 -0.083928) (xy 5.513289 -0.133169)
    (xy 5.480961 -0.18986) (xy 5.44532 -0.251595) (xy 5.407779 -0.315968) (xy 5.369751 -0.380572)
    (xy 5.332648 -0.443003) (xy 5.297884 -0.500853) (xy 5.26687 -0.551717) (xy 5.24102 -0.593188)
    (xy 5.221746 -0.62286) (xy 5.21046 -0.638328) (xy 5.208384 -0.640014) (xy 5.192336 -0.63466)
    (xy 5.170705 -0.622234) (xy 5.14457 -0.60452) (xy 5.315484 -0.30988) (xy 5.356188 -0.239409)
    (xy 5.393424 -0.174364) (xy 5.426002 -0.116868) (xy 5.452734 -0.069043) (xy 5.47243 -0.033013)
    (xy 5.4839 -0.010899) (xy 5.486399 -0.004816) (xy 5.481493 0.006167) (xy 5.46756 0.03261)
    (xy 5.445775 0.072402) (xy 5.417313 0.123432) (xy 5.38335 0.183588) (xy 5.345062 0.250758)
    (xy 5.314197 0.3045) (xy 5.141994 0.603391) (xy 4.249697 0.603391) (xy 4.225027 0.561443)
    (xy 4.130151 0.400114) (xy 5.009209 0.400114) (xy 5.036984 0.41843) (xy 5.059143 0.431107)
    (xy 5.074546 0.436582) (xy 5.07492 0.436588) (xy 5.082586 0.428105) (xy 5.098807 0.404329)
    (xy 5.122103 0.367633) (xy 5.150991 0.320394) (xy 5.183989 0.264984) (xy 5.21208 0.216837)
    (xy 5.246806 0.156204) (xy 5.277674 0.101178) (xy 5.303339 0.054247) (xy 5.322457 0.017901)
    (xy 5.333685 -0.005372) (xy 5.336095 -0.01287) (xy 5.328883 -0.028411) (xy 5.313121 -0.057197)
    (xy 5.290586 -0.096326) (xy 5.263056 -0.1429) (xy 5.232308 -0.194018) (xy 5.200118 -0.246778)
    (xy 5.168263 -0.298281) (xy 5.13852 -0.345627) (xy 5.112665 -0.385914) (xy 5.092477 -0.416242)
    (xy 5.079731 -0.433711) (xy 5.076379 -0.436814) (xy 5.060265 -0.43152) (xy 5.038157 -0.419034)
    (xy 5.011555 -0.40132) (xy 5.126953 -0.20828) (xy 5.16049 -0.15185) (xy 5.190203 -0.101219)
    (xy 5.214594 -0.058996) (xy 5.232163 -0.027788) (xy 5.241409 -0.010203) (xy 5.242456 -0.007434)
    (xy 5.237572 0.003221) (xy 5.223826 0.028802) (xy 5.202666 0.066727) (xy 5.175542 0.114414)
    (xy 5.143903 0.169281) (xy 5.125884 0.200243) (xy 5.009209 0.400114) (xy 4.130151 0.400114)
    (xy 4.089034 0.3302) (xy 3.858077 0.327469) (xy 3.792024 0.326949) (xy 3.733339 0.326989)
    (xy 3.684873 0.327545) (xy 3.649479 0.328573) (xy 3.630008 0.33003) (xy 3.62712 0.33098)
    (xy 3.631953 0.340967) (xy 3.645697 0.366573) (xy 3.667216 0.405753) (xy 3.695375 0.456462)
    (xy 3.729041 0.516657) (xy 3.767077 0.584291) (xy 3.803451 0.648671) (xy 3.844992 0.722091)
    (xy 3.883727 0.790642) (xy 3.918423 0.852131) (xy 3.947842 0.904366) (xy 3.97075 0.945153)
    (xy 3.985911 0.9723) (xy 3.991758 0.98296) (xy 3.994577 0.991439) (xy 3.994046 1.002535)
    (xy 3.989099 1.018412) (xy 3.978668 1.041236) (xy 3.961686 1.073171) (xy 3.937085 1.116382)
    (xy 3.903798 1.173034) (xy 3.870285 1.22934) (xy 3.736837 1.45288) (xy 3.221099 1.45288)
    (xy 2.970203 1.032345) (xy 2.719307 0.611811) (xy 2.530593 0.605751) (xy 2.457693 0.603451)
    (xy 2.371929 0.600812) (xy 2.280753 0.598059) (xy 2.191613 0.595417) (xy 2.121789 0.593391)
    (xy 1.901699 0.587091) (xy 1.667129 0.980264) (xy 1.618734 1.061605) (xy 1.573708 1.137717)
    (xy 1.533095 1.206803) (xy 1.497941 1.267065) (xy 1.46929 1.316704) (xy 1.448187 1.353922)
    (xy 1.435679 1.376923) (xy 1.43256 1.383842) (xy 1.437326 1.394768) (xy 1.450916 1.421459)
    (xy 1.472262 1.46193) (xy 1.500297 1.514195) (xy 1.533955 1.576269) (xy 1.572171 1.646167)
    (xy 1.613876 1.721902) (xy 1.62306 1.73851) (xy 1.81356 2.082772) (xy 2.790738 2.0828)
    (xy 2.801916 2.107333) (xy 2.810196 2.123134) (xy 2.82707 2.153535) (xy 2.850873 2.195598)
    (xy 2.879936 2.246385) (xy 2.912594 2.302958) (xy 2.925682 2.325503) (xy 2.958868 2.382807)
    (xy 2.988719 2.434789) (xy 3.013667 2.478678) (xy 3.03214 2.511707) (xy 3.042569 2.531105)
    (xy 3.044157 2.534482) (xy 3.04109 2.547685) (xy 3.028934 2.576402) (xy 3.008725 2.618528)
    (xy 2.981494 2.671957) (xy 2.948277 2.734582) (xy 2.924562 2.778138) (xy 2.79908 3.006451)
    (xy 2.405772 3.006905) (xy 2.012464 3.00736) (xy 2.134501 3.210395) (xy 2.256539 3.41343)
    (xy 2.526418 3.416135) (xy 2.796296 3.41884) (xy 3.014923 3.79476) (xy 3.061361 3.8748)
    (xy 3.104643 3.949773) (xy 3.143688 4.01778) (xy 3.177417 4.076922) (xy 3.204748 4.1253)
    (xy 3.224602 4.161014) (xy 3.235898 4.182167) (xy 3.238092 4.186979) (xy 3.234111 4.198947)
    (xy 3.220876 4.22663) (xy 3.19938 4.268195) (xy 3.170617 4.321807) (xy 3.135579 4.385634)
    (xy 3.095259 4.457841) (xy 3.050649 4.536597) (xy 3.016666 4.595919) (xy 2.790697 4.98856)
    (xy 1.880456 4.98856) (xy 1.855895 4.94538) (xy 1.838864 4.914771) (xy 1.815323 4.871498)
    (xy 1.786469 4.817839) (xy 1.758285 4.76504) (xy 1.9812 4.76504) (xy 1.9812 4.846567)
    (xy 2.359235 4.843903) (xy 2.737271 4.84124) (xy 2.918035 4.52658) (xy 2.959736 4.453836)
    (xy 2.998041 4.386717) (xy 3.031812 4.327241) (xy 3.05991 4.277426) (xy 3.081196 4.239292)
    (xy 3.094531 4.214856) (xy 3.0988 4.20619) (xy 3.091095 4.198174) (xy 3.073111 4.185558)
    (xy 3.052544 4.173216) (xy 3.03709 4.166026) (xy 3.034732 4.1656) (xy 3.028684 4.174097)
    (xy 3.013799 4.198233) (xy 2.991272 4.235978) (xy 2.9623 4.285299) (xy 2.928076 4.344166)
    (xy 2.889797 4.410546) (xy 2.8585 4.465169) (xy 2.68732 4.764738) (xy 1.9812 4.76504)
    (xy 1.758285 4.76504) (xy 1.753497 4.756071) (xy 1.717605 4.688472) (xy 1.679987 4.61732)
    (xy 1.645418 4.55168) (xy 2.09296 4.55168) (xy 2.09296 4.63296) (xy 2.35458 4.632643)
    (xy 2.6162 4.632327) (xy 2.73558 4.416394) (xy 2.768754 4.356112) (xy 2.798384 4.301738)
    (xy 2.823125 4.255787) (xy 2.841628 4.220774) (xy 2.852548 4.199214) (xy 2.85496 4.193451)
    (xy 2.847072 4.185303) (xy 2.828673 4.17319) (xy 2.807663 4.16175) (xy 2.791939 4.155621)
    (xy 2.790235 4.15544) (xy 2.784147 4.163922) (xy 2.769733 4.187683) (xy 2.748456 4.224197)
    (xy 2.721781 4.270937) (xy 2.69117 4.325376) (xy 2.675476 4.35356) (xy 2.56549 4.55168)
    (xy 2.09296 4.55168) (xy 1.645418 4.55168) (xy 1.641842 4.544891) (xy 1.604365 4.473465)
    (xy 1.568752 4.405318) (xy 1.544477 4.35864) (xy 2.1844 4.35864) (xy 2.1844 4.43992)
    (xy 2.498695 4.43992) (xy 2.55633 4.34086) (xy 2.581769 4.297213) (xy 2.605417 4.256773)
    (xy 2.624223 4.224751) (xy 2.633368 4.209302) (xy 2.652771 4.176804) (xy 2.62229 4.161042)
    (xy 2.599092 4.150254) (xy 2.583856 4.145312) (xy 2.583237 4.14528) (xy 2.575188 4.153605)
    (xy 2.559573 4.176284) (xy 2.53863 4.20987) (xy 2.514594 4.250919) (xy 2.514152 4.251695)
    (xy 2.45364 4.35811) (xy 2.1844 4.35864) (xy 1.544477 4.35864) (xy 1.536201 4.342728)
    (xy 1.507906 4.287973) (xy 1.489659 4.252309) (xy 2.2352 4.252309) (xy 2.24453 4.254572)
    (xy 2.269208 4.256246) (xy 2.304262 4.25702) (xy 2.311253 4.25704) (xy 2.387307 4.25704)
    (xy 2.417933 4.196369) (xy 2.433548 4.163967) (xy 2.444581 4.138265) (xy 2.44856 4.125249)
    (xy 2.439078 4.119684) (xy 2.413266 4.116008) (xy 2.378372 4.1148) (xy 2.308184 4.1148)
    (xy 2.271692 4.181189) (xy 2.254106 4.213772) (xy 2.241165 4.238872) (xy 2.235315 4.251724)
    (xy 2.2352 4.252309) (xy 1.489659 4.252309) (xy 1.485065 4.243331) (xy 1.468875 4.21108)
    (xy 1.460531 4.193496) (xy 1.459653 4.191007) (xy 1.464418 4.179631) (xy 1.477855 4.152956)
    (xy 1.498679 4.113394) (xy 1.525602 4.063358) (xy 1.55734 4.00526) (xy 1.592606 3.941515)
    (xy 1.593426 3.940041) (xy 1.628705 3.87644) (xy 1.660498 3.818687) (xy 1.687523 3.769143)
    (xy 1.708502 3.730171) (xy 1.722152 3.70413) (xy 1.727195 3.693384) (xy 1.7272 3.69332)
    (xy 1.722133 3.68278) (xy 1.708134 3.658201) (xy 1.687004 3.622503) (xy 1.660546 3.578605)
    (xy 1.630562 3.529426) (xy 1.598853 3.477886) (xy 1.567221 3.426905) (xy 1.537469 3.379401)
    (xy 1.511398 3.338293) (xy 1.490811 3.306503) (xy 1.477508 3.286948) (xy 1.47336 3.282065)
    (xy 1.467272 3.290643) (xy 1.452215 3.314905) (xy 1.42934 3.352911) (xy 1.399796 3.402724)
    (xy 1.364731 3.462405) (xy 1.325296 3.530015) (xy 1.282639 3.603615) (xy 1.27911 3.609725)
    (xy 1.0901 3.937) (xy 0.826808 3.939704) (xy 0.563517 3.942408) (xy 0.432465 3.721399)
    (xy 0.396697 3.660654) (xy 0.364648 3.605409) (xy 0.337716 3.55814) (xy 0.317297 3.521321)
    (xy 0.304788 3.497428) (xy 0.301413 3.48922) (xy 0.306311 3.478383) (xy 0.320344 3.451718)
    (xy 0.342516 3.411012) (xy 0.371833 3.358052) (xy 0.407301 3.294626) (xy 0.447924 3.222521)
    (xy 0.492709 3.143525) (xy 0.536786 3.066202) (xy 0.584539 2.98238) (xy 0.629045 2.903745)
    (xy 0.669307 2.832092) (xy 0.70433 2.769219) (xy 0.733119 2.71692) (xy 0.754678 2.676992)
    (xy 0.768012 2.65123) (xy 0.77216 2.641588) (xy 0.766968 2.630392) (xy 0.752163 2.603895)
    (xy 0.728898 2.564029) (xy 0.698327 2.512727) (xy 0.661603 2.451921) (xy 0.61988 2.383542)
    (xy 0.574312 2.309523) (xy 0.562024 2.289668) (xy 0.351888 1.950515) (xy -0.105512 1.953157)
    (xy -0.562913 1.9558) (xy -0.661886 2.16408) (xy -0.69498 2.233822) (xy -0.729325 2.306378)
    (xy -0.762518 2.376658) (xy -0.792156 2.439573) (xy -0.815836 2.490031) (xy -0.818856 2.496492)
    (xy -0.876852 2.620624) (xy -0.635815 3.042666) (xy -0.58757 3.127525) (xy -0.542679 3.207222)
    (xy -0.502113 3.279987) (xy -0.466839 3.344045) (xy -0.437826 3.397624) (xy -0.416042 3.438952)
    (xy -0.402457 3.466256) (xy -0.398039 3.477764) (xy -0.39805 3.477816) (xy -0.40393 3.489904)
    (xy -0.41872 3.516923) (xy -0.440969 3.556319) (xy -0.469228 3.605544) (xy -0.502044 3.662045)
    (xy -0.528095 3.706506) (xy -0.65487 3.922088) (xy -0.91813 3.919384) (xy -1.181391 3.91668)
    (xy -1.368112 3.59664) (xy -1.41096 3.523478) (xy -1.450748 3.456077) (xy -1.48629 3.396408)
    (xy -1.516399 3.346438) (xy -1.539889 3.308135) (xy -1.555574 3.28347) (xy -1.562268 3.274411)
    (xy -1.562276 3.274408) (xy -1.569223 3.282202) (xy -1.584525 3.305244) (xy -1.606647 3.341029)
    (xy -1.634057 3.387053) (xy -1.665221 3.440811) (xy -1.679633 3.466104) (xy -1.789546 3.659991)
    (xy -1.652714 3.910255) (xy -1.611767 3.985535) (xy -1.579928 4.045121) (xy -1.556277 4.090991)
    (xy -1.539892 4.125122) (xy -1.529848 4.149492) (xy -1.525226 4.166077) (xy -1.525102 4.176855)
    (xy -1.526518 4.18084) (xy -1.533857 4.193683) (xy -1.550471 4.22206) (xy -1.575225 4.264053)
    (xy -1.606984 4.317744) (xy -1.644613 4.381214) (xy -1.686977 4.452548) (xy -1.73294 4.529827)
    (xy -1.759563 4.57454) (xy -1.981973 4.94792) (xy -2.446407 4.947664) (xy -2.91084 4.947408)
    (xy -3.344834 4.180293) (xy -3.211422 4.180293) (xy -3.208244 4.193348) (xy -3.199172 4.215028)
    (xy -3.183439 4.246821) (xy -3.160278 4.290216) (xy -3.128921 4.346701) (xy -3.0886 4.417764)
    (xy -3.042928 4.497297) (xy -3.000774 4.570297) (xy -2.961552 4.637981) (xy -2.926481 4.698264)
    (xy -2.89678 4.74906) (xy -2.873667 4.788285) (xy -2.858362 4.813851) (xy -2.852271 4.82346)
    (xy -2.844409 4.827202) (xy -2.826207 4.830196) (xy -2.796008 4.832505) (xy -2.752156 4.834193)
    (xy -2.692993 4.835322) (xy -2.616863 4.835957) (xy -2.522109 4.836159) (xy -2.519855 4.83616)
    (xy -2.438502 4.835958) (xy -2.361654 4.835386) (xy -2.292219 4.834495) (xy -2.233104 4.833335)
    (xy -2.187218 4.831958) (xy -2.157469 4.830415) (xy -2.150259 4.829699) (xy -2.121684 4.824953)
    (xy -2.107888 4.817675) (xy -2.103489 4.802775) (xy -2.10312 4.785115) (xy -2.10312 4.746993)
    (xy -2.447424 4.752435) (xy -2.791728 4.757878) (xy -2.817394 4.718279) (xy -2.829028 4.69935)
    (xy -2.849216 4.665433) (xy -2.876412 4.619171) (xy -2.90907 4.563208) (xy -2.945642 4.500188)
    (xy -2.984582 4.432754) (xy -2.992156 4.4196) (xy -3.030279 4.353537) (xy -3.065355 4.29311)
    (xy -3.096046 4.240592) (xy -3.121015 4.198258) (xy -3.13609 4.173114) (xy -2.97688 4.173114)
    (xy -2.972006 4.183369) (xy -2.958254 4.208889) (xy -2.936935 4.247353) (xy -2.909357 4.296442)
    (xy -2.87683 4.353839) (xy -2.840662 4.417223) (xy -2.802162 4.484276) (xy -2.76264 4.552678)
    (xy -2.761747 4.55422) (xy -2.721984 4.6228) (xy -2.652941 4.6228) (xy -2.619602 4.62242)
    (xy -2.570948 4.621371) (xy -2.511972 4.619782) (xy -2.447664 4.617785) (xy -2.399389 4.616116)
    (xy -2.21488 4.609433) (xy -2.21488 4.528816) (xy -2.67716 4.53644) (xy -2.888847 4.167203)
    (xy -2.766655 4.167203) (xy -2.765508 4.169195) (xy -2.757348 4.181823) (xy -2.741074 4.208482)
    (xy -2.718804 4.245652) (xy -2.69266 4.289811) (xy -2.683554 4.3053) (xy -2.610509 4.42976)
    (xy -2.30632 4.42976) (xy -2.30632 4.349087) (xy -2.43586 4.346243) (xy -2.5654 4.3434)
    (xy -2.628818 4.23672) (xy -2.653559 4.194782) (xy -2.67435 4.158941) (xy -2.689041 4.132942)
    (xy -2.695485 4.120533) (xy -2.695521 4.120431) (xy -2.705125 4.119375) (xy -2.72557 4.127859)
    (xy -2.736611 4.134187) (xy -2.761453 4.153157) (xy -2.766655 4.167203) (xy -2.888847 4.167203)
    (xy -2.912128 4.126596) (xy -2.944504 4.147096) (xy -2.965428 4.161659) (xy -2.976402 4.171865)
    (xy -2.97688 4.173114) (xy -3.13609 4.173114) (xy -3.138928 4.168382) (xy -3.148446 4.153238)
    (xy -3.149415 4.151958) (xy -3.16117 4.149005) (xy -3.18247 4.157647) (xy -3.209473 4.174377)
    (xy -3.211422 4.180293) (xy -3.344834 4.180293) (xy -3.364628 4.145306) (xy -3.343681 4.110009)
    (xy -2.57048 4.110009) (xy -2.566234 4.121142) (xy -2.555111 4.145107) (xy -2.539854 4.176049)
    (xy -2.509228 4.23672) (xy -2.438254 4.23672) (xy -2.402839 4.235414) (xy -2.377532 4.231962)
    (xy -2.367307 4.22706) (xy -2.36728 4.226785) (xy -2.371478 4.212968) (xy -2.382381 4.187137)
    (xy -2.394797 4.160745) (xy -2.422314 4.10464) (xy -2.496397 4.10464) (xy -2.532258 4.105315)
    (xy -2.558568 4.107098) (xy -2.57029 4.109624) (xy -2.57048 4.110009) (xy -3.343681 4.110009)
    (xy -2.90068 3.363556) (xy -2.605854 3.363258) (xy -2.311027 3.36296) (xy -2.223231 3.20294)
    (xy -2.178822 3.121582) (xy -2.144111 3.057041) (xy -2.118681 3.008511) (xy -2.102113 2.975184)
    (xy -2.093988 2.956256) (xy -2.09296 2.951884) (xy -2.10275 2.950648) (xy -2.130633 2.949509)
    (xy -2.174387 2.9485) (xy -2.231784 2.947652) (xy -2.300601 2.946999) (xy -2.378612 2.946571)
    (xy -2.463591 2.946401) (xy -2.472605 2.9464) (xy -2.852249 2.9464) (xy -2.978791 2.719684)
    (xy -3.105332 2.492968) (xy -2.977606 2.267971) (xy -2.84988 2.042973) (xy -2.36411 2.040026)
    (xy -1.878339 2.03708) (xy -1.701547 1.71196) (xy -1.661056 1.637154) (xy -1.623807 1.567684)
    (xy -1.590891 1.505632) (xy -1.563399 1.453084) (xy -1.542423 1.412124) (xy -1.529052 1.384838)
    (xy -1.524378 1.373349) (xy -1.529257 1.361972) (xy -1.54336 1.33493) (xy -1.565641 1.294089)
    (xy -1.595054 1.241317) (xy -1.630554 1.178481) (xy -1.63177 1.176349) (xy -1.1684 1.176349)
    (xy -1.163619 1.188452) (xy -1.150428 1.214874) (xy -1.130555 1.252324) (xy -1.105731 1.297511)
    (xy -1.090287 1.32501) (xy -1.012174 1.46304) (xy -0.838827 1.462961) (xy -0.66548 1.462883)
    (xy -0.642317 1.422321) (xy -0.624957 1.39192) (xy 0.344833 1.39192) (xy 0.367996 1.432669)
    (xy 0.39116 1.473418) (xy 0.558434 1.470769) (xy 0.725709 1.46812) (xy 0.814479 1.316884)
    (xy 0.903249 1.165649) (xy 0.882203 1.124395) (xy 0.874267 1.1085) (xy 0.867684 1.097812)
    (xy 0.860836 1.094005) (xy 0.852103 1.098752) (xy 0.839867 1.113729) (xy 0.822508 1.140609)
    (xy 0.798407 1.181065) (xy 0.765945 1.236773) (xy 0.754481 1.256458) (xy 0.67564 1.391711)
    (xy 0.510236 1.391815) (xy 0.344833 1.39192) (xy -0.624957 1.39192) (xy -0.619154 1.38176)
    (xy -0.963011 1.38176) (xy -1.044084 1.238754) (xy -1.125158 1.095749) (xy -1.146779 1.130734)
    (xy -1.160538 1.155442) (xy -1.167973 1.173556) (xy -1.1684 1.176349) (xy -1.63177 1.176349)
    (xy -1.671094 1.107449) (xy -1.715629 1.030089) (xy -1.744857 0.979649) (xy -1.859485 0.782313)
    (xy -0.935868 0.782313) (xy -0.878029 0.886456) (xy -0.85298 0.93134) (xy -0.829554 0.972925)
    (xy -0.810645 1.006096) (xy -0.800427 1.02362) (xy -0.780663 1.05664) (xy -0.420302 1.05664)
    (xy -0.397594 1.016236) (xy -0.380331 0.98552) (xy 0.120619 0.98552) (xy 0.166573 1.067284)
    (xy 0.329027 1.064502) (xy 0.49148 1.06172) (xy 0.580661 0.9144) (xy 0.610201 0.86486)
    (xy 0.635652 0.820766) (xy 0.655255 0.785279) (xy 0.667252 0.761558) (xy 0.670201 0.753407)
    (xy 0.665806 0.736492) (xy 0.654903 0.713731) (xy 0.641817 0.692765) (xy 0.630871 0.681234)
    (xy 0.629062 0.68072) (xy 0.622006 0.689041) (xy 0.606557 0.712121) (xy 0.584503 0.747131)
    (xy 0.55763 0.791245) (xy 0.532727 0.83312) (xy 0.443028 0.98552) (xy 0.120619 0.98552)
    (xy -0.380331 0.98552) (xy -0.374886 0.975833) (xy -0.555492 0.973056) (xy -0.736097 0.97028)
    (xy -0.886849 0.70011) (xy -0.911358 0.741212) (xy -0.935868 0.782313) (xy -1.859485 0.782313)
    (xy -1.965713 0.59944) (xy -2.158877 0.600845) (xy -2.235615 0.60171) (xy -2.3205 0.603175)
    (xy -2.405521 0.605069) (xy -2.482668 0.607223) (xy -2.519056 0.608465) (xy -2.686071 0.61468)
    (xy -3.167407 1.43764) (xy -3.692445 1.43764) (xy -3.801744 1.25476) (xy -3.83602 1.197195)
    (xy -3.868061 1.142985) (xy -3.895903 1.095484) (xy -3.917581 1.058047) (xy -3.931132 1.034029)
    (xy -3.932636 1.03124) (xy -3.954228 0.9906) (xy -3.774216 0.67056) (xy -3.732689 0.596625)
    (xy -3.694272 0.528025) (xy -3.660118 0.466836) (xy -3.634999 0.42164) (xy -0.713096 0.42164)
    (xy -0.650093 0.5334) (xy -0.624687 0.57826) (xy -0.6017 0.618477) (xy -0.58361 0.649735)
    (xy -0.5729 0.667719) (xy -0.572711 0.66802) (xy -0.566842 0.676203) (xy -0.559069 0.682154)
    (xy -0.546379 0.686228) (xy -0.525756 0.688776) (xy -0.494184 0.690153) (xy -0.448649 0.690711)
    (xy -0.386136 0.690804) (xy -0.378226 0.690801) (xy -0.19812 0.690723) (xy -0.174957 0.650161)
    (xy -0.154511 0.614357) (xy -0.08128 0.614357) (xy -0.0766 0.624934) (xy -0.064892 0.646259)
    (xy -0.059957 0.654739) (xy -0.038633 0.69088) (xy 0.282033 0.69088) (xy 0.375372 0.534318)
    (xy 0.46871 0.377757) (xy 0.446588 0.334395) (xy 0.431972 0.309004) (xy 0.422027 0.300752)
    (xy 0.415756 0.305536) (xy 0.407798 0.318886) (xy 0.391437 0.346406) (xy 0.368638 0.384788)
    (xy 0.341364 0.430725) (xy 0.322636 0.46228) (xy 0.238225 0.60452) (xy 0.078472 0.607317)
    (xy 0.024092 0.608524) (xy -0.022344 0.610041) (xy -0.057405 0.611715) (xy -0.07766 0.613396)
    (xy -0.08128 0.614357) (xy -0.154511 0.614357) (xy -0.151794 0.6096) (xy -0.506617 0.6096)
    (xy -0.525978 0.58166) (xy -0.539664 0.559978) (xy -0.559372 0.526395) (xy -0.581584 0.48695)
    (xy -0.589538 0.47244) (xy -0.611491 0.432393) (xy -0.631764 0.395973) (xy -0.646991 0.369208)
    (xy -0.650634 0.363024) (xy -0.667529 0.334888) (xy -0.690312 0.378264) (xy -0.713096 0.42164)
    (xy -3.634999 0.42164) (xy -3.631382 0.415134) (xy -3.609216 0.374994) (xy -3.594776 0.348493)
    (xy -3.589256 0.33782) (xy -3.591822 0.333583) (xy -3.604532 0.33034) (xy -3.629322 0.327981)
    (xy -3.66813 0.326399) (xy -3.722896 0.325486) (xy -3.795556 0.325133) (xy -3.816655 0.32512)
    (xy -4.049004 0.32512) (xy -4.194892 0.568736) (xy -4.23336 0.632604) (xy -4.268932 0.690966)
    (xy -4.300145 0.741477) (xy -4.325537 0.781791) (xy -4.343645 0.809563) (xy -4.353005 0.822449)
    (xy -4.353421 0.822844) (xy -4.367385 0.82572) (xy -4.401548 0.827995) (xy -4.4558 0.829667)
    (xy -4.530027 0.830733) (xy -4.624119 0.831193) (xy -4.737964 0.831044) (xy -4.811436 0.830687)
    (xy -5.25681 0.82804) (xy -5.487491 0.43688) (xy -5.542761 0.342998) (xy -5.588415 0.264997)
    (xy -5.625276 0.201323) (xy -5.654166 0.150426) (xy -5.675909 0.110751) (xy -5.691329 0.080747)
    (xy -5.701249 0.058861) (xy -5.706491 0.04354) (xy -5.707565 0.03556) (xy -5.570284 0.03556)
    (xy -5.565434 0.045792) (xy -5.5518 0.071168) (xy -5.530772 0.109241) (xy -5.503744 0.157567)
    (xy -5.472109 0.213702) (xy -5.437259 0.2752) (xy -5.400587 0.339618) (xy -5.363485 0.404511)
    (xy -5.327347 0.467434) (xy -5.293565 0.525942) (xy -5.263532 0.577592) (xy -5.23864 0.619937)
    (xy -5.220283 0.650534) (xy -5.215757 0.65786) (xy -5.204311 0.674434) (xy -5.193627 0.679204)
    (xy -5.176378 0.673149) (xy -5.160776 0.665219) (xy -5.14042 0.653459) (xy -5.130897 0.645528)
    (xy -5.1308 0.645109) (xy -5.135697 0.635536) (xy -5.149607 0.610439) (xy -5.17136 0.571876)
    (xy -5.199785 0.521907) (xy -5.233712 0.462591) (xy -5.27197 0.395987) (xy -5.30352 0.341246)
    (xy -5.344321 0.27039) (xy -5.381685 0.205184) (xy -5.414442 0.147699) (xy -5.441419 0.100002)
    (xy -5.461445 0.064164) (xy -5.473348 0.042253) (xy -5.47624 0.036183) (xy -5.474672 0.033029)
    (xy -5.32384 0.033029) (xy -5.318896 0.044503) (xy -5.304987 0.070972) (xy -5.283503 0.109945)
    (xy -5.255831 0.158933) (xy -5.22336 0.215444) (xy -5.194871 0.264379) (xy -5.065901 0.48467)
    (xy -5.032311 0.464851) (xy -5.010792 0.451097) (xy -4.99931 0.441697) (xy -4.99872 0.440505)
    (xy -5.003617 0.430771) (xy -5.017288 0.406195) (xy -5.038209 0.369454) (xy -5.064854 0.32322)
    (xy -5.095698 0.27017) (xy -5.103924 0.256089) (xy -5.136476 0.200319) (xy -5.166094 0.149372)
    (xy -5.191025 0.106279) (xy -5.209516 0.074069) (xy -5.219816 0.055776) (xy -5.220709 0.054111)
    (xy -5.223597 0.04487) (xy -5.222766 0.035027) (xy -5.10032 0.035027) (xy -5.095559 0.047096)
    (xy -5.082706 0.072361) (xy -5.063911 0.107076) (xy -5.041323 0.147494) (xy -5.017091 0.189869)
    (xy -4.993365 0.230453) (xy -4.972293 0.265501) (xy -4.956025 0.291265) (xy -4.946709 0.303999)
    (xy -4.945626 0.304719) (xy -4.93273 0.29995) (xy -4.910966 0.288185) (xy -4.908003 0.286404)
    (xy -4.877755 0.268009) (xy -4.943318 0.153117) (xy -4.967741 0.110095) (xy -4.988035 0.073924)
    (xy -5.00232 0.047987) (xy -5.007582 0.037849) (xy -4.887755 0.037849) (xy -4.85061 0.100204)
    (xy -4.831555 0.130767) (xy -4.816114 0.152934) (xy -4.807386 0.162287) (xy -4.807033 0.162349)
    (xy -4.799129 0.15413) (xy -4.784306 0.132669) (xy -4.765622 0.102427) (xy -4.76367 0.09911)
    (xy -4.726739 0.036081) (xy -4.786139 -0.05139) (xy -1.869837 -0.05139) (xy -1.797292 0.075905)
    (xy -1.724748 0.2032) (xy -1.680254 0.2032) (xy -1.653405 0.20215) (xy -1.637568 0.199501)
    (xy -1.63576 0.198052) (xy -1.640502 0.187789) (xy -1.653479 0.163341) (xy -1.672821 0.12815)
    (xy -1.696654 0.085659) (xy -1.7018 0.076579) (xy -1.72641 0.032415) (xy -1.746857 -0.005833)
    (xy -1.761244 -0.034499) (xy -1.767674 -0.049918) (xy -1.76784 -0.051011) (xy -1.765844 -0.056061)
    (xy -1.397 -0.056061) (xy -1.392333 -0.04389) (xy -1.379501 -0.017431) (xy -1.360257 0.019869)
    (xy -1.336354 0.064566) (xy -1.32588 0.083743) (xy -1.25476 0.213206) (xy -1.206414 0.213283)
    (xy -1.158067 0.21336) (xy -1.190893 0.15494) (xy -1.212659 0.116309) (xy -1.239014 0.069685)
    (xy -1.264496 0.02473) (xy -1.266076 0.021947) (xy -1.306524 -0.049265) (xy -0.975292 -0.049265)
    (xy -0.902503 0.08163) (xy -0.875715 0.128205) (xy -0.851097 0.16808) (xy -0.830807 0.197973)
    (xy -0.817001 0.2146) (xy -0.813638 0.216844) (xy -0.79232 0.220263) (xy -0.764334 0.222341)
    (xy -0.731108 0.22352) (xy -0.750827 0.18542) (xy -0.764434 0.159941) (xy -0.784774 0.122822)
    (xy -0.808533 0.080084) (xy -0.82213 0.05588) (xy -0.843688 0.016542) (xy -0.860828 -0.016871)
    (xy -0.868407 -0.033482) (xy -0.627205 -0.033482) (xy -0.62114 -0.022698) (xy -0.606528 0.003229)
    (xy -0.584806 0.041748) (xy -0.557416 0.090306) (xy -0.525796 0.146351) (xy -0.503751 0.18542)
    (xy -0.384783 0.39624) (xy -0.133972 0.395857) (xy 0.11684 0.395475) (xy 0.216379 0.224205)
    (xy 4.89712 0.224205) (xy 4.905028 0.233909) (xy 4.923465 0.247084) (xy 4.944494 0.258711)
    (xy 4.959652 0.263753) (xy 4.966711 0.255524) (xy 4.981663 0.232608) (xy 5.00259 0.198114)
    (xy 5.027577 0.155151) (xy 5.039221 0.13462) (xy 5.065116 0.088417) (xy 5.087202 0.048636)
    (xy 5.103667 0.018565) (xy 5.112703 0.001494) (xy 5.113849 -0.001017) (xy 5.109796 -0.011893)
    (xy 5.097536 -0.036323) (xy 5.079275 -0.070412) (xy 5.057222 -0.110265) (xy 5.033581 -0.151987)
    (xy 5.01056 -0.191684) (xy 4.990365 -0.22546) (xy 4.975204 -0.249421) (xy 4.967316 -0.259651)
    (xy 4.952914 -0.259749) (xy 4.927553 -0.247328) (xy 4.909336 -0.235662) (xy 4.90575 -0.227316)
    (xy 4.910057 -0.210235) (xy 4.923295 -0.181866) (xy 4.946501 -0.139658) (xy 4.952851 -0.128601)
    (xy 4.976307 -0.087543) (xy 4.996142 -0.052018) (xy 5.010009 -0.026283) (xy 5.015279 -0.015467)
    (xy 5.012671 -0.001315) (xy 5.001359 0.026288) (xy 4.983146 0.0634) (xy 4.959834 0.106079)
    (xy 4.959064 0.107423) (xy 4.935226 0.14965) (xy 4.915641 0.185646) (xy 4.902284 0.211687)
    (xy 4.897127 0.224052) (xy 4.89712 0.224205) (xy 0.216379 0.224205) (xy 0.241507 0.180969)
    (xy 0.366175 -0.033538) (xy 0.244628 -0.247909) (xy 0.197949 -0.330237) (xy 0.44704 -0.330237)
    (xy 0.451745 -0.320081) (xy 0.46472 -0.2954) (xy 0.484254 -0.259367) (xy 0.508634 -0.215156)
    (xy 0.523092 -0.189212) (xy 0.549943 -0.140901) (xy 0.57343 -0.098077) (xy 0.591659 -0.064233)
    (xy 0.602741 -0.042862) (xy 0.605005 -0.03796) (xy 0.602385 -0.023272) (xy 0.59048 0.004895)
    (xy 0.570986 0.042922) (xy 0.549272 0.081041) (xy 0.525316 0.121662) (xy 0.505711 0.155433)
    (xy 0.492488 0.178815) (xy 0.48768 0.188261) (xy 0.49654 0.191734) (xy 0.518131 0.19552)
    (xy 0.5207 0.19585) (xy 0.546664 0.199112) (xy 0.563628 0.201314) (xy 0.56388 0.201349)
    (xy 0.572543 0.193604) (xy 0.588965 0.171432) (xy 0.610907 0.138099) (xy 0.636131 0.096868)
    (xy 0.64008 0.090171) (xy 0.664728 0.047204) (xy 0.684808 0.010385) (xy 0.698438 -0.016702)
    (xy 0.703739 -0.030472) (xy 0.703707 -0.031141) (xy 0.698159 -0.042525) (xy 0.684337 -0.068477)
    (xy 0.663947 -0.105863) (xy 0.638694 -0.15155) (xy 0.618596 -0.187577) (xy 0.54443 -0.32004)
    (xy 0.87446 -0.32004) (xy 0.95539 -0.175112) (xy 0.982591 -0.125842) (xy 1.005898 -0.082563)
    (xy 1.023642 -0.048459) (xy 1.034153 -0.026714) (xy 1.03632 -0.020645) (xy 1.031336 -0.008629)
    (xy 1.017796 0.016851) (xy 0.997811 0.051966) (xy 0.97536 0.089804) (xy 0.951346 0.130063)
    (xy 0.931787 0.163819) (xy 0.91878 0.187388) (xy 0.9144 0.196957) (xy 0.923482 0.200694)
    (xy 0.946442 0.202924) (xy 0.959745 0.2032) (xy 1.00509 0.2032) (xy 1.071169 0.091878)
    (xy 1.137249 -0.019443) (xy 1.055836 -0.164623) (xy 1.027969 -0.213935) (xy 1.003167 -0.257108)
    (xy 0.983285 -0.290972) (xy 0.970175 -0.312355) (xy 0.968337 -0.31496) (xy 1.342515 -0.31496)
    (xy 1.423097 -0.172738) (xy 1.450349 -0.124186) (xy 1.473657 -0.081791) (xy 1.491327 -0.048706)
    (xy 1.501666 -0.028082) (xy 1.503653 -0.022878) (xy 1.498771 -0.010808) (xy 1.486061 0.013128)
    (xy 1.470114 0.04064) (xy 1.445632 0.081977) (xy 1.418657 0.128283) (xy 1.40301 0.155541)
    (xy 1.36942 0.214562) (xy 1.41842 0.211421) (xy 1.467421 0.20828) (xy 1.535208 0.092729)
    (xy 1.591969 -0.004026) (xy 4.74472 -0.004026) (xy 4.749631 0.007255) (xy 4.762541 0.030815)
    (xy 4.780719 0.06168) (xy 4.781801 0.063463) (xy 4.801311 0.09504) (xy 4.813636 0.111628)
    (xy 4.822116 0.115618) (xy 4.830095 0.109402) (xy 4.835795 0.102082) (xy 4.851123 0.079255)
    (xy 4.869575 0.048493) (xy 4.876238 0.036587) (xy 4.899767 -0.006485) (xy 4.861445 -0.064203)
    (xy 4.842004 -0.093036) (xy 4.827487 -0.113728) (xy 4.820958 -0.121914) (xy 4.82092 -0.12192)
    (xy 4.814207 -0.114148) (xy 4.800436 -0.09445) (xy 4.783115 -0.068258) (xy 4.765755 -0.041001)
    (xy 4.751865 -0.01811) (xy 4.744955 -0.005015) (xy 4.74472 -0.004026) (xy 1.591969 -0.004026)
    (xy 1.602996 -0.022821) (xy 1.541859 -0.130791) (xy 1.515763 -0.176875) (xy 1.491185 -0.220275)
    (xy 1.471055 -0.255818) (xy 1.459181 -0.276782) (xy 1.444145 -0.300184) (xy 1.428742 -0.311307)
    (xy 1.404748 -0.314683) (xy 1.390077 -0.314882) (xy 1.342515 -0.31496) (xy 0.968337 -0.31496)
    (xy 0.966111 -0.318113) (xy 0.951514 -0.32263) (xy 0.925278 -0.323723) (xy 0.91613 -0.323232)
    (xy 0.87446 -0.32004) (xy 0.54443 -0.32004) (xy 0.535897 -0.33528) (xy 0.491468 -0.33528)
    (xy 0.464642 -0.334251) (xy 0.448832 -0.331653) (xy 0.44704 -0.330237) (xy 0.197949 -0.330237)
    (xy 0.12308 -0.46228) (xy -0.130006 -0.464992) (xy -0.383092 -0.467703) (xy -0.507391 -0.254634)
    (xy -0.541738 -0.195135) (xy -0.572079 -0.141376) (xy -0.597065 -0.095846) (xy -0.615347 -0.061037)
    (xy -0.625575 -0.039438) (xy -0.627205 -0.033482) (xy -0.868407 -0.033482) (xy -0.871399 -0.040037)
    (xy -0.873737 -0.0478) (xy -0.868736 -0.060579) (xy -0.855007 -0.087105) (xy -0.834489 -0.123831)
    (xy -0.809123 -0.167209) (xy -0.801527 -0.17988) (xy -0.774877 -0.224097) (xy -0.751974 -0.262102)
    (xy -0.734873 -0.290486) (xy -0.72563 -0.305838) (xy -0.724727 -0.30734) (xy -0.731046 -0.311669)
    (xy -0.752223 -0.314288) (xy -0.769021 -0.31467) (xy -0.81788 -0.314379) (xy -0.975292 -0.049265)
    (xy -1.306524 -0.049265) (xy -1.308434 -0.052626) (xy -1.247484 -0.155853) (xy -1.221237 -0.200227)
    (xy -1.196791 -0.241409) (xy -1.17714 -0.27437) (xy -1.166479 -0.2921) (xy -1.146423 -0.32512)
    (xy -1.195512 -0.324904) (xy -1.2446 -0.324687) (xy -1.3208 -0.195544) (xy -1.347687 -0.149309)
    (xy -1.370412 -0.108955) (xy -1.387142 -0.077841) (xy -1.396039 -0.059327) (xy -1.397 -0.056061)
    (xy -1.765844 -0.056061) (xy -1.762916 -0.063464) (xy -1.749412 -0.089799) (xy -1.729231 -0.126488)
    (xy -1.704274 -0.170005) (xy -1.69653 -0.183203) (xy -1.664029 -0.2383) (xy -1.641009 -0.278208)
    (xy -1.626852 -0.305367) (xy -1.620936 -0.32222) (xy -1.622642 -0.331207) (xy -1.63135 -0.334769)
    (xy -1.64644 -0.335349) (xy -1.657908 -0.33528) (xy -1.702549 -0.33528) (xy -1.869837 -0.05139)
    (xy -4.786139 -0.05139) (xy -4.807977 -0.083547) (xy -4.887755 0.037849) (xy -5.007582 0.037849)
    (xy -5.008713 0.03567) (xy -5.00888 0.035156) (xy -5.004117 0.025673) (xy -4.991201 0.002306)
    (xy -4.972192 -0.031265) (xy -4.952666 -0.065277) (xy -4.924471 -0.114236) (xy -4.905498 -0.148615)
    (xy -4.894954 -0.171511) (xy -4.892041 -0.186023) (xy -4.895963 -0.195249) (xy -4.905927 -0.202287)
    (xy -4.916112 -0.207594) (xy -4.938196 -0.218354) (xy -4.951175 -0.223456) (xy -4.951734 -0.22352)
    (xy -4.958194 -0.215257) (xy -4.972271 -0.193008) (xy -4.991777 -0.160581) (xy -5.014523 -0.121788)
    (xy -5.038318 -0.080438) (xy -5.060973 -0.040341) (xy -5.080299 -0.005307) (xy -5.094107 0.020854)
    (xy -5.100206 0.034333) (xy -5.10032 0.035027) (xy -5.222766 0.035027) (xy -5.222558 0.032569)
    (xy -5.216441 0.01477) (xy -5.204094 -0.010964) (xy -5.184368 -0.047068) (xy -5.156111 -0.095979)
    (xy -5.124736 -0.149089) (xy -5.091861 -0.20452) (xy -5.06215 -0.254753) (xy -5.037308 -0.296894)
    (xy -5.01904 -0.328047) (xy -5.009054 -0.345317) (xy -5.008088 -0.347057) (xy -5.006043 -0.360805)
    (xy -5.018351 -0.374489) (xy -5.033522 -0.384287) (xy -5.06805 -0.404659) (xy -5.195945 -0.191345)
    (xy -5.2314 -0.131775) (xy -5.263082 -0.077711) (xy -5.289558 -0.031666) (xy -5.309397 0.003849)
    (xy -5.321166 0.026321) (xy -5.32384 0.033029) (xy -5.474672 0.033029) (xy -5.471333 0.026314)
    (xy -5.457401 0.000972) (xy -5.435633 -0.03775) (xy -5.407219 -0.087757) (xy -5.373344 -0.146957)
    (xy -5.335199 -0.213255) (xy -5.307225 -0.261673) (xy -5.266699 -0.331705) (xy -5.229441 -0.396105)
    (xy -5.196667 -0.452768) (xy -5.169595 -0.49959) (xy -5.149441 -0.534465) (xy -5.137423 -0.555288)
    (xy -5.13452 -0.560346) (xy -5.139988 -0.56908) (xy -5.158135 -0.582854) (xy -5.165954 -0.587694)
    (xy -5.201077 -0.608418) (xy -5.281737 -0.469309) (xy -5.314255 -0.413308) (xy -5.353436 -0.345959)
    (xy -5.395675 -0.273449) (xy -5.437369 -0.201966) (xy -5.466319 -0.1524) (xy -5.497848 -0.097979)
    (xy -5.525534 -0.049279) (xy -5.54783 -0.009096) (xy -5.563189 0.019772) (xy -5.570063 0.034527)
    (xy -5.570284 0.03556) (xy -5.707565 0.03556) (xy -5.707879 0.033232) (xy -5.706236 0.026385)
    (xy -5.705682 0.0254) (xy -5.698146 0.012515) (xy -5.681644 -0.016119) (xy -5.657268 -0.058593)
    (xy -5.626109 -0.113) (xy -5.589261 -0.177432) (xy -5.547814 -0.249983) (xy -5.50286 -0.328743)
    (xy -5.471606 -0.38354) (xy -5.25002 -0.77216) (xy -4.340868 -0.77216) (xy -4.194026 -0.53086)
    (xy -4.047183 -0.28956) (xy -3.817466 -0.286831) (xy -3.587748 -0.284102) (xy -3.711484 -0.500775)
    (xy -0.701003 -0.500775) (xy -0.696111 -0.487668) (xy -0.684009 -0.465094) (xy -0.680027 -0.458416)
    (xy -0.672153 -0.444867) (xy -0.665905 -0.435878) (xy -0.659502 -0.433275) (xy -0.651166 -0.438885)
    (xy -0.639116 -0.454537) (xy -0.621574 -0.482056) (xy -0.59676 -0.52327) (xy -0.564945 -0.57658)
    (xy -0.498782 -0.687141) (xy -0.12192 -0.687141) (xy -0.112291 -0.685095) (xy -0.085527 -0.683301)
    (xy -0.04481 -0.681873) (xy 0.006674 -0.680922) (xy 0.0635 -0.680564) (xy 0.24892 -0.680407)
    (xy 0.32512 -0.543431) (xy 0.351662 -0.496302) (xy 0.374882 -0.456174) (xy 0.392967 -0.42609)
    (xy 0.404108 -0.409094) (xy 0.406629 -0.406428) (xy 0.414277 -0.414469) (xy 0.426989 -0.434618)
    (xy 0.431726 -0.443144) (xy 0.451514 -0.479888) (xy 0.412746 -0.553241) (xy 0.387756 -0.599669)
    (xy 0.360001 -0.649947) (xy 0.33631 -0.691757) (xy 0.298643 -0.75692) (xy 0.109646 -0.759681)
    (xy -0.07935 -0.762442) (xy -0.100635 -0.728002) (xy -0.11416 -0.704646) (xy -0.121489 -0.689125)
    (xy -0.12192 -0.687141) (xy -0.498782 -0.687141) (xy -0.496544 -0.69088) (xy -0.354952 -0.69088)
    (xy -0.303956 -0.6912) (xy -0.261118 -0.692077) (xy -0.230084 -0.69339) (xy -0.214495 -0.695017)
    (xy -0.21336 -0.695616) (xy -0.217329 -0.706961) (xy -0.227189 -0.729262) (xy -0.230482 -0.736256)
    (xy -0.247604 -0.77216) (xy -0.545092 -0.77216) (xy -0.623066 -0.640475) (xy -0.650274 -0.594015)
    (xy -0.673341 -0.553653) (xy -0.690455 -0.522636) (xy -0.699804 -0.504212) (xy -0.701003 -0.500775)
    (xy -3.711484 -0.500775) (xy -3.776441 -0.61452) (xy -3.965133 -0.944937) (xy -3.850247 -1.145569)
    (xy -3.816051 -1.205041) (xy -3.784164 -1.260039) (xy -3.756324 -1.3076) (xy -3.73427 -1.344763)
    (xy -3.71974 -1.368564) (xy -3.716109 -1.374141) (xy -3.696857 -1.402081) (xy -3.438728 -1.402081)
    (xy -3.180598 -1.40208) (xy -3.142239 -1.335339) (xy -3.128628 -1.311781) (xy -3.106134 -1.272998)
    (xy -3.076112 -1.221319) (xy -3.039915 -1.159071) (xy -2.998899 -1.088585) (xy -2.954416 -1.012187)
    (xy -2.907821 -0.932207) (xy -2.895554 -0.911159) (xy -2.687228 -0.55372) (xy -2.423114 -0.541068)
    (xy -2.346706 -0.537658) (xy -2.272343 -0.534799) (xy -2.203886 -0.532605) (xy -2.1452 -0.531189)
    (xy -2.100148 -0.530666) (xy -2.078244 -0.530908) (xy -1.997487 -0.5334) (xy -1.797228 -0.877325)
    (xy -0.90424 -0.877325) (xy -0.899798 -0.858877) (xy -0.88917 -0.836623) (xy -0.876407 -0.817357)
    (xy -0.865557 -0.807869) (xy -0.862973 -0.808108) (xy -0.855552 -0.817986) (xy -0.839927 -0.84219)
    (xy -0.818119 -0.877485) (xy -0.792147 -0.920638) (xy -0.781017 -0.939419) (xy -0.708862 -1.06172)
    (xy 0.101727 -1.06172) (xy 0.276923 -1.05664) (xy 0.335078 -1.054552) (xy 0.38645 -1.051946)
    (xy 0.427468 -1.049067) (xy 0.454562 -1.046154) (xy 0.463769 -1.04399) (xy 0.472572 -1.032793)
    (xy 0.488981 -1.007055) (xy 0.510971 -0.970129) (xy 0.536515 -0.925367) (xy 0.548498 -0.9038)
    (xy 0.578785 -0.849705) (xy 0.601509 -0.812363) (xy 0.61845 -0.790484) (xy 0.63139 -0.782777)
    (xy 0.642109 -0.787952) (xy 0.652388 -0.804718) (xy 0.660315 -0.822756) (xy 0.664377 -0.835078)
    (xy 0.664899 -0.847988) (xy 0.660642 -0.864651) (xy 0.650369 -0.888234) (xy 0.63284 -0.921902)
    (xy 0.606816 -0.968819) (xy 0.59485 -0.990059) (xy 0.517123 -1.12776) (xy 0.141941 -1.12776)
    (xy 0.101727 -1.06172) (xy -0.708862 -1.06172) (xy -0.70612 -1.066367) (xy -0.56134 -1.066584)
    (xy -0.509734 -1.066974) (xy -0.466247 -1.067898) (xy -0.434481 -1.069234) (xy -0.41804 -1.070858)
    (xy -0.41656 -1.071536) (xy -0.420529 -1.082881) (xy -0.430389 -1.105182) (xy -0.433682 -1.112176)
    (xy -0.450804 -1.14808) (xy -0.750509 -1.14808) (xy -0.827375 -1.020538) (xy -0.854671 -0.974218)
    (xy -0.8777 -0.933185) (xy -0.894569 -0.900959) (xy -0.903389 -0.881064) (xy -0.90424 -0.877325)
    (xy -1.797228 -0.877325) (xy -1.781556 -0.90424) (xy -1.73553 -0.983593) (xy -1.692832 -1.057796)
    (xy -1.65453 -1.124954) (xy -1.621689 -1.18317) (xy -1.595375 -1.230549) (xy -1.576654 -1.265194)
    (xy -1.566591 -1.28521) (xy -1.565133 -1.289228) (xy -1.565271 -1.28955) (xy -1.131083 -1.28955)
    (xy -1.130665 -1.277118) (xy -1.127154 -1.268178) (xy -1.10777 -1.236061) (xy -1.093054 -1.223173)
    (xy -1.087782 -1.223871) (xy -1.080249 -1.233844) (xy -1.064678 -1.258028) (xy -1.043183 -1.293031)
    (xy -1.017878 -1.335461) (xy -1.011878 -1.34568) (xy -0.945359 -1.459301) (xy 0.34544 -1.459301)
    (xy 0.355056 -1.457217) (xy 0.381731 -1.455415) (xy 0.422203 -1.454015) (xy 0.473213 -1.453133)
    (xy 0.522224 -1.45288) (xy 0.699009 -1.45288) (xy 0.778764 -1.310863) (xy 0.806013 -1.26287)
    (xy 0.8299 -1.221797) (xy 0.848647 -1.190622) (xy 0.860475 -1.172324) (xy 0.8636 -1.168748)
    (xy 0.871739 -1.176381) (xy 0.885991 -1.195604) (xy 0.89154 -1.203944) (xy 0.9144 -1.239237)
    (xy 0.831126 -1.386699) (xy 0.747852 -1.53416) (xy 0.387737 -1.53416) (xy 0.366588 -1.499941)
    (xy 0.353114 -1.476658) (xy 0.345849 -1.46122) (xy 0.34544 -1.459301) (xy -0.945359 -1.459301)
    (xy -0.94317 -1.46304) (xy -0.629314 -1.46304) (xy -0.67564 -1.544164) (xy -0.99175 -1.54432)
    (xy -1.065576 -1.418038) (xy -1.094621 -1.367797) (xy -1.114357 -1.331738) (xy -1.126079 -1.306706)
    (xy -1.131083 -1.28955) (xy -1.565271 -1.28955) (xy -1.570071 -1.300727) (xy -1.584382 -1.327768)
    (xy -1.606992 -1.368467) (xy -1.636822 -1.420939) (xy -1.672798 -1.4833) (xy -1.713843 -1.553665)
    (xy -1.758881 -1.630149) (xy -1.78409 -1.67267) (xy -2.00354 -2.041965) (xy -2.48767 -2.044603)
    (xy -2.9718 -2.04724) (xy -3.100057 -2.270649) (xy -3.228314 -2.494057) (xy -3.199602 -2.544969)
    (xy -3.185579 -2.569885) (xy -3.163731 -2.608767) (xy -3.136171 -2.657852) (xy -3.10501 -2.713379)
    (xy -3.072358 -2.771589) (xy -3.071185 -2.77368) (xy -2.97148 -2.95148) (xy -2.59318 -2.954144)
    (xy -2.507769 -2.954912) (xy -2.429103 -2.955938) (xy -2.359411 -2.957171) (xy -2.300921 -2.958556)
    (xy -2.255864 -2.96004) (xy -2.226468 -2.961569) (xy -2.214962 -2.96309) (xy -2.21488 -2.963225)
    (xy -2.219603 -2.973596) (xy -2.232829 -2.999071) (xy -2.253143 -3.037017) (xy -2.279129 -3.084803)
    (xy -2.309374 -3.139797) (xy -2.324055 -3.166301) (xy -2.43323 -3.36296) (xy -3.016137 -3.36296)
    (xy -3.035359 -3.3909) (xy -3.044605 -3.405513) (xy -3.063002 -3.435603) (xy -3.089348 -3.479166)
    (xy -3.122436 -3.534197) (xy -3.161062 -3.59869) (xy -3.204023 -3.670642) (xy -3.250113 -3.748046)
    (xy -3.270585 -3.782491) (xy -3.434952 -4.05921) (xy -2.6416 -4.05921) (xy -2.6323 -4.056561)
    (xy -2.607827 -4.054643) (xy -2.573328 -4.053844) (xy -2.570627 -4.05384) (xy -2.499653 -4.05384)
    (xy -2.469027 -4.114511) (xy -2.453516 -4.145983) (xy -2.442499 -4.169758) (xy -2.4384 -4.180551)
    (xy -2.447701 -4.1832) (xy -2.472174 -4.185118) (xy -2.506673 -4.185917) (xy -2.509374 -4.18592)
    (xy -2.580348 -4.18592) (xy -2.610974 -4.12525) (xy -2.626485 -4.093778) (xy -2.637502 -4.070003)
    (xy -2.6416 -4.05921) (xy -3.434952 -4.05921) (xy -3.485221 -4.143839) (xy -3.29184 -4.143839)
    (xy -3.283966 -4.134639) (xy -3.265647 -4.121791) (xy -3.244843 -4.110267) (xy -3.229728 -4.105047)
    (xy -3.223391 -4.113445) (xy -3.214329 -4.127809) (xy -3.055098 -4.127809) (xy -3.028689 -4.111415)
    (xy -3.006223 -4.099572) (xy -2.990736 -4.094751) (xy -2.982661 -4.103172) (xy -2.968829 -4.12341)
    (xy -2.841142 -4.12341) (xy -2.835853 -4.114331) (xy -2.818199 -4.099971) (xy -2.811768 -4.095686)
    (xy -2.797195 -4.086453) (xy -2.785871 -4.081856) (xy -2.775549 -4.084054) (xy -2.763982 -4.095206)
    (xy -2.748922 -4.117471) (xy -2.72812 -4.153008) (xy -2.699686 -4.203345) (xy -2.64668 -4.297253)
    (xy -2.51206 -4.297467) (xy -2.37744 -4.29768) (xy -2.37744 -4.37896) (xy -2.691625 -4.37896)
    (xy -2.764566 -4.2545) (xy -2.790996 -4.209375) (xy -2.813684 -4.170584) (xy -2.830679 -4.141467)
    (xy -2.840031 -4.125362) (xy -2.841142 -4.12341) (xy -2.968829 -4.12341) (xy -2.966435 -4.126912)
    (xy -2.943619 -4.163437) (xy -2.915773 -4.210218) (xy -2.884456 -4.264723) (xy -2.868816 -4.292586)
    (xy -2.75844 -4.490692) (xy -2.286 -4.49072) (xy -2.286 -4.572) (xy -2.80924 -4.571416)
    (xy -2.932169 -4.349612) (xy -3.055098 -4.127809) (xy -3.214329 -4.127809) (xy -3.208225 -4.137484)
    (xy -3.185433 -4.175137) (xy -3.156222 -4.224376) (xy -3.121796 -4.283175) (xy -3.08336 -4.349505)
    (xy -3.051928 -4.404194) (xy -2.88036 -4.703748) (xy -2.17424 -4.70408) (xy -2.17424 -4.785608)
    (xy -2.930748 -4.78028) (xy -3.111294 -4.466094) (xy -3.152998 -4.393303) (xy -3.1913 -4.326027)
    (xy -3.225059 -4.266306) (xy -3.253131 -4.216179) (xy -3.274375 -4.177684) (xy -3.28765 -4.152859)
    (xy -3.29184 -4.143839) (xy -3.485221 -4.143839) (xy -3.486589 -4.146141) (xy -3.259675 -4.546997)
    (xy -3.03276 -4.947853) (xy -2.568213 -4.947887) (xy -2.103666 -4.94792) (xy -1.869912 -4.556017)
    (xy -1.636159 -4.164113) (xy -1.773888 -3.913397) (xy -1.817877 -3.832587) (xy -1.852079 -3.768031)
    (xy -1.877081 -3.718513) (xy -1.893471 -3.682816) (xy -1.901839 -3.659723) (xy -1.902771 -3.648018)
    (xy -1.902487 -3.64744) (xy -1.894818 -3.634195) (xy -1.878816 -3.606247) (xy -1.856176 -3.566567)
    (xy -1.828593 -3.518126) (xy -1.797762 -3.463894) (xy -1.793673 -3.456696) (xy -1.762828 -3.402774)
    (xy -1.735153 -3.355123) (xy -1.712282 -3.316494) (xy -1.695846 -3.28964) (xy -1.687478 -3.277311)
    (xy -1.687001 -3.276873) (xy -1.680482 -3.284343) (xy -1.664985 -3.307502) (xy -1.641682 -3.344436)
    (xy -1.611746 -3.393234) (xy -1.576352 -3.451981) (xy -1.536671 -3.518765) (xy -1.493877 -3.591672)
    (xy -1.492158 -3.594617) (xy -1.304304 -3.91668) (xy -1.040339 -3.919385) (xy -0.776373 -3.92209)
    (xy -0.649807 -3.706916) (xy -0.614594 -3.646734) (xy -0.582879 -3.591928) (xy -0.556118 -3.54506)
    (xy -0.535762 -3.508691) (xy -0.523266 -3.485381) (xy -0.519946 -3.478103) (xy -0.5242 -3.466793)
    (xy -0.537672 -3.439686) (xy -0.559385 -3.398561) (xy -0.588364 -3.345199) (xy -0.623633 -3.281382)
    (xy -0.664215 -3.208888) (xy -0.709135 -3.129498) (xy -0.756787 -3.04609) (xy -0.805104 -2.961838)
    (xy -0.850251 -2.882972) (xy -0.891234 -2.811242) (xy -0.927057 -2.748394) (xy -0.956724 -2.696179)
    (xy -0.979242 -2.656345) (xy -0.993613 -2.63064) (xy -0.998841 -2.620823) (xy -0.993323 -2.611582)
    (xy -0.977008 -2.588532) (xy -0.951595 -2.553891) (xy -0.918778 -2.509876) (xy -0.880255 -2.458704)
    (xy -0.837723 -2.402594) (xy -0.792877 -2.343762) (xy -0.747414 -2.284426) (xy -0.70303 -2.226804)
    (xy -0.661423 -2.173113) (xy -0.624287 -2.125571) (xy -0.593321 -2.086395) (xy -0.57022 -2.057803)
    (xy -0.556681 -2.042012) (xy -0.554322 -2.039776) (xy -0.542205 -2.038216) (xy -0.511885 -2.036763)
    (xy -0.465479 -2.035453) (xy -0.405103 -2.03432) (xy -0.332876 -2.033399) (xy -0.250913 -2.032725)
    (xy -0.161333 -2.032332) (xy -0.09652 -2.032244) (xy 0.35052 -2.032177) (xy 0.423481 -2.136229)
    (xy 0.451325 -2.175814) (xy 0.488035 -2.227823) (xy 0.53069 -2.288128) (xy 0.576369 -2.3526)
    (xy 0.622152 -2.417112) (xy 0.63834 -2.439894) (xy 0.780237 -2.639507) (xy 0.541003 -3.059654)
    (xy 0.492934 -3.144274) (xy 0.448084 -3.223618) (xy 0.407435 -3.29592) (xy 0.37197 -3.359414)
    (xy 0.34267 -3.412334) (xy 0.320519 -3.452914) (xy 0.306498 -3.479388) (xy 0.301591 -3.489988)
    (xy 0.306514 -3.501191) (xy 0.320459 -3.527379) (xy 0.342036 -3.566088) (xy 0.369856 -3.614852)
    (xy 0.40253 -3.671206) (xy 0.431936 -3.721293) (xy 0.562459 -3.942411) (xy 0.826644 -3.939706)
    (xy 1.090829 -3.937) (xy 1.275269 -3.619134) (xy 1.317913 -3.545826) (xy 1.357594 -3.477963)
    (xy 1.393105 -3.417584) (xy 1.423239 -3.366729) (xy 1.446787 -3.327435) (xy 1.462542 -3.301741)
    (xy 1.469215 -3.291761) (xy 1.47752 -3.29697) (xy 1.495007 -3.318722) (xy 1.520874 -3.355861)
    (xy 1.554322 -3.407231) (xy 1.594549 -3.471676) (xy 1.60042 -3.481257) (xy 1.635343 -3.538678)
    (xy 1.666568 -3.590617) (xy 1.692557 -3.634471) (xy 1.711777 -3.667636) (xy 1.722691 -3.687509)
    (xy 1.72459 -3.69179) (xy 1.72046 -3.703363) (xy 1.707567 -3.730217) (xy 1.687164 -3.769955)
    (xy 1.660508 -3.820178) (xy 1.628854 -3.878491) (xy 1.593457 -3.942494) (xy 1.590852 -3.94716)
    (xy 1.454644 -4.191) (xy 1.481259 -4.241511) (xy 2.2352 -4.241511) (xy 2.239446 -4.230378)
    (xy 2.250569 -4.206413) (xy 2.265826 -4.175471) (xy 2.296452 -4.1148) (xy 2.373352 -4.1148)
    (xy 2.409394 -4.115819) (xy 2.435423 -4.118518) (xy 2.446784 -4.122359) (xy 2.446866 -4.123273)
    (xy 2.440638 -4.136111) (xy 2.427767 -4.161162) (xy 2.413 -4.189289) (xy 2.38252 -4.246832)
    (xy 2.30886 -4.246856) (xy 2.273112 -4.246189) (xy 2.246931 -4.244405) (xy 2.235366 -4.241872)
    (xy 2.2352 -4.241511) (xy 1.481259 -4.241511) (xy 1.529594 -4.33324) (xy 1.555364 -4.382051)
    (xy 1.585988 -4.43992) (xy 2.1844 -4.43992) (xy 2.1844 -4.35864) (xy 2.437858 -4.35864)
    (xy 2.506027 -4.242437) (xy 2.534326 -4.194539) (xy 2.554941 -4.162196) (xy 2.570556 -4.143488)
    (xy 2.583856 -4.136494) (xy 2.597524 -4.139296) (xy 2.614246 -4.149973) (xy 2.624567 -4.157647)
    (xy 2.631041 -4.163977) (xy 2.633237 -4.172556) (xy 2.630011 -4.18623) (xy 2.620218 -4.20785)
    (xy 2.602716 -4.240262) (xy 2.57636 -4.286315) (xy 2.565107 -4.305711) (xy 2.487119 -4.43992)
    (xy 2.1844 -4.43992) (xy 1.585988 -4.43992) (xy 1.588412 -4.4445) (xy 1.62646 -4.516293)
    (xy 1.667231 -4.593134) (xy 1.688386 -4.63296) (xy 2.0828 -4.63296) (xy 2.0828 -4.55168)
    (xy 2.548877 -4.55168) (xy 2.663818 -4.348787) (xy 2.69688 -4.290914) (xy 2.726813 -4.239443)
    (xy 2.752126 -4.196862) (xy 2.771331 -4.165657) (xy 2.782938 -4.148315) (xy 2.785556 -4.145587)
    (xy 2.798145 -4.149963) (xy 2.820078 -4.161089) (xy 2.823586 -4.16306) (xy 2.843575 -4.176271)
    (xy 2.852398 -4.185799) (xy 2.85235 -4.186756) (xy 2.846835 -4.196855) (xy 2.832624 -4.222147)
    (xy 2.811105 -4.260181) (xy 2.783666 -4.308508) (xy 2.751695 -4.36468) (xy 2.724246 -4.412816)
    (xy 2.598612 -4.632961) (xy 2.340706 -4.63296) (xy 2.0828 -4.63296) (xy 1.688386 -4.63296)
    (xy 1.708449 -4.67073) (xy 1.739691 -4.72948) (xy 1.758753 -4.765307) (xy 1.9812 -4.765307)
    (xy 2.328696 -4.762634) (xy 2.676192 -4.75996) (xy 2.849396 -4.458081) (xy 2.890176 -4.387091)
    (xy 2.92765 -4.322018) (xy 2.960648 -4.264886) (xy 2.987997 -4.217713) (xy 3.008528 -4.182522)
    (xy 3.021068 -4.161333) (xy 3.024559 -4.155821) (xy 3.033624 -4.160204) (xy 3.053857 -4.171608)
    (xy 3.061557 -4.176114) (xy 3.096597 -4.196788) (xy 2.91052 -4.519014) (xy 2.724444 -4.84124)
    (xy 2.352822 -4.843906) (xy 1.9812 -4.846571) (xy 1.9812 -4.765307) (xy 1.758753 -4.765307)
    (xy 1.874839 -4.98348) (xy 2.791027 -4.988766) (xy 3.016925 -4.596382)) (layer F.SilkS) (width 0.01))
)
