EESchema Schematic File Version 4
EELAYER 30 0
EELAYER END
$Descr A4 11693 8268
encoding utf-8
Sheet 22 27
Title ""
Date ""
Rev ""
Comp ""
Comment1 ""
Comment2 ""
Comment3 ""
Comment4 ""
$EndDescr
Text HLabel 800  1050 0    50   Input ~ 0
v_in
Text HLabel 10950 750  2    50   Output ~ 0
v_out
Text HLabel 3100 2600 0    50   Input ~ 0
sync
$Comp
L POWDER_Power:LM5176_QFN U2401
U 1 1 5F390FD2
P 6000 2800
F 0 "U2401" H 5500 3750 50  0000 L CNN
F 1 "LM5176_QFN" H 5500 3650 50  0000 L CNN
F 2 "POWDER_Power:LM5176_QFN" H 6700 3650 50  0001 L CNN
F 3 "" H 8000 2350 50  0001 C CNN
F 4 "3000-0000000511" H 6000 2800 50  0001 C CNN "PartSpecification"
	1    6000 2800
	1    0    0    -1  
$EndComp
$Comp
L Device:CP C2402
U 1 1 5F39A7A7
P 1800 1300
F 0 "C2402" H 1825 1400 50  0000 L CNN
F 1 "82uF" H 1825 1200 50  0000 L CNN
F 2 "Capacitor_SMD:CP_Elec_10x10" H 1838 1150 50  0001 C CNN
F 3 "~" H 1800 1300 50  0001 C CNN
F 4 "" H 1800 1300 50  0001 C CNN "PartNumber"
F 5 "63V" H 1800 1300 50  0001 C CNN "Voltage"
F 6 "1.4A" H 1800 1300 50  0001 C CNN "Ripple current"
F 7 "3000-0000000470" H 1800 1300 50  0001 C CNN "PartSpecification"
	1    1800 1300
	1    0    0    -1  
$EndComp
$Comp
L Device:CP C2401
U 1 1 5F39BAA3
P 1500 1300
F 0 "C2401" H 1525 1400 50  0000 L CNN
F 1 "82uF" H 1525 1200 50  0000 L CNN
F 2 "Capacitor_SMD:CP_Elec_10x10" H 1538 1150 50  0001 C CNN
F 3 "~" H 1500 1300 50  0001 C CNN
F 4 "" H 1500 1300 50  0001 C CNN "PartNumber"
F 5 "63V" H 1500 1300 50  0001 C CNN "Voltage"
F 6 "1.4A" H 1500 1300 50  0001 C CNN "Ripple current"
F 7 "3000-0000000470" H 1500 1300 50  0001 C CNN "PartSpecification"
	1    1500 1300
	1    0    0    -1  
$EndComp
$Comp
L power:GND #PWR?
U 1 1 5F39D7B9
P 2100 1550
F 0 "#PWR?" H 2100 1300 50  0001 C CNN
F 1 "GND" H 2100 1400 50  0000 C CNN
F 2 "" H 2100 1550 50  0001 C CNN
F 3 "" H 2100 1550 50  0001 C CNN
	1    2100 1550
	1    0    0    -1  
$EndComp
$Comp
L power:GND #PWR?
U 1 1 5F39D9A6
P 1800 1550
F 0 "#PWR?" H 1800 1300 50  0001 C CNN
F 1 "GND" H 1800 1400 50  0000 C CNN
F 2 "" H 1800 1550 50  0001 C CNN
F 3 "" H 1800 1550 50  0001 C CNN
	1    1800 1550
	1    0    0    -1  
$EndComp
$Comp
L power:GND #PWR?
U 1 1 5F39DB4E
P 1500 1550
F 0 "#PWR?" H 1500 1300 50  0001 C CNN
F 1 "GND" H 1500 1400 50  0000 C CNN
F 2 "" H 1500 1550 50  0001 C CNN
F 3 "" H 1500 1550 50  0001 C CNN
	1    1500 1550
	1    0    0    -1  
$EndComp
Wire Wire Line
	1500 1550 1500 1450
Wire Wire Line
	1800 1450 1800 1550
Wire Wire Line
	2100 1550 2100 1450
Wire Wire Line
	800  1050 1500 1050
Wire Wire Line
	1500 1150 1500 1050
Connection ~ 1500 1050
Wire Wire Line
	1500 1050 1800 1050
Wire Wire Line
	1800 1150 1800 1050
Connection ~ 1800 1050
Wire Wire Line
	1800 1050 2100 1050
Wire Wire Line
	2100 1150 2100 1050
Connection ~ 2100 1050
Wire Wire Line
	2100 1050 2350 1050
$Comp
L 000_PreferredDiodes:D_Schottky_60V_1A D2401
U 1 1 5F3B1BBF
P 2500 1300
F 0 "D2401" H 2500 1400 50  0000 C CNN
F 1 "D_Schottky_60V_1A" H 2500 1200 50  0001 C CNN
F 2 "Diode_SMD:D_SOD-123F" H 2500 1300 50  0001 C CNN
F 3 "~" H 2500 1300 50  0001 C CNN
F 4 "DSS16UTR" H 2500 1300 50  0001 C CNN "PartNumber"
F 5 "Schottky" H 2500 1200 50  0000 C CNN "DisplayValue"
F 6 "60V_1A" H 2500 1100 50  0000 C CNN "DisplayValue2"
F 7 "3000-0000000481" H 2500 1300 50  0001 C CNN "PartSpecification"
	1    2500 1300
	0    -1   -1   0   
$EndComp
$Comp
L Device:R R2402
U 1 1 5F3B2D09
P 2950 2300
F 0 "R2402" V 3030 2300 50  0000 C CNN
F 1 "2k" V 2950 2300 50  0000 C CNN
F 2 "Resistor_SMD:R_0603_1608Metric" V 2880 2300 50  0001 C CNN
F 3 "~" H 2950 2300 50  0001 C CNN
F 4 "3000-0000000553" H 2950 2300 50  0001 C CNN "PartSpecification"
	1    2950 2300
	0    1    1    0   
$EndComp
Wire Wire Line
	3100 2300 5300 2300
Wire Wire Line
	2800 2300 2350 2300
Wire Wire Line
	2350 2300 2350 1050
Connection ~ 2350 1050
Wire Wire Line
	2350 1050 2500 1050
$Comp
L Device:R R2401
U 1 1 5F3B631F
P 2500 1700
F 0 "R2401" V 2580 1700 50  0000 C CNN
F 1 "10" V 2500 1700 50  0000 C CNN
F 2 "Resistor_SMD:R_0603_1608Metric" V 2430 1700 50  0001 C CNN
F 3 "~" H 2500 1700 50  0001 C CNN
F 4 "3000-0000000551" H 2500 1700 50  0001 C CNN "PartSpecification"
	1    2500 1700
	-1   0    0    1   
$EndComp
$Comp
L 000_PreferredParts:C_0_1uF C2404
U 1 1 5F3B86C5
P 2550 2500
F 0 "C2404" H 2575 2600 50  0000 L CNN
F 1 "C_0_1uF" H 2575 2400 50  0001 L CNN
F 2 "Capacitor_SMD:C_0402_1005Metric" H 2588 2350 50  0001 C CNN
F 3 "~" H 2550 2500 50  0001 C CNN
F 4 "0.1uF" H 2700 2400 50  0000 C CNN "DisplayValue"
F 5 "3000-0000000125" H 2550 2500 50  0001 C CNN "PartSpecification"
	1    2550 2500
	1    0    0    -1  
$EndComp
Wire Wire Line
	2550 2350 2550 2100
Wire Wire Line
	2550 2100 2500 2100
Wire Wire Line
	2550 2100 5300 2100
Connection ~ 2550 2100
Wire Wire Line
	2500 1150 2500 1050
Connection ~ 2500 1050
$Comp
L power:GND #PWR?
U 1 1 5F3B9A2A
P 2550 2750
F 0 "#PWR?" H 2550 2500 50  0001 C CNN
F 1 "GND" H 2550 2600 50  0000 C CNN
F 2 "" H 2550 2750 50  0001 C CNN
F 3 "" H 2550 2750 50  0001 C CNN
	1    2550 2750
	1    0    0    -1  
$EndComp
Wire Wire Line
	2550 2750 2550 2650
$Comp
L 000_PreferredParts:C_1uF C2411
U 1 1 5F3BA906
P 6400 1550
F 0 "C2411" H 6425 1650 50  0000 L CNN
F 1 "C_1uF" H 6425 1450 50  0000 L CNN
F 2 "Capacitor_SMD:C_0603_1608Metric" H 6438 1400 50  0001 C CNN
F 3 "~" H 6400 1550 50  0001 C CNN
F 4 "3000-0000000136" H 6400 1550 50  0001 C CNN "PartSpecification"
	1    6400 1550
	1    0    0    -1  
$EndComp
$Comp
L power:GND #PWR?
U 1 1 5F3BB06D
P 6400 1800
F 0 "#PWR?" H 6400 1550 50  0001 C CNN
F 1 "GND" H 6400 1650 50  0000 C CNN
F 2 "" H 6400 1800 50  0001 C CNN
F 3 "" H 6400 1800 50  0001 C CNN
	1    6400 1800
	1    0    0    -1  
$EndComp
Wire Wire Line
	6400 1800 6400 1700
Wire Wire Line
	6400 1400 6100 1400
Wire Wire Line
	6100 1400 6100 1800
Text HLabel 3100 2500 0    50   Input ~ 0
en
Wire Wire Line
	3100 2500 5300 2500
$Comp
L Device:R R2403
U 1 1 5F3D0245
P 3600 2850
F 0 "R2403" V 3680 2850 50  0000 C CNN
F 1 "14.036k" V 3600 2850 50  0000 C CNN
F 2 "Resistor_SMD:R_0402_1005Metric" V 3530 2850 50  0001 C CNN
F 3 "~" H 3600 2850 50  0001 C CNN
F 4 "3000-0000000571" H 3600 2850 50  0001 C CNN "PartSpecification"
	1    3600 2850
	1    0    0    -1  
$EndComp
Wire Wire Line
	3600 2700 3600 2600
Wire Wire Line
	3600 2600 5300 2600
$Comp
L power:GND #PWR?
U 1 1 5F3D3432
P 3600 3100
F 0 "#PWR?" H 3600 2850 50  0001 C CNN
F 1 "GND" H 3600 2950 50  0000 C CNN
F 2 "" H 3600 3100 50  0001 C CNN
F 3 "" H 3600 3100 50  0001 C CNN
	1    3600 3100
	1    0    0    -1  
$EndComp
Wire Wire Line
	3600 3100 3600 3000
$Comp
L 000_PreferredParts:C_1nF C2405
U 1 1 5F3D3CEE
P 3350 2600
F 0 "C2405" H 3375 2700 50  0000 L CNN
F 1 "C_1nF" H 3375 2500 50  0000 L CNN
F 2 "Capacitor_SMD:C_0402_1005Metric" H 3388 2450 50  0001 C CNN
F 3 "~" H 3350 2600 50  0001 C CNN
F 4 "3000-0000000128" H 3350 2600 50  0001 C CNN "PartSpecification"
	1    3350 2600
	0    1    1    0   
$EndComp
Wire Wire Line
	3100 2600 3200 2600
Connection ~ 3600 2600
Wire Wire Line
	3500 2600 3600 2600
$Comp
L 000_PreferredParts:C_0_1uF C2408
U 1 1 5F3E361A
P 4200 2950
F 0 "C2408" H 4225 3050 50  0000 L CNN
F 1 "C_0_1uF" H 4225 2850 50  0001 L CNN
F 2 "Capacitor_SMD:C_0402_1005Metric" H 4238 2800 50  0001 C CNN
F 3 "~" H 4200 2950 50  0001 C CNN
F 4 "0.1uF" H 4350 2850 50  0000 C CNN "DisplayValue"
F 5 "3000-0000000125" H 4200 2950 50  0001 C CNN "PartSpecification"
F 6 "100V" H 4200 2950 50  0001 C CNN "Voltage"
	1    4200 2950
	1    0    0    -1  
$EndComp
Wire Wire Line
	4200 2800 5300 2800
$Comp
L power:GND #PWR?
U 1 1 5F3E4758
P 4200 3200
F 0 "#PWR?" H 4200 2950 50  0001 C CNN
F 1 "GND" H 4200 3050 50  0000 C CNN
F 2 "" H 4200 3200 50  0001 C CNN
F 3 "" H 4200 3200 50  0001 C CNN
	1    4200 3200
	1    0    0    -1  
$EndComp
Wire Wire Line
	4200 3200 4200 3100
$Comp
L Device:R R2404
U 1 1 5F3EB29F
P 3900 2950
F 0 "R2404" V 3980 2950 50  0000 C CNN
F 1 "93.1k" V 3900 2950 50  0000 C CNN
F 2 "Resistor_SMD:R_0402_1005Metric" V 3830 2950 50  0001 C CNN
F 3 "~" H 3900 2950 50  0001 C CNN
F 4 "3000-0000000572" H 3900 2950 50  0001 C CNN "PartSpecification"
	1    3900 2950
	1    0    0    -1  
$EndComp
$Comp
L power:GND #PWR?
U 1 1 5F3EB2A5
P 3900 3200
F 0 "#PWR?" H 3900 2950 50  0001 C CNN
F 1 "GND" H 3900 3050 50  0000 C CNN
F 2 "" H 3900 3200 50  0001 C CNN
F 3 "" H 3900 3200 50  0001 C CNN
	1    3900 3200
	1    0    0    -1  
$EndComp
Wire Wire Line
	3900 3200 3900 3100
Wire Wire Line
	3900 2800 3900 2700
Wire Wire Line
	3900 2700 5300 2700
$Comp
L power:GND #PWR?
U 1 1 5F3F9EC8
P 4500 3000
F 0 "#PWR?" H 4500 2750 50  0001 C CNN
F 1 "GND" H 4500 2850 50  0000 C CNN
F 2 "" H 4500 3000 50  0001 C CNN
F 3 "" H 4500 3000 50  0001 C CNN
	1    4500 3000
	1    0    0    -1  
$EndComp
Wire Wire Line
	4500 3000 4500 2900
Wire Wire Line
	4500 2900 5300 2900
$Comp
L Device:L L2401
U 1 1 5F3FCF71
P 8250 2500
F 0 "L2401" V 8200 2500 50  0000 C CNN
F 1 "10uH" V 8325 2500 50  0000 C CNN
F 2 "POWDER_Power:PQ2614BxA" H 8250 2500 50  0001 C CNN
F 3 "~" H 8250 2500 50  0001 C CNN
F 4 "CDEP15D90T150NP-100MC-125" V 8250 2500 50  0001 C CNN "PartNumber"
F 5 "3000-0000000493" H 8250 2500 50  0001 C CNN "PartSpecification"
	1    8250 2500
	0    1    1    0   
$EndComp
$Comp
L POWDER_Power:CSD18531Q5A U2402
U 1 1 5F402125
P 7750 2100
F 0 "U2402" H 7750 1800 50  0000 C CNN
F 1 "CSD18531Q5A" H 7750 2400 50  0000 C CNN
F 2 "POWDER_Power:CSD16321Q5" H 7650 1700 50  0001 C CNN
F 3 "" H 7750 2100 50  0001 C CNN
F 4 "3000-0000000512" H 7750 2100 50  0001 C CNN "PartSpecification"
	1    7750 2100
	1    0    0    -1  
$EndComp
Wire Wire Line
	7500 2100 6700 2100
Wire Wire Line
	6700 2500 6850 2500
Wire Wire Line
	7900 2500 7900 2300
Wire Wire Line
	8100 2500 7900 2500
Connection ~ 7900 2500
$Comp
L POWDER_Power:CSD18531Q5A U2403
U 1 1 5F40C233
P 7750 2900
F 0 "U2403" H 7750 2600 50  0000 C CNN
F 1 "CSD18531Q5A" H 7750 3200 50  0000 C CNN
F 2 "POWDER_Power:CSD16321Q5" H 7650 2500 50  0001 C CNN
F 3 "" H 7750 2900 50  0001 C CNN
F 4 "3000-0000000512" H 7750 2900 50  0001 C CNN "PartSpecification"
	1    7750 2900
	1    0    0    -1  
$EndComp
Wire Wire Line
	6700 2600 7400 2600
Wire Wire Line
	7400 2600 7400 2900
Wire Wire Line
	7400 2900 7500 2900
Wire Wire Line
	7700 2700 7800 2700
Wire Wire Line
	7900 2700 7800 2700
Connection ~ 7800 2700
Wire Wire Line
	7900 2700 8000 2700
Connection ~ 7900 2700
Wire Wire Line
	7900 2700 7900 2500
Wire Wire Line
	7700 2300 7800 2300
Wire Wire Line
	7800 2300 7900 2300
Connection ~ 7800 2300
Connection ~ 7900 2300
Wire Wire Line
	7700 3100 7800 3100
Wire Wire Line
	7800 3100 7900 3100
Connection ~ 7800 3100
$Comp
L POWDER_Power:CSD18531Q5A U2404
U 1 1 5F414F8E
P 8750 2100
F 0 "U2404" H 8750 1800 50  0000 C CNN
F 1 "CSD18531Q5A" H 8750 2400 50  0000 C CNN
F 2 "POWDER_Power:CSD16321Q5" H 8650 1700 50  0001 C CNN
F 3 "" H 8750 2100 50  0001 C CNN
F 4 "3000-0000000512" H 8750 2100 50  0001 C CNN "PartSpecification"
	1    8750 2100
	-1   0    0    -1  
$EndComp
Wire Wire Line
	8600 2500 8600 2300
Connection ~ 8600 2500
$Comp
L POWDER_Power:CSD18531Q5A U2405
U 1 1 5F414F99
P 8750 2900
F 0 "U2405" H 8750 2600 50  0000 C CNN
F 1 "CSD18531Q5A" H 8750 3200 50  0000 C CNN
F 2 "POWDER_Power:CSD16321Q5" H 8650 2500 50  0001 C CNN
F 3 "" H 8750 2900 50  0001 C CNN
F 4 "3000-0000000512" H 8750 2900 50  0001 C CNN "PartSpecification"
	1    8750 2900
	-1   0    0    -1  
$EndComp
Wire Wire Line
	9100 2900 9000 2900
Wire Wire Line
	8800 2700 8700 2700
Wire Wire Line
	8600 2700 8700 2700
Connection ~ 8700 2700
Wire Wire Line
	8600 2700 8500 2700
Connection ~ 8600 2700
Wire Wire Line
	8600 2700 8600 2500
Wire Wire Line
	8800 2300 8700 2300
Wire Wire Line
	8700 2300 8600 2300
Connection ~ 8700 2300
Connection ~ 8600 2300
Wire Wire Line
	8800 3100 8700 3100
Wire Wire Line
	8700 3100 8600 3100
Connection ~ 8700 3100
$Comp
L Device:CP C2423
U 1 1 5F4212CE
P 10450 1000
F 0 "C2423" H 10475 1100 50  0000 L CNN
F 1 "82uF" H 10475 900 50  0000 L CNN
F 2 "Capacitor_SMD:CP_Elec_10x10" H 10488 850 50  0001 C CNN
F 3 "~" H 10450 1000 50  0001 C CNN
F 4 "" H 10450 1000 50  0001 C CNN "PartNumber"
F 5 "63V" H 10450 1000 50  0001 C CNN "Voltage"
F 6 "1.4A" H 10450 1000 50  0001 C CNN "Ripple current"
F 7 "3000-0000000470" H 10450 1000 50  0001 C CNN "PartSpecification"
	1    10450 1000
	1    0    0    -1  
$EndComp
$Comp
L Device:CP C2421
U 1 1 5F4212D7
P 10150 1000
F 0 "C2421" H 10175 1100 50  0000 L CNN
F 1 "82uF" H 10175 900 50  0000 L CNN
F 2 "Capacitor_SMD:CP_Elec_10x10" H 10188 850 50  0001 C CNN
F 3 "~" H 10150 1000 50  0001 C CNN
F 4 "" H 10150 1000 50  0001 C CNN "PartNumber"
F 5 "63V" H 10150 1000 50  0001 C CNN "Voltage"
F 6 "1.4A" H 10150 1000 50  0001 C CNN "Ripple current"
F 7 "3000-0000000470" H 10150 1000 50  0001 C CNN "PartSpecification"
	1    10150 1000
	1    0    0    -1  
$EndComp
$Comp
L power:GND #PWR?
U 1 1 5F4212EC
P 10450 1250
F 0 "#PWR?" H 10450 1000 50  0001 C CNN
F 1 "GND" H 10450 1100 50  0000 C CNN
F 2 "" H 10450 1250 50  0001 C CNN
F 3 "" H 10450 1250 50  0001 C CNN
	1    10450 1250
	1    0    0    -1  
$EndComp
$Comp
L power:GND #PWR?
U 1 1 5F4212F2
P 10150 1250
F 0 "#PWR?" H 10150 1000 50  0001 C CNN
F 1 "GND" H 10150 1100 50  0000 C CNN
F 2 "" H 10150 1250 50  0001 C CNN
F 3 "" H 10150 1250 50  0001 C CNN
	1    10150 1250
	1    0    0    -1  
$EndComp
Wire Wire Line
	10150 1250 10150 1150
Wire Wire Line
	10450 1150 10450 1250
Wire Wire Line
	10150 850  10150 750 
Wire Wire Line
	10450 850  10450 750 
$Comp
L Device:CP C2419
U 1 1 5F4234A8
P 9850 1000
F 0 "C2419" H 9875 1100 50  0000 L CNN
F 1 "82uF" H 9875 900 50  0000 L CNN
F 2 "Capacitor_SMD:CP_Elec_10x10" H 9888 850 50  0001 C CNN
F 3 "~" H 9850 1000 50  0001 C CNN
F 4 "" H 9850 1000 50  0001 C CNN "PartNumber"
F 5 "63V" H 9850 1000 50  0001 C CNN "Voltage"
F 6 "1.4A" H 9850 1000 50  0001 C CNN "Ripple current"
F 7 "3000-0000000470" H 9850 1000 50  0001 C CNN "PartSpecification"
	1    9850 1000
	1    0    0    -1  
$EndComp
$Comp
L Device:CP C2416
U 1 1 5F4234B1
P 9550 1000
F 0 "C2416" H 9575 1100 50  0000 L CNN
F 1 "82uF" H 9575 900 50  0000 L CNN
F 2 "Capacitor_SMD:CP_Elec_10x10" H 9588 850 50  0001 C CNN
F 3 "~" H 9550 1000 50  0001 C CNN
F 4 "" H 9550 1000 50  0001 C CNN "PartNumber"
F 5 "63V" H 9550 1000 50  0001 C CNN "Voltage"
F 6 "1.4A" H 9550 1000 50  0001 C CNN "Ripple current"
F 7 "3000-0000000470" H 9550 1000 50  0001 C CNN "PartSpecification"
	1    9550 1000
	1    0    0    -1  
$EndComp
$Comp
L power:GND #PWR?
U 1 1 5F4234C6
P 9850 1250
F 0 "#PWR?" H 9850 1000 50  0001 C CNN
F 1 "GND" H 9850 1100 50  0000 C CNN
F 2 "" H 9850 1250 50  0001 C CNN
F 3 "" H 9850 1250 50  0001 C CNN
	1    9850 1250
	1    0    0    -1  
$EndComp
$Comp
L power:GND #PWR?
U 1 1 5F4234CC
P 9550 1250
F 0 "#PWR?" H 9550 1000 50  0001 C CNN
F 1 "GND" H 9550 1100 50  0000 C CNN
F 2 "" H 9550 1250 50  0001 C CNN
F 3 "" H 9550 1250 50  0001 C CNN
	1    9550 1250
	1    0    0    -1  
$EndComp
Wire Wire Line
	9550 1250 9550 1150
Wire Wire Line
	9850 1150 9850 1250
Wire Wire Line
	9550 850  9550 750 
Wire Wire Line
	9850 850  9850 750 
Wire Wire Line
	9550 750  9850 750 
Connection ~ 9850 750 
Connection ~ 10150 750 
Wire Wire Line
	10150 750  10450 750 
Connection ~ 10450 750 
Wire Wire Line
	9300 2100 9000 2100
Wire Wire Line
	8400 2500 8600 2500
$Comp
L Device:R R2411
U 1 1 5F43A242
P 8250 3400
F 0 "R2411" V 8330 3400 50  0000 C CNN
F 1 "R" V 8250 3400 50  0000 C CNN
F 2 "Resistor_SMD:R_2512_6332Metric" V 8180 3400 50  0001 C CNN
F 3 "~" H 8250 3400 50  0001 C CNN
	1    8250 3400
	1    0    0    -1  
$EndComp
Wire Wire Line
	8250 3250 8250 3200
Wire Wire Line
	8250 3150 7900 3150
Wire Wire Line
	7900 3150 7900 3100
Connection ~ 7900 3100
Wire Wire Line
	8250 3150 8600 3150
Wire Wire Line
	8600 3150 8600 3100
Connection ~ 8250 3150
Connection ~ 8600 3100
$Comp
L power:GND #PWR?
U 1 1 5F43EB27
P 8700 3650
F 0 "#PWR?" H 8700 3400 50  0001 C CNN
F 1 "GND" H 8700 3500 50  0000 C CNN
F 2 "" H 8700 3650 50  0001 C CNN
F 3 "" H 8700 3650 50  0001 C CNN
	1    8700 3650
	1    0    0    -1  
$EndComp
Wire Wire Line
	8250 3650 8250 3600
Wire Wire Line
	9100 2900 9100 3900
Wire Wire Line
	6700 3900 9100 3900
Wire Wire Line
	6700 4000 6850 4000
Wire Wire Line
	9200 4000 9200 2500
Wire Wire Line
	9200 2500 8600 2500
Wire Wire Line
	6700 4400 9300 4400
Wire Wire Line
	9300 4400 9300 2100
$Comp
L Device:C C2403
U 1 1 5F47B9FB
P 2100 1300
F 0 "C2403" H 2125 1400 50  0000 L CNN
F 1 "10uF" H 2125 1200 50  0000 L CNN
F 2 "Capacitor_SMD:C_1210_3225Metric" H 2138 1150 50  0001 C CNN
F 3 "~" H 2100 1300 50  0001 C CNN
F 4 "60" H 2100 1300 50  0001 C CNN "Voltage"
F 5 "3000-0000000472" H 2100 1300 50  0001 C CNN "PartSpecification"
	1    2100 1300
	1    0    0    -1  
$EndComp
$Comp
L Device:R R2408
U 1 1 5F47CE3B
P 7200 3600
F 0 "R2408" V 7280 3600 50  0000 C CNN
F 1 "100" V 7200 3600 50  0000 C CNN
F 2 "Resistor_SMD:R_0402_1005Metric" V 7130 3600 50  0001 C CNN
F 3 "~" H 7200 3600 50  0001 C CNN
F 4 "3000-0000000149" H 7200 3600 50  0001 C CNN "PartSpecification"
	1    7200 3600
	0    1    1    0   
$EndComp
$Comp
L Device:R R2407
U 1 1 5F47D456
P 7200 3200
F 0 "R2407" V 7280 3200 50  0000 C CNN
F 1 "100" V 7200 3200 50  0000 C CNN
F 2 "Resistor_SMD:R_0402_1005Metric" V 7130 3200 50  0001 C CNN
F 3 "~" H 7200 3200 50  0001 C CNN
F 4 "3000-0000000149" H 7200 3200 50  0001 C CNN "PartSpecification"
	1    7200 3200
	0    1    1    0   
$EndComp
Wire Wire Line
	7050 3600 6850 3600
Wire Wire Line
	6850 3550 6850 3600
Connection ~ 6850 3600
Wire Wire Line
	6850 3600 6700 3600
Wire Wire Line
	7050 3200 6850 3200
Wire Wire Line
	6850 3250 6850 3200
Connection ~ 6850 3200
Wire Wire Line
	6850 3200 6700 3200
Wire Wire Line
	7350 3200 8250 3200
Connection ~ 8250 3200
Wire Wire Line
	8250 3200 8250 3150
Wire Wire Line
	7350 3600 8250 3600
Connection ~ 8250 3600
Wire Wire Line
	8250 3600 8250 3550
$Comp
L 000_PreferredParts:C_0_1uF C2412
U 1 1 5F493905
P 6850 2350
F 0 "C2412" H 6875 2450 50  0000 L CNN
F 1 "C_0_1uF" H 6875 2250 50  0001 L CNN
F 2 "Capacitor_SMD:C_0402_1005Metric" H 6888 2200 50  0001 C CNN
F 3 "~" H 6850 2350 50  0001 C CNN
F 4 "0.1uF" H 7000 2250 50  0000 C CNN "DisplayValue"
F 5 "3000-0000000125" H 6850 2350 50  0001 C CNN "PartSpecification"
F 6 "100V" H 6850 2350 50  0001 C CNN "Voltage"
	1    6850 2350
	1    0    0    -1  
$EndComp
Connection ~ 6850 2500
Wire Wire Line
	6850 2500 7900 2500
Wire Wire Line
	6850 2200 6700 2200
$Comp
L 000_PreferredDiodes:D_Schottky_60V_1A D2402
U 1 1 5F4978BC
P 6850 1850
F 0 "D2402" H 6850 1950 50  0000 C CNN
F 1 "D_Schottky_60V_1A" H 6850 1750 50  0001 C CNN
F 2 "Diode_SMD:D_SOD-123F" H 6850 1850 50  0001 C CNN
F 3 "~" H 6850 1850 50  0001 C CNN
F 4 "DSS16UTR" H 6850 1850 50  0001 C CNN "PartNumber"
F 5 "Schottky" H 6850 1750 50  0000 C CNN "DisplayValue"
F 6 "60V_1A" H 6850 1650 50  0000 C CNN "DisplayValue2"
F 7 "3000-0000000481" H 6850 1850 50  0001 C CNN "PartSpecification"
	1    6850 1850
	0    -1   -1   0   
$EndComp
Wire Wire Line
	6850 2000 6850 2200
Connection ~ 6850 2200
Wire Wire Line
	6850 1400 6400 1400
Connection ~ 6400 1400
Wire Wire Line
	6850 1400 6850 1700
$Comp
L 000_PreferredParts:C_0_1uF C2414
U 1 1 5F4A4C15
P 6850 4150
F 0 "C2414" H 6875 4250 50  0000 L CNN
F 1 "C_0_1uF" H 6875 4050 50  0001 L CNN
F 2 "Capacitor_SMD:C_0402_1005Metric" H 6888 4000 50  0001 C CNN
F 3 "~" H 6850 4150 50  0001 C CNN
F 4 "0.1uF" H 7000 4050 50  0000 C CNN "DisplayValue"
F 5 "3000-0000000125" H 6850 4150 50  0001 C CNN "PartSpecification"
F 6 "100V" H 6850 4150 50  0001 C CNN "Voltage"
	1    6850 4150
	1    0    0    -1  
$EndComp
Connection ~ 6850 4000
Wire Wire Line
	6850 4000 9200 4000
Wire Wire Line
	6700 4300 6850 4300
$Comp
L 000_PreferredDiodes:D_Schottky_60V_1A D2403
U 1 1 5F4AACC3
P 7150 4300
F 0 "D2403" H 7150 4400 50  0000 C CNN
F 1 "D_Schottky_60V_1A" H 7150 4200 50  0001 C CNN
F 2 "Diode_SMD:D_SOD-123F" H 7150 4300 50  0001 C CNN
F 3 "~" H 7150 4300 50  0001 C CNN
F 4 "DSS16UTR" H 7150 4300 50  0001 C CNN "PartNumber"
F 5 "Schottky" H 7150 4200 50  0000 C CNN "DisplayValue"
F 6 "60V_1A" H 7150 4100 50  0000 C CNN "DisplayValue2"
F 7 "3000-0000000481" H 7150 4300 50  0001 C CNN "PartSpecification"
	1    7150 4300
	1    0    0    -1  
$EndComp
Wire Wire Line
	7000 4300 6850 4300
Connection ~ 6850 4300
Wire Wire Line
	6850 1400 7200 1400
Connection ~ 6850 1400
Text Label 7200 1400 0    50   ~ 0
VCC
Text Label 7400 4300 0    50   ~ 0
VCC
Wire Wire Line
	7400 4300 7300 4300
Wire Wire Line
	7700 1900 7800 1900
Connection ~ 7800 1900
Wire Wire Line
	7800 1900 7900 1900
Connection ~ 7900 1900
Wire Wire Line
	7900 1900 8000 1900
Wire Wire Line
	8000 1900 8000 1050
Wire Wire Line
	2500 1050 7500 1050
Connection ~ 8000 1900
Wire Wire Line
	8500 1900 8600 1900
Connection ~ 8600 1900
Wire Wire Line
	8600 1900 8700 1900
Connection ~ 8700 1900
Wire Wire Line
	8700 1900 8800 1900
Connection ~ 8800 1900
Wire Wire Line
	8800 1900 9400 1900
Wire Wire Line
	9850 750  10150 750 
Wire Wire Line
	10450 750  10850 750 
Wire Wire Line
	10850 1900 10850 750 
Connection ~ 10850 750 
Wire Wire Line
	10850 750  10950 750 
$Comp
L Device:C C2410
U 1 1 5F5123DE
P 4700 3150
F 0 "C2410" H 4725 3250 50  0000 L CNN
F 1 "C" H 4725 3050 50  0000 L CNN
F 2 "Capacitor_SMD:C_0402_1005Metric" H 4738 3000 50  0001 C CNN
F 3 "~" H 4700 3150 50  0001 C CNN
	1    4700 3150
	1    0    0    -1  
$EndComp
Wire Wire Line
	5300 3000 4700 3000
$Comp
L power:GND #PWR?
U 1 1 5F5184ED
P 4700 3400
F 0 "#PWR?" H 4700 3150 50  0001 C CNN
F 1 "GND" H 4700 3250 50  0000 C CNN
F 2 "" H 4700 3400 50  0001 C CNN
F 3 "" H 4700 3400 50  0001 C CNN
	1    4700 3400
	1    0    0    -1  
$EndComp
Wire Wire Line
	4700 3400 4700 3300
$Comp
L Device:R R2406
U 1 1 5F5224BD
P 5200 1800
F 0 "R2406" V 5280 1800 50  0000 C CNN
F 1 "10k" V 5200 1800 50  0000 C CNN
F 2 "Resistor_SMD:R_0402_1005Metric" V 5130 1800 50  0001 C CNN
F 3 "~" H 5200 1800 50  0001 C CNN
F 4 "3000-0000000131" H 5200 1800 50  0001 C CNN "PartSpecification"
	1    5200 1800
	1    0    0    -1  
$EndComp
Wire Wire Line
	5200 1950 5200 3300
Wire Wire Line
	5200 3300 5300 3300
Wire Wire Line
	5200 3300 5100 3300
Connection ~ 5200 3300
Wire Wire Line
	5200 1400 5200 1650
Wire Wire Line
	5200 1400 6100 1400
Connection ~ 6100 1400
$Comp
L Device:C C2407
U 1 1 5F53FE79
P 4000 4450
F 0 "C2407" H 4025 4550 50  0000 L CNN
F 1 "C" H 4025 4350 50  0000 L CNN
F 2 "Capacitor_SMD:C_0402_1005Metric" H 4038 4300 50  0001 C CNN
F 3 "~" H 4000 4450 50  0001 C CNN
	1    4000 4450
	1    0    0    -1  
$EndComp
$Comp
L Device:C C2409
U 1 1 5F540294
P 4500 4450
F 0 "C2409" H 4525 4550 50  0000 L CNN
F 1 "C" H 4525 4350 50  0000 L CNN
F 2 "Capacitor_SMD:C_0402_1005Metric" H 4538 4300 50  0001 C CNN
F 3 "~" H 4500 4450 50  0001 C CNN
	1    4500 4450
	1    0    0    -1  
$EndComp
$Comp
L Device:R R2405
U 1 1 5F540983
P 4500 4950
F 0 "R2405" V 4580 4950 50  0000 C CNN
F 1 "R" V 4500 4950 50  0000 C CNN
F 2 "Resistor_SMD:R_0402_1005Metric" V 4430 4950 50  0001 C CNN
F 3 "~" H 4500 4950 50  0001 C CNN
	1    4500 4950
	1    0    0    -1  
$EndComp
$Comp
L power:GND #PWR?
U 1 1 5F541704
P 4000 4700
F 0 "#PWR?" H 4000 4450 50  0001 C CNN
F 1 "GND" H 4000 4550 50  0000 C CNN
F 2 "" H 4000 4700 50  0001 C CNN
F 3 "" H 4000 4700 50  0001 C CNN
	1    4000 4700
	1    0    0    -1  
$EndComp
$Comp
L power:GND #PWR?
U 1 1 5F541AA7
P 4500 5200
F 0 "#PWR?" H 4500 4950 50  0001 C CNN
F 1 "GND" H 4500 5050 50  0000 C CNN
F 2 "" H 4500 5200 50  0001 C CNN
F 3 "" H 4500 5200 50  0001 C CNN
	1    4500 5200
	1    0    0    -1  
$EndComp
Wire Wire Line
	4500 5200 4500 5100
Wire Wire Line
	4500 4800 4500 4600
Wire Wire Line
	4000 4700 4000 4600
Wire Wire Line
	4000 4300 4000 4200
Wire Wire Line
	4000 4200 4500 4200
Wire Wire Line
	4500 4200 4500 4300
Wire Wire Line
	4500 4200 4500 3800
Wire Wire Line
	4500 3800 5300 3800
Connection ~ 4500 4200
$Comp
L power:GND #PWR?
U 1 1 5F55D08A
P 5900 5850
F 0 "#PWR?" H 5900 5600 50  0001 C CNN
F 1 "GND" H 5900 5700 50  0000 C CNN
F 2 "" H 5900 5850 50  0001 C CNN
F 3 "" H 5900 5850 50  0001 C CNN
	1    5900 5850
	1    0    0    -1  
$EndComp
$Comp
L power:GND #PWR?
U 1 1 5F55D617
P 6000 5850
F 0 "#PWR?" H 6000 5600 50  0001 C CNN
F 1 "GND" H 6000 5700 50  0000 C CNN
F 2 "" H 6000 5850 50  0001 C CNN
F 3 "" H 6000 5850 50  0001 C CNN
	1    6000 5850
	1    0    0    -1  
$EndComp
$Comp
L power:GND #PWR?
U 1 1 5F55D724
P 6100 5850
F 0 "#PWR?" H 6100 5600 50  0001 C CNN
F 1 "GND" H 6100 5700 50  0000 C CNN
F 2 "" H 6100 5850 50  0001 C CNN
F 3 "" H 6100 5850 50  0001 C CNN
	1    6100 5850
	1    0    0    -1  
$EndComp
Connection ~ 10850 1900
Wire Wire Line
	10850 1900 10850 4600
$Comp
L 000_PreferredParts:C_0_1uF C2406
U 1 1 5F5B5693
P 3700 3850
F 0 "C2406" H 3725 3950 50  0000 L CNN
F 1 "C_0_1uF" H 3725 3750 50  0001 L CNN
F 2 "Capacitor_SMD:C_0402_1005Metric" H 3738 3700 50  0001 C CNN
F 3 "~" H 3700 3850 50  0001 C CNN
F 4 "0.1uF" H 3850 3750 50  0000 C CNN "DisplayValue"
F 5 "3000-0000000125" H 3700 3850 50  0001 C CNN "PartSpecification"
F 6 "100V" H 3700 3850 50  0001 C CNN "Voltage"
	1    3700 3850
	1    0    0    -1  
$EndComp
Wire Wire Line
	3700 3700 3700 3600
Wire Wire Line
	3700 3600 5300 3600
$Comp
L power:GND #PWR?
U 1 1 5F5BBC58
P 3700 4100
F 0 "#PWR?" H 3700 3850 50  0001 C CNN
F 1 "GND" H 3700 3950 50  0000 C CNN
F 2 "" H 3700 4100 50  0001 C CNN
F 3 "" H 3700 4100 50  0001 C CNN
	1    3700 4100
	1    0    0    -1  
$EndComp
Wire Wire Line
	3700 4100 3700 4000
Wire Wire Line
	6700 4600 7650 4600
$Comp
L Device:R R2409
U 1 1 5F5CB1A5
P 7650 4750
F 0 "R2409" V 7730 4750 50  0000 C CNN
F 1 "R" V 7650 4750 50  0000 C CNN
F 2 "Resistor_SMD:R_0402_1005Metric" V 7580 4750 50  0001 C CNN
F 3 "~" H 7650 4750 50  0001 C CNN
	1    7650 4750
	-1   0    0    1   
$EndComp
Connection ~ 7650 4600
Wire Wire Line
	7650 4600 10850 4600
Wire Wire Line
	6700 4900 7650 4900
$Comp
L Device:R R2410
U 1 1 5F5D22D4
P 7650 5250
F 0 "R2410" V 7730 5250 50  0000 C CNN
F 1 "R" V 7650 5250 50  0000 C CNN
F 2 "Resistor_SMD:R_0402_1005Metric" V 7580 5250 50  0001 C CNN
F 3 "~" H 7650 5250 50  0001 C CNN
	1    7650 5250
	-1   0    0    1   
$EndComp
Wire Wire Line
	7650 5100 7650 4900
Connection ~ 7650 4900
$Comp
L power:GND #PWR?
U 1 1 5F5D8FB9
P 7650 5500
F 0 "#PWR?" H 7650 5250 50  0001 C CNN
F 1 "GND" H 7650 5350 50  0000 C CNN
F 2 "" H 7650 5500 50  0001 C CNN
F 3 "" H 7650 5500 50  0001 C CNN
	1    7650 5500
	1    0    0    -1  
$EndComp
Wire Wire Line
	7650 5500 7650 5400
Wire Wire Line
	6100 5850 6100 5750
Wire Wire Line
	6000 5750 6000 5850
Wire Wire Line
	5900 5750 5900 5850
$Comp
L 000_PreferredParts:C_10uF_0805 C2415
U 1 1 5F65554F
P 9400 2150
F 0 "C2415" H 9425 2250 50  0000 L CNN
F 1 "C_10uF_0805" H 9425 2050 50  0001 L CNN
F 2 "Capacitor_SMD:C_0805_2012Metric" H 9438 2000 50  0001 C CNN
F 3 "~" H 9400 2150 50  0001 C CNN
F 4 "10uF" H 9550 2050 50  0000 C CNN "DisplayValue"
F 5 "0805" H 9550 1950 50  0000 C CNN "DisplayFootprint"
F 6 "3000-0000000134" H 9400 2150 50  0001 C CNN "PartSpecification"
	1    9400 2150
	1    0    0    -1  
$EndComp
$Comp
L 000_PreferredParts:C_10uF_0805 C2417
U 1 1 5F655921
P 9600 2150
F 0 "C2417" H 9625 2250 50  0000 L CNN
F 1 "C_10uF_0805" H 9625 2050 50  0001 L CNN
F 2 "Capacitor_SMD:C_0805_2012Metric" H 9638 2000 50  0001 C CNN
F 3 "~" H 9600 2150 50  0001 C CNN
F 4 "10uF" H 9750 2050 50  0000 C CNN "DisplayValue"
F 5 "0805" H 9750 1950 50  0000 C CNN "DisplayFootprint"
F 6 "3000-0000000134" H 9600 2150 50  0001 C CNN "PartSpecification"
	1    9600 2150
	1    0    0    -1  
$EndComp
$Comp
L 000_PreferredParts:C_10uF_0805 C2418
U 1 1 5F655C7C
P 9800 2150
F 0 "C2418" H 9825 2250 50  0000 L CNN
F 1 "C_10uF_0805" H 9825 2050 50  0001 L CNN
F 2 "Capacitor_SMD:C_0805_2012Metric" H 9838 2000 50  0001 C CNN
F 3 "~" H 9800 2150 50  0001 C CNN
F 4 "10uF" H 9950 2050 50  0000 C CNN "DisplayValue"
F 5 "0805" H 9950 1950 50  0000 C CNN "DisplayFootprint"
F 6 "3000-0000000134" H 9800 2150 50  0001 C CNN "PartSpecification"
	1    9800 2150
	1    0    0    -1  
$EndComp
$Comp
L 000_PreferredParts:C_10uF_0805 C2420
U 1 1 5F655F49
P 10000 2150
F 0 "C2420" H 10025 2250 50  0000 L CNN
F 1 "C_10uF_0805" H 10025 2050 50  0001 L CNN
F 2 "Capacitor_SMD:C_0805_2012Metric" H 10038 2000 50  0001 C CNN
F 3 "~" H 10000 2150 50  0001 C CNN
F 4 "10uF" H 10150 2050 50  0000 C CNN "DisplayValue"
F 5 "0805" H 10150 1950 50  0000 C CNN "DisplayFootprint"
F 6 "3000-0000000134" H 10000 2150 50  0001 C CNN "PartSpecification"
	1    10000 2150
	1    0    0    -1  
$EndComp
$Comp
L 000_PreferredParts:C_10uF_0805 C2422
U 1 1 5F66C043
P 10200 2150
F 0 "C2422" H 10225 2250 50  0000 L CNN
F 1 "C_10uF_0805" H 10225 2050 50  0001 L CNN
F 2 "Capacitor_SMD:C_0805_2012Metric" H 10238 2000 50  0001 C CNN
F 3 "~" H 10200 2150 50  0001 C CNN
F 4 "10uF" H 10350 2050 50  0000 C CNN "DisplayValue"
F 5 "0805" H 10350 1950 50  0000 C CNN "DisplayFootprint"
F 6 "3000-0000000134" H 10200 2150 50  0001 C CNN "PartSpecification"
	1    10200 2150
	1    0    0    -1  
$EndComp
$Comp
L power:GND #PWR?
U 1 1 5F66C3BB
P 9800 2500
F 0 "#PWR?" H 9800 2250 50  0001 C CNN
F 1 "GND" H 9800 2350 50  0000 C CNN
F 2 "" H 9800 2500 50  0001 C CNN
F 3 "" H 9800 2500 50  0001 C CNN
	1    9800 2500
	1    0    0    -1  
$EndComp
Wire Wire Line
	9800 2500 9800 2400
Wire Wire Line
	9800 2400 10000 2400
Wire Wire Line
	10200 2400 10200 2300
Connection ~ 9800 2400
Wire Wire Line
	9800 2400 9800 2300
Wire Wire Line
	10000 2300 10000 2400
Connection ~ 10000 2400
Wire Wire Line
	10000 2400 10200 2400
Wire Wire Line
	9400 2400 9400 2300
Wire Wire Line
	9600 2300 9600 2400
Connection ~ 9600 2400
Wire Wire Line
	9600 2400 9400 2400
Wire Wire Line
	9600 2400 9800 2400
Wire Wire Line
	9400 2000 9400 1900
Connection ~ 9400 1900
Wire Wire Line
	9400 1900 9600 1900
Wire Wire Line
	9600 1900 9600 2000
Connection ~ 9600 1900
Wire Wire Line
	9600 1900 9800 1900
Wire Wire Line
	9800 2000 9800 1900
Connection ~ 9800 1900
Wire Wire Line
	9800 1900 10000 1900
Wire Wire Line
	10000 1900 10000 2000
Connection ~ 10000 1900
Wire Wire Line
	10000 1900 10200 1900
Wire Wire Line
	10200 2000 10200 1900
Connection ~ 10200 1900
Wire Wire Line
	2500 1550 2500 1450
Wire Wire Line
	2500 2100 2500 1850
Wire Wire Line
	10200 1900 10850 1900
$Comp
L power:GND #PWR?
U 1 1 5E2D3EA2
P 6800 5550
F 0 "#PWR?" H 6800 5300 50  0001 C CNN
F 1 "GND" H 6800 5400 50  0000 C CNN
F 2 "" H 6800 5550 50  0001 C CNN
F 3 "" H 6800 5550 50  0001 C CNN
	1    6800 5550
	1    0    0    -1  
$EndComp
Wire Wire Line
	6800 5550 6800 5450
Wire Wire Line
	6800 5150 6700 5150
Wire Wire Line
	6700 5450 6800 5450
Connection ~ 6800 5450
Wire Wire Line
	6800 5450 6800 5150
Text HLabel 5100 3300 0    50   Output ~ 0
p_good
$Comp
L power:GND #PWR?
U 1 1 5F7CB673
P 7500 1550
F 0 "#PWR?" H 7500 1300 50  0001 C CNN
F 1 "GND" H 7500 1400 50  0000 C CNN
F 2 "" H 7500 1550 50  0001 C CNN
F 3 "" H 7500 1550 50  0001 C CNN
	1    7500 1550
	1    0    0    -1  
$EndComp
Wire Wire Line
	7500 1550 7500 1450
Wire Wire Line
	7500 1150 7500 1050
$Comp
L Device:C C2424
U 1 1 5F7CB67C
P 7500 1300
F 0 "C2424" H 7525 1400 50  0000 L CNN
F 1 "10uF" H 7525 1200 50  0000 L CNN
F 2 "Capacitor_SMD:C_1210_3225Metric" H 7538 1150 50  0001 C CNN
F 3 "~" H 7500 1300 50  0001 C CNN
F 4 "60" H 7500 1300 50  0001 C CNN "Voltage"
F 5 "3000-0000000472" H 7500 1300 50  0001 C CNN "PartSpecification"
	1    7500 1300
	1    0    0    -1  
$EndComp
$Comp
L power:GND #PWR?
U 1 1 5F7D3229
P 7750 1550
F 0 "#PWR?" H 7750 1300 50  0001 C CNN
F 1 "GND" H 7750 1400 50  0000 C CNN
F 2 "" H 7750 1550 50  0001 C CNN
F 3 "" H 7750 1550 50  0001 C CNN
	1    7750 1550
	1    0    0    -1  
$EndComp
Wire Wire Line
	7750 1550 7750 1450
Wire Wire Line
	7750 1150 7750 1050
$Comp
L Device:C C2425
U 1 1 5F7D3232
P 7750 1300
F 0 "C2425" H 7775 1400 50  0000 L CNN
F 1 "10uF" H 7775 1200 50  0000 L CNN
F 2 "Capacitor_SMD:C_1210_3225Metric" H 7788 1150 50  0001 C CNN
F 3 "~" H 7750 1300 50  0001 C CNN
F 4 "60" H 7750 1300 50  0001 C CNN "Voltage"
F 5 "3000-0000000472" H 7750 1300 50  0001 C CNN "PartSpecification"
	1    7750 1300
	1    0    0    -1  
$EndComp
Connection ~ 7750 1050
Wire Wire Line
	7750 1050 8000 1050
Connection ~ 7500 1050
Wire Wire Line
	7500 1050 7750 1050
Text Label 7900 2500 0    50   ~ 0
L_in
Text Label 8700 2500 0    50   ~ 0
L_out
Text Label 7150 2600 0    50   ~ 0
G_LOW_IN
Text Label 7100 2100 0    50   ~ 0
G_HIGH_IN
Text Label 8300 4400 0    50   ~ 0
G_HIGH_OUT
Text Label 8250 3900 0    50   ~ 0
G_LOW_OUT
Text Label 6850 2150 0    50   ~ 0
BOOT_IN
Text Label 6750 4300 0    50   ~ 0
BOOT_OUT
Text Label 7250 4900 0    50   ~ 0
FB
Text Label 5200 3150 0    50   ~ 0
PG
Text Label 2500 1500 0    50   ~ 0
V_IN_D
Text Label 2800 2100 0    50   ~ 0
V_IN_IC
Text Label 4400 2600 0    50   ~ 0
SYNC_IC
Text Label 4450 2700 0    50   ~ 0
MODE
Text Label 4500 2800 0    50   ~ 0
SS
Text Label 4800 3000 0    50   ~ 0
SLOPE
Text Label 4050 3600 0    50   ~ 0
BIAS
Text Label 4800 3800 0    50   ~ 0
COMP
Text Label 4500 4700 0    50   ~ 0
COMP_MID
$Comp
L Device:Net-Tie_2 NT2401
U 1 1 5F90E4DA
P 8350 3650
F 0 "NT2401" H 8350 3700 50  0000 C CNN
F 1 "Net-Tie_2" H 8350 3600 50  0000 C CNN
F 2 "NetTie:NetTie-2_SMD_Pad2.0mm" H 8350 3650 50  0001 C CNN
F 3 "~" H 8350 3650 50  0001 C CNN
	1    8350 3650
	1    0    0    -1  
$EndComp
Wire Wire Line
	8450 3650 8700 3650
Text Label 8000 3200 0    50   ~ 0
CS
Text Label 7900 3600 0    50   ~ 0
CSG
Text Label 6850 3200 0    50   ~ 0
CS_IC
Text Label 6850 3600 0    50   ~ 0
CSG_IC
Text Label 4000 2300 0    50   ~ 0
VISNS
$Comp
L 000_PreferredParts:C_100pF C2413
U 1 1 5E4D4BBA
P 6850 3400
F 0 "C2413" H 6875 3500 50  0000 L CNN
F 1 "C_100pF" H 6875 3300 50  0001 L CNN
F 2 "Capacitor_SMD:C_0402_1005Metric" H 6888 3250 50  0001 C CNN
F 3 "~" H 6850 3400 50  0001 C CNN
F 4 "100pF" H 7000 3300 50  0000 C CNN "DisplayValue"
F 5 "3000-0000000474" H 6850 3400 50  0001 C CNN "PartSpecification"
	1    6850 3400
	1    0    0    -1  
$EndComp
$EndSCHEMATC
