EESchema Schematic File Version 4
EELAYER 30 0
EELAYER END
$Descr A4 11693 8268
encoding utf-8
Sheet 34 39
Title ""
Date ""
Rev ""
Comp ""
Comment1 ""
Comment2 ""
Comment3 ""
Comment4 ""
$EndDescr
$Comp
L POWDER_Digital:10M50DAF256 U2201
U 8 1 5F9DCABC
P 4500 3650
F 0 "U2201" H 4500 3800 50  0000 C CNN
F 1 "‎10M08DAF256C8G" H 4500 3650 50  0000 C CNN
F 2 "Package_BGA:BGA-256_17.0x17.0mm_Layout16x16_P1.0mm_Ball0.5mm_Pad0.4mm_NSMD" H 4500 3650 50  0001 C CNN
F 3 "" H 4500 3650 50  0001 C CNN
F 4 "3000-0000001300" H 4500 3650 50  0001 C CNN "PartSpecification"
	8    4500 3650
	1    0    0    -1  
$EndComp
$Comp
L 000_PreferredParts:C_1nF C?
U 1 1 5FBAA2BF
P 4800 2000
AR Path="/5F8E5420/5F971A6D/5FBAA2BF" Ref="C?"  Part="1" 
AR Path="/5F8E5420/5F9D23DE/5FBAA2BF" Ref="C1103"  Part="1" 
AR Path="/605746B5/5F8E5420/5F9D23DE/5FBAA2BF" Ref="C2903"  Part="1" 
F 0 "C2903" H 4825 2100 50  0000 L CNN
F 1 "C_1nF" H 4825 1900 50  0000 L CNN
F 2 "Capacitor_SMD:C_0402_1005Metric" H 4838 1850 50  0001 C CNN
F 3 "~" H 4800 2000 50  0001 C CNN
F 4 "3000-0000000128" H 4800 2000 50  0001 C CNN "PartSpecification"
	1    4800 2000
	1    0    0    -1  
$EndComp
$Comp
L 000_PreferredParts:C_1nF C?
U 1 1 5FBAA2C6
P 3750 2000
AR Path="/5F8E5420/5F971A6D/5FBAA2C6" Ref="C?"  Part="1" 
AR Path="/5F8E5420/5F9D23DE/5FBAA2C6" Ref="C1101"  Part="1" 
AR Path="/605746B5/5F8E5420/5F9D23DE/5FBAA2C6" Ref="C2901"  Part="1" 
F 0 "C2901" H 3775 2100 50  0000 L CNN
F 1 "C_1nF" H 3775 1900 50  0000 L CNN
F 2 "Capacitor_SMD:C_0402_1005Metric" H 3788 1850 50  0001 C CNN
F 3 "~" H 3750 2000 50  0001 C CNN
F 4 "3000-0000000128" H 3750 2000 50  0001 C CNN "PartSpecification"
	1    3750 2000
	1    0    0    -1  
$EndComp
$Comp
L 000_PreferredParts:C_0_1uF C?
U 1 1 5FBAA2CF
P 5150 2000
AR Path="/5F8E5420/5F971A6D/5FBAA2CF" Ref="C?"  Part="1" 
AR Path="/5F8E5420/5F9D23DE/5FBAA2CF" Ref="C1104"  Part="1" 
AR Path="/605746B5/5F8E5420/5F9D23DE/5FBAA2CF" Ref="C2904"  Part="1" 
F 0 "C2904" H 5175 2100 50  0000 L CNN
F 1 "C_0_1uF" H 5175 1900 50  0001 L CNN
F 2 "Capacitor_SMD:C_0402_1005Metric" H 5188 1850 50  0001 C CNN
F 3 "~" H 5150 2000 50  0001 C CNN
F 4 "0.1uF" H 5300 1900 50  0000 C CNN "DisplayValue"
F 5 "3000-0000000125" H 5150 2000 50  0001 C CNN "PartSpecification"
F 6 "100V" H 5150 2000 50  0001 C CNN "Voltage"
	1    5150 2000
	1    0    0    -1  
$EndComp
$Comp
L power:GND #PWR?
U 1 1 5FBAA2DB
P 5500 2200
AR Path="/5F8E5420/5F971A6D/5FBAA2DB" Ref="#PWR?"  Part="1" 
AR Path="/5F8E5420/5F9D23DE/5FBAA2DB" Ref="#PWR?"  Part="1" 
AR Path="/605746B5/5F8E5420/5F9D23DE/5FBAA2DB" Ref="#PWR?"  Part="1" 
F 0 "#PWR?" H 5500 1950 50  0001 C CNN
F 1 "GND" H 5500 2050 50  0000 C CNN
F 2 "" H 5500 2200 50  0001 C CNN
F 3 "" H 5500 2200 50  0001 C CNN
	1    5500 2200
	1    0    0    -1  
$EndComp
Wire Wire Line
	4800 2150 4800 2200
Wire Wire Line
	4800 2200 5150 2200
Wire Wire Line
	5150 2200 5150 2150
Connection ~ 5150 2200
Wire Wire Line
	5150 2200 5500 2200
Wire Wire Line
	4600 2350 4600 1750
Wire Wire Line
	4600 1750 4800 1750
Wire Wire Line
	5150 1850 5150 1750
Wire Wire Line
	4800 1850 4800 1750
Connection ~ 4800 1750
Wire Wire Line
	4800 1750 5150 1750
$Comp
L power:GND #PWR?
U 1 1 5FBAA2F1
P 3750 2200
AR Path="/5F8E5420/5F971A6D/5FBAA2F1" Ref="#PWR?"  Part="1" 
AR Path="/5F8E5420/5F9D23DE/5FBAA2F1" Ref="#PWR?"  Part="1" 
AR Path="/605746B5/5F8E5420/5F9D23DE/5FBAA2F1" Ref="#PWR?"  Part="1" 
F 0 "#PWR?" H 3750 1950 50  0001 C CNN
F 1 "GND" H 3750 2050 50  0000 C CNN
F 2 "" H 3750 2200 50  0001 C CNN
F 3 "" H 3750 2200 50  0001 C CNN
	1    3750 2200
	1    0    0    -1  
$EndComp
Wire Wire Line
	3750 2200 3750 2150
Wire Wire Line
	3750 1850 3750 1750
Wire Wire Line
	3750 1750 4500 1750
Wire Wire Line
	4500 1750 4500 2350
Wire Wire Line
	4500 1750 4500 1650
Wire Wire Line
	4500 1650 4600 1650
Wire Wire Line
	4600 1650 4600 1750
Connection ~ 4500 1750
Connection ~ 4600 1750
$Comp
L 000_PreferredParts:C_1nF C?
U 1 1 5FBAA301
P 4100 2000
AR Path="/5F8E5420/5F971A6D/5FBAA301" Ref="C?"  Part="1" 
AR Path="/5F8E5420/5F9D23DE/5FBAA301" Ref="C1102"  Part="1" 
AR Path="/605746B5/5F8E5420/5F9D23DE/5FBAA301" Ref="C2902"  Part="1" 
F 0 "C2902" H 4125 2100 50  0000 L CNN
F 1 "C_1nF" H 4125 1900 50  0000 L CNN
F 2 "Capacitor_SMD:C_0402_1005Metric" H 4138 1850 50  0001 C CNN
F 3 "~" H 4100 2000 50  0001 C CNN
F 4 "3000-0000000128" H 4100 2000 50  0001 C CNN "PartSpecification"
	1    4100 2000
	1    0    0    -1  
$EndComp
$Comp
L power:GND #PWR?
U 1 1 5FBAA307
P 4100 2200
AR Path="/5F8E5420/5F971A6D/5FBAA307" Ref="#PWR?"  Part="1" 
AR Path="/5F8E5420/5F9D23DE/5FBAA307" Ref="#PWR?"  Part="1" 
AR Path="/605746B5/5F8E5420/5F9D23DE/5FBAA307" Ref="#PWR?"  Part="1" 
F 0 "#PWR?" H 4100 1950 50  0001 C CNN
F 1 "GND" H 4100 2050 50  0000 C CNN
F 2 "" H 4100 2200 50  0001 C CNN
F 3 "" H 4100 2200 50  0001 C CNN
	1    4100 2200
	1    0    0    -1  
$EndComp
Wire Wire Line
	4100 2200 4100 2150
Wire Wire Line
	4100 1850 4400 1850
Wire Wire Line
	4400 1850 4400 2350
Wire Wire Line
	4400 1850 4400 1650
Wire Wire Line
	4400 1650 4500 1650
Connection ~ 4400 1850
Connection ~ 4500 1650
Wire Wire Line
	6250 3100 5650 3100
Wire Wire Line
	3350 4500 2500 4500
Wire Wire Line
	5650 4300 6500 4300
Wire Wire Line
	5650 3800 6500 3800
Wire Wire Line
	5650 3600 6500 3600
Text Label 5850 4400 0    50   ~ 0
LNA_BIAS1
Text Label 5850 4000 0    50   ~ 0
LNA_BIAS0
Wire Wire Line
	2500 4100 3350 4100
Wire Wire Line
	6250 3200 5650 3200
Text Label 5850 3300 0    50   ~ 0
LNA_BIAS3
Text Label 5850 3500 0    50   ~ 0
LNA_BIAS2
Wire Wire Line
	2500 4000 3350 4000
Wire Wire Line
	2500 3800 3350 3800
Wire Wire Line
	6500 4200 5650 4200
Wire Wire Line
	5650 3400 6250 3400
Text Label 5850 3000 0    50   ~ 0
~CONFIG
Text Label 5850 3700 0    50   ~ 0
CRC_ERROR
Text Label 5850 3900 0    50   ~ 0
~STATUS
Text Label 5850 4100 0    50   ~ 0
CONF_DONE
Text Label 3150 4300 2    50   ~ 0
CONFIG_SEL
Text Label 3150 3900 2    50   ~ 0
DEV_OE
Text Label 3150 3700 2    50   ~ 0
~DEV_CLR
Wire Wire Line
	1350 3700 3350 3700
Wire Wire Line
	5650 4100 8250 4100
Wire Wire Line
	5650 3700 7300 3700
$Comp
L power:+2V5 #PWR?
U 1 1 605B6F65
P 4500 1550
AR Path="/605746B5/5F8E5420/5F955280/605B6F65" Ref="#PWR?"  Part="1" 
AR Path="/605746B5/5F8E5420/5F9D23DE/605B6F65" Ref="#PWR?"  Part="1" 
F 0 "#PWR?" H 4500 1400 50  0001 C CNN
F 1 "+2V5" H 4500 1690 50  0000 C CNN
F 2 "" H 4500 1550 50  0001 C CNN
F 3 "" H 4500 1550 50  0001 C CNN
	1    4500 1550
	1    0    0    -1  
$EndComp
Wire Wire Line
	4500 1550 4500 1650
$Comp
L Device:R R2906
U 1 1 605CE627
P 8250 3750
F 0 "R2906" H 8320 3796 50  0000 L CNN
F 1 "10k" H 8320 3705 50  0000 L CNN
F 2 "Resistor_SMD:R_0402_1005Metric" V 8180 3750 50  0001 C CNN
F 3 "~" H 8250 3750 50  0001 C CNN
F 4 "3000-0000000131" H 8250 3750 50  0001 C CNN "PartSpecification"
	1    8250 3750
	1    0    0    -1  
$EndComp
$Comp
L power:+2V5 #PWR?
U 1 1 605D7CFE
P 8250 3500
AR Path="/605746B5/5F8E5420/5F955280/605D7CFE" Ref="#PWR?"  Part="1" 
AR Path="/605746B5/5F8E5420/5F9D23DE/605D7CFE" Ref="#PWR?"  Part="1" 
F 0 "#PWR?" H 8250 3350 50  0001 C CNN
F 1 "+2V5" H 8250 3640 50  0000 C CNN
F 2 "" H 8250 3500 50  0001 C CNN
F 3 "" H 8250 3500 50  0001 C CNN
	1    8250 3500
	1    0    0    -1  
$EndComp
Wire Wire Line
	8250 3500 8250 3600
$Comp
L Device:R R2904
U 1 1 605DE1AF
P 8000 3500
F 0 "R2904" H 8070 3546 50  0000 L CNN
F 1 "10k" H 8070 3455 50  0000 L CNN
F 2 "Resistor_SMD:R_0402_1005Metric" V 7930 3500 50  0001 C CNN
F 3 "~" H 8000 3500 50  0001 C CNN
F 4 "3000-0000000131" H 8000 3500 50  0001 C CNN "PartSpecification"
	1    8000 3500
	1    0    0    -1  
$EndComp
$Comp
L power:+2V5 #PWR?
U 1 1 605DE1B5
P 8000 3250
AR Path="/605746B5/5F8E5420/5F955280/605DE1B5" Ref="#PWR?"  Part="1" 
AR Path="/605746B5/5F8E5420/5F9D23DE/605DE1B5" Ref="#PWR?"  Part="1" 
F 0 "#PWR?" H 8000 3100 50  0001 C CNN
F 1 "+2V5" H 8000 3390 50  0000 C CNN
F 2 "" H 8000 3250 50  0001 C CNN
F 3 "" H 8000 3250 50  0001 C CNN
	1    8000 3250
	1    0    0    -1  
$EndComp
Wire Wire Line
	8000 3250 8000 3350
Wire Wire Line
	8000 3650 8000 3900
$Comp
L Device:R R2903
U 1 1 605EA589
P 7500 3250
F 0 "R2903" H 7570 3296 50  0000 L CNN
F 1 "10k" H 7570 3205 50  0000 L CNN
F 2 "Resistor_SMD:R_0402_1005Metric" V 7430 3250 50  0001 C CNN
F 3 "~" H 7500 3250 50  0001 C CNN
F 4 "3000-0000000131" H 7500 3250 50  0001 C CNN "PartSpecification"
	1    7500 3250
	1    0    0    -1  
$EndComp
$Comp
L power:+2V5 #PWR?
U 1 1 605EA58F
P 7500 3000
AR Path="/605746B5/5F8E5420/5F955280/605EA58F" Ref="#PWR?"  Part="1" 
AR Path="/605746B5/5F8E5420/5F9D23DE/605EA58F" Ref="#PWR?"  Part="1" 
F 0 "#PWR?" H 7500 2850 50  0001 C CNN
F 1 "+2V5" H 7500 3140 50  0000 C CNN
F 2 "" H 7500 3000 50  0001 C CNN
F 3 "" H 7500 3000 50  0001 C CNN
	1    7500 3000
	1    0    0    -1  
$EndComp
Wire Wire Line
	7500 3000 7500 3100
$Comp
L Device:R R2905
U 1 1 605FE183
P 1000 3650
F 0 "R2905" H 1070 3696 50  0000 L CNN
F 1 "10k" H 1070 3605 50  0000 L CNN
F 2 "Resistor_SMD:R_0402_1005Metric" V 930 3650 50  0001 C CNN
F 3 "~" H 1000 3650 50  0001 C CNN
F 4 "3000-0000000131" H 1000 3650 50  0001 C CNN "PartSpecification"
	1    1000 3650
	1    0    0    -1  
$EndComp
$Comp
L power:+2V5 #PWR?
U 1 1 605FE189
P 1000 3400
AR Path="/605746B5/5F8E5420/5F955280/605FE189" Ref="#PWR?"  Part="1" 
AR Path="/605746B5/5F8E5420/5F9D23DE/605FE189" Ref="#PWR?"  Part="1" 
F 0 "#PWR?" H 1000 3250 50  0001 C CNN
F 1 "+2V5" H 1000 3540 50  0000 C CNN
F 2 "" H 1000 3400 50  0001 C CNN
F 3 "" H 1000 3400 50  0001 C CNN
	1    1000 3400
	1    0    0    -1  
$EndComp
Wire Wire Line
	1000 3400 1000 3500
$Comp
L Device:R R2902
U 1 1 60603922
P 1350 3250
F 0 "R2902" H 1420 3296 50  0000 L CNN
F 1 "10k" H 1420 3205 50  0000 L CNN
F 2 "Resistor_SMD:R_0402_1005Metric" V 1280 3250 50  0001 C CNN
F 3 "~" H 1350 3250 50  0001 C CNN
F 4 "3000-0000000131" H 1350 3250 50  0001 C CNN "PartSpecification"
	1    1350 3250
	1    0    0    -1  
$EndComp
$Comp
L power:+2V5 #PWR?
U 1 1 60603928
P 1350 3000
AR Path="/605746B5/5F8E5420/5F955280/60603928" Ref="#PWR?"  Part="1" 
AR Path="/605746B5/5F8E5420/5F9D23DE/60603928" Ref="#PWR?"  Part="1" 
F 0 "#PWR?" H 1350 2850 50  0001 C CNN
F 1 "+2V5" H 1350 3140 50  0000 C CNN
F 2 "" H 1350 3000 50  0001 C CNN
F 3 "" H 1350 3000 50  0001 C CNN
	1    1350 3000
	1    0    0    -1  
$EndComp
Wire Wire Line
	1350 3000 1350 3100
Wire Wire Line
	1000 3900 1000 3800
Wire Wire Line
	1000 3900 3350 3900
$Comp
L Device:R R2907
U 1 1 60611391
P 1000 4500
F 0 "R2907" H 1070 4546 50  0000 L CNN
F 1 "10k" H 1070 4455 50  0000 L CNN
F 2 "Resistor_SMD:R_0402_1005Metric" V 930 4500 50  0001 C CNN
F 3 "~" H 1000 4500 50  0001 C CNN
F 4 "3000-0000000131" H 1000 4500 50  0001 C CNN "PartSpecification"
	1    1000 4500
	1    0    0    -1  
$EndComp
Wire Wire Line
	1000 4350 1000 4300
$Comp
L power:GND #PWR?
U 1 1 60616633
P 1000 4750
AR Path="/5F8E5420/5F971A6D/60616633" Ref="#PWR?"  Part="1" 
AR Path="/5F8E5420/5F9D23DE/60616633" Ref="#PWR?"  Part="1" 
AR Path="/605746B5/5F8E5420/5F9D23DE/60616633" Ref="#PWR?"  Part="1" 
F 0 "#PWR?" H 1000 4500 50  0001 C CNN
F 1 "GND" H 1000 4600 50  0000 C CNN
F 2 "" H 1000 4750 50  0001 C CNN
F 3 "" H 1000 4750 50  0001 C CNN
	1    1000 4750
	1    0    0    -1  
$EndComp
Wire Wire Line
	1000 4750 1000 4650
Wire Wire Line
	1000 4300 1100 4300
$Comp
L Device:R R2901
U 1 1 60623795
P 6500 2750
F 0 "R2901" H 6570 2796 50  0000 L CNN
F 1 "10k" H 6570 2705 50  0000 L CNN
F 2 "Resistor_SMD:R_0402_1005Metric" V 6430 2750 50  0001 C CNN
F 3 "~" H 6500 2750 50  0001 C CNN
F 4 "3000-0000000131" H 6500 2750 50  0001 C CNN "PartSpecification"
	1    6500 2750
	1    0    0    -1  
$EndComp
$Comp
L power:+2V5 #PWR?
U 1 1 6062379B
P 6500 2500
AR Path="/605746B5/5F8E5420/5F955280/6062379B" Ref="#PWR?"  Part="1" 
AR Path="/605746B5/5F8E5420/5F9D23DE/6062379B" Ref="#PWR?"  Part="1" 
F 0 "#PWR?" H 6500 2350 50  0001 C CNN
F 1 "+2V5" H 6500 2640 50  0000 C CNN
F 2 "" H 6500 2500 50  0001 C CNN
F 3 "" H 6500 2500 50  0001 C CNN
	1    6500 2500
	1    0    0    -1  
$EndComp
Wire Wire Line
	6500 2500 6500 2600
Wire Wire Line
	6500 2900 6500 3000
Wire Wire Line
	5650 3000 6500 3000
Text HLabel 2500 4000 0    50   Output ~ 0
TDD_CTRL
Text HLabel 2500 3800 0    50   Output ~ 0
TDD_ENABLE
Text HLabel 6500 4200 2    50   Output ~ 0
LNA_REG_EN
Text HLabel 6500 4300 2    50   Output ~ 0
LNA_REG_VSEL_1
Text HLabel 2500 4500 0    50   Output ~ 0
LNA_REG_VSEL_2
Text HLabel 6250 3400 2    50   Output ~ 0
LNA_REG_PS_SYNC
Text HLabel 2500 4100 0    50   Input ~ 0
LNA_REG_DCDC_PG
Text HLabel 6250 3200 2    50   Input ~ 0
LNA_REG_LDO_PG
Text HLabel 7500 2500 2    50   Output ~ 0
LNA_BIAS[0..3]
Text HLabel 6500 3600 2    50   Output ~ 0
BP_RX_CTRL_1
Text HLabel 6500 3800 2    50   Output ~ 0
BP_RX_CTRL_2
Text HLabel 6250 3100 2    50   Output ~ 0
BP_RX_ENABLE
Wire Wire Line
	1350 3400 1350 3700
Wire Wire Line
	7500 3400 7500 3700
Wire Wire Line
	8250 3900 8250 4100
Wire Bus Line
	7500 2500 7250 2500
Wire Wire Line
	5650 3500 7150 3500
Wire Wire Line
	5650 4400 7150 4400
Wire Wire Line
	5650 4000 7150 4000
Entry Wire Line
	7250 3400 7150 3500
Entry Wire Line
	7250 4300 7150 4400
Entry Wire Line
	7250 3900 7150 4000
NoConn ~ 3350 3300
NoConn ~ 3350 4200
NoConn ~ 3350 4400
$Comp
L Switch:SW_Push SW?
U 1 1 614E3823
P 2500 5750
AR Path="/5D69D382/614E3823" Ref="SW?"  Part="1" 
AR Path="/5D67C7FD/614E3823" Ref="SW?"  Part="1" 
AR Path="/60834A7B/6083FA27/614E3823" Ref="SW?"  Part="1" 
AR Path="/605746B5/5F8E5420/5F9D23DE/614E3823" Ref="SW2901"  Part="1" 
F 0 "SW2901" V 2454 5898 50  0000 L CNN
F 1 "SW_Push" V 2545 5898 50  0000 L CNN
F 2 "Button_Switch_SMD:SW_SPST_PTS645" H 2500 5950 50  0001 C CNN
F 3 "" H 2500 5950 50  0001 C CNN
F 4 "C&K" H 2500 5750 50  0001 C CNN "Manufacturer"
F 5 "PTS645SK43SMTR92 LFS" H 2500 5750 50  0001 C CNN "PartNumber"
F 6 "3000-0000000176" H 2500 5750 50  0001 C CNN "PartSpecification"
	1    2500 5750
	0    1    1    0   
$EndComp
$Comp
L Switch:SW_Push SW?
U 1 1 614E382C
P 3000 5750
AR Path="/5D69D382/614E382C" Ref="SW?"  Part="1" 
AR Path="/5D67C7FD/614E382C" Ref="SW?"  Part="1" 
AR Path="/60834A7B/6083FA27/614E382C" Ref="SW?"  Part="1" 
AR Path="/605746B5/5F8E5420/5F9D23DE/614E382C" Ref="SW2902"  Part="1" 
F 0 "SW2902" V 2954 5898 50  0000 L CNN
F 1 "SW_Push" V 3045 5898 50  0000 L CNN
F 2 "Button_Switch_SMD:SW_SPST_PTS645" H 3000 5950 50  0001 C CNN
F 3 "" H 3000 5950 50  0001 C CNN
F 4 "C&K" H 3000 5750 50  0001 C CNN "Manufacturer"
F 5 "PTS645SK43SMTR92 LFS" H 3000 5750 50  0001 C CNN "PartNumber"
F 6 "3000-0000000176" H 3000 5750 50  0001 C CNN "PartSpecification"
	1    3000 5750
	0    1    1    0   
$EndComp
$Comp
L Device:R R?
U 1 1 614E3835
P 3000 6300
AR Path="/5D69D382/614E3835" Ref="R?"  Part="1" 
AR Path="/5D67C7FD/614E3835" Ref="R?"  Part="1" 
AR Path="/60834A7B/6083FA27/614E3835" Ref="R?"  Part="1" 
AR Path="/605746B5/5F8E5420/5F9D23DE/614E3835" Ref="R2911"  Part="1" 
F 0 "R2911" H 3070 6346 50  0000 L CNN
F 1 "10k" H 3070 6255 50  0000 L CNN
F 2 "Resistor_SMD:R_0402_1005Metric" V 2930 6300 50  0001 C CNN
F 3 "~" H 3000 6300 50  0001 C CNN
F 4 "Delta Electronics/Cyntec" H 3000 6300 50  0001 C CNN "Manufacturer"
F 5 "PFR05S-103-FNH" H 3000 6300 50  0001 C CNN "PartNumber"
F 6 "3000-0000000131" H 3000 6300 50  0001 C CNN "PartSpecification"
	1    3000 6300
	1    0    0    -1  
$EndComp
$Comp
L Device:R R?
U 1 1 614E383E
P 2500 6300
AR Path="/5D69D382/614E383E" Ref="R?"  Part="1" 
AR Path="/5D67C7FD/614E383E" Ref="R?"  Part="1" 
AR Path="/60834A7B/6083FA27/614E383E" Ref="R?"  Part="1" 
AR Path="/605746B5/5F8E5420/5F9D23DE/614E383E" Ref="R2910"  Part="1" 
F 0 "R2910" H 2570 6346 50  0000 L CNN
F 1 "10k" H 2570 6255 50  0000 L CNN
F 2 "Resistor_SMD:R_0402_1005Metric" V 2430 6300 50  0001 C CNN
F 3 "~" H 2500 6300 50  0001 C CNN
F 4 "Delta Electronics/Cyntec" H 2500 6300 50  0001 C CNN "Manufacturer"
F 5 "PFR05S-103-FNH" H 2500 6300 50  0001 C CNN "PartNumber"
F 6 "3000-0000000131" H 2500 6300 50  0001 C CNN "PartSpecification"
	1    2500 6300
	1    0    0    -1  
$EndComp
Wire Wire Line
	2500 5950 2500 6150
Wire Wire Line
	3000 6150 3000 5950
$Comp
L power:GND #PWR?
U 1 1 614E3846
P 3000 6550
AR Path="/60834A7B/6083FA27/614E3846" Ref="#PWR?"  Part="1" 
AR Path="/605746B5/5F8E5420/5F9D23DE/614E3846" Ref="#PWR?"  Part="1" 
F 0 "#PWR?" H 3000 6300 50  0001 C CNN
F 1 "GND" H 3005 6377 50  0000 C CNN
F 2 "" H 3000 6550 50  0001 C CNN
F 3 "" H 3000 6550 50  0001 C CNN
	1    3000 6550
	1    0    0    -1  
$EndComp
Wire Wire Line
	3000 6550 3000 6500
Wire Wire Line
	3000 5500 3000 5550
Wire Wire Line
	2500 5550 2500 5500
Wire Wire Line
	2500 5500 2750 5500
Wire Wire Line
	2500 6450 2500 6500
Wire Wire Line
	2500 6500 3000 6500
Connection ~ 3000 6500
Wire Wire Line
	3000 6500 3000 6450
Text Label 2500 6100 0    50   ~ 0
PB4_
Text Label 3000 6100 0    50   ~ 0
PB5_
$Comp
L power:+2V5 #PWR?
U 1 1 614E4F9C
P 2750 5400
AR Path="/605746B5/5F8E5420/5F955280/614E4F9C" Ref="#PWR?"  Part="1" 
AR Path="/605746B5/5F8E5420/5F9D23DE/614E4F9C" Ref="#PWR?"  Part="1" 
F 0 "#PWR?" H 2750 5250 50  0001 C CNN
F 1 "+2V5" H 2750 5540 50  0000 C CNN
F 2 "" H 2750 5400 50  0001 C CNN
F 3 "" H 2750 5400 50  0001 C CNN
	1    2750 5400
	1    0    0    -1  
$EndComp
Wire Wire Line
	2750 5400 2750 5500
Connection ~ 2750 5500
Wire Wire Line
	2750 5500 3000 5500
$Comp
L Device:R R?
U 1 1 614F50E9
P 2850 3400
AR Path="/5D69D382/614F50E9" Ref="R?"  Part="1" 
AR Path="/5D67C7FD/614F50E9" Ref="R?"  Part="1" 
AR Path="/60834A7B/6083FA27/614F50E9" Ref="R?"  Part="1" 
AR Path="/605746B5/5F8E5420/5F9D23DE/614F50E9" Ref="R2909"  Part="1" 
F 0 "R2909" V 2643 3400 50  0000 C CNN
F 1 "10" V 2734 3400 50  0000 C CNN
F 2 "Resistor_SMD:R_0402_1005Metric" V 2780 3400 50  0001 C CNN
F 3 "~" H 2850 3400 50  0001 C CNN
F 4 "Delta Electronics/Cyntec" H 2850 3400 50  0001 C CNN "Manufacturer"
F 5 "PFR05S-100-FNH" H 2850 3400 50  0001 C CNN "PartNumber"
F 6 "3000-0000000146" H 2850 3400 50  0001 C CNN "PartSpecification"
	1    2850 3400
	0    1    1    0   
$EndComp
$Comp
L Device:R R?
U 1 1 614F50F2
P 2550 3200
AR Path="/5D69D382/614F50F2" Ref="R?"  Part="1" 
AR Path="/5D67C7FD/614F50F2" Ref="R?"  Part="1" 
AR Path="/60834A7B/6083FA27/614F50F2" Ref="R?"  Part="1" 
AR Path="/605746B5/5F8E5420/5F9D23DE/614F50F2" Ref="R2908"  Part="1" 
F 0 "R2908" V 2343 3200 50  0000 C CNN
F 1 "10" V 2434 3200 50  0000 C CNN
F 2 "Resistor_SMD:R_0402_1005Metric" V 2480 3200 50  0001 C CNN
F 3 "~" H 2550 3200 50  0001 C CNN
F 4 "Delta Electronics/Cyntec" H 2550 3200 50  0001 C CNN "Manufacturer"
F 5 "PFR05S-100-FNH" H 2550 3200 50  0001 C CNN "PartNumber"
F 6 "3000-0000000146" H 2550 3200 50  0001 C CNN "PartSpecification"
	1    2550 3200
	0    1    1    0   
$EndComp
Wire Wire Line
	3000 3400 3350 3400
Wire Wire Line
	3350 3200 2700 3200
Text Label 3050 3200 0    50   ~ 0
PB4
Text Label 3050 3400 0    50   ~ 0
PB5
Wire Wire Line
	2200 3200 2400 3200
Wire Wire Line
	2200 3400 2700 3400
Text Label 2200 3200 0    50   ~ 0
PB4_
Text Label 2200 3400 0    50   ~ 0
PB5_
Text HLabel 2500 3500 0    50   Output ~ 0
A_5VA_EN
Text HLabel 2500 3600 0    50   Input ~ 0
A_5VA_PG
Wire Wire Line
	3350 3600 2500 3600
Wire Wire Line
	2500 3500 3350 3500
NoConn ~ 3350 3100
NoConn ~ 3350 3000
NoConn ~ 3350 2900
Text HLabel 1000 4200 0    50   Input ~ 0
CONFIG_SEL
Wire Wire Line
	1000 4200 1100 4200
Wire Wire Line
	1100 4200 1100 4300
Connection ~ 1100 4300
Wire Wire Line
	1100 4300 3350 4300
Text HLabel 8400 4100 2    50   Output ~ 0
CONF_DONE
Wire Wire Line
	8400 4100 8250 4100
Connection ~ 8250 4100
Text HLabel 7500 4000 2    50   Output ~ 0
~STATUS
Wire Wire Line
	7500 4000 7400 4000
Wire Wire Line
	7400 4000 7400 3900
Connection ~ 7400 3900
Wire Wire Line
	7400 3900 8000 3900
Text HLabel 7400 3800 2    50   Output ~ 0
CRC_ERROR
Wire Wire Line
	7400 3800 7300 3800
Wire Wire Line
	7300 3800 7300 3700
Connection ~ 7300 3700
Wire Wire Line
	7300 3700 7500 3700
Wire Wire Line
	7150 3900 7150 3850
Wire Wire Line
	7150 3850 7350 3850
Wire Wire Line
	7350 3850 7350 3900
Wire Wire Line
	5650 3900 7150 3900
Wire Wire Line
	7350 3900 7400 3900
Entry Wire Line
	7250 3200 7150 3300
Wire Wire Line
	5650 3300 7150 3300
Wire Bus Line
	7250 2500 7250 4300
$EndSCHEMATC
