EESchema Schematic File Version 4
LIBS:fdd_frontend_ue-cache
EELAYER 30 0
EELAYER END
$Descr A4 11693 8268
encoding utf-8
Sheet 1 7
Title ""
Date ""
Rev ""
Comp ""
Comment1 ""
Comment2 ""
Comment3 ""
Comment4 ""
$EndDescr
$Comp
L POWDER_RF:Qorvo_QPQ1270 U102
U 1 1 5D1C07D9
P 6200 4800
F 0 "U102" H 6350 5050 50  0000 L CNN
F 1 "Qorvo_QPQ1270" H 5500 5050 50  0000 L CNN
F 2 "POWDER_RF:Qorvo_SMP" H 6750 4400 50  0001 C CNN
F 3 "" H 6200 4800 50  0001 C CNN
F 4 "Qorvo" H 6200 4800 50  0001 C CNN "Manufacturer"
F 5 "QPQ1270TR7 " H 6200 4800 50  0001 C CNN "PartNumber"
	1    6200 4800
	1    0    0    -1  
$EndComp
$Comp
L POWDER_RF:MAAL-011078 U101
U 1 1 5D1C10C8
P 3500 4800
F 0 "U101" H 3250 5300 50  0000 R CNN
F 1 "MAAL-011078" H 3050 4300 50  0000 R CNN
F 2 "Package_DFN_QFN:DFN-8-1EP_2x2mm_P0.5mm_EP1.05x1.75mm" H 3500 4800 50  0001 C CNN
F 3 "" H 3500 4800 50  0001 C CNN
F 4 "M/A-Com Technology Solutions" H 3500 4800 50  0001 C CNN "Manufacturer"
F 5 "MAAL-011078-TR1000" H 3500 4800 50  0001 C CNN "PartNumber"
	1    3500 4800
	-1   0    0    -1  
$EndComp
$Comp
L POWDER_RF:SKY66297-11 U103
U 1 1 5D1C1FA2
P 8000 4800
F 0 "U103" H 7500 5400 50  0000 R CNN
F 1 "SKY66297-11" H 7500 4300 50  0000 R CNN
F 2 "POWDER_RF:SKY66288-11" H 8000 3900 50  0001 C CNN
F 3 "" H 7900 4800 50  0001 C CNN
F 4 "Skyworks Solutions Inc." H 8000 4800 50  0001 C CNN "Manufacturer"
F 5 "SKY66297-11" H 8000 4800 50  0001 C CNN "PartNumber"
	1    8000 4800
	-1   0    0    -1  
$EndComp
$Comp
L Device:C C115
U 1 1 5D1C6728
P 5600 5050
F 0 "C115" H 5715 5096 50  0000 L CNN
F 1 "DNP" H 5715 5005 50  0000 L CNN
F 2 "Capacitor_SMD:C_0201_0603Metric" H 5638 4900 50  0001 C CNN
F 3 "~" H 5600 5050 50  0001 C CNN
	1    5600 5050
	1    0    0    -1  
$EndComp
$Comp
L Device:L L105
U 1 1 5D1C6D25
P 5350 4800
F 0 "L105" V 5540 4800 50  0000 C CNN
F 1 "0 ohm" V 5449 4800 50  0000 C CNN
F 2 "Inductor_SMD:L_0201_0603Metric" H 5350 4800 50  0001 C CNN
F 3 "~" H 5350 4800 50  0001 C CNN
F 4 "Delta Electronics/Cyntec" H 5350 4800 50  0001 C CNN "Manufacturer"
F 5 "PFR03S-000-XNH" H 5350 4800 50  0001 C CNN "PartNumber"
	1    5350 4800
	0    -1   -1   0   
$EndComp
$Comp
L Device:L L104
U 1 1 5D1C7FC6
P 4850 4800
F 0 "L104" V 5040 4800 50  0000 C CNN
F 1 "10pF" V 4949 4800 50  0000 C CNN
F 2 "Inductor_SMD:L_0201_0603Metric" H 4850 4800 50  0001 C CNN
F 3 "~" H 4850 4800 50  0001 C CNN
F 4 "Murata Electronics" H 4850 4800 50  0001 C CNN "Manufacturer"
F 5 "GJM0336C1E100GB01D" H 4850 4800 50  0001 C CNN "PartNumber"
	1    4850 4800
	0    -1   -1   0   
$EndComp
$Comp
L Device:C C114
U 1 1 5D1C9DB9
P 5100 5050
F 0 "C114" H 5215 5096 50  0000 L CNN
F 1 "DNP" H 5215 5005 50  0000 L CNN
F 2 "Capacitor_SMD:C_0201_0603Metric" H 5138 4900 50  0001 C CNN
F 3 "~" H 5100 5050 50  0001 C CNN
	1    5100 5050
	1    0    0    -1  
$EndComp
$Comp
L Device:C C112
U 1 1 5D1CC977
P 4600 5050
F 0 "C112" H 4715 5096 50  0000 L CNN
F 1 "0.6pF" H 4715 5005 50  0000 L CNN
F 2 "Capacitor_SMD:C_0201_0603Metric" H 4638 4900 50  0001 C CNN
F 3 "~" H 4600 5050 50  0001 C CNN
F 4 "Murata Electronics" H 4600 5050 50  0001 C CNN "Manufacturer"
F 5 "GJM0335C1HR60WB01D" H 4600 5050 50  0001 C CNN "PartNumber"
	1    4600 5050
	1    0    0    -1  
$EndComp
$Comp
L power:GND #PWR?
U 1 1 5D1CD94B
P 5950 5300
F 0 "#PWR?" H 5950 5050 50  0001 C CNN
F 1 "GND" H 5955 5127 50  0000 C CNN
F 2 "" H 5950 5300 50  0001 C CNN
F 3 "" H 5950 5300 50  0001 C CNN
	1    5950 5300
	1    0    0    -1  
$EndComp
$Comp
L Device:C C111
U 1 1 5D1CEDD7
P 4350 4800
F 0 "C111" V 4098 4800 50  0000 C CNN
F 1 "2.4nH" V 4189 4800 50  0000 C CNN
F 2 "Capacitor_SMD:C_0201_0603Metric" H 4388 4650 50  0001 C CNN
F 3 "~" H 4350 4800 50  0001 C CNN
F 4 "Murata Electronics" H 4350 4800 50  0001 C CNN "Manufacturer"
F 5 "LQP03HQ2N4B02D" H 4350 4800 50  0001 C CNN "PartNumber"
	1    4350 4800
	0    1    1    0   
$EndComp
$Comp
L power:GND #PWR?
U 1 1 5D1D0916
P 5600 5300
F 0 "#PWR?" H 5600 5050 50  0001 C CNN
F 1 "GND" H 5605 5127 50  0000 C CNN
F 2 "" H 5600 5300 50  0001 C CNN
F 3 "" H 5600 5300 50  0001 C CNN
	1    5600 5300
	1    0    0    -1  
$EndComp
Wire Wire Line
	5600 5300 5600 5200
$Comp
L power:GND #PWR?
U 1 1 5D1D0EB8
P 5100 5300
F 0 "#PWR?" H 5100 5050 50  0001 C CNN
F 1 "GND" H 5105 5127 50  0000 C CNN
F 2 "" H 5100 5300 50  0001 C CNN
F 3 "" H 5100 5300 50  0001 C CNN
	1    5100 5300
	1    0    0    -1  
$EndComp
$Comp
L power:GND #PWR?
U 1 1 5D1D13D9
P 4600 5300
F 0 "#PWR?" H 4600 5050 50  0001 C CNN
F 1 "GND" H 4605 5127 50  0000 C CNN
F 2 "" H 4600 5300 50  0001 C CNN
F 3 "" H 4600 5300 50  0001 C CNN
	1    4600 5300
	1    0    0    -1  
$EndComp
Wire Wire Line
	4600 5300 4600 5200
Wire Wire Line
	4200 4800 4100 4800
Wire Wire Line
	4500 4800 4600 4800
Wire Wire Line
	4600 4900 4600 4800
Connection ~ 4600 4800
Wire Wire Line
	4600 4800 4700 4800
Wire Wire Line
	5000 4800 5100 4800
Wire Wire Line
	5100 4800 5100 4900
Connection ~ 5100 4800
Wire Wire Line
	5100 4800 5200 4800
Wire Wire Line
	5100 5200 5100 5300
Wire Wire Line
	5500 4800 5600 4800
Wire Wire Line
	5600 4800 5600 4900
Connection ~ 5600 4800
Wire Wire Line
	5600 4800 5800 4800
Wire Wire Line
	5950 5150 5950 5300
$Comp
L power:GND #PWR?
U 1 1 5D1D3E09
P 6050 5300
F 0 "#PWR?" H 6050 5050 50  0001 C CNN
F 1 "GND" H 6055 5127 50  0000 C CNN
F 2 "" H 6050 5300 50  0001 C CNN
F 3 "" H 6050 5300 50  0001 C CNN
	1    6050 5300
	1    0    0    -1  
$EndComp
Wire Wire Line
	6050 5150 6050 5300
$Comp
L power:GND #PWR?
U 1 1 5D1D3F95
P 6150 5300
F 0 "#PWR?" H 6150 5050 50  0001 C CNN
F 1 "GND" H 6155 5127 50  0000 C CNN
F 2 "" H 6150 5300 50  0001 C CNN
F 3 "" H 6150 5300 50  0001 C CNN
	1    6150 5300
	1    0    0    -1  
$EndComp
Wire Wire Line
	6150 5150 6150 5300
$Comp
L power:GND #PWR?
U 1 1 5D1D41E3
P 6250 5300
F 0 "#PWR?" H 6250 5050 50  0001 C CNN
F 1 "GND" H 6255 5127 50  0000 C CNN
F 2 "" H 6250 5300 50  0001 C CNN
F 3 "" H 6250 5300 50  0001 C CNN
	1    6250 5300
	1    0    0    -1  
$EndComp
Wire Wire Line
	6250 5150 6250 5300
$Comp
L power:GND #PWR?
U 1 1 5D1D4556
P 6350 5300
F 0 "#PWR?" H 6350 5050 50  0001 C CNN
F 1 "GND" H 6355 5127 50  0000 C CNN
F 2 "" H 6350 5300 50  0001 C CNN
F 3 "" H 6350 5300 50  0001 C CNN
	1    6350 5300
	1    0    0    -1  
$EndComp
Wire Wire Line
	6350 5150 6350 5300
$Comp
L power:GND #PWR?
U 1 1 5D1D4955
P 6450 5300
F 0 "#PWR?" H 6450 5050 50  0001 C CNN
F 1 "GND" H 6455 5127 50  0000 C CNN
F 2 "" H 6450 5300 50  0001 C CNN
F 3 "" H 6450 5300 50  0001 C CNN
	1    6450 5300
	1    0    0    -1  
$EndComp
Wire Wire Line
	6450 5150 6450 5300
$Comp
L power:GND #PWR?
U 1 1 5D1D60A5
P 3600 5250
F 0 "#PWR?" H 3600 5000 50  0001 C CNN
F 1 "GND" H 3605 5077 50  0000 C CNN
F 2 "" H 3600 5250 50  0001 C CNN
F 3 "" H 3600 5250 50  0001 C CNN
	1    3600 5250
	1    0    0    -1  
$EndComp
Wire Wire Line
	3600 5150 3600 5250
$Comp
L 000_PreferredParts:C_0_1uF C109
U 1 1 5D1D7C2E
P 3950 3600
F 0 "C109" H 4065 3646 50  0000 L CNN
F 1 "C_0_1uF" H 4065 3555 50  0000 L CNN
F 2 "Capacitor_SMD:C_0402_1005Metric" H 3988 3450 50  0001 C CNN
F 3 "~" H 3950 3600 50  0001 C CNN
F 4 "Murata Electronics" H 3950 3600 50  0001 C CNN "Manufacturer"
F 5 "GRM155R62A104KE14D" H 3950 3600 50  0001 C CNN "PartNumber"
	1    3950 3600
	1    0    0    -1  
$EndComp
$Comp
L power:GND #PWR?
U 1 1 5D1DA354
P 3950 3900
F 0 "#PWR?" H 3950 3650 50  0001 C CNN
F 1 "GND" H 3955 3727 50  0000 C CNN
F 2 "" H 3950 3900 50  0001 C CNN
F 3 "" H 3950 3900 50  0001 C CNN
	1    3950 3900
	1    0    0    -1  
$EndComp
Wire Wire Line
	3950 3750 3950 3900
$Comp
L power:GND #PWR?
U 1 1 5D1DA9B3
P 4500 3900
F 0 "#PWR?" H 4500 3650 50  0001 C CNN
F 1 "GND" H 4505 3727 50  0000 C CNN
F 2 "" H 4500 3900 50  0001 C CNN
F 3 "" H 4500 3900 50  0001 C CNN
	1    4500 3900
	1    0    0    -1  
$EndComp
Wire Wire Line
	4500 3750 4500 3900
Wire Wire Line
	3950 3450 3950 3300
Wire Wire Line
	3950 3300 4500 3300
Wire Wire Line
	4500 3300 4500 3450
Wire Wire Line
	3600 3300 3950 3300
Connection ~ 3950 3300
$Comp
L 000_PreferredParts:C_10pF C113
U 1 1 5D1E094E
P 4950 3600
F 0 "C113" H 5065 3646 50  0000 L CNN
F 1 "C_10pF" H 5065 3555 50  0000 L CNN
F 2 "Capacitor_SMD:C_0402_1005Metric" H 4988 3450 50  0001 C CNN
F 3 "~" H 4950 3600 50  0001 C CNN
F 4 "Murata Electronics" H 4950 3600 50  0001 C CNN "Manufacturer"
F 5 "GJM0336C1E100GB01D" H 4950 3600 50  0001 C CNN "PartNumber"
	1    4950 3600
	1    0    0    -1  
$EndComp
$Comp
L power:GND #PWR?
U 1 1 5D1E0958
P 4950 3900
F 0 "#PWR?" H 4950 3650 50  0001 C CNN
F 1 "GND" H 4955 3727 50  0000 C CNN
F 2 "" H 4950 3900 50  0001 C CNN
F 3 "" H 4950 3900 50  0001 C CNN
	1    4950 3900
	1    0    0    -1  
$EndComp
Wire Wire Line
	4950 3750 4950 3900
Wire Wire Line
	4950 3300 4950 3450
Wire Wire Line
	4950 3300 4500 3300
Connection ~ 4500 3300
$Comp
L Device:R R102
U 1 1 5D1E4616
P 3600 4150
F 0 "R102" H 3670 4196 50  0000 L CNN
F 1 "100" H 3670 4105 50  0000 L CNN
F 2 "Resistor_SMD:R_0402_1005Metric" V 3530 4150 50  0001 C CNN
F 3 "~" H 3600 4150 50  0001 C CNN
F 4 "Delta Electronics/Cyntec" H 3600 4150 50  0001 C CNN "Manufacturer"
F 5 "PFR05S-101-FNH" H 3600 4150 50  0001 C CNN "PartNumber"
	1    3600 4150
	1    0    0    -1  
$EndComp
Wire Wire Line
	3600 4450 3600 4400
Wire Wire Line
	3600 4000 3600 3300
$Comp
L 000_PreferredParts:C_0_1uF C102
U 1 1 5D1E6ED6
P 1500 3600
F 0 "C102" H 1615 3646 50  0000 L CNN
F 1 "C_0_1uF" H 1615 3555 50  0000 L CNN
F 2 "Capacitor_SMD:C_0402_1005Metric" H 1538 3450 50  0001 C CNN
F 3 "~" H 1500 3600 50  0001 C CNN
F 4 "Murata Electronics" H 1500 3600 50  0001 C CNN "Manufacturer"
F 5 "GRM155R62A104KE14D" H 1500 3600 50  0001 C CNN "PartNumber"
	1    1500 3600
	1    0    0    -1  
$EndComp
$Comp
L power:GND #PWR?
U 1 1 5D1E6EEA
P 1500 3900
F 0 "#PWR?" H 1500 3650 50  0001 C CNN
F 1 "GND" H 1505 3727 50  0000 C CNN
F 2 "" H 1500 3900 50  0001 C CNN
F 3 "" H 1500 3900 50  0001 C CNN
	1    1500 3900
	1    0    0    -1  
$EndComp
Wire Wire Line
	1500 3750 1500 3900
$Comp
L power:GND #PWR?
U 1 1 5D1E6EF5
P 2050 3900
F 0 "#PWR?" H 2050 3650 50  0001 C CNN
F 1 "GND" H 2055 3727 50  0000 C CNN
F 2 "" H 2050 3900 50  0001 C CNN
F 3 "" H 2050 3900 50  0001 C CNN
	1    2050 3900
	1    0    0    -1  
$EndComp
Wire Wire Line
	2050 3750 2050 3900
Wire Wire Line
	1500 3450 1500 3300
Wire Wire Line
	1500 3300 2050 3300
Wire Wire Line
	2050 3300 2050 3450
$Comp
L 000_PreferredParts:C_10pF C106
U 1 1 5D1E6F05
P 2550 3600
F 0 "C106" H 2665 3646 50  0000 L CNN
F 1 "C_10pF" H 2665 3555 50  0000 L CNN
F 2 "Capacitor_SMD:C_0402_1005Metric" H 2588 3450 50  0001 C CNN
F 3 "~" H 2550 3600 50  0001 C CNN
F 4 "Murata Electronics" H 2550 3600 50  0001 C CNN "Manufacturer"
F 5 "GJM0336C1E100GB01D" H 2550 3600 50  0001 C CNN "PartNumber"
	1    2550 3600
	1    0    0    -1  
$EndComp
$Comp
L power:GND #PWR?
U 1 1 5D1E6F0F
P 2550 3900
F 0 "#PWR?" H 2550 3650 50  0001 C CNN
F 1 "GND" H 2555 3727 50  0000 C CNN
F 2 "" H 2550 3900 50  0001 C CNN
F 3 "" H 2550 3900 50  0001 C CNN
	1    2550 3900
	1    0    0    -1  
$EndComp
Wire Wire Line
	2550 3750 2550 3900
Wire Wire Line
	2550 3300 2550 3450
Wire Wire Line
	2550 3300 2050 3300
Connection ~ 2050 3300
$Comp
L Device:R R101
U 1 1 5D1EC2BF
P 3200 4000
F 0 "R101" H 3270 4046 50  0000 L CNN
F 1 "DNP" H 3270 3955 50  0000 L CNN
F 2 "Resistor_SMD:R_0402_1005Metric" V 3130 4000 50  0001 C CNN
F 3 "~" H 3200 4000 50  0001 C CNN
	1    3200 4000
	1    0    0    -1  
$EndComp
Wire Wire Line
	3200 3300 3200 3850
Wire Wire Line
	2550 3300 2900 3300
Connection ~ 2550 3300
Wire Wire Line
	3200 4150 3200 4400
Wire Wire Line
	3200 4400 3600 4400
Connection ~ 3600 4400
Wire Wire Line
	3600 4400 3600 4300
$Comp
L Device:L L103
U 1 1 5D20411D
P 2900 3950
F 0 "L103" H 2953 3996 50  0000 L CNN
F 1 "2.7nH" H 2953 3905 50  0000 L CNN
F 2 "Inductor_SMD:L_0201_0603Metric" H 2900 3950 50  0001 C CNN
F 3 "~" H 2900 3950 50  0001 C CNN
F 4 "Murata Electronics" H 2900 3950 50  0001 C CNN "Manufacturer"
F 5 "LQP03HQ2N7B02D" H 2900 3950 50  0001 C CNN "PartNumber"
	1    2900 3950
	1    0    0    -1  
$EndComp
Wire Wire Line
	2900 3800 2900 3300
Connection ~ 2900 3300
Wire Wire Line
	2900 3300 3200 3300
Wire Wire Line
	2900 4800 3000 4800
$Comp
L Device:C C108
U 1 1 5D20A6A2
P 2900 5050
F 0 "C108" H 3015 5096 50  0000 L CNN
F 1 "DNP" H 3015 5005 50  0000 L CNN
F 2 "Capacitor_SMD:C_0201_0603Metric" H 2938 4900 50  0001 C CNN
F 3 "~" H 2900 5050 50  0001 C CNN
	1    2900 5050
	1    0    0    -1  
$EndComp
$Comp
L Device:C C107
U 1 1 5D20A6AC
P 2650 4800
F 0 "C107" V 2398 4800 50  0000 C CNN
F 1 "1.5pF" V 2489 4800 50  0000 C CNN
F 2 "Capacitor_SMD:C_0201_0603Metric" H 2688 4650 50  0001 C CNN
F 3 "~" H 2650 4800 50  0001 C CNN
F 4 "Murata Electronics" H 2650 4800 50  0001 C CNN "Manufacturer"
F 5 "GJM0335C1E1R5WB01D" H 2650 4800 50  0001 C CNN "PartNumber"
	1    2650 4800
	0    1    1    0   
$EndComp
$Comp
L power:GND #PWR?
U 1 1 5D20A6B6
P 2900 5300
F 0 "#PWR?" H 2900 5050 50  0001 C CNN
F 1 "GND" H 2905 5127 50  0000 C CNN
F 2 "" H 2900 5300 50  0001 C CNN
F 3 "" H 2900 5300 50  0001 C CNN
	1    2900 5300
	1    0    0    -1  
$EndComp
Wire Wire Line
	2900 5300 2900 5200
Wire Wire Line
	2900 4900 2900 4800
Connection ~ 2900 4800
Wire Wire Line
	2900 4100 2900 4800
Wire Wire Line
	2800 4800 2900 4800
$Comp
L Device:C C105
U 1 1 5D219BB1
P 2400 5050
F 0 "C105" H 2515 5096 50  0000 L CNN
F 1 "0.5pF" H 2515 5005 50  0000 L CNN
F 2 "Capacitor_SMD:C_0201_0603Metric" H 2438 4900 50  0001 C CNN
F 3 "~" H 2400 5050 50  0001 C CNN
F 4 "Murata Electronics" H 2400 5050 50  0001 C CNN "Manufacturer"
F 5 "GJM0335C1HR50WB01D" H 2400 5050 50  0001 C CNN "PartNumber"
	1    2400 5050
	1    0    0    -1  
$EndComp
$Comp
L power:GND #PWR?
U 1 1 5D219BB7
P 2400 5300
F 0 "#PWR?" H 2400 5050 50  0001 C CNN
F 1 "GND" H 2405 5127 50  0000 C CNN
F 2 "" H 2400 5300 50  0001 C CNN
F 3 "" H 2400 5300 50  0001 C CNN
	1    2400 5300
	1    0    0    -1  
$EndComp
Wire Wire Line
	2400 5300 2400 5200
Wire Wire Line
	2400 4900 2400 4800
Wire Wire Line
	2400 4800 2500 4800
$Comp
L Device:L L101
U 1 1 5D2242D0
P 1650 4800
F 0 "L101" V 1840 4800 50  0000 C CNN
F 1 "0 ohm" V 1749 4800 50  0000 C CNN
F 2 "Inductor_SMD:L_0201_0603Metric" H 1650 4800 50  0001 C CNN
F 3 "~" H 1650 4800 50  0001 C CNN
F 4 "Delta Electronics/Cyntec" H 1650 4800 50  0001 C CNN "Manufacturer"
F 5 "PFR03S-000-XNH" H 1650 4800 50  0001 C CNN "PartNumber"
	1    1650 4800
	0    -1   -1   0   
$EndComp
$Comp
L Device:C C103
U 1 1 5D2242D6
P 1900 5050
F 0 "C103" H 2015 5096 50  0000 L CNN
F 1 "DNP" H 2015 5005 50  0000 L CNN
F 2 "Capacitor_SMD:C_0201_0603Metric" H 1938 4900 50  0001 C CNN
F 3 "~" H 1900 5050 50  0001 C CNN
	1    1900 5050
	1    0    0    -1  
$EndComp
$Comp
L Device:C C101
U 1 1 5D2242DC
P 1400 5050
F 0 "C101" H 1515 5096 50  0000 L CNN
F 1 "DNP" H 1515 5005 50  0000 L CNN
F 2 "Capacitor_SMD:C_0201_0603Metric" H 1438 4900 50  0001 C CNN
F 3 "~" H 1400 5050 50  0001 C CNN
	1    1400 5050
	1    0    0    -1  
$EndComp
$Comp
L power:GND #PWR?
U 1 1 5D2242E2
P 1900 5300
F 0 "#PWR?" H 1900 5050 50  0001 C CNN
F 1 "GND" H 1905 5127 50  0000 C CNN
F 2 "" H 1900 5300 50  0001 C CNN
F 3 "" H 1900 5300 50  0001 C CNN
	1    1900 5300
	1    0    0    -1  
$EndComp
$Comp
L power:GND #PWR?
U 1 1 5D2242E8
P 1400 5300
F 0 "#PWR?" H 1400 5050 50  0001 C CNN
F 1 "GND" H 1405 5127 50  0000 C CNN
F 2 "" H 1400 5300 50  0001 C CNN
F 3 "" H 1400 5300 50  0001 C CNN
	1    1400 5300
	1    0    0    -1  
$EndComp
Wire Wire Line
	1400 5300 1400 5200
Wire Wire Line
	850  4800 950  4800
Wire Wire Line
	1400 4900 1400 4800
Connection ~ 1400 4800
Wire Wire Line
	1400 4800 1500 4800
Wire Wire Line
	1800 4800 1900 4800
Wire Wire Line
	1900 4800 1900 4900
Connection ~ 1900 4800
Wire Wire Line
	1900 4800 2000 4800
Wire Wire Line
	1900 5200 1900 5300
$Comp
L Device:L L102
U 1 1 5D225911
P 2150 4800
F 0 "L102" V 2340 4800 50  0000 C CNN
F 1 "47pF" V 2249 4800 50  0000 C CNN
F 2 "Inductor_SMD:L_0201_0603Metric" H 2150 4800 50  0001 C CNN
F 3 "~" H 2150 4800 50  0001 C CNN
F 4 "Murata Electronics" H 2150 4800 50  0001 C CNN "Manufacturer"
F 5 "GRM0335C1H470GA01D" H 2150 4800 50  0001 C CNN "PartNumber"
	1    2150 4800
	0    -1   -1   0   
$EndComp
Wire Wire Line
	2300 4800 2400 4800
Connection ~ 2400 4800
$Comp
L Connector:Conn_Coaxial J101
U 1 1 5D23A7CA
P 650 4800
F 0 "J101" H 578 5038 50  0000 C CNN
F 1 "Conn_Coaxial" H 578 4947 50  0000 C CNN
F 2 "POWDER_RF:SMA_EndLaunch_142-0761-881" H 650 4800 50  0001 C CNN
F 3 " ~" H 650 4800 50  0001 C CNN
F 4 "Cinch Connectivity Solutions Johnson" H 650 4800 50  0001 C CNN "Manufacturer"
F 5 "142-0761-881" H 650 4800 50  0001 C CNN "PartNumber"
	1    650  4800
	-1   0    0    -1  
$EndComp
$Comp
L power:GND #PWR?
U 1 1 5D23AFE1
P 650 5300
F 0 "#PWR?" H 650 5050 50  0001 C CNN
F 1 "GND" H 655 5127 50  0000 C CNN
F 2 "" H 650 5300 50  0001 C CNN
F 3 "" H 650 5300 50  0001 C CNN
	1    650  5300
	1    0    0    -1  
$EndComp
Wire Wire Line
	650  5300 650  5000
$Comp
L Connector:Conn_Coaxial J102
U 1 1 5D23FE0B
P 6200 4100
F 0 "J102" V 6174 4200 50  0000 L CNN
F 1 "Conn_Coaxial" V 6083 4200 50  0000 L CNN
F 2 "POWDER_RF:SMA_EndLaunch_142-0761-881" H 6200 4100 50  0001 C CNN
F 3 " ~" H 6200 4100 50  0001 C CNN
F 4 "Cinch Connectivity Solutions Johnson" H 6200 4100 50  0001 C CNN "Manufacturer"
F 5 "142-0761-881" H 6200 4100 50  0001 C CNN "PartNumber"
	1    6200 4100
	0    1    -1   0   
$EndComp
Wire Wire Line
	6200 4300 6200 4450
$Comp
L power:GND #PWR?
U 1 1 5D242F06
P 5900 4200
F 0 "#PWR?" H 5900 3950 50  0001 C CNN
F 1 "GND" H 5905 4027 50  0000 C CNN
F 2 "" H 5900 4200 50  0001 C CNN
F 3 "" H 5900 4200 50  0001 C CNN
	1    5900 4200
	1    0    0    -1  
$EndComp
Wire Wire Line
	5900 4200 5900 4100
Wire Wire Line
	5900 4100 6000 4100
$Comp
L Device:R R104
U 1 1 5D24D1B4
P 6950 4800
F 0 "R104" V 6743 4800 50  0000 C CNN
F 1 "0" V 6834 4800 50  0000 C CNN
F 2 "Resistor_SMD:R_0201_0603Metric" V 6880 4800 50  0001 C CNN
F 3 "~" H 6950 4800 50  0001 C CNN
F 4 "Delta Electronics/Cyntec" H 6950 4800 50  0001 C CNN "Manufacturer"
F 5 "PFR03S-000-XNH" H 6950 4800 50  0001 C CNN "PartNumber"
	1    6950 4800
	0    1    1    0   
$EndComp
$Comp
L Device:R R103
U 1 1 5D253390
P 6700 5050
F 0 "R103" H 6630 5004 50  0000 R CNN
F 1 "DNP" H 6630 5095 50  0000 R CNN
F 2 "Resistor_SMD:R_0201_0603Metric" V 6630 5050 50  0001 C CNN
F 3 "~" H 6700 5050 50  0001 C CNN
	1    6700 5050
	-1   0    0    1   
$EndComp
Wire Wire Line
	6600 4800 6700 4800
Wire Wire Line
	6700 4800 6700 4900
Connection ~ 6700 4800
Wire Wire Line
	6700 4800 6800 4800
$Comp
L Device:R R105
U 1 1 5D25A0AE
P 7200 5050
F 0 "R105" H 7130 5004 50  0000 R CNN
F 1 "DNP" H 7130 5095 50  0000 R CNN
F 2 "Resistor_SMD:R_0201_0603Metric" V 7130 5050 50  0001 C CNN
F 3 "~" H 7200 5050 50  0001 C CNN
	1    7200 5050
	-1   0    0    1   
$EndComp
Wire Wire Line
	7300 4800 7200 4800
Wire Wire Line
	7200 4800 7200 4900
Connection ~ 7200 4800
Wire Wire Line
	7200 4800 7100 4800
$Comp
L power:GND #PWR?
U 1 1 5D25EBC3
P 6700 5300
F 0 "#PWR?" H 6700 5050 50  0001 C CNN
F 1 "GND" H 6705 5127 50  0000 C CNN
F 2 "" H 6700 5300 50  0001 C CNN
F 3 "" H 6700 5300 50  0001 C CNN
	1    6700 5300
	1    0    0    -1  
$EndComp
$Comp
L power:GND #PWR?
U 1 1 5D260511
P 7200 5300
F 0 "#PWR?" H 7200 5050 50  0001 C CNN
F 1 "GND" H 7205 5127 50  0000 C CNN
F 2 "" H 7200 5300 50  0001 C CNN
F 3 "" H 7200 5300 50  0001 C CNN
	1    7200 5300
	1    0    0    -1  
$EndComp
Wire Wire Line
	7200 5200 7200 5300
Wire Wire Line
	6700 5200 6700 5300
$Comp
L power:GND #PWR?
U 1 1 5D26646F
P 7550 5450
F 0 "#PWR?" H 7550 5200 50  0001 C CNN
F 1 "GND" H 7555 5277 50  0000 C CNN
F 2 "" H 7550 5450 50  0001 C CNN
F 3 "" H 7550 5450 50  0001 C CNN
	1    7550 5450
	1    0    0    -1  
$EndComp
$Comp
L power:GND #PWR?
U 1 1 5D266F16
P 7650 5450
F 0 "#PWR?" H 7650 5200 50  0001 C CNN
F 1 "GND" H 7655 5277 50  0000 C CNN
F 2 "" H 7650 5450 50  0001 C CNN
F 3 "" H 7650 5450 50  0001 C CNN
	1    7650 5450
	1    0    0    -1  
$EndComp
$Comp
L power:GND #PWR?
U 1 1 5D267265
P 7750 5450
F 0 "#PWR?" H 7750 5200 50  0001 C CNN
F 1 "GND" H 7755 5277 50  0000 C CNN
F 2 "" H 7750 5450 50  0001 C CNN
F 3 "" H 7750 5450 50  0001 C CNN
	1    7750 5450
	1    0    0    -1  
$EndComp
$Comp
L power:GND #PWR?
U 1 1 5D267617
P 7850 5450
F 0 "#PWR?" H 7850 5200 50  0001 C CNN
F 1 "GND" H 7855 5277 50  0000 C CNN
F 2 "" H 7850 5450 50  0001 C CNN
F 3 "" H 7850 5450 50  0001 C CNN
	1    7850 5450
	1    0    0    -1  
$EndComp
$Comp
L power:GND #PWR?
U 1 1 5D2679B2
P 7950 5450
F 0 "#PWR?" H 7950 5200 50  0001 C CNN
F 1 "GND" H 7955 5277 50  0000 C CNN
F 2 "" H 7950 5450 50  0001 C CNN
F 3 "" H 7950 5450 50  0001 C CNN
	1    7950 5450
	1    0    0    -1  
$EndComp
$Comp
L power:GND #PWR?
U 1 1 5D267D63
P 8050 5450
F 0 "#PWR?" H 8050 5200 50  0001 C CNN
F 1 "GND" H 8055 5277 50  0000 C CNN
F 2 "" H 8050 5450 50  0001 C CNN
F 3 "" H 8050 5450 50  0001 C CNN
	1    8050 5450
	1    0    0    -1  
$EndComp
$Comp
L power:GND #PWR?
U 1 1 5D268107
P 8150 5450
F 0 "#PWR?" H 8150 5200 50  0001 C CNN
F 1 "GND" H 8155 5277 50  0000 C CNN
F 2 "" H 8150 5450 50  0001 C CNN
F 3 "" H 8150 5450 50  0001 C CNN
	1    8150 5450
	1    0    0    -1  
$EndComp
$Comp
L power:GND #PWR?
U 1 1 5D26846E
P 8250 5450
F 0 "#PWR?" H 8250 5200 50  0001 C CNN
F 1 "GND" H 8255 5277 50  0000 C CNN
F 2 "" H 8250 5450 50  0001 C CNN
F 3 "" H 8250 5450 50  0001 C CNN
	1    8250 5450
	1    0    0    -1  
$EndComp
$Comp
L power:GND #PWR?
U 1 1 5D2687F6
P 8350 5450
F 0 "#PWR?" H 8350 5200 50  0001 C CNN
F 1 "GND" H 8355 5277 50  0000 C CNN
F 2 "" H 8350 5450 50  0001 C CNN
F 3 "" H 8350 5450 50  0001 C CNN
	1    8350 5450
	1    0    0    -1  
$EndComp
$Comp
L power:GND #PWR?
U 1 1 5D268BAC
P 8450 5450
F 0 "#PWR?" H 8450 5200 50  0001 C CNN
F 1 "GND" H 8455 5277 50  0000 C CNN
F 2 "" H 8450 5450 50  0001 C CNN
F 3 "" H 8450 5450 50  0001 C CNN
	1    8450 5450
	1    0    0    -1  
$EndComp
Wire Wire Line
	7550 5350 7550 5450
Wire Wire Line
	7650 5450 7650 5350
Wire Wire Line
	7750 5350 7750 5450
Wire Wire Line
	7850 5450 7850 5350
Wire Wire Line
	7950 5350 7950 5450
Wire Wire Line
	8050 5450 8050 5350
Wire Wire Line
	8150 5350 8150 5450
Wire Wire Line
	8250 5350 8250 5450
Wire Wire Line
	8350 5450 8350 5350
Wire Wire Line
	8450 5350 8450 5450
$Comp
L Device:R R107
U 1 1 5D28ADF0
P 9450 4800
F 0 "R107" V 9243 4800 50  0000 C CNN
F 1 "71.5" V 9334 4800 50  0000 C CNN
F 2 "Resistor_SMD:R_0201_0603Metric" V 9380 4800 50  0001 C CNN
F 3 "~" H 9450 4800 50  0001 C CNN
F 4 "Stackpole Electronics Inc" H 9450 4800 50  0001 C CNN "Manufacturer"
F 5 "RMCF0201FT71R5" H 9450 4800 50  0001 C CNN "PartNumber"
	1    9450 4800
	0    1    1    0   
$EndComp
$Comp
L Device:R R106
U 1 1 5D28ADF6
P 9200 5050
F 0 "R106" H 9130 5004 50  0000 R CNN
F 1 "100" H 9130 5095 50  0000 R CNN
F 2 "Resistor_SMD:R_0201_0603Metric" V 9130 5050 50  0001 C CNN
F 3 "~" H 9200 5050 50  0001 C CNN
F 4 "Delta Electronics/Cyntec" H 9200 5050 50  0001 C CNN "Manufacturer"
F 5 "PFR03S-101-FNH" H 9200 5050 50  0001 C CNN "PartNumber"
	1    9200 5050
	-1   0    0    1   
$EndComp
Wire Wire Line
	9200 4800 9200 4900
Connection ~ 9200 4800
Wire Wire Line
	9200 4800 9300 4800
$Comp
L Device:R R108
U 1 1 5D28AE00
P 9700 5050
F 0 "R108" H 9630 5004 50  0000 R CNN
F 1 "47" H 9630 5095 50  0000 R CNN
F 2 "Resistor_SMD:R_0201_0603Metric" V 9630 5050 50  0001 C CNN
F 3 "~" H 9700 5050 50  0001 C CNN
F 4 "Delta Electronics/Cyntec" H 9700 5050 50  0001 C CNN "Manufacturer"
F 5 "PFR03S-470-FNH" H 9700 5050 50  0001 C CNN "PartNumber"
	1    9700 5050
	-1   0    0    1   
$EndComp
Wire Wire Line
	9800 4800 9700 4800
Wire Wire Line
	9700 4800 9700 4900
Connection ~ 9700 4800
Wire Wire Line
	9700 4800 9600 4800
$Comp
L power:GND #PWR?
U 1 1 5D28AE0A
P 9200 5300
F 0 "#PWR?" H 9200 5050 50  0001 C CNN
F 1 "GND" H 9205 5127 50  0000 C CNN
F 2 "" H 9200 5300 50  0001 C CNN
F 3 "" H 9200 5300 50  0001 C CNN
	1    9200 5300
	1    0    0    -1  
$EndComp
$Comp
L power:GND #PWR?
U 1 1 5D28AE10
P 9700 5300
F 0 "#PWR?" H 9700 5050 50  0001 C CNN
F 1 "GND" H 9705 5127 50  0000 C CNN
F 2 "" H 9700 5300 50  0001 C CNN
F 3 "" H 9700 5300 50  0001 C CNN
	1    9700 5300
	1    0    0    -1  
$EndComp
Wire Wire Line
	9700 5200 9700 5300
Wire Wire Line
	9200 5200 9200 5300
Wire Wire Line
	8700 4800 9200 4800
$Comp
L Device:R R109
U 1 1 5D294F33
P 9950 4800
F 0 "R109" V 9743 4800 50  0000 C CNN
F 1 "71.5" V 9834 4800 50  0000 C CNN
F 2 "Resistor_SMD:R_0201_0603Metric" V 9880 4800 50  0001 C CNN
F 3 "~" H 9950 4800 50  0001 C CNN
F 4 "Stackpole Electronics Inc" H 9950 4800 50  0001 C CNN "Manufacturer"
F 5 "RMCF0201FT71R5" H 9950 4800 50  0001 C CNN "PartNumber"
	1    9950 4800
	0    1    1    0   
$EndComp
$Comp
L Device:R R110
U 1 1 5D294F39
P 10200 5050
F 0 "R110" H 10130 5004 50  0000 R CNN
F 1 "100" H 10130 5095 50  0000 R CNN
F 2 "Resistor_SMD:R_0201_0603Metric" V 10130 5050 50  0001 C CNN
F 3 "~" H 10200 5050 50  0001 C CNN
F 4 "Delta Electronics/Cyntec" H 10200 5050 50  0001 C CNN "Manufacturer"
F 5 "PFR03S-101-FNH" H 10200 5050 50  0001 C CNN "PartNumber"
	1    10200 5050
	-1   0    0    1   
$EndComp
Wire Wire Line
	10700 4800 10550 4800
Wire Wire Line
	10200 4800 10200 4900
Connection ~ 10200 4800
Wire Wire Line
	10200 4800 10100 4800
$Comp
L power:GND #PWR?
U 1 1 5D294F43
P 10200 5300
F 0 "#PWR?" H 10200 5050 50  0001 C CNN
F 1 "GND" H 10205 5127 50  0000 C CNN
F 2 "" H 10200 5300 50  0001 C CNN
F 3 "" H 10200 5300 50  0001 C CNN
	1    10200 5300
	1    0    0    -1  
$EndComp
Wire Wire Line
	10200 5200 10200 5300
$Comp
L Connector:Conn_Coaxial J103
U 1 1 5D299CC6
P 10900 4800
F 0 "J103" H 11000 4775 50  0000 L CNN
F 1 "Conn_Coaxial" H 11000 4684 50  0000 L CNN
F 2 "POWDER_RF:SMA_EndLaunch_142-0761-881" H 10900 4800 50  0001 C CNN
F 3 " ~" H 10900 4800 50  0001 C CNN
F 4 "Cinch Connectivity Solutions Johnson" H 10900 4800 50  0001 C CNN "Manufacturer"
F 5 "142-0761-881" H 10900 4800 50  0001 C CNN "PartNumber"
	1    10900 4800
	1    0    0    -1  
$EndComp
$Comp
L power:GND #PWR?
U 1 1 5D29D283
P 10900 5300
F 0 "#PWR?" H 10900 5050 50  0001 C CNN
F 1 "GND" H 10905 5127 50  0000 C CNN
F 2 "" H 10900 5300 50  0001 C CNN
F 3 "" H 10900 5300 50  0001 C CNN
	1    10900 5300
	1    0    0    -1  
$EndComp
Wire Wire Line
	10900 5300 10900 5000
Wire Wire Line
	7850 1950 8200 1950
$Comp
L power:GND #PWR?
U 1 1 5D2A8925
P 8200 2700
F 0 "#PWR?" H 8200 2450 50  0001 C CNN
F 1 "GND" H 8205 2527 50  0000 C CNN
F 2 "" H 8200 2700 50  0001 C CNN
F 3 "" H 8200 2700 50  0001 C CNN
	1    8200 2700
	1    0    0    -1  
$EndComp
Wire Wire Line
	7850 1950 7850 4150
Wire Wire Line
	8200 2700 8200 2600
Wire Wire Line
	8200 2300 8200 1950
$Comp
L 000_PreferredParts:C_0_1uF C117
U 1 1 5D2C6182
P 6300 3100
F 0 "C117" H 6415 3146 50  0000 L CNN
F 1 "C_0_1uF" H 6415 3055 50  0000 L CNN
F 2 "Capacitor_SMD:C_0402_1005Metric" H 6338 2950 50  0001 C CNN
F 3 "~" H 6300 3100 50  0001 C CNN
F 4 "Murata Electronics" H 6300 3100 50  0001 C CNN "Manufacturer"
F 5 "GRM155R62A104KE14D" H 6300 3100 50  0001 C CNN "PartNumber"
	1    6300 3100
	1    0    0    -1  
$EndComp
$Comp
L power:GND #PWR?
U 1 1 5D2C6196
P 6300 3400
F 0 "#PWR?" H 6300 3150 50  0001 C CNN
F 1 "GND" H 6305 3227 50  0000 C CNN
F 2 "" H 6300 3400 50  0001 C CNN
F 3 "" H 6300 3400 50  0001 C CNN
	1    6300 3400
	1    0    0    -1  
$EndComp
Wire Wire Line
	6300 3250 6300 3400
$Comp
L power:GND #PWR?
U 1 1 5D2C61A1
P 6700 3400
F 0 "#PWR?" H 6700 3150 50  0001 C CNN
F 1 "GND" H 6705 3227 50  0000 C CNN
F 2 "" H 6700 3400 50  0001 C CNN
F 3 "" H 6700 3400 50  0001 C CNN
	1    6700 3400
	1    0    0    -1  
$EndComp
Wire Wire Line
	6700 3250 6700 3400
Wire Wire Line
	6700 2800 6700 2950
$Comp
L 000_PreferredParts:C_10pF C119
U 1 1 5D2C61B1
P 7200 3100
F 0 "C119" H 7315 3146 50  0000 L CNN
F 1 "C_10pF" H 7315 3055 50  0000 L CNN
F 2 "Capacitor_SMD:C_0402_1005Metric" H 7238 2950 50  0001 C CNN
F 3 "~" H 7200 3100 50  0001 C CNN
F 4 "Murata Electronics" H 7200 3100 50  0001 C CNN "Manufacturer"
F 5 "GJM0336C1E100GB01D" H 7200 3100 50  0001 C CNN "PartNumber"
	1    7200 3100
	1    0    0    -1  
$EndComp
$Comp
L power:GND #PWR?
U 1 1 5D2C61BB
P 7200 3400
F 0 "#PWR?" H 7200 3150 50  0001 C CNN
F 1 "GND" H 7205 3227 50  0000 C CNN
F 2 "" H 7200 3400 50  0001 C CNN
F 3 "" H 7200 3400 50  0001 C CNN
	1    7200 3400
	1    0    0    -1  
$EndComp
Wire Wire Line
	7200 3250 7200 3400
Wire Wire Line
	7200 2800 7200 2950
Wire Wire Line
	7200 2800 6700 2800
Connection ~ 6700 2800
Wire Wire Line
	7200 2800 7650 2800
Wire Wire Line
	7650 2800 7650 4150
Connection ~ 7200 2800
Text Label 3700 3300 0    50   ~ 0
lna_v_bias
Text Label 3250 4400 0    50   ~ 0
lna_bias
Wire Wire Line
	6300 2800 6700 2800
$Comp
L 000_PreferredParts:C_10uF_0603 C116
U 1 1 5D2F14DB
P 5900 3100
F 0 "C116" H 6015 3146 50  0000 L CNN
F 1 "C_10uF_0603" H 6015 3055 50  0000 L CNN
F 2 "Capacitor_SMD:C_0603_1608Metric" H 5938 2950 50  0001 C CNN
F 3 "~" H 5900 3100 50  0001 C CNN
F 4 "Murata Electronics" H 5900 3100 50  0001 C CNN "Manufacturer"
F 5 "GRM188R6YA106MA73D" H 5900 3100 50  0001 C CNN "PartNumber"
	1    5900 3100
	1    0    0    -1  
$EndComp
$Comp
L power:GND #PWR?
U 1 1 5D2F14E1
P 5900 3400
F 0 "#PWR?" H 5900 3150 50  0001 C CNN
F 1 "GND" H 5905 3227 50  0000 C CNN
F 2 "" H 5900 3400 50  0001 C CNN
F 3 "" H 5900 3400 50  0001 C CNN
	1    5900 3400
	1    0    0    -1  
$EndComp
Wire Wire Line
	5900 3250 5900 3400
Wire Wire Line
	5900 2950 5900 2800
Wire Wire Line
	5900 2800 6300 2800
Wire Wire Line
	6300 2950 6300 2800
Connection ~ 6300 2800
$Comp
L 000_PreferredParts:C_0_1uF C126
U 1 1 5D30AE5B
P 9600 3900
F 0 "C126" H 9715 3946 50  0000 L CNN
F 1 "C_0_1uF" H 9715 3855 50  0000 L CNN
F 2 "Capacitor_SMD:C_0402_1005Metric" H 9638 3750 50  0001 C CNN
F 3 "~" H 9600 3900 50  0001 C CNN
F 4 "Murata Electronics" H 9600 3900 50  0001 C CNN "Manufacturer"
F 5 "GRM155R62A104KE14D" H 9600 3900 50  0001 C CNN "PartNumber"
	1    9600 3900
	1    0    0    -1  
$EndComp
$Comp
L power:GND #PWR?
U 1 1 5D30AE67
P 9600 4200
F 0 "#PWR?" H 9600 3950 50  0001 C CNN
F 1 "GND" H 9605 4027 50  0000 C CNN
F 2 "" H 9600 4200 50  0001 C CNN
F 3 "" H 9600 4200 50  0001 C CNN
	1    9600 4200
	1    0    0    -1  
$EndComp
Wire Wire Line
	9600 4050 9600 4200
$Comp
L power:GND #PWR?
U 1 1 5D30AE6E
P 10150 4200
F 0 "#PWR?" H 10150 3950 50  0001 C CNN
F 1 "GND" H 10155 4027 50  0000 C CNN
F 2 "" H 10150 4200 50  0001 C CNN
F 3 "" H 10150 4200 50  0001 C CNN
	1    10150 4200
	1    0    0    -1  
$EndComp
Wire Wire Line
	10150 4050 10150 4200
Wire Wire Line
	10150 3600 10150 3750
$Comp
L 000_PreferredParts:C_10pF C132
U 1 1 5D30AE76
P 10600 3900
F 0 "C132" H 10715 3946 50  0000 L CNN
F 1 "C_10pF" H 10715 3855 50  0000 L CNN
F 2 "Capacitor_SMD:C_0402_1005Metric" H 10638 3750 50  0001 C CNN
F 3 "~" H 10600 3900 50  0001 C CNN
F 4 "Murata Electronics" H 10600 3900 50  0001 C CNN "Manufacturer"
F 5 "GJM0336C1E100GB01D" H 10600 3900 50  0001 C CNN "PartNumber"
	1    10600 3900
	1    0    0    -1  
$EndComp
$Comp
L power:GND #PWR?
U 1 1 5D30AE7C
P 10600 4200
F 0 "#PWR?" H 10600 3950 50  0001 C CNN
F 1 "GND" H 10605 4027 50  0000 C CNN
F 2 "" H 10600 4200 50  0001 C CNN
F 3 "" H 10600 4200 50  0001 C CNN
	1    10600 4200
	1    0    0    -1  
$EndComp
Wire Wire Line
	10600 4050 10600 4200
Wire Wire Line
	10600 3600 10600 3750
Wire Wire Line
	10600 3600 10150 3600
Connection ~ 10150 3600
Wire Wire Line
	9600 3600 10150 3600
$Comp
L 000_PreferredParts:C_10uF_0603 C123
U 1 1 5D30AE89
P 8900 3900
F 0 "C123" H 9015 3946 50  0000 L CNN
F 1 "C_10uF_0603" H 9015 3855 50  0000 L CNN
F 2 "Capacitor_SMD:C_0603_1608Metric" H 8938 3750 50  0001 C CNN
F 3 "~" H 8900 3900 50  0001 C CNN
F 4 "Murata Electronics" H 8900 3900 50  0001 C CNN "Manufacturer"
F 5 "GRM188R6YA106MA73D" H 8900 3900 50  0001 C CNN "PartNumber"
	1    8900 3900
	1    0    0    -1  
$EndComp
$Comp
L power:GND #PWR?
U 1 1 5D30AE8F
P 8900 4200
F 0 "#PWR?" H 8900 3950 50  0001 C CNN
F 1 "GND" H 8905 4027 50  0000 C CNN
F 2 "" H 8900 4200 50  0001 C CNN
F 3 "" H 8900 4200 50  0001 C CNN
	1    8900 4200
	1    0    0    -1  
$EndComp
Wire Wire Line
	8900 4050 8900 4200
Wire Wire Line
	8900 3750 8900 3600
Wire Wire Line
	8900 3600 9600 3600
Wire Wire Line
	9600 3750 9600 3600
Connection ~ 9600 3600
$Comp
L 000_PreferredParts:C_0_1uF C125
U 1 1 5D3119D6
P 9950 2900
F 0 "C125" H 10065 2946 50  0000 L CNN
F 1 "C_0_1uF" H 10065 2855 50  0000 L CNN
F 2 "Capacitor_SMD:C_0402_1005Metric" H 9988 2750 50  0001 C CNN
F 3 "~" H 9950 2900 50  0001 C CNN
F 4 "Murata Electronics" H 9950 2900 50  0001 C CNN "Manufacturer"
F 5 "GRM155R62A104KE14D" H 9950 2900 50  0001 C CNN "PartNumber"
	1    9950 2900
	1    0    0    -1  
$EndComp
$Comp
L power:GND #PWR?
U 1 1 5D3119E2
P 9950 3200
F 0 "#PWR?" H 9950 2950 50  0001 C CNN
F 1 "GND" H 9955 3027 50  0000 C CNN
F 2 "" H 9950 3200 50  0001 C CNN
F 3 "" H 9950 3200 50  0001 C CNN
	1    9950 3200
	1    0    0    -1  
$EndComp
Wire Wire Line
	9950 3050 9950 3200
$Comp
L power:GND #PWR?
U 1 1 5D3119E9
P 10350 3200
F 0 "#PWR?" H 10350 2950 50  0001 C CNN
F 1 "GND" H 10355 3027 50  0000 C CNN
F 2 "" H 10350 3200 50  0001 C CNN
F 3 "" H 10350 3200 50  0001 C CNN
	1    10350 3200
	1    0    0    -1  
$EndComp
Wire Wire Line
	10350 3050 10350 3200
Wire Wire Line
	10350 2600 10350 2750
$Comp
L 000_PreferredParts:C_10pF C131
U 1 1 5D3119F1
P 10800 2900
F 0 "C131" H 10915 2946 50  0000 L CNN
F 1 "C_10pF" H 10915 2855 50  0000 L CNN
F 2 "Capacitor_SMD:C_0402_1005Metric" H 10838 2750 50  0001 C CNN
F 3 "~" H 10800 2900 50  0001 C CNN
F 4 "Murata Electronics" H 10800 2900 50  0001 C CNN "Manufacturer"
F 5 "GJM0336C1E100GB01D" H 10800 2900 50  0001 C CNN "PartNumber"
	1    10800 2900
	1    0    0    -1  
$EndComp
$Comp
L power:GND #PWR?
U 1 1 5D3119F7
P 10800 3200
F 0 "#PWR?" H 10800 2950 50  0001 C CNN
F 1 "GND" H 10805 3027 50  0000 C CNN
F 2 "" H 10800 3200 50  0001 C CNN
F 3 "" H 10800 3200 50  0001 C CNN
	1    10800 3200
	1    0    0    -1  
$EndComp
Wire Wire Line
	10800 3050 10800 3200
Wire Wire Line
	10800 2600 10800 2750
Wire Wire Line
	10800 2600 10350 2600
Connection ~ 10350 2600
Wire Wire Line
	9950 2600 10350 2600
$Comp
L 000_PreferredParts:C_10uF_0603 C122
U 1 1 5D311A04
P 9550 2900
F 0 "C122" H 9665 2946 50  0000 L CNN
F 1 "C_10uF_0603" H 9665 2855 50  0000 L CNN
F 2 "Capacitor_SMD:C_0603_1608Metric" H 9588 2750 50  0001 C CNN
F 3 "~" H 9550 2900 50  0001 C CNN
F 4 "Murata Electronics" H 9550 2900 50  0001 C CNN "Manufacturer"
F 5 "GRM188R6YA106MA73D" H 9550 2900 50  0001 C CNN "PartNumber"
	1    9550 2900
	1    0    0    -1  
$EndComp
$Comp
L power:GND #PWR?
U 1 1 5D311A0A
P 9550 3200
F 0 "#PWR?" H 9550 2950 50  0001 C CNN
F 1 "GND" H 9555 3027 50  0000 C CNN
F 2 "" H 9550 3200 50  0001 C CNN
F 3 "" H 9550 3200 50  0001 C CNN
	1    9550 3200
	1    0    0    -1  
$EndComp
Wire Wire Line
	9550 3050 9550 3200
Wire Wire Line
	9550 2750 9550 2600
Wire Wire Line
	9550 2600 9950 2600
Wire Wire Line
	9950 2750 9950 2600
Connection ~ 9950 2600
Wire Wire Line
	8350 4150 8350 3600
Wire Wire Line
	8350 3600 8900 3600
Connection ~ 8900 3600
Wire Wire Line
	8250 4150 8250 3300
Wire Wire Line
	9400 3300 9400 2600
Wire Wire Line
	9400 2600 9550 2600
Connection ~ 9550 2600
Text Label 7300 2800 0    50   ~ 0
pa_vdd3
Text Label 8700 3600 0    50   ~ 0
pa_vcc1
Text Label 9050 3300 0    50   ~ 0
pa_vcc2
Text Label 7900 1950 0    50   ~ 0
pa_en
Wire Wire Line
	8050 4150 8050 3050
$Comp
L Device:C C124
U 1 1 5D3AE5F4
P 10000 1600
F 0 "C124" H 10115 1646 50  0000 L CNN
F 1 "DNP" H 10115 1555 50  0000 L CNN
F 2 "Capacitor_SMD:C_0402_1005Metric" H 10038 1450 50  0001 C CNN
F 3 "~" H 10000 1600 50  0001 C CNN
	1    10000 1600
	1    0    0    -1  
$EndComp
$Comp
L Device:C C127
U 1 1 5D3AE5FA
P 10400 1600
F 0 "C127" H 10515 1646 50  0000 L CNN
F 1 "DNP" H 10515 1555 50  0000 L CNN
F 2 "Capacitor_SMD:C_0402_1005Metric" H 10438 1450 50  0001 C CNN
F 3 "~" H 10400 1600 50  0001 C CNN
	1    10400 1600
	1    0    0    -1  
$EndComp
$Comp
L power:GND #PWR?
U 1 1 5D3AE600
P 10000 1900
F 0 "#PWR?" H 10000 1650 50  0001 C CNN
F 1 "GND" H 10005 1727 50  0000 C CNN
F 2 "" H 10000 1900 50  0001 C CNN
F 3 "" H 10000 1900 50  0001 C CNN
	1    10000 1900
	1    0    0    -1  
$EndComp
Wire Wire Line
	10000 1750 10000 1900
$Comp
L power:GND #PWR?
U 1 1 5D3AE607
P 10400 1900
F 0 "#PWR?" H 10400 1650 50  0001 C CNN
F 1 "GND" H 10405 1727 50  0000 C CNN
F 2 "" H 10400 1900 50  0001 C CNN
F 3 "" H 10400 1900 50  0001 C CNN
	1    10400 1900
	1    0    0    -1  
$EndComp
Wire Wire Line
	10400 1750 10400 1900
Wire Wire Line
	10400 1300 10400 1450
$Comp
L Device:C C130
U 1 1 5D3AE60F
P 10750 1600
F 0 "C130" H 10865 1646 50  0000 L CNN
F 1 "DNP" H 10865 1555 50  0000 L CNN
F 2 "Capacitor_SMD:C_0402_1005Metric" H 10788 1450 50  0001 C CNN
F 3 "~" H 10750 1600 50  0001 C CNN
	1    10750 1600
	1    0    0    -1  
$EndComp
$Comp
L power:GND #PWR?
U 1 1 5D3AE615
P 10750 1900
F 0 "#PWR?" H 10750 1650 50  0001 C CNN
F 1 "GND" H 10755 1727 50  0000 C CNN
F 2 "" H 10750 1900 50  0001 C CNN
F 3 "" H 10750 1900 50  0001 C CNN
	1    10750 1900
	1    0    0    -1  
$EndComp
Wire Wire Line
	10750 1750 10750 1900
Wire Wire Line
	10750 1300 10750 1450
Wire Wire Line
	10750 1300 10400 1300
Connection ~ 10400 1300
Wire Wire Line
	10000 1300 10400 1300
$Comp
L Device:C C121
U 1 1 5D3AE620
P 9550 1600
F 0 "C121" H 9665 1646 50  0000 L CNN
F 1 "1uF" H 9665 1555 50  0000 L CNN
F 2 "Capacitor_SMD:C_0402_1005Metric" H 9588 1450 50  0001 C CNN
F 3 "~" H 9550 1600 50  0001 C CNN
F 4 "TDK Corporation" H 9550 1600 50  0001 C CNN "Manufacturer"
F 5 "C1005X5R1V105K050BE" H 9550 1600 50  0001 C CNN "PartNumber"
	1    9550 1600
	1    0    0    -1  
$EndComp
$Comp
L power:GND #PWR?
U 1 1 5D3AE626
P 9550 1900
F 0 "#PWR?" H 9550 1650 50  0001 C CNN
F 1 "GND" H 9555 1727 50  0000 C CNN
F 2 "" H 9550 1900 50  0001 C CNN
F 3 "" H 9550 1900 50  0001 C CNN
	1    9550 1900
	1    0    0    -1  
$EndComp
Wire Wire Line
	9550 1750 9550 1900
Wire Wire Line
	9550 1450 9550 1300
Wire Wire Line
	9550 1300 10000 1300
Wire Wire Line
	10000 1450 10000 1300
Connection ~ 10000 1300
Connection ~ 9550 1300
Wire Wire Line
	9300 1300 9300 3050
Wire Wire Line
	9300 1300 9550 1300
Text Label 8950 3050 0    50   ~ 0
pa_vbias
Text Label 1350 4800 1    50   ~ 0
lna_matched_out
Text Label 2900 4650 1    50   ~ 0
lna_out
Text Label 2400 4800 1    50   ~ 0
lna_out_match_1
Text Label 1900 4800 1    50   ~ 0
lna_out_match_2
Text Label 4150 4800 1    50   ~ 0
lna_in
Text Label 4600 4800 1    50   ~ 0
lna_match_in_1
Text Label 5100 4800 1    50   ~ 0
lna_match_in_2
Text Label 5600 4800 1    50   ~ 0
lna_matched_in
Text Label 6200 4400 0    50   ~ 0
ant
Text Label 10300 4800 0    50   ~ 0
pa_in
Text Label 9700 4800 1    50   ~ 0
pa_in_att_1
Text Label 8900 4800 1    50   ~ 0
pa_in_att_2
Text Label 7200 4800 1    50   ~ 0
pa_out_att_1
Text Label 6700 4800 1    50   ~ 0
pa_out
Text Label 7100 6750 0    50   ~ 0
pa_en
Wire Wire Line
	7100 6750 6750 6750
Wire Wire Line
	8050 1150 7950 1150
Wire Wire Line
	8050 1450 7950 1450
Wire Wire Line
	7200 2050 7100 2050
Wire Wire Line
	7200 2550 7100 2550
Text Label 7200 2550 0    50   ~ 0
pa_vcc1
Text Label 7200 2050 0    50   ~ 0
pa_vcc2
Text Label 8050 1450 0    50   ~ 0
pa_vdd3
Text Label 8050 1150 0    50   ~ 0
pa_vbias
$Comp
L power:GND #PWR?
U 1 1 5D4F0878
P 3700 5300
F 0 "#PWR?" H 3700 5050 50  0001 C CNN
F 1 "GND" H 3705 5127 50  0000 C CNN
F 2 "" H 3700 5300 50  0001 C CNN
F 3 "" H 3700 5300 50  0001 C CNN
	1    3700 5300
	1    0    0    -1  
$EndComp
Wire Wire Line
	3700 5300 3700 5200
$Comp
L power:GND #PWR?
U 1 1 5D4F8762
P 3800 5350
F 0 "#PWR?" H 3800 5100 50  0001 C CNN
F 1 "GND" H 3805 5177 50  0000 C CNN
F 2 "" H 3800 5350 50  0001 C CNN
F 3 "" H 3800 5350 50  0001 C CNN
	1    3800 5350
	1    0    0    -1  
$EndComp
Wire Wire Line
	3800 5350 3800 5250
$Comp
L power:GND #PWR?
U 1 1 5D5008DC
P 3900 5400
F 0 "#PWR?" H 3900 5150 50  0001 C CNN
F 1 "GND" H 3905 5227 50  0000 C CNN
F 2 "" H 3900 5400 50  0001 C CNN
F 3 "" H 3900 5400 50  0001 C CNN
	1    3900 5400
	1    0    0    -1  
$EndComp
Wire Wire Line
	3900 5400 3900 5300
$Comp
L power:GND #PWR?
U 1 1 5D50902E
P 3500 5200
F 0 "#PWR?" H 3500 4950 50  0001 C CNN
F 1 "GND" H 3505 5027 50  0000 C CNN
F 2 "" H 3500 5200 50  0001 C CNN
F 3 "" H 3500 5200 50  0001 C CNN
	1    3500 5200
	1    0    0    -1  
$EndComp
Wire Wire Line
	3500 5200 3500 5100
$Comp
L power:GND #PWR?
U 1 1 5D511578
P 3400 5150
F 0 "#PWR?" H 3400 4900 50  0001 C CNN
F 1 "GND" H 3405 4977 50  0000 C CNN
F 2 "" H 3400 5150 50  0001 C CNN
F 3 "" H 3400 5150 50  0001 C CNN
	1    3400 5150
	1    0    0    -1  
$EndComp
Wire Wire Line
	3400 5150 3400 5050
$Sheet
S 900  1050 900  650 
U 5D562501
F0 "vreg_5_1" 50
F1 "voltage_regulator_5.sch" 50
F2 "EN" I L 900 1350 50 
F3 "PS_SYNC" I L 900 1550 50 
F4 "VSEL" I L 900 1450 50 
F5 "PG" O R 1800 1350 50 
F6 "V_12" I L 900 1150 50 
F7 "V_OUT" O R 1800 1150 50 
$EndSheet
$Sheet
S 2650 1050 900  650 
U 5D587C46
F0 "vreg_5_2" 50
F1 "voltage_regulator_5.sch" 50
F2 "EN" I L 2650 1350 50 
F3 "PS_SYNC" I L 2650 1550 50 
F4 "VSEL" I L 2650 1450 50 
F5 "PG" O R 3550 1350 50 
F6 "V_12" I L 2650 1150 50 
F7 "V_OUT" O R 3550 1150 50 
$EndSheet
$Sheet
S 4400 1050 900  650 
U 5D591ABD
F0 "vreg_3_3_1" 50
F1 "voltage_regulator_3_3.sch" 50
F2 "PG" O R 5300 1350 50 
F3 "V_12" I L 4400 1150 50 
F4 "V_OUT" O R 5300 1150 50 
$EndSheet
$Comp
L power:+12V #PWR?
U 1 1 5D59A645
P 650 950
F 0 "#PWR?" H 650 800 50  0001 C CNN
F 1 "+12V" H 665 1123 50  0000 C CNN
F 2 "" H 650 950 50  0001 C CNN
F 3 "" H 650 950 50  0001 C CNN
	1    650  950 
	1    0    0    -1  
$EndComp
Wire Wire Line
	650  950  650  1150
Wire Wire Line
	650  1150 900  1150
$Comp
L power:+12V #PWR?
U 1 1 5D5A301C
P 2400 950
F 0 "#PWR?" H 2400 800 50  0001 C CNN
F 1 "+12V" H 2415 1123 50  0000 C CNN
F 2 "" H 2400 950 50  0001 C CNN
F 3 "" H 2400 950 50  0001 C CNN
	1    2400 950 
	1    0    0    -1  
$EndComp
Wire Wire Line
	2400 950  2400 1150
Wire Wire Line
	2400 1150 2650 1150
$Comp
L power:+12V #PWR?
U 1 1 5D5ABD69
P 4150 950
F 0 "#PWR?" H 4150 800 50  0001 C CNN
F 1 "+12V" H 4165 1123 50  0000 C CNN
F 2 "" H 4150 950 50  0001 C CNN
F 3 "" H 4150 950 50  0001 C CNN
	1    4150 950 
	1    0    0    -1  
$EndComp
Wire Wire Line
	4150 950  4150 1150
Wire Wire Line
	4150 1150 4400 1150
Wire Wire Line
	1800 1150 2050 1150
Text Label 1900 1150 0    50   ~ 0
VDD_LNA
Wire Wire Line
	3550 1150 3800 1150
Text Label 3650 1150 0    50   ~ 0
VDD_PA
Wire Wire Line
	5300 1150 5550 1150
$Comp
L power:+3.3V #PWR?
U 1 1 5D5D9F95
P 5550 950
F 0 "#PWR?" H 5550 800 50  0001 C CNN
F 1 "+3.3V" H 5565 1123 50  0000 C CNN
F 2 "" H 5550 950 50  0001 C CNN
F 3 "" H 5550 950 50  0001 C CNN
	1    5550 950 
	1    0    0    -1  
$EndComp
Wire Wire Line
	5550 950  5550 1150
Text Label 3200 2950 0    50   ~ 0
VDD_LNA
$Comp
L Device:L L109
U 1 1 5D5FF5C0
P 6950 2550
F 0 "L109" V 7140 2550 50  0000 C CNN
F 1 "BEAD" V 7049 2550 50  0000 C CNN
F 2 "Inductor_SMD:L_0603_1608Metric" H 6950 2550 50  0001 C CNN
F 3 "~" H 6950 2550 50  0001 C CNN
F 4 "BLM18EG221SZ1" V 6950 2550 50  0001 C CNN "PartNumber"
F 5 "Murata Electronics" H 6950 2550 50  0001 C CNN "Manufacturer"
	1    6950 2550
	0    -1   -1   0   
$EndComp
$Comp
L Device:L L108
U 1 1 5D5FF809
P 6950 2050
F 0 "L108" V 7140 2050 50  0000 C CNN
F 1 "BEAD" V 7049 2050 50  0000 C CNN
F 2 "Inductor_SMD:L_0603_1608Metric" H 6950 2050 50  0001 C CNN
F 3 "~" H 6950 2050 50  0001 C CNN
F 4 "BLM18EG221SZ1" V 6950 2050 50  0001 C CNN "PartNumber"
F 5 "Murata Electronics" H 6950 2050 50  0001 C CNN "Manufacturer"
	1    6950 2050
	0    -1   -1   0   
$EndComp
$Comp
L Device:L L107
U 1 1 5D5FF89B
P 7800 1450
F 0 "L107" V 7990 1450 50  0000 C CNN
F 1 "BEAD" V 7899 1450 50  0000 C CNN
F 2 "Inductor_SMD:L_0603_1608Metric" H 7800 1450 50  0001 C CNN
F 3 "~" H 7800 1450 50  0001 C CNN
F 4 "BLM18EG221SZ1" V 7800 1450 50  0001 C CNN "PartNumber"
F 5 "Murata Electronics" H 7800 1450 50  0001 C CNN "Manufacturer"
	1    7800 1450
	0    -1   -1   0   
$EndComp
$Comp
L Device:L L106
U 1 1 5D5FF9E2
P 7800 1150
F 0 "L106" V 7990 1150 50  0000 C CNN
F 1 "BEAD" V 7899 1150 50  0000 C CNN
F 2 "Inductor_SMD:L_0603_1608Metric" H 7800 1150 50  0001 C CNN
F 3 "~" H 7800 1150 50  0001 C CNN
F 4 "BLM18EG221SZ1" V 7800 1150 50  0001 C CNN "PartNumber"
F 5 "Murata Electronics" H 7800 1150 50  0001 C CNN "Manufacturer"
	1    7800 1150
	0    -1   -1   0   
$EndComp
Wire Wire Line
	5900 1150 5700 1150
Text Label 5750 1150 0    50   ~ 0
VDD_PA
$Sheet
S 1200 5700 2000 2000
U 5D67C7FD
F0 "microcontroller_gpio" 50
F1 "microcontroller_gpio.sch" 50
F2 "LINK_LED" O R 3200 5800 50 
F3 "ACT_LED" O R 3200 5900 50 
F4 "RST" O R 3200 6100 50 
F5 "PA0" B L 1200 5800 50 
F6 "PA1" B L 1200 5900 50 
F7 "PA2" B L 1200 6000 50 
F8 "PA3" B L 1200 6100 50 
F9 "PD0" B L 1200 6300 50 
F10 "PD1" B L 1200 6400 50 
F11 "PD2" B L 1200 6500 50 
F12 "PD3" B L 1200 6600 50 
F13 "PL0" B L 1200 6800 50 
F14 "PL1" B L 1200 6900 50 
F15 "PL2" B L 1200 7000 50 
F16 "PL3" B L 1200 7100 50 
F17 "PH0" B R 3200 6300 50 
F18 "PH1" B R 3200 6400 50 
F19 "PH2" B R 3200 6500 50 
F20 "PH3" B R 3200 6600 50 
F21 "PK0" B R 3200 6800 50 
F22 "PK1" B R 3200 6900 50 
F23 "PK2" B R 3200 7000 50 
F24 "PK3" B R 3200 7100 50 
F25 "PK4" B R 3200 7200 50 
F26 "PK5" B R 3200 7300 50 
F27 "PK6" B R 3200 7400 50 
F28 "PK7" B R 3200 7500 50 
F29 "ADC0" I L 1200 7300 50 
F30 "ADC1" I L 1200 7400 50 
F31 "ADC2" I L 1200 7500 50 
F32 "ADC3" I L 1200 7600 50 
$EndSheet
$Sheet
S 3450 5700 650  500 
U 5D69D382
F0 "microcontroller_ethernet" 50
F1 "microcontroller_ethernet.sch" 50
F2 "G_LED" I L 3450 5800 50 
F3 "Y_LED" I L 3450 5900 50 
F4 "RST" I L 3450 6100 50 
$EndSheet
$Sheet
S 900  2100 1000 850 
U 5D69DD47
F0 "microcontroller_power" 50
F1 "microcontroller_power.sch" 50
$EndSheet
Wire Wire Line
	8050 3050 9300 3050
$Comp
L 000_PreferredParts:C_1nF C120
U 1 1 5D752D10
P 8200 2450
F 0 "C120" H 8315 2496 50  0000 L CNN
F 1 "C_1nF" H 8315 2405 50  0000 L CNN
F 2 "Capacitor_SMD:C_0402_1005Metric" H 8238 2300 50  0001 C CNN
F 3 "~" H 8200 2450 50  0001 C CNN
F 4 "Wurth Electronics Inc." H 8200 2450 50  0001 C CNN "Manufacturer"
F 5 "885012205061" H 8200 2450 50  0001 C CNN "PartNumber"
	1    8200 2450
	1    0    0    -1  
$EndComp
$Comp
L 000_PreferredParts:C_1nF C133
U 1 1 5D752DB4
P 8600 2200
F 0 "C133" H 8715 2246 50  0000 L CNN
F 1 "C_1nF" H 8715 2155 50  0000 L CNN
F 2 "Capacitor_SMD:C_0402_1005Metric" H 8638 2050 50  0001 C CNN
F 3 "~" H 8600 2200 50  0001 C CNN
F 4 "Wurth Electronics Inc." H 8600 2200 50  0001 C CNN "Manufacturer"
F 5 "885012205061" H 8600 2200 50  0001 C CNN "PartNumber"
	1    8600 2200
	1    0    0    -1  
$EndComp
$Comp
L 000_PreferredParts:C_1nF C134
U 1 1 5D752E68
P 8950 2450
F 0 "C134" H 9065 2496 50  0000 L CNN
F 1 "C_1nF" H 9065 2405 50  0000 L CNN
F 2 "Capacitor_SMD:C_0402_1005Metric" H 8988 2300 50  0001 C CNN
F 3 "~" H 8950 2450 50  0001 C CNN
F 4 "Wurth Electronics Inc." H 8950 2450 50  0001 C CNN "Manufacturer"
F 5 "885012205061" H 8950 2450 50  0001 C CNN "PartNumber"
	1    8950 2450
	1    0    0    -1  
$EndComp
Wire Wire Line
	8250 3300 9400 3300
Wire Wire Line
	8950 2300 8950 1950
Wire Wire Line
	8950 1950 8600 1950
Connection ~ 8200 1950
Wire Wire Line
	8600 1950 8600 2050
Connection ~ 8600 1950
Wire Wire Line
	8600 1950 8200 1950
$Comp
L power:GND #PWR?
U 1 1 5D783E9C
P 8600 2700
F 0 "#PWR?" H 8600 2450 50  0001 C CNN
F 1 "GND" H 8605 2527 50  0000 C CNN
F 2 "" H 8600 2700 50  0001 C CNN
F 3 "" H 8600 2700 50  0001 C CNN
	1    8600 2700
	1    0    0    -1  
$EndComp
Wire Wire Line
	8600 2350 8600 2700
$Comp
L power:GND #PWR?
U 1 1 5D78E06A
P 8950 2700
F 0 "#PWR?" H 8950 2450 50  0001 C CNN
F 1 "GND" H 8955 2527 50  0000 C CNN
F 2 "" H 8950 2700 50  0001 C CNN
F 3 "" H 8950 2700 50  0001 C CNN
	1    8950 2700
	1    0    0    -1  
$EndComp
Wire Wire Line
	8950 2700 8950 2600
$Comp
L 000_PreferredParts:C_1nF C129
U 1 1 5D798F3B
P 10350 2900
F 0 "C129" H 10465 2946 50  0000 L CNN
F 1 "C_1nF" H 10465 2855 50  0000 L CNN
F 2 "Capacitor_SMD:C_0402_1005Metric" H 10388 2750 50  0001 C CNN
F 3 "~" H 10350 2900 50  0001 C CNN
F 4 "Wurth Electronics Inc." H 10350 2900 50  0001 C CNN "Manufacturer"
F 5 "885012205061" H 10350 2900 50  0001 C CNN "PartNumber"
	1    10350 2900
	1    0    0    -1  
$EndComp
$Comp
L 000_PreferredParts:C_1nF C128
U 1 1 5D798FE5
P 10150 3900
F 0 "C128" H 10265 3946 50  0000 L CNN
F 1 "C_1nF" H 10265 3855 50  0000 L CNN
F 2 "Capacitor_SMD:C_0402_1005Metric" H 10188 3750 50  0001 C CNN
F 3 "~" H 10150 3900 50  0001 C CNN
F 4 "Wurth Electronics Inc." H 10150 3900 50  0001 C CNN "Manufacturer"
F 5 "885012205061" H 10150 3900 50  0001 C CNN "PartNumber"
	1    10150 3900
	1    0    0    -1  
$EndComp
$Comp
L 000_PreferredParts:C_1nF C104
U 1 1 5D7990B3
P 2050 3600
F 0 "C104" H 2165 3646 50  0000 L CNN
F 1 "C_1nF" H 2165 3555 50  0000 L CNN
F 2 "Capacitor_SMD:C_0402_1005Metric" H 2088 3450 50  0001 C CNN
F 3 "~" H 2050 3600 50  0001 C CNN
F 4 "Wurth Electronics Inc." H 2050 3600 50  0001 C CNN "Manufacturer"
F 5 "885012205061" H 2050 3600 50  0001 C CNN "PartNumber"
	1    2050 3600
	1    0    0    -1  
$EndComp
$Comp
L 000_PreferredParts:C_1nF C110
U 1 1 5D7992C1
P 4500 3600
F 0 "C110" H 4615 3646 50  0000 L CNN
F 1 "C_1nF" H 4615 3555 50  0000 L CNN
F 2 "Capacitor_SMD:C_0402_1005Metric" H 4538 3450 50  0001 C CNN
F 3 "~" H 4500 3600 50  0001 C CNN
F 4 "Wurth Electronics Inc." H 4500 3600 50  0001 C CNN "Manufacturer"
F 5 "885012205061" H 4500 3600 50  0001 C CNN "PartNumber"
	1    4500 3600
	1    0    0    -1  
$EndComp
$Comp
L 000_PreferredParts:C_1nF C118
U 1 1 5D799BE1
P 6700 3100
F 0 "C118" H 6815 3146 50  0000 L CNN
F 1 "C_1nF" H 6815 3055 50  0000 L CNN
F 2 "Capacitor_SMD:C_0402_1005Metric" H 6738 2950 50  0001 C CNN
F 3 "~" H 6700 3100 50  0001 C CNN
F 4 "Wurth Electronics Inc." H 6700 3100 50  0001 C CNN "Manufacturer"
F 5 "885012205061" H 6700 3100 50  0001 C CNN "PartNumber"
	1    6700 3100
	1    0    0    -1  
$EndComp
$Comp
L Device:D_TVS D101
U 1 1 5D88D993
P 950 5050
F 0 "D101" V 904 5129 50  0000 L CNN
F 1 "D_TVS" V 995 5129 50  0000 L CNN
F 2 "Capacitor_SMD:C_0201_0603Metric" H 950 5050 50  0001 C CNN
F 3 "~" H 950 5050 50  0001 C CNN
F 4 "LXES03AAA1-134" V 950 5050 50  0001 C CNN "PartNumber"
F 5 "Murata Electronics" H 950 5050 50  0001 C CNN "Manufacturer"
	1    950  5050
	0    1    1    0   
$EndComp
$Comp
L power:GND #PWR?
U 1 1 5D8A2378
P 950 5300
F 0 "#PWR?" H 950 5050 50  0001 C CNN
F 1 "GND" H 955 5127 50  0000 C CNN
F 2 "" H 950 5300 50  0001 C CNN
F 3 "" H 950 5300 50  0001 C CNN
	1    950  5300
	1    0    0    -1  
$EndComp
Wire Wire Line
	950  5300 950  5200
Wire Wire Line
	950  4900 950  4800
Connection ~ 950  4800
Wire Wire Line
	950  4800 1400 4800
$Comp
L Device:D_TVS D102
U 1 1 5D8B7F82
P 6500 4450
F 0 "D102" H 6500 4234 50  0000 C CNN
F 1 "D_TVS" H 6500 4325 50  0000 C CNN
F 2 "Capacitor_SMD:C_0201_0603Metric" H 6500 4450 50  0001 C CNN
F 3 "~" H 6500 4450 50  0001 C CNN
F 4 "LXES03AAA1-134" V 6500 4450 50  0001 C CNN "PartNumber"
F 5 "Murata Electronics" H 6500 4450 50  0001 C CNN "Manufacturer"
	1    6500 4450
	-1   0    0    1   
$EndComp
Wire Wire Line
	6350 4450 6200 4450
Connection ~ 6200 4450
Wire Wire Line
	6200 4450 6200 4500
$Comp
L power:GND #PWR?
U 1 1 5D8C2D1F
P 6750 4450
F 0 "#PWR?" H 6750 4200 50  0001 C CNN
F 1 "GND" H 6755 4277 50  0000 C CNN
F 2 "" H 6750 4450 50  0001 C CNN
F 3 "" H 6750 4450 50  0001 C CNN
	1    6750 4450
	0    -1   -1   0   
$EndComp
Wire Wire Line
	6750 4450 6650 4450
$Comp
L Device:D_TVS D103
U 1 1 5D8CDC3E
P 10550 5050
F 0 "D103" V 10596 4971 50  0000 R CNN
F 1 "D_TVS" V 10505 4971 50  0000 R CNN
F 2 "Capacitor_SMD:C_0201_0603Metric" H 10550 5050 50  0001 C CNN
F 3 "~" H 10550 5050 50  0001 C CNN
F 4 "LXES03AAA1-134" V 10550 5050 50  0001 C CNN "PartNumber"
F 5 "Murata Electronics" H 10550 5050 50  0001 C CNN "Manufacturer"
	1    10550 5050
	0    -1   -1   0   
$EndComp
Wire Wire Line
	10550 4900 10550 4800
Connection ~ 10550 4800
Wire Wire Line
	10550 4800 10200 4800
$Comp
L power:GND #PWR?
U 1 1 5D8E3D8F
P 10550 5300
F 0 "#PWR?" H 10550 5050 50  0001 C CNN
F 1 "GND" H 10555 5127 50  0000 C CNN
F 2 "" H 10550 5300 50  0001 C CNN
F 3 "" H 10550 5300 50  0001 C CNN
	1    10550 5300
	1    0    0    -1  
$EndComp
Wire Wire Line
	10550 5300 10550 5200
Wire Wire Line
	3200 5800 3450 5800
Wire Wire Line
	3450 5900 3200 5900
Wire Wire Line
	3200 6100 3450 6100
Wire Wire Line
	650  1350 900  1350
Wire Wire Line
	900  1450 650  1450
Wire Wire Line
	650  1550 900  1550
Wire Wire Line
	1200 5800 800  5800
Text Label 850  5800 0    50   ~ 0
PA0
Wire Wire Line
	1200 5900 800  5900
Text Label 850  5900 0    50   ~ 0
PA1
Wire Wire Line
	1200 6000 800  6000
Text Label 850  6000 0    50   ~ 0
PA2
Wire Wire Line
	1200 6100 800  6100
Text Label 850  6100 0    50   ~ 0
PA3
Wire Wire Line
	1200 6300 800  6300
Text Label 850  6300 0    50   ~ 0
PD0
Wire Wire Line
	1200 6400 800  6400
Text Label 850  6400 0    50   ~ 0
PD1
Wire Wire Line
	1200 6500 800  6500
Text Label 850  6500 0    50   ~ 0
PD2
Wire Wire Line
	1200 6600 800  6600
Text Label 850  6600 0    50   ~ 0
PD3
Wire Wire Line
	1200 6800 800  6800
Wire Wire Line
	1200 6900 800  6900
Wire Wire Line
	1200 7000 800  7000
Wire Wire Line
	1200 7100 800  7100
Text Label 850  7100 0    50   ~ 0
PG_3
Text Label 700  1350 0    50   ~ 0
PA0
Text Label 700  1450 0    50   ~ 0
PA1
Text Label 1900 1350 0    50   ~ 0
PA3
Wire Wire Line
	2100 1350 1800 1350
Text Label 700  1550 0    50   ~ 0
PA2
Wire Wire Line
	2400 1350 2650 1350
Wire Wire Line
	2650 1450 2400 1450
Wire Wire Line
	2400 1550 2650 1550
Text Label 2450 1350 0    50   ~ 0
PD0
Text Label 2450 1450 0    50   ~ 0
PD1
Text Label 2450 1550 0    50   ~ 0
PD2
Text Label 3650 1350 0    50   ~ 0
PD3
Wire Wire Line
	3850 1350 3550 1350
Text Label 5400 1350 0    50   ~ 0
PG_3
Wire Wire Line
	5600 1350 5300 1350
Wire Wire Line
	3200 6300 6750 6300
$Comp
L Device:R R126
U 1 1 5DA747DB
P 6750 6550
F 0 "R126" H 6680 6504 50  0000 R CNN
F 1 "10k" H 6680 6595 50  0000 R CNN
F 2 "Resistor_SMD:R_0402_1005Metric" V 6680 6550 50  0001 C CNN
F 3 "~" H 6750 6550 50  0001 C CNN
F 4 "Delta Electronics/Cyntec" H 6750 6550 50  0001 C CNN "Manufacturer"
F 5 "PFR05S-103-FNH" H 6750 6550 50  0001 C CNN "PartNumber"
	1    6750 6550
	-1   0    0    1   
$EndComp
Wire Wire Line
	6750 6400 6750 6300
$Comp
L Device:R R127
U 1 1 5DAAE07F
P 6750 6950
F 0 "R127" H 6680 6904 50  0000 R CNN
F 1 "10k" H 6680 6995 50  0000 R CNN
F 2 "Resistor_SMD:R_0402_1005Metric" V 6680 6950 50  0001 C CNN
F 3 "~" H 6750 6950 50  0001 C CNN
F 4 "Delta Electronics/Cyntec" H 6750 6950 50  0001 C CNN "Manufacturer"
F 5 "PFR05S-103-FNH" H 6750 6950 50  0001 C CNN "PartNumber"
	1    6750 6950
	-1   0    0    1   
$EndComp
$Comp
L Device:R R128
U 1 1 5DAAE1A7
P 6750 7350
F 0 "R128" H 6680 7304 50  0000 R CNN
F 1 "10k" H 6680 7395 50  0000 R CNN
F 2 "Resistor_SMD:R_0402_1005Metric" V 6680 7350 50  0001 C CNN
F 3 "~" H 6750 7350 50  0001 C CNN
F 4 "Delta Electronics/Cyntec" H 6750 7350 50  0001 C CNN "Manufacturer"
F 5 "PFR05S-103-FNH" H 6750 7350 50  0001 C CNN "PartNumber"
	1    6750 7350
	-1   0    0    1   
$EndComp
Wire Wire Line
	6750 6700 6750 6750
Wire Wire Line
	6750 7100 6750 7200
$Comp
L power:GND #PWR?
U 1 1 5DACB190
P 6750 7600
F 0 "#PWR?" H 6750 7350 50  0001 C CNN
F 1 "GND" H 6755 7427 50  0000 C CNN
F 2 "" H 6750 7600 50  0001 C CNN
F 3 "" H 6750 7600 50  0001 C CNN
	1    6750 7600
	1    0    0    -1  
$EndComp
Wire Wire Line
	6750 7600 6750 7500
Connection ~ 6750 6750
Wire Wire Line
	6750 6750 6750 6800
Wire Wire Line
	3200 6800 3600 6800
Wire Wire Line
	3200 7000 4600 7000
$Comp
L Device:R R112
U 1 1 5DB64C13
P 3750 6800
F 0 "R112" H 3820 6846 50  0000 L CNN
F 1 "400" H 3820 6755 50  0000 L CNN
F 2 "Resistor_SMD:R_0402_1005Metric" V 3680 6800 50  0001 C CNN
F 3 "~" H 3750 6800 50  0001 C CNN
F 4 "Stackpole Electronics Inc" H 3750 6800 50  0001 C CNN "Manufacturer"
F 5 "RMCF0402FT402R" H 3750 6800 50  0001 C CNN "PartNumber"
	1    3750 6800
	0    1    1    0   
$EndComp
$Comp
L Device:R R114
U 1 1 5DB64E19
P 4050 6900
F 0 "R114" H 4120 6946 50  0000 L CNN
F 1 "400" H 4120 6855 50  0000 L CNN
F 2 "Resistor_SMD:R_0402_1005Metric" V 3980 6900 50  0001 C CNN
F 3 "~" H 4050 6900 50  0001 C CNN
F 4 "Stackpole Electronics Inc" H 4050 6900 50  0001 C CNN "Manufacturer"
F 5 "RMCF0402FT402R" H 4050 6900 50  0001 C CNN "PartNumber"
	1    4050 6900
	0    1    1    0   
$EndComp
$Comp
L Device:R R118
U 1 1 5DB64EC1
P 4750 7000
F 0 "R118" H 4820 7046 50  0000 L CNN
F 1 "400" H 4820 6955 50  0000 L CNN
F 2 "Resistor_SMD:R_0402_1005Metric" V 4680 7000 50  0001 C CNN
F 3 "~" H 4750 7000 50  0001 C CNN
F 4 "Stackpole Electronics Inc" H 4750 7000 50  0001 C CNN "Manufacturer"
F 5 "RMCF0402FT402R" H 4750 7000 50  0001 C CNN "PartNumber"
	1    4750 7000
	0    1    1    0   
$EndComp
Wire Wire Line
	3200 7100 3300 7100
Wire Wire Line
	3200 6900 3900 6900
Text Label 4450 6800 0    50   ~ 0
lna_v_bias
$Comp
L Device:R R116
U 1 1 5DC4EED3
P 4450 6900
F 0 "R116" H 4520 6946 50  0000 L CNN
F 1 "400" H 4520 6855 50  0000 L CNN
F 2 "Resistor_SMD:R_0402_1005Metric" V 4380 6900 50  0001 C CNN
F 3 "~" H 4450 6900 50  0001 C CNN
F 4 "Stackpole Electronics Inc" H 4450 6900 50  0001 C CNN "Manufacturer"
F 5 "RMCF0402FT402R" H 4450 6900 50  0001 C CNN "PartNumber"
	1    4450 6900
	0    1    1    0   
$EndComp
$Comp
L Device:R R120
U 1 1 5DC5F017
P 5150 7000
F 0 "R120" H 5220 7046 50  0000 L CNN
F 1 "400" H 5220 6955 50  0000 L CNN
F 2 "Resistor_SMD:R_0402_1005Metric" V 5080 7000 50  0001 C CNN
F 3 "~" H 5150 7000 50  0001 C CNN
F 4 "Stackpole Electronics Inc" H 5150 7000 50  0001 C CNN "Manufacturer"
F 5 "RMCF0402FT402R" H 5150 7000 50  0001 C CNN "PartNumber"
	1    5150 7000
	0    1    1    0   
$EndComp
$Comp
L Device:R R122
U 1 1 5DC5F0CB
P 5550 7000
F 0 "R122" H 5620 7046 50  0000 L CNN
F 1 "400" H 5620 6955 50  0000 L CNN
F 2 "Resistor_SMD:R_0402_1005Metric" V 5480 7000 50  0001 C CNN
F 3 "~" H 5550 7000 50  0001 C CNN
F 4 "Stackpole Electronics Inc" H 5550 7000 50  0001 C CNN "Manufacturer"
F 5 "RMCF0402FT402R" H 5550 7000 50  0001 C CNN "PartNumber"
	1    5550 7000
	0    1    1    0   
$EndComp
$Comp
L Device:R R124
U 1 1 5DC5F18B
P 5950 7000
F 0 "R124" H 6020 7046 50  0000 L CNN
F 1 "400" H 6020 6955 50  0000 L CNN
F 2 "Resistor_SMD:R_0402_1005Metric" V 5880 7000 50  0001 C CNN
F 3 "~" H 5950 7000 50  0001 C CNN
F 4 "Stackpole Electronics Inc" H 5950 7000 50  0001 C CNN "Manufacturer"
F 5 "RMCF0402FT402R" H 5950 7000 50  0001 C CNN "PartNumber"
	1    5950 7000
	0    1    1    0   
$EndComp
$Comp
L Device:R R125
U 1 1 5DC9DE68
P 6250 7200
F 0 "R125" H 6320 7246 50  0000 L CNN
F 1 "400" H 6320 7155 50  0000 L CNN
F 2 "Resistor_SMD:R_0402_1005Metric" V 6180 7200 50  0001 C CNN
F 3 "~" H 6250 7200 50  0001 C CNN
F 4 "Stackpole Electronics Inc" H 6250 7200 50  0001 C CNN "Manufacturer"
F 5 "RMCF0402FT402R" H 6250 7200 50  0001 C CNN "PartNumber"
	1    6250 7200
	0    1    1    0   
$EndComp
Wire Wire Line
	3300 7200 3300 7100
Wire Wire Line
	3600 7200 3700 7200
Wire Wire Line
	4000 7200 4100 7200
Wire Wire Line
	6100 7200 6000 7200
Wire Wire Line
	6400 7200 6400 6800
Wire Wire Line
	3900 6800 4700 6800
Wire Wire Line
	4600 6900 4700 6900
Wire Wire Line
	4700 6900 4700 6800
Connection ~ 4700 6800
Wire Wire Line
	4700 6800 6200 6800
Wire Wire Line
	4900 7000 5000 7000
Wire Wire Line
	4300 6900 4200 6900
Wire Wire Line
	4500 7200 4400 7200
Wire Wire Line
	4800 7200 4900 7200
Wire Wire Line
	5200 7200 5300 7200
Wire Wire Line
	5400 7000 5300 7000
Wire Wire Line
	5700 7000 5800 7000
Wire Wire Line
	6100 7000 6200 7000
Wire Wire Line
	6200 7000 6200 6800
Connection ~ 6200 6800
Wire Wire Line
	6200 6800 6400 6800
Wire Wire Line
	5700 7200 5600 7200
$Comp
L Device:R R123
U 1 1 5DDA9600
P 5850 7200
F 0 "R123" H 5920 7246 50  0000 L CNN
F 1 "400" H 5920 7155 50  0000 L CNN
F 2 "Resistor_SMD:R_0402_1005Metric" V 5780 7200 50  0001 C CNN
F 3 "~" H 5850 7200 50  0001 C CNN
F 4 "Stackpole Electronics Inc" H 5850 7200 50  0001 C CNN "Manufacturer"
F 5 "RMCF0402FT402R" H 5850 7200 50  0001 C CNN "PartNumber"
	1    5850 7200
	0    1    1    0   
$EndComp
$Comp
L Device:R R121
U 1 1 5DDA96BC
P 5450 7200
F 0 "R121" H 5520 7246 50  0000 L CNN
F 1 "400" H 5520 7155 50  0000 L CNN
F 2 "Resistor_SMD:R_0402_1005Metric" V 5380 7200 50  0001 C CNN
F 3 "~" H 5450 7200 50  0001 C CNN
F 4 "Stackpole Electronics Inc" H 5450 7200 50  0001 C CNN "Manufacturer"
F 5 "RMCF0402FT402R" H 5450 7200 50  0001 C CNN "PartNumber"
	1    5450 7200
	0    1    1    0   
$EndComp
$Comp
L Device:R R119
U 1 1 5DDA977A
P 5050 7200
F 0 "R119" H 5120 7246 50  0000 L CNN
F 1 "400" H 5120 7155 50  0000 L CNN
F 2 "Resistor_SMD:R_0402_1005Metric" V 4980 7200 50  0001 C CNN
F 3 "~" H 5050 7200 50  0001 C CNN
F 4 "Stackpole Electronics Inc" H 5050 7200 50  0001 C CNN "Manufacturer"
F 5 "RMCF0402FT402R" H 5050 7200 50  0001 C CNN "PartNumber"
	1    5050 7200
	0    1    1    0   
$EndComp
$Comp
L Device:R R117
U 1 1 5DDA982E
P 4650 7200
F 0 "R117" H 4720 7246 50  0000 L CNN
F 1 "400" H 4720 7155 50  0000 L CNN
F 2 "Resistor_SMD:R_0402_1005Metric" V 4580 7200 50  0001 C CNN
F 3 "~" H 4650 7200 50  0001 C CNN
F 4 "Stackpole Electronics Inc" H 4650 7200 50  0001 C CNN "Manufacturer"
F 5 "RMCF0402FT402R" H 4650 7200 50  0001 C CNN "PartNumber"
	1    4650 7200
	0    1    1    0   
$EndComp
$Comp
L Device:R R115
U 1 1 5DDA98F0
P 4250 7200
F 0 "R115" H 4320 7246 50  0000 L CNN
F 1 "400" H 4320 7155 50  0000 L CNN
F 2 "Resistor_SMD:R_0402_1005Metric" V 4180 7200 50  0001 C CNN
F 3 "~" H 4250 7200 50  0001 C CNN
F 4 "Stackpole Electronics Inc" H 4250 7200 50  0001 C CNN "Manufacturer"
F 5 "RMCF0402FT402R" H 4250 7200 50  0001 C CNN "PartNumber"
	1    4250 7200
	0    1    1    0   
$EndComp
$Comp
L Device:R R113
U 1 1 5DDA99B0
P 3850 7200
F 0 "R113" H 3920 7246 50  0000 L CNN
F 1 "400" H 3920 7155 50  0000 L CNN
F 2 "Resistor_SMD:R_0402_1005Metric" V 3780 7200 50  0001 C CNN
F 3 "~" H 3850 7200 50  0001 C CNN
F 4 "Stackpole Electronics Inc" H 3850 7200 50  0001 C CNN "Manufacturer"
F 5 "RMCF0402FT402R" H 3850 7200 50  0001 C CNN "PartNumber"
	1    3850 7200
	0    1    1    0   
$EndComp
$Comp
L Device:R R111
U 1 1 5DDA9A6E
P 3450 7200
F 0 "R111" H 3520 7246 50  0000 L CNN
F 1 "400" H 3520 7155 50  0000 L CNN
F 2 "Resistor_SMD:R_0402_1005Metric" V 3380 7200 50  0001 C CNN
F 3 "~" H 3450 7200 50  0001 C CNN
F 4 "Stackpole Electronics Inc" H 3450 7200 50  0001 C CNN "Manufacturer"
F 5 "RMCF0402FT402R" H 3450 7200 50  0001 C CNN "PartNumber"
	1    3450 7200
	0    1    1    0   
$EndComp
Wire Wire Line
	1200 7300 950  7300
Text Label 1000 7300 0    50   ~ 0
ADC0
Text Label 850  7400 0    50   ~ 0
ADC1
Text Label 850  7500 0    50   ~ 0
ADC2
Text Label 850  7600 0    50   ~ 0
ADC3
$Comp
L Connector:TestPoint TP104
U 1 1 5DE22625
P 950 7300
F 0 "TP104" V 1145 7374 50  0000 C CNN
F 1 "TestPoint" V 1054 7374 50  0000 C CNN
F 2 "TestPoint:TestPoint_Pad_D1.0mm" H 1150 7300 50  0001 C CNN
F 3 "~" H 1150 7300 50  0001 C CNN
	1    950  7300
	0    -1   -1   0   
$EndComp
$Comp
L Connector:TestPoint TP103
U 1 1 5DE22912
P 650 7700
F 0 "TP103" V 604 7888 50  0000 L CNN
F 1 "TestPoint" V 695 7888 50  0000 L CNN
F 2 "TestPoint:TestPoint_Pad_D1.0mm" H 850 7700 50  0001 C CNN
F 3 "~" H 850 7700 50  0001 C CNN
	1    650  7700
	0    1    1    0   
$EndComp
Wire Wire Line
	650  7700 650  7600
Wire Wire Line
	650  7600 1200 7600
$Comp
L Connector:TestPoint TP102
U 1 1 5DE35D68
P 650 7400
F 0 "TP102" V 845 7474 50  0000 C CNN
F 1 "TestPoint" V 754 7474 50  0000 C CNN
F 2 "TestPoint:TestPoint_Pad_D1.0mm" H 850 7400 50  0001 C CNN
F 3 "~" H 850 7400 50  0001 C CNN
	1    650  7400
	0    -1   -1   0   
$EndComp
Wire Wire Line
	650  7400 1200 7400
$Comp
L Connector:TestPoint TP101
U 1 1 5DE5B23B
P 550 7700
F 0 "TP101" V 745 7774 50  0000 C CNN
F 1 "TestPoint" V 654 7774 50  0000 C CNN
F 2 "TestPoint:TestPoint_Pad_D1.0mm" H 750 7700 50  0001 C CNN
F 3 "~" H 750 7700 50  0001 C CNN
	1    550  7700
	0    -1   -1   0   
$EndComp
Wire Wire Line
	550  7700 550  7500
Wire Wire Line
	550  7500 1200 7500
Text Label 3300 6800 0    50   ~ 0
lna_b0
Text Label 3300 6900 0    50   ~ 0
lna_b1
Text Label 3300 7000 0    50   ~ 0
lna_b2
Text Label 3300 7100 0    50   ~ 0
lna_b3
Text Label 4250 6900 1    50   ~ 0
lna_b1_1
Text Label 4950 7000 1    50   ~ 0
lba_b2_1
Text Label 5350 7000 1    50   ~ 0
lba_b2_2
Text Label 5750 7000 1    50   ~ 0
lba_b2_3
Text Label 3650 7200 3    50   ~ 0
lba_b3_1
Text Label 4050 7200 3    50   ~ 0
lba_b3_2
Text Label 4450 7200 3    50   ~ 0
lba_b3_3
Text Label 4850 7200 3    50   ~ 0
lba_b3_4
Text Label 5250 7200 3    50   ~ 0
lba_b3_5
Text Label 5650 7200 3    50   ~ 0
lba_b3_6
Text Label 6050 7200 3    50   ~ 0
lba_b3_7
Text Label 6750 7150 0    50   ~ 0
pa_en_half
$Comp
L Connector_Generic:Conn_01x02 J104
U 1 1 5D6B88F4
P 2850 2300
F 0 "J104" H 2930 2292 50  0000 L CNN
F 1 "Conn_01x02" H 2930 2201 50  0000 L CNN
F 2 "TerminalBlock:TerminalBlock_bornier-2_P5.08mm" H 2850 2300 50  0001 C CNN
F 3 "~" H 2850 2300 50  0001 C CNN
F 4 "Molex" H 2850 2300 50  0001 C CNN "Manufacturer"
F 5 "0398800302" H 2850 2300 50  0001 C CNN "PartNumber"
	1    2850 2300
	1    0    0    -1  
$EndComp
$Comp
L power:+12V #PWR?
U 1 1 5D6B9142
P 2550 2200
F 0 "#PWR?" H 2550 2050 50  0001 C CNN
F 1 "+12V" H 2565 2373 50  0000 C CNN
F 2 "" H 2550 2200 50  0001 C CNN
F 3 "" H 2550 2200 50  0001 C CNN
	1    2550 2200
	1    0    0    -1  
$EndComp
$Comp
L power:GND #PWR?
U 1 1 5D6B9F88
P 2550 2500
F 0 "#PWR?" H 2550 2250 50  0001 C CNN
F 1 "GND" H 2555 2327 50  0000 C CNN
F 2 "" H 2550 2500 50  0001 C CNN
F 3 "" H 2550 2500 50  0001 C CNN
	1    2550 2500
	1    0    0    -1  
$EndComp
Wire Wire Line
	2550 2500 2550 2400
Wire Wire Line
	2550 2400 2650 2400
Wire Wire Line
	2650 2300 2550 2300
Wire Wire Line
	2550 2300 2550 2200
$Comp
L Connector_Generic:Conn_01x03 J105
U 1 1 5D6E680F
P 4550 2150
F 0 "J105" H 4630 2192 50  0000 L CNN
F 1 "Conn_01x03" H 4630 2101 50  0000 L CNN
F 2 "Connector:FanPinHeader_1x03_P2.54mm_Vertical" H 4550 2150 50  0001 C CNN
F 3 "~" H 4550 2150 50  0001 C CNN
F 4 "Sullins Connector Solutions" H 4550 2150 50  0001 C CNN "Manufacturer"
F 5 "SWR25X-NRTC-S03-ST-BA" H 4550 2150 50  0001 C CNN "PartNumber"
	1    4550 2150
	1    0    0    -1  
$EndComp
$Comp
L power:GND #PWR?
U 1 1 5D6E884B
P 4050 2250
F 0 "#PWR?" H 4050 2000 50  0001 C CNN
F 1 "GND" H 4055 2077 50  0000 C CNN
F 2 "" H 4050 2250 50  0001 C CNN
F 3 "" H 4050 2250 50  0001 C CNN
	1    4050 2250
	1    0    0    -1  
$EndComp
$Comp
L power:+12V #PWR?
U 1 1 5D6E909F
P 4050 1950
F 0 "#PWR?" H 4050 1800 50  0001 C CNN
F 1 "+12V" H 4065 2123 50  0000 C CNN
F 2 "" H 4050 1950 50  0001 C CNN
F 3 "" H 4050 1950 50  0001 C CNN
	1    4050 1950
	1    0    0    -1  
$EndComp
Wire Wire Line
	4050 1950 4050 2050
Wire Wire Line
	4050 2050 4350 2050
Wire Wire Line
	4050 2250 4050 2150
Wire Wire Line
	4050 2150 4350 2150
Wire Wire Line
	4350 2250 4250 2250
Text Label 850  7000 0    50   ~ 0
fan_tach
$Comp
L Device:R R129
U 1 1 5D73A757
P 4000 2750
F 0 "R129" V 3793 2750 50  0000 C CNN
F 1 "10k" V 3884 2750 50  0000 C CNN
F 2 "Resistor_SMD:R_0402_1005Metric" V 3930 2750 50  0001 C CNN
F 3 "~" H 4000 2750 50  0001 C CNN
F 4 "Delta Electronics/Cyntec" H 4000 2750 50  0001 C CNN "Manufacturer"
F 5 "PFR05S-103-FNH" H 4000 2750 50  0001 C CNN "PartNumber"
	1    4000 2750
	0    1    1    0   
$EndComp
$Comp
L Device:R R130
U 1 1 5D73B5BF
P 4500 3000
F 0 "R130" V 4293 3000 50  0000 C CNN
F 1 "1k" V 4384 3000 50  0000 C CNN
F 2 "Resistor_SMD:R_0402_1005Metric" V 4430 3000 50  0001 C CNN
F 3 "~" H 4500 3000 50  0001 C CNN
F 4 "Delta Electronics/Cyntec" H 4500 3000 50  0001 C CNN "Manufacturer"
F 5 "PFR05S-102-FNH" H 4500 3000 50  0001 C CNN "PartNumber"
	1    4500 3000
	0    1    1    0   
$EndComp
Wire Wire Line
	4350 3000 4250 3000
Wire Wire Line
	4050 2050 3750 2050
Wire Wire Line
	3750 2050 3750 2750
Wire Wire Line
	3750 2750 3850 2750
Connection ~ 4050 2050
Wire Wire Line
	4250 2250 4250 2750
Wire Wire Line
	4150 2750 4250 2750
Connection ~ 4250 2750
Wire Wire Line
	4250 2750 4250 3000
$Comp
L Diode:BZX84Cxx D104
U 1 1 5D7C38DC
P 5400 3250
F 0 "D104" V 5354 3329 50  0000 L CNN
F 1 "BZX84Cxx" V 5445 3329 50  0000 L CNN
F 2 "Diode_SMD:D_SOT-23_ANK" H 5400 3250 50  0001 C CNN
F 3 "https://diotec.com/tl_files/diotec/files/pdf/datasheets/bzx84c2v4.pdf" H 5400 3250 50  0001 C CNN
F 4 "ON Semiconductor" H 5400 3250 50  0001 C CNN "Manufacturer"
F 5 "BZX84C2V7LT1G" H 5400 3250 50  0001 C CNN "PartNumber"
	1    5400 3250
	0    1    1    0   
$EndComp
$Comp
L Device:R R131
U 1 1 5D7C3FC2
P 4900 3000
F 0 "R131" V 4693 3000 50  0000 C CNN
F 1 "1k" V 4784 3000 50  0000 C CNN
F 2 "Resistor_SMD:R_0402_1005Metric" V 4830 3000 50  0001 C CNN
F 3 "~" H 4900 3000 50  0001 C CNN
F 4 "Delta Electronics/Cyntec" H 4900 3000 50  0001 C CNN "Manufacturer"
F 5 "PFR05S-102-FNH" H 4900 3000 50  0001 C CNN "PartNumber"
	1    4900 3000
	0    1    1    0   
$EndComp
Wire Wire Line
	5400 3100 5400 3000
Wire Wire Line
	5400 3000 5050 3000
Wire Wire Line
	4750 3000 4650 3000
$Comp
L power:GND #PWR?
U 1 1 5D7F22B0
P 5400 3500
F 0 "#PWR?" H 5400 3250 50  0001 C CNN
F 1 "GND" H 5405 3327 50  0000 C CNN
F 2 "" H 5400 3500 50  0001 C CNN
F 3 "" H 5400 3500 50  0001 C CNN
	1    5400 3500
	1    0    0    -1  
$EndComp
Wire Wire Line
	5400 3500 5400 3400
Connection ~ 5400 3000
Wire Wire Line
	5600 3000 5400 3000
Text Label 5450 3000 0    50   ~ 0
fan_tach
Text Label 4250 2450 0    50   ~ 0
fan_tach_in
Text Label 4700 3000 1    50   ~ 0
fan_tach_mid
$Comp
L Mechanical:MountingHole_Pad H101
U 1 1 5D871389
P 7000 6050
F 0 "H101" H 7100 6099 50  0000 L CNN
F 1 "MountingHole_Pad" H 7100 6008 50  0000 L CNN
F 2 "MountingHole:MountingHole_3.2mm_M3_ISO7380_Pad" H 7000 6050 50  0001 C CNN
F 3 "~" H 7000 6050 50  0001 C CNN
	1    7000 6050
	1    0    0    -1  
$EndComp
$Comp
L Mechanical:MountingHole_Pad H102
U 1 1 5D8718A0
P 8000 6050
F 0 "H102" H 8100 6099 50  0000 L CNN
F 1 "MountingHole_Pad" H 8100 6008 50  0000 L CNN
F 2 "MountingHole:MountingHole_3.2mm_M3_ISO7380_Pad" H 8000 6050 50  0001 C CNN
F 3 "~" H 8000 6050 50  0001 C CNN
	1    8000 6050
	1    0    0    -1  
$EndComp
$Comp
L Mechanical:MountingHole_Pad H103
U 1 1 5D872CDD
P 9000 6050
F 0 "H103" H 9100 6099 50  0000 L CNN
F 1 "MountingHole_Pad" H 9100 6008 50  0000 L CNN
F 2 "MountingHole:MountingHole_3.2mm_M3_ISO7380_Pad" H 9000 6050 50  0001 C CNN
F 3 "~" H 9000 6050 50  0001 C CNN
	1    9000 6050
	1    0    0    -1  
$EndComp
$Comp
L Mechanical:MountingHole_Pad H104
U 1 1 5D87327C
P 10000 6050
F 0 "H104" H 10100 6099 50  0000 L CNN
F 1 "MountingHole_Pad" H 10100 6008 50  0000 L CNN
F 2 "MountingHole:MountingHole_3.2mm_M3_ISO7380_Pad" H 10000 6050 50  0001 C CNN
F 3 "~" H 10000 6050 50  0001 C CNN
	1    10000 6050
	1    0    0    -1  
$EndComp
$Comp
L power:GND #PWR?
U 1 1 5D87A5B1
P 7000 6250
F 0 "#PWR?" H 7000 6000 50  0001 C CNN
F 1 "GND" H 7005 6077 50  0000 C CNN
F 2 "" H 7000 6250 50  0001 C CNN
F 3 "" H 7000 6250 50  0001 C CNN
	1    7000 6250
	1    0    0    -1  
$EndComp
Wire Wire Line
	7000 6250 7000 6150
$Comp
L power:GND #PWR?
U 1 1 5D8969EB
P 8000 6250
F 0 "#PWR?" H 8000 6000 50  0001 C CNN
F 1 "GND" H 8005 6077 50  0000 C CNN
F 2 "" H 8000 6250 50  0001 C CNN
F 3 "" H 8000 6250 50  0001 C CNN
	1    8000 6250
	1    0    0    -1  
$EndComp
Wire Wire Line
	8000 6250 8000 6150
$Comp
L power:GND #PWR?
U 1 1 5D8AD3D7
P 9000 6250
F 0 "#PWR?" H 9000 6000 50  0001 C CNN
F 1 "GND" H 9005 6077 50  0000 C CNN
F 2 "" H 9000 6250 50  0001 C CNN
F 3 "" H 9000 6250 50  0001 C CNN
	1    9000 6250
	1    0    0    -1  
$EndComp
Wire Wire Line
	9000 6250 9000 6150
$Comp
L power:GND #PWR?
U 1 1 5D8C3F4B
P 10000 6250
F 0 "#PWR?" H 10000 6000 50  0001 C CNN
F 1 "GND" H 10005 6077 50  0000 C CNN
F 2 "" H 10000 6250 50  0001 C CNN
F 3 "" H 10000 6250 50  0001 C CNN
	1    10000 6250
	1    0    0    -1  
$EndComp
Wire Wire Line
	10000 6250 10000 6150
Wire Wire Line
	5900 1150 5900 1450
$Comp
L Device:R R136
U 1 1 5D5FB67C
P 6150 2550
F 0 "R136" V 5943 2550 50  0000 C CNN
F 1 "50m" V 6034 2550 50  0000 C CNN
F 2 "Resistor_SMD:R_0612_1632Metric" V 6080 2550 50  0001 C CNN
F 3 "~" H 6150 2550 50  0001 C CNN
F 4 "Panasonic Electronic Components" H 6150 2550 50  0001 C CNN "Manufacturer"
F 5 "ERJ-B2CFR05V" H 6150 2550 50  0001 C CNN "PartNumber"
	1    6150 2550
	0    1    1    0   
$EndComp
Wire Wire Line
	6000 2550 5900 2550
Wire Wire Line
	6000 2050 5900 2050
Connection ~ 5900 2050
Wire Wire Line
	5900 2050 5900 2550
Wire Wire Line
	6000 1450 5900 1450
Connection ~ 5900 1450
Wire Wire Line
	5900 1450 5900 2050
Wire Wire Line
	6000 1150 5900 1150
Connection ~ 5900 1150
$Comp
L Device:R R135
U 1 1 5D6B924F
P 6150 2050
F 0 "R135" V 5943 2050 50  0000 C CNN
F 1 "50m" V 6034 2050 50  0000 C CNN
F 2 "Resistor_SMD:R_0612_1632Metric" V 6080 2050 50  0001 C CNN
F 3 "~" H 6150 2050 50  0001 C CNN
F 4 "Panasonic Electronic Components" H 6150 2050 50  0001 C CNN "Manufacturer"
F 5 "ERJ-B2CFR05V" H 6150 2050 50  0001 C CNN "PartNumber"
	1    6150 2050
	0    1    1    0   
$EndComp
$Comp
L Device:R R134
U 1 1 5D6B9B01
P 6150 1450
F 0 "R134" V 5943 1450 50  0000 C CNN
F 1 "5m" V 6034 1450 50  0000 C CNN
F 2 "Resistor_SMD:R_0612_1632Metric" V 6080 1450 50  0001 C CNN
F 3 "~" H 6150 1450 50  0001 C CNN
F 4 "Bourns Inc." H 6150 1450 50  0001 C CNN "Manufacturer"
F 5 "CFG0612-FX-R005ELF" H 6150 1450 50  0001 C CNN "PartNumber"
	1    6150 1450
	0    1    1    0   
$EndComp
$Comp
L Device:R R133
U 1 1 5D6BA276
P 6150 1150
F 0 "R133" V 5943 1150 50  0000 C CNN
F 1 "50m" V 6034 1150 50  0000 C CNN
F 2 "Resistor_SMD:R_0612_1632Metric" V 6080 1150 50  0001 C CNN
F 3 "~" H 6150 1150 50  0001 C CNN
F 4 "Panasonic Electronic Components" H 6150 1150 50  0001 C CNN "Manufacturer"
F 5 "ERJ-B2CFR05V" H 6150 1150 50  0001 C CNN "PartNumber"
	1    6150 1150
	0    1    1    0   
$EndComp
$Comp
L Device:R R132
U 1 1 5D6BB111
P 3200 3150
F 0 "R132" H 3130 3104 50  0000 R CNN
F 1 "50m" H 3130 3195 50  0000 R CNN
F 2 "Resistor_SMD:R_0612_1632Metric" V 3130 3150 50  0001 C CNN
F 3 "~" H 3200 3150 50  0001 C CNN
F 4 "Panasonic Electronic Components" H 3200 3150 50  0001 C CNN "Manufacturer"
F 5 "ERJ-B2CFR05V" H 3200 3150 50  0001 C CNN "PartNumber"
	1    3200 3150
	-1   0    0    1   
$EndComp
Connection ~ 3200 3300
Wire Wire Line
	3200 3000 3200 2950
$Comp
L Connector:TestPoint TP107
U 1 1 5D6D7453
P 5900 900
F 0 "TP107" H 5958 1018 50  0000 L CNN
F 1 "TestPoint" H 5958 927 50  0000 L CNN
F 2 "TestPoint:TestPoint_Pad_D1.0mm" H 6100 900 50  0001 C CNN
F 3 "~" H 6100 900 50  0001 C CNN
	1    5900 900 
	1    0    0    -1  
$EndComp
Wire Wire Line
	5900 900  5900 1150
Wire Wire Line
	6300 1150 6350 1150
Wire Wire Line
	6300 1450 6350 1450
Wire Wire Line
	6300 2050 6350 2050
Wire Wire Line
	6300 2550 6350 2550
$Comp
L Connector:TestPoint TP108
U 1 1 5D714556
P 6350 1150
F 0 "TP108" H 6408 1268 50  0000 L CNN
F 1 "TestPoint" H 6408 1177 50  0000 L CNN
F 2 "TestPoint:TestPoint_Pad_D1.0mm" H 6550 1150 50  0001 C CNN
F 3 "~" H 6550 1150 50  0001 C CNN
	1    6350 1150
	1    0    0    -1  
$EndComp
Connection ~ 6350 1150
Wire Wire Line
	6350 1150 7650 1150
$Comp
L Connector:TestPoint TP109
U 1 1 5D714A15
P 6350 1450
F 0 "TP109" H 6408 1568 50  0000 L CNN
F 1 "TestPoint" H 6408 1477 50  0000 L CNN
F 2 "TestPoint:TestPoint_Pad_D1.0mm" H 6550 1450 50  0001 C CNN
F 3 "~" H 6550 1450 50  0001 C CNN
	1    6350 1450
	1    0    0    -1  
$EndComp
Connection ~ 6350 1450
Wire Wire Line
	6350 1450 7650 1450
$Comp
L Connector:TestPoint TP110
U 1 1 5D714D69
P 6350 2050
F 0 "TP110" H 6408 2168 50  0000 L CNN
F 1 "TestPoint" H 6408 2077 50  0000 L CNN
F 2 "TestPoint:TestPoint_Pad_D1.0mm" H 6550 2050 50  0001 C CNN
F 3 "~" H 6550 2050 50  0001 C CNN
	1    6350 2050
	1    0    0    -1  
$EndComp
Connection ~ 6350 2050
Wire Wire Line
	6350 2050 6800 2050
$Comp
L Connector:TestPoint TP111
U 1 1 5D715194
P 6350 2550
F 0 "TP111" H 6408 2668 50  0000 L CNN
F 1 "TestPoint" H 6408 2577 50  0000 L CNN
F 2 "TestPoint:TestPoint_Pad_D1.0mm" H 6550 2550 50  0001 C CNN
F 3 "~" H 6550 2550 50  0001 C CNN
	1    6350 2550
	1    0    0    -1  
$EndComp
Connection ~ 6350 2550
Wire Wire Line
	6350 2550 6800 2550
$Comp
L Connector:TestPoint TP105
U 1 1 5D71553A
P 2550 3300
F 0 "TP105" H 2608 3418 50  0000 L CNN
F 1 "TestPoint" H 2608 3327 50  0000 L CNN
F 2 "TestPoint:TestPoint_Pad_D1.0mm" H 2750 3300 50  0001 C CNN
F 3 "~" H 2750 3300 50  0001 C CNN
	1    2550 3300
	1    0    0    -1  
$EndComp
$Comp
L Connector:TestPoint TP106
U 1 1 5D71774F
P 2650 2950
F 0 "TP106" H 2708 3068 50  0000 L CNN
F 1 "TestPoint" H 2708 2977 50  0000 L CNN
F 2 "TestPoint:TestPoint_Pad_D1.0mm" H 2850 2950 50  0001 C CNN
F 3 "~" H 2850 2950 50  0001 C CNN
	1    2650 2950
	1    0    0    -1  
$EndComp
Wire Wire Line
	2650 2950 3200 2950
Text Label 3200 3450 0    50   ~ 0
VDD_LNA_meas
Text Label 6800 1150 0    50   ~ 0
PA_meas_bias
Text Label 6800 1450 0    50   ~ 0
PA_meas_3
Text Label 6800 2050 1    50   ~ 0
PA_meas_2
Text Label 6800 2550 1    50   ~ 0
PA_meas_1
$Comp
L Mechanical:MountingHole_Pad H105
U 1 1 5D70ED26
P 7600 6700
F 0 "H105" H 7700 6749 50  0000 L CNN
F 1 "MountingHole_Pad" H 7700 6658 50  0000 L CNN
F 2 "MountingHole:MountingHole_3.2mm_M3_ISO7380_Pad" H 7600 6700 50  0001 C CNN
F 3 "~" H 7600 6700 50  0001 C CNN
	1    7600 6700
	1    0    0    -1  
$EndComp
$Comp
L Mechanical:MountingHole_Pad H106
U 1 1 5D70ED30
P 8600 6700
F 0 "H106" H 8700 6749 50  0000 L CNN
F 1 "MountingHole_Pad" H 8700 6658 50  0000 L CNN
F 2 "MountingHole:MountingHole_3.2mm_M3_ISO7380_Pad" H 8600 6700 50  0001 C CNN
F 3 "~" H 8600 6700 50  0001 C CNN
	1    8600 6700
	1    0    0    -1  
$EndComp
$Comp
L Mechanical:MountingHole_Pad H107
U 1 1 5D70ED3A
P 9600 6700
F 0 "H107" H 9700 6749 50  0000 L CNN
F 1 "MountingHole_Pad" H 9700 6658 50  0000 L CNN
F 2 "MountingHole:MountingHole_3.2mm_M3_ISO7380_Pad" H 9600 6700 50  0001 C CNN
F 3 "~" H 9600 6700 50  0001 C CNN
	1    9600 6700
	1    0    0    -1  
$EndComp
$Comp
L Mechanical:MountingHole_Pad H108
U 1 1 5D70ED44
P 10600 6700
F 0 "H108" H 10700 6749 50  0000 L CNN
F 1 "MountingHole_Pad" H 10700 6658 50  0000 L CNN
F 2 "MountingHole:MountingHole_3.2mm_M3_ISO7380_Pad" H 10600 6700 50  0001 C CNN
F 3 "~" H 10600 6700 50  0001 C CNN
	1    10600 6700
	1    0    0    -1  
$EndComp
Wire Wire Line
	10600 6900 10600 6800
Wire Wire Line
	9600 6900 9600 6800
Wire Wire Line
	8600 6900 8600 6800
Wire Wire Line
	7600 6900 7600 6800
$Comp
L power:GND #PWR?
U 1 1 5D765850
P 7600 6900
F 0 "#PWR?" H 7600 6650 50  0001 C CNN
F 1 "GND" H 7605 6727 50  0000 C CNN
F 2 "" H 7600 6900 50  0001 C CNN
F 3 "" H 7600 6900 50  0001 C CNN
	1    7600 6900
	1    0    0    -1  
$EndComp
$Comp
L power:GND #PWR?
U 1 1 5D76585A
P 8600 6900
F 0 "#PWR?" H 8600 6650 50  0001 C CNN
F 1 "GND" H 8605 6727 50  0000 C CNN
F 2 "" H 8600 6900 50  0001 C CNN
F 3 "" H 8600 6900 50  0001 C CNN
	1    8600 6900
	1    0    0    -1  
$EndComp
$Comp
L power:GND #PWR?
U 1 1 5D765864
P 9600 6900
F 0 "#PWR?" H 9600 6650 50  0001 C CNN
F 1 "GND" H 9605 6727 50  0000 C CNN
F 2 "" H 9600 6900 50  0001 C CNN
F 3 "" H 9600 6900 50  0001 C CNN
	1    9600 6900
	1    0    0    -1  
$EndComp
$Comp
L power:GND #PWR?
U 1 1 5D76586E
P 10600 6900
F 0 "#PWR?" H 10600 6650 50  0001 C CNN
F 1 "GND" H 10605 6727 50  0000 C CNN
F 2 "" H 10600 6900 50  0001 C CNN
F 3 "" H 10600 6900 50  0001 C CNN
	1    10600 6900
	1    0    0    -1  
$EndComp
$EndSCHEMATC
