EESchema Schematic File Version 4
EELAYER 30 0
EELAYER END
$Descr A4 11693 8268
encoding utf-8
Sheet 24 39
Title ""
Date ""
Rev ""
Comp ""
Comment1 ""
Comment2 ""
Comment3 ""
Comment4 ""
$EndDescr
Text HLabel 1500 750  0    50   Input ~ 0
VSENSE_PA_IN
$Comp
L 000_PreferredParts:C_100nF C2401
U 1 1 611AECC6
P 1750 1000
F 0 "C2401" H 1865 1046 50  0000 L CNN
F 1 "C_100nF" H 1775 900 50  0001 L CNN
F 2 "Capacitor_SMD:C_0402_1005Metric" H 1788 850 50  0001 C CNN
F 3 "~" H 1750 1000 50  0001 C CNN
F 4 "100nF" H 1865 955 50  0000 L CNN "DisplayValue"
F 5 "3000-0000000125" H 1750 1000 50  0001 C CNN "PartSpecification"
	1    1750 1000
	1    0    0    -1  
$EndComp
$Comp
L power:GND #PWR?
U 1 1 611AF64E
P 1750 1250
F 0 "#PWR?" H 1750 1000 50  0001 C CNN
F 1 "GND" H 1755 1077 50  0000 C CNN
F 2 "" H 1750 1250 50  0001 C CNN
F 3 "" H 1750 1250 50  0001 C CNN
	1    1750 1250
	1    0    0    -1  
$EndComp
Wire Wire Line
	1750 1250 1750 1150
Wire Wire Line
	1750 850  1750 750 
Wire Wire Line
	1750 750  1500 750 
Text HLabel 2000 750  2    50   Output ~ 0
VSENSE_PA_OUT
Wire Wire Line
	2000 750  1750 750 
Connection ~ 1750 750 
Text HLabel 1500 1750 0    50   Input ~ 0
VSENSE_4_8_IN
$Comp
L 000_PreferredParts:C_100nF C2406
U 1 1 611B130C
P 1750 2000
F 0 "C2406" H 1865 2046 50  0000 L CNN
F 1 "C_100nF" H 1775 1900 50  0001 L CNN
F 2 "Capacitor_SMD:C_0402_1005Metric" H 1788 1850 50  0001 C CNN
F 3 "~" H 1750 2000 50  0001 C CNN
F 4 "100nF" H 1865 1955 50  0000 L CNN "DisplayValue"
F 5 "3000-0000000125" H 1750 2000 50  0001 C CNN "PartSpecification"
	1    1750 2000
	1    0    0    -1  
$EndComp
$Comp
L power:GND #PWR?
U 1 1 611B1312
P 1750 2250
F 0 "#PWR?" H 1750 2000 50  0001 C CNN
F 1 "GND" H 1755 2077 50  0000 C CNN
F 2 "" H 1750 2250 50  0001 C CNN
F 3 "" H 1750 2250 50  0001 C CNN
	1    1750 2250
	1    0    0    -1  
$EndComp
Wire Wire Line
	1750 2250 1750 2150
Wire Wire Line
	1750 1850 1750 1750
Wire Wire Line
	1750 1750 1500 1750
Text HLabel 2000 1750 2    50   Output ~ 0
VSENSE_4_8_OUT
Wire Wire Line
	2000 1750 1750 1750
Connection ~ 1750 1750
Text HLabel 1500 2750 0    50   Input ~ 0
VSENSE_3_3VFR_IN
$Comp
L 000_PreferredParts:C_100nF C2413
U 1 1 611B297D
P 1750 3000
F 0 "C2413" H 1865 3046 50  0000 L CNN
F 1 "C_100nF" H 1775 2900 50  0001 L CNN
F 2 "Capacitor_SMD:C_0402_1005Metric" H 1788 2850 50  0001 C CNN
F 3 "~" H 1750 3000 50  0001 C CNN
F 4 "100nF" H 1865 2955 50  0000 L CNN "DisplayValue"
F 5 "3000-0000000125" H 1750 3000 50  0001 C CNN "PartSpecification"
	1    1750 3000
	1    0    0    -1  
$EndComp
$Comp
L power:GND #PWR?
U 1 1 611B2983
P 1750 3250
F 0 "#PWR?" H 1750 3000 50  0001 C CNN
F 1 "GND" H 1755 3077 50  0000 C CNN
F 2 "" H 1750 3250 50  0001 C CNN
F 3 "" H 1750 3250 50  0001 C CNN
	1    1750 3250
	1    0    0    -1  
$EndComp
Wire Wire Line
	1750 3250 1750 3150
Wire Wire Line
	1750 2850 1750 2750
Wire Wire Line
	1750 2750 1500 2750
Text HLabel 2000 2750 2    50   Output ~ 0
VSENSE_3_3VRF_OUT
Wire Wire Line
	2000 2750 1750 2750
Connection ~ 1750 2750
Text HLabel 1500 3750 0    50   Input ~ 0
VSENSE_LNA_IN
$Comp
L 000_PreferredParts:C_100nF C2417
U 1 1 611B3278
P 1750 4000
F 0 "C2417" H 1865 4046 50  0000 L CNN
F 1 "C_100nF" H 1775 3900 50  0001 L CNN
F 2 "Capacitor_SMD:C_0402_1005Metric" H 1788 3850 50  0001 C CNN
F 3 "~" H 1750 4000 50  0001 C CNN
F 4 "100nF" H 1865 3955 50  0000 L CNN "DisplayValue"
F 5 "3000-0000000125" H 1750 4000 50  0001 C CNN "PartSpecification"
	1    1750 4000
	1    0    0    -1  
$EndComp
$Comp
L power:GND #PWR?
U 1 1 611B327E
P 1750 4250
F 0 "#PWR?" H 1750 4000 50  0001 C CNN
F 1 "GND" H 1755 4077 50  0000 C CNN
F 2 "" H 1750 4250 50  0001 C CNN
F 3 "" H 1750 4250 50  0001 C CNN
	1    1750 4250
	1    0    0    -1  
$EndComp
Wire Wire Line
	1750 4250 1750 4150
Wire Wire Line
	1750 3850 1750 3750
Wire Wire Line
	1750 3750 1500 3750
Text HLabel 2000 3750 2    50   Output ~ 0
VSENSE_LNA_OUT
Wire Wire Line
	2000 3750 1750 3750
Connection ~ 1750 3750
Text HLabel 1500 4750 0    50   Input ~ 0
VSENSE_LNA_BIAS_IN
$Comp
L power:GND #PWR?
U 1 1 611B3CCE
P 1750 5250
F 0 "#PWR?" H 1750 5000 50  0001 C CNN
F 1 "GND" H 1755 5077 50  0000 C CNN
F 2 "" H 1750 5250 50  0001 C CNN
F 3 "" H 1750 5250 50  0001 C CNN
	1    1750 5250
	1    0    0    -1  
$EndComp
Wire Wire Line
	1750 5250 1750 5150
Wire Wire Line
	1750 4850 1750 4750
Wire Wire Line
	1750 4750 1500 4750
Text HLabel 2000 4750 2    50   Output ~ 0
VSENSE_LNA_BIAS_OUT
Wire Wire Line
	2000 4750 1750 4750
Connection ~ 1750 4750
Text HLabel 1500 5750 0    50   Input ~ 0
VSENSE_12_IN
$Comp
L 000_PreferredParts:C_100nF C2426
U 1 1 611B4C18
P 1750 6000
F 0 "C2426" H 1865 6046 50  0000 L CNN
F 1 "C_100nF" H 1775 5900 50  0001 L CNN
F 2 "Capacitor_SMD:C_0402_1005Metric" H 1788 5850 50  0001 C CNN
F 3 "~" H 1750 6000 50  0001 C CNN
F 4 "100nF" H 1865 5955 50  0000 L CNN "DisplayValue"
F 5 "3000-0000000125" H 1750 6000 50  0001 C CNN "PartSpecification"
	1    1750 6000
	1    0    0    -1  
$EndComp
$Comp
L power:GND #PWR?
U 1 1 611B4C1E
P 1750 6250
F 0 "#PWR?" H 1750 6000 50  0001 C CNN
F 1 "GND" H 1755 6077 50  0000 C CNN
F 2 "" H 1750 6250 50  0001 C CNN
F 3 "" H 1750 6250 50  0001 C CNN
	1    1750 6250
	1    0    0    -1  
$EndComp
Wire Wire Line
	1750 6250 1750 6150
Wire Wire Line
	1750 5850 1750 5750
Wire Wire Line
	1750 5750 1500 5750
Text HLabel 2000 5750 2    50   Output ~ 0
VSENSE_12_OUT
Wire Wire Line
	2000 5750 1750 5750
Connection ~ 1750 5750
Text HLabel 1500 6750 0    50   Input ~ 0
VSENSE_MAX10_6_IN
$Comp
L 000_PreferredParts:C_100nF C2430
U 1 1 611B54A7
P 1750 7000
F 0 "C2430" H 1865 7046 50  0000 L CNN
F 1 "C_100nF" H 1775 6900 50  0001 L CNN
F 2 "Capacitor_SMD:C_0402_1005Metric" H 1788 6850 50  0001 C CNN
F 3 "~" H 1750 7000 50  0001 C CNN
F 4 "100nF" H 1865 6955 50  0000 L CNN "DisplayValue"
F 5 "3000-0000000125" H 1750 7000 50  0001 C CNN "PartSpecification"
	1    1750 7000
	1    0    0    -1  
$EndComp
$Comp
L power:GND #PWR?
U 1 1 611B54AD
P 1750 7250
F 0 "#PWR?" H 1750 7000 50  0001 C CNN
F 1 "GND" H 1755 7077 50  0000 C CNN
F 2 "" H 1750 7250 50  0001 C CNN
F 3 "" H 1750 7250 50  0001 C CNN
	1    1750 7250
	1    0    0    -1  
$EndComp
Wire Wire Line
	1750 7250 1750 7150
Wire Wire Line
	1750 6850 1750 6750
Wire Wire Line
	1750 6750 1500 6750
Text HLabel 2000 6750 2    50   Output ~ 0
VSENSE_MAX10_6_OUT
Wire Wire Line
	2000 6750 1750 6750
Connection ~ 1750 6750
$Comp
L 000_PreferredParts:C_1uF C2422
U 1 1 611B59E8
P 1750 5000
F 0 "C2422" H 1865 5046 50  0000 L CNN
F 1 "C_1uF" H 1865 4955 50  0000 L CNN
F 2 "Capacitor_SMD:C_0603_1608Metric" H 1788 4850 50  0001 C CNN
F 3 "~" H 1750 5000 50  0001 C CNN
F 4 "3000-0000000136" H 1750 5000 50  0001 C CNN "PartSpecification"
	1    1750 5000
	1    0    0    -1  
$EndComp
Text HLabel 2750 1250 0    50   Input ~ 0
VSENSE_1_2_IN
$Comp
L 000_PreferredParts:C_100nF C2404
U 1 1 611C72A0
P 3000 1500
F 0 "C2404" H 3115 1546 50  0000 L CNN
F 1 "C_100nF" H 3025 1400 50  0001 L CNN
F 2 "Capacitor_SMD:C_0402_1005Metric" H 3038 1350 50  0001 C CNN
F 3 "~" H 3000 1500 50  0001 C CNN
F 4 "100nF" H 3115 1455 50  0000 L CNN "DisplayValue"
F 5 "3000-0000000125" H 3000 1500 50  0001 C CNN "PartSpecification"
	1    3000 1500
	1    0    0    -1  
$EndComp
$Comp
L power:GND #PWR?
U 1 1 611C72A6
P 3000 1750
F 0 "#PWR?" H 3000 1500 50  0001 C CNN
F 1 "GND" H 3005 1577 50  0000 C CNN
F 2 "" H 3000 1750 50  0001 C CNN
F 3 "" H 3000 1750 50  0001 C CNN
	1    3000 1750
	1    0    0    -1  
$EndComp
Wire Wire Line
	3000 1750 3000 1650
Wire Wire Line
	3000 1350 3000 1250
Wire Wire Line
	3000 1250 2750 1250
Text HLabel 3250 1250 2    50   Output ~ 0
VSENSE_1_2_OUT
Wire Wire Line
	3250 1250 3000 1250
Connection ~ 3000 1250
Text HLabel 2750 2250 0    50   Input ~ 0
VSENSE_2_5_IN
$Comp
L 000_PreferredParts:C_100nF C2411
U 1 1 611C72B5
P 3000 2500
F 0 "C2411" H 3115 2546 50  0000 L CNN
F 1 "C_100nF" H 3025 2400 50  0001 L CNN
F 2 "Capacitor_SMD:C_0402_1005Metric" H 3038 2350 50  0001 C CNN
F 3 "~" H 3000 2500 50  0001 C CNN
F 4 "100nF" H 3115 2455 50  0000 L CNN "DisplayValue"
F 5 "3000-0000000125" H 3000 2500 50  0001 C CNN "PartSpecification"
	1    3000 2500
	1    0    0    -1  
$EndComp
$Comp
L power:GND #PWR?
U 1 1 611C72BB
P 3000 2750
F 0 "#PWR?" H 3000 2500 50  0001 C CNN
F 1 "GND" H 3005 2577 50  0000 C CNN
F 2 "" H 3000 2750 50  0001 C CNN
F 3 "" H 3000 2750 50  0001 C CNN
	1    3000 2750
	1    0    0    -1  
$EndComp
Wire Wire Line
	3000 2750 3000 2650
Wire Wire Line
	3000 2350 3000 2250
Wire Wire Line
	3000 2250 2750 2250
Text HLabel 3250 2250 2    50   Output ~ 0
VSENSE_2_5_OUT
Wire Wire Line
	3250 2250 3000 2250
Connection ~ 3000 2250
Text HLabel 2750 3250 0    50   Input ~ 0
VSENSE_2_5A_IN
$Comp
L 000_PreferredParts:C_100nF C2416
U 1 1 611C72CA
P 3000 3500
F 0 "C2416" H 3115 3546 50  0000 L CNN
F 1 "C_100nF" H 3025 3400 50  0001 L CNN
F 2 "Capacitor_SMD:C_0402_1005Metric" H 3038 3350 50  0001 C CNN
F 3 "~" H 3000 3500 50  0001 C CNN
F 4 "100nF" H 3115 3455 50  0000 L CNN "DisplayValue"
F 5 "3000-0000000125" H 3000 3500 50  0001 C CNN "PartSpecification"
	1    3000 3500
	1    0    0    -1  
$EndComp
$Comp
L power:GND #PWR?
U 1 1 611C72D0
P 3000 3750
F 0 "#PWR?" H 3000 3500 50  0001 C CNN
F 1 "GND" H 3005 3577 50  0000 C CNN
F 2 "" H 3000 3750 50  0001 C CNN
F 3 "" H 3000 3750 50  0001 C CNN
	1    3000 3750
	1    0    0    -1  
$EndComp
Wire Wire Line
	3000 3750 3000 3650
Wire Wire Line
	3000 3350 3000 3250
Wire Wire Line
	3000 3250 2750 3250
Text HLabel 3250 3250 2    50   Output ~ 0
VSENSE_2_5A_OUT
Wire Wire Line
	3250 3250 3000 3250
Connection ~ 3000 3250
Text HLabel 2750 4250 0    50   Input ~ 0
ISENSE_VCC1_IN
$Comp
L 000_PreferredParts:C_100nF C2420
U 1 1 611C7D08
P 3250 4500
F 0 "C2420" H 3365 4546 50  0000 L CNN
F 1 "C_100nF" H 3275 4400 50  0001 L CNN
F 2 "Capacitor_SMD:C_0402_1005Metric" H 3288 4350 50  0001 C CNN
F 3 "~" H 3250 4500 50  0001 C CNN
F 4 "100nF" H 3365 4455 50  0000 L CNN "DisplayValue"
F 5 "3000-0000000125" H 3250 4500 50  0001 C CNN "PartSpecification"
	1    3250 4500
	1    0    0    -1  
$EndComp
$Comp
L power:GND #PWR?
U 1 1 611C7D0E
P 3250 4750
F 0 "#PWR?" H 3250 4500 50  0001 C CNN
F 1 "GND" H 3255 4577 50  0000 C CNN
F 2 "" H 3250 4750 50  0001 C CNN
F 3 "" H 3250 4750 50  0001 C CNN
	1    3250 4750
	1    0    0    -1  
$EndComp
Wire Wire Line
	3250 4750 3250 4650
Wire Wire Line
	3250 4350 3250 4250
Text HLabel 3500 4250 2    50   Output ~ 0
ISENSE_VCC1_OUT
Wire Wire Line
	3500 4250 3250 4250
$Comp
L Device:R R2410
U 1 1 611CA230
P 3000 4250
F 0 "R2410" V 2793 4250 50  0000 C CNN
F 1 "3k" V 2884 4250 50  0000 C CNN
F 2 "Resistor_SMD:R_0402_1005Metric" V 2930 4250 50  0001 C CNN
F 3 "~" H 3000 4250 50  0001 C CNN
F 4 "3000-0000000230" H 3000 4250 50  0001 C CNN "PartSpecification"
	1    3000 4250
	0    1    1    0   
$EndComp
Wire Wire Line
	3150 4250 3250 4250
Connection ~ 3250 4250
Wire Wire Line
	2750 4250 2850 4250
Text HLabel 2750 5250 0    50   Input ~ 0
ISENSE_VCC2_IN
$Comp
L 000_PreferredParts:C_100nF C2424
U 1 1 611DCEAD
P 3250 5500
F 0 "C2424" H 3365 5546 50  0000 L CNN
F 1 "C_100nF" H 3275 5400 50  0001 L CNN
F 2 "Capacitor_SMD:C_0402_1005Metric" H 3288 5350 50  0001 C CNN
F 3 "~" H 3250 5500 50  0001 C CNN
F 4 "100nF" H 3365 5455 50  0000 L CNN "DisplayValue"
F 5 "3000-0000000125" H 3250 5500 50  0001 C CNN "PartSpecification"
	1    3250 5500
	1    0    0    -1  
$EndComp
$Comp
L power:GND #PWR?
U 1 1 611DCEB3
P 3250 5750
F 0 "#PWR?" H 3250 5500 50  0001 C CNN
F 1 "GND" H 3255 5577 50  0000 C CNN
F 2 "" H 3250 5750 50  0001 C CNN
F 3 "" H 3250 5750 50  0001 C CNN
	1    3250 5750
	1    0    0    -1  
$EndComp
Wire Wire Line
	3250 5750 3250 5650
Wire Wire Line
	3250 5350 3250 5250
Text HLabel 3500 5250 2    50   Output ~ 0
ISENSE_VCC2_OUT
Wire Wire Line
	3500 5250 3250 5250
$Comp
L Device:R R2413
U 1 1 611DCEBD
P 3000 5250
F 0 "R2413" V 2793 5250 50  0000 C CNN
F 1 "3k" V 2884 5250 50  0000 C CNN
F 2 "Resistor_SMD:R_0402_1005Metric" V 2930 5250 50  0001 C CNN
F 3 "~" H 3000 5250 50  0001 C CNN
F 4 "3000-0000000230" H 3000 5250 50  0001 C CNN "PartSpecification"
	1    3000 5250
	0    1    1    0   
$EndComp
Wire Wire Line
	3150 5250 3250 5250
Connection ~ 3250 5250
Wire Wire Line
	2750 5250 2850 5250
Text HLabel 2750 6250 0    50   Input ~ 0
ISENSE_VCC3_IN
$Comp
L 000_PreferredParts:C_100nF C2429
U 1 1 611DE8C7
P 3250 6500
F 0 "C2429" H 3365 6546 50  0000 L CNN
F 1 "C_100nF" H 3275 6400 50  0001 L CNN
F 2 "Capacitor_SMD:C_0402_1005Metric" H 3288 6350 50  0001 C CNN
F 3 "~" H 3250 6500 50  0001 C CNN
F 4 "100nF" H 3365 6455 50  0000 L CNN "DisplayValue"
F 5 "3000-0000000125" H 3250 6500 50  0001 C CNN "PartSpecification"
	1    3250 6500
	1    0    0    -1  
$EndComp
$Comp
L power:GND #PWR?
U 1 1 611DE8CD
P 3250 6750
F 0 "#PWR?" H 3250 6500 50  0001 C CNN
F 1 "GND" H 3255 6577 50  0000 C CNN
F 2 "" H 3250 6750 50  0001 C CNN
F 3 "" H 3250 6750 50  0001 C CNN
	1    3250 6750
	1    0    0    -1  
$EndComp
Wire Wire Line
	3250 6750 3250 6650
Wire Wire Line
	3250 6350 3250 6250
Text HLabel 3500 6250 2    50   Output ~ 0
ISENSE_VCC3_OUT
Wire Wire Line
	3500 6250 3250 6250
$Comp
L Device:R R2417
U 1 1 611DE8D7
P 3000 6250
F 0 "R2417" V 2793 6250 50  0000 C CNN
F 1 "3k" V 2884 6250 50  0000 C CNN
F 2 "Resistor_SMD:R_0402_1005Metric" V 2930 6250 50  0001 C CNN
F 3 "~" H 3000 6250 50  0001 C CNN
F 4 "3000-0000000230" H 3000 6250 50  0001 C CNN "PartSpecification"
	1    3000 6250
	0    1    1    0   
$EndComp
Wire Wire Line
	3150 6250 3250 6250
Connection ~ 3250 6250
Wire Wire Line
	2750 6250 2850 6250
Text HLabel 4500 750  0    50   Input ~ 0
ISENSE_VBIAS_IN
$Comp
L 000_PreferredParts:C_100nF C2402
U 1 1 611FDDCB
P 5000 1000
F 0 "C2402" H 5115 1046 50  0000 L CNN
F 1 "C_100nF" H 5025 900 50  0001 L CNN
F 2 "Capacitor_SMD:C_0402_1005Metric" H 5038 850 50  0001 C CNN
F 3 "~" H 5000 1000 50  0001 C CNN
F 4 "100nF" H 5115 955 50  0000 L CNN "DisplayValue"
F 5 "3000-0000000125" H 5000 1000 50  0001 C CNN "PartSpecification"
	1    5000 1000
	1    0    0    -1  
$EndComp
$Comp
L power:GND #PWR?
U 1 1 611FDDD1
P 5000 1250
F 0 "#PWR?" H 5000 1000 50  0001 C CNN
F 1 "GND" H 5005 1077 50  0000 C CNN
F 2 "" H 5000 1250 50  0001 C CNN
F 3 "" H 5000 1250 50  0001 C CNN
	1    5000 1250
	1    0    0    -1  
$EndComp
Wire Wire Line
	5000 1250 5000 1150
Wire Wire Line
	5000 850  5000 750 
Text HLabel 5250 750  2    50   Output ~ 0
ISENSE_VBIAS_OUT
Wire Wire Line
	5250 750  5000 750 
$Comp
L Device:R R2401
U 1 1 611FDDDB
P 4750 750
F 0 "R2401" V 4543 750 50  0000 C CNN
F 1 "3k" V 4634 750 50  0000 C CNN
F 2 "Resistor_SMD:R_0402_1005Metric" V 4680 750 50  0001 C CNN
F 3 "~" H 4750 750 50  0001 C CNN
F 4 "3000-0000000230" H 4750 750 50  0001 C CNN "PartSpecification"
	1    4750 750 
	0    1    1    0   
$EndComp
Wire Wire Line
	4900 750  5000 750 
Connection ~ 5000 750 
Wire Wire Line
	4500 750  4600 750 
Text HLabel 4500 1750 0    50   Input ~ 0
ISENSE_LNA_IN
$Comp
L 000_PreferredParts:C_100nF C2407
U 1 1 6120430F
P 5000 2000
F 0 "C2407" H 5115 2046 50  0000 L CNN
F 1 "C_100nF" H 5025 1900 50  0001 L CNN
F 2 "Capacitor_SMD:C_0402_1005Metric" H 5038 1850 50  0001 C CNN
F 3 "~" H 5000 2000 50  0001 C CNN
F 4 "100nF" H 5115 1955 50  0000 L CNN "DisplayValue"
F 5 "3000-0000000125" H 5000 2000 50  0001 C CNN "PartSpecification"
	1    5000 2000
	1    0    0    -1  
$EndComp
$Comp
L power:GND #PWR?
U 1 1 61204315
P 5000 2250
F 0 "#PWR?" H 5000 2000 50  0001 C CNN
F 1 "GND" H 5005 2077 50  0000 C CNN
F 2 "" H 5000 2250 50  0001 C CNN
F 3 "" H 5000 2250 50  0001 C CNN
	1    5000 2250
	1    0    0    -1  
$EndComp
Wire Wire Line
	5000 2250 5000 2150
Wire Wire Line
	5000 1850 5000 1750
Text HLabel 5250 1750 2    50   Output ~ 0
ISENSE_LNA_OUT
Wire Wire Line
	5250 1750 5000 1750
$Comp
L Device:R R2404
U 1 1 6120431F
P 4750 1750
F 0 "R2404" V 4543 1750 50  0000 C CNN
F 1 "3k" V 4634 1750 50  0000 C CNN
F 2 "Resistor_SMD:R_0402_1005Metric" V 4680 1750 50  0001 C CNN
F 3 "~" H 4750 1750 50  0001 C CNN
F 4 "3000-0000000230" H 4750 1750 50  0001 C CNN "PartSpecification"
	1    4750 1750
	0    1    1    0   
$EndComp
Wire Wire Line
	4900 1750 5000 1750
Connection ~ 5000 1750
Wire Wire Line
	4500 1750 4600 1750
Text HLabel 4500 2750 0    50   Input ~ 0
ISENSE_MAX10_6_IN
$Comp
L 000_PreferredParts:C_100nF C2414
U 1 1 6120FD09
P 5000 3000
F 0 "C2414" H 5115 3046 50  0000 L CNN
F 1 "C_100nF" H 5025 2900 50  0001 L CNN
F 2 "Capacitor_SMD:C_0402_1005Metric" H 5038 2850 50  0001 C CNN
F 3 "~" H 5000 3000 50  0001 C CNN
F 4 "100nF" H 5115 2955 50  0000 L CNN "DisplayValue"
F 5 "3000-0000000125" H 5000 3000 50  0001 C CNN "PartSpecification"
	1    5000 3000
	1    0    0    -1  
$EndComp
$Comp
L power:GND #PWR?
U 1 1 6120FD0F
P 5000 3250
F 0 "#PWR?" H 5000 3000 50  0001 C CNN
F 1 "GND" H 5005 3077 50  0000 C CNN
F 2 "" H 5000 3250 50  0001 C CNN
F 3 "" H 5000 3250 50  0001 C CNN
	1    5000 3250
	1    0    0    -1  
$EndComp
Wire Wire Line
	5000 3250 5000 3150
Wire Wire Line
	5000 2850 5000 2750
Text HLabel 5250 2750 2    50   Output ~ 0
ISENSE_MAX10_6_OUT
Wire Wire Line
	5250 2750 5000 2750
$Comp
L Device:R R2406
U 1 1 6120FD19
P 4750 2750
F 0 "R2406" V 4543 2750 50  0000 C CNN
F 1 "3k" V 4634 2750 50  0000 C CNN
F 2 "Resistor_SMD:R_0402_1005Metric" V 4680 2750 50  0001 C CNN
F 3 "~" H 4750 2750 50  0001 C CNN
F 4 "3000-0000000230" H 4750 2750 50  0001 C CNN "PartSpecification"
	1    4750 2750
	0    1    1    0   
$EndComp
Wire Wire Line
	4900 2750 5000 2750
Connection ~ 5000 2750
Wire Wire Line
	4500 2750 4600 2750
Text HLabel 4500 3750 0    50   Input ~ 0
ISENSE_1_2_IN
$Comp
L 000_PreferredParts:C_100nF C2418
U 1 1 61214E74
P 5000 4000
F 0 "C2418" H 5115 4046 50  0000 L CNN
F 1 "C_100nF" H 5025 3900 50  0001 L CNN
F 2 "Capacitor_SMD:C_0402_1005Metric" H 5038 3850 50  0001 C CNN
F 3 "~" H 5000 4000 50  0001 C CNN
F 4 "100nF" H 5115 3955 50  0000 L CNN "DisplayValue"
F 5 "3000-0000000125" H 5000 4000 50  0001 C CNN "PartSpecification"
	1    5000 4000
	1    0    0    -1  
$EndComp
$Comp
L power:GND #PWR?
U 1 1 61214E7A
P 5000 4250
F 0 "#PWR?" H 5000 4000 50  0001 C CNN
F 1 "GND" H 5005 4077 50  0000 C CNN
F 2 "" H 5000 4250 50  0001 C CNN
F 3 "" H 5000 4250 50  0001 C CNN
	1    5000 4250
	1    0    0    -1  
$EndComp
Wire Wire Line
	5000 4250 5000 4150
Wire Wire Line
	5000 3850 5000 3750
Text HLabel 5250 3750 2    50   Output ~ 0
ISENSE_1_2_OUT
Wire Wire Line
	5250 3750 5000 3750
$Comp
L Device:R R2408
U 1 1 61214E84
P 4750 3750
F 0 "R2408" V 4543 3750 50  0000 C CNN
F 1 "3k" V 4634 3750 50  0000 C CNN
F 2 "Resistor_SMD:R_0402_1005Metric" V 4680 3750 50  0001 C CNN
F 3 "~" H 4750 3750 50  0001 C CNN
F 4 "3000-0000000230" H 4750 3750 50  0001 C CNN "PartSpecification"
	1    4750 3750
	0    1    1    0   
$EndComp
Wire Wire Line
	4900 3750 5000 3750
Connection ~ 5000 3750
Wire Wire Line
	4500 3750 4600 3750
Text HLabel 4500 4750 0    50   Input ~ 0
ISENSE_2_5_IN
$Comp
L 000_PreferredParts:C_100nF C2423
U 1 1 61217843
P 5000 5000
F 0 "C2423" H 5115 5046 50  0000 L CNN
F 1 "C_100nF" H 5025 4900 50  0001 L CNN
F 2 "Capacitor_SMD:C_0402_1005Metric" H 5038 4850 50  0001 C CNN
F 3 "~" H 5000 5000 50  0001 C CNN
F 4 "100nF" H 5115 4955 50  0000 L CNN "DisplayValue"
F 5 "3000-0000000125" H 5000 5000 50  0001 C CNN "PartSpecification"
	1    5000 5000
	1    0    0    -1  
$EndComp
$Comp
L power:GND #PWR?
U 1 1 61217849
P 5000 5250
F 0 "#PWR?" H 5000 5000 50  0001 C CNN
F 1 "GND" H 5005 5077 50  0000 C CNN
F 2 "" H 5000 5250 50  0001 C CNN
F 3 "" H 5000 5250 50  0001 C CNN
	1    5000 5250
	1    0    0    -1  
$EndComp
Wire Wire Line
	5000 5250 5000 5150
Wire Wire Line
	5000 4850 5000 4750
Text HLabel 5250 4750 2    50   Output ~ 0
ISENSE_2_5_OUT
Wire Wire Line
	5250 4750 5000 4750
$Comp
L Device:R R2412
U 1 1 61217853
P 4750 4750
F 0 "R2412" V 4543 4750 50  0000 C CNN
F 1 "3k" V 4634 4750 50  0000 C CNN
F 2 "Resistor_SMD:R_0402_1005Metric" V 4680 4750 50  0001 C CNN
F 3 "~" H 4750 4750 50  0001 C CNN
F 4 "3000-0000000230" H 4750 4750 50  0001 C CNN "PartSpecification"
	1    4750 4750
	0    1    1    0   
$EndComp
Wire Wire Line
	4900 4750 5000 4750
Connection ~ 5000 4750
Wire Wire Line
	4500 4750 4600 4750
Text HLabel 4500 5750 0    50   Input ~ 0
ISENSE_2_5A_IN
$Comp
L 000_PreferredParts:C_100nF C2427
U 1 1 61219BAB
P 5000 6000
F 0 "C2427" H 5115 6046 50  0000 L CNN
F 1 "C_100nF" H 5025 5900 50  0001 L CNN
F 2 "Capacitor_SMD:C_0402_1005Metric" H 5038 5850 50  0001 C CNN
F 3 "~" H 5000 6000 50  0001 C CNN
F 4 "100nF" H 5115 5955 50  0000 L CNN "DisplayValue"
F 5 "3000-0000000125" H 5000 6000 50  0001 C CNN "PartSpecification"
	1    5000 6000
	1    0    0    -1  
$EndComp
$Comp
L power:GND #PWR?
U 1 1 61219BB1
P 5000 6250
F 0 "#PWR?" H 5000 6000 50  0001 C CNN
F 1 "GND" H 5005 6077 50  0000 C CNN
F 2 "" H 5000 6250 50  0001 C CNN
F 3 "" H 5000 6250 50  0001 C CNN
	1    5000 6250
	1    0    0    -1  
$EndComp
Wire Wire Line
	5000 6250 5000 6150
Wire Wire Line
	5000 5850 5000 5750
Text HLabel 5250 5750 2    50   Output ~ 0
ISENSE_2_5A_OUT
Wire Wire Line
	5250 5750 5000 5750
$Comp
L Device:R R2415
U 1 1 61219BBB
P 4750 5750
F 0 "R2415" V 4543 5750 50  0000 C CNN
F 1 "3k" V 4634 5750 50  0000 C CNN
F 2 "Resistor_SMD:R_0402_1005Metric" V 4680 5750 50  0001 C CNN
F 3 "~" H 4750 5750 50  0001 C CNN
F 4 "3000-0000000230" H 4750 5750 50  0001 C CNN "PartSpecification"
	1    4750 5750
	0    1    1    0   
$EndComp
Wire Wire Line
	4900 5750 5000 5750
Connection ~ 5000 5750
Wire Wire Line
	4500 5750 4600 5750
$Comp
L POWDER_Analog:TLV9004_SOIC_TSSOP U2401
U 1 1 6124C881
P 8700 750
F 0 "U2401" H 8712 1115 50  0000 C CNN
F 1 "TLV9004_SOIC_TSSOP" H 8712 1024 50  0000 C CNN
F 2 "Package_SO:SOIC-14_3.9x8.7mm_P1.27mm" H 8700 750 50  0001 C CNN
F 3 "" H 8700 750 50  0001 C CNN
F 4 "TLV9004QDRQ1" H 8700 750 50  0001 C CNN "PartNumber"
F 5 "3000-0000001315" H 8700 750 50  0001 C CNN "PartSpecification"
	1    8700 750 
	1    0    0    -1  
$EndComp
$Comp
L POWDER_Analog:TLV9004_SOIC_TSSOP U2401
U 2 1 6124E6BB
P 8700 1500
F 0 "U2401" H 8800 1650 50  0000 C CNN
F 1 "TLV9004_SOIC_TSSOP" H 8712 1774 50  0000 C CNN
F 2 "Package_SO:SOIC-14_3.9x8.7mm_P1.27mm" H 8700 1500 50  0001 C CNN
F 3 "" H 8700 1500 50  0001 C CNN
F 4 "TLV9004QDRQ1" H 8700 1500 50  0001 C CNN "PartNumber"
F 5 "3000-0000001315" H 8700 1500 50  0001 C CNN "PartSpecification"
	2    8700 1500
	1    0    0    -1  
$EndComp
$Comp
L POWDER_Analog:TLV9004_SOIC_TSSOP U2401
U 3 1 6124FEBF
P 8700 2250
F 0 "U2401" H 8800 2400 50  0000 C CNN
F 1 "TLV9004_SOIC_TSSOP" H 8712 2524 50  0000 C CNN
F 2 "Package_SO:SOIC-14_3.9x8.7mm_P1.27mm" H 8700 2250 50  0001 C CNN
F 3 "" H 8700 2250 50  0001 C CNN
F 4 "TLV9004QDRQ1" H 8700 2250 50  0001 C CNN "PartNumber"
F 5 "3000-0000001315" H 8700 2250 50  0001 C CNN "PartSpecification"
	3    8700 2250
	1    0    0    -1  
$EndComp
$Comp
L POWDER_Analog:TLV9004_SOIC_TSSOP U2401
U 4 1 61251A11
P 8700 3000
F 0 "U2401" H 8800 3150 50  0000 C CNN
F 1 "TLV9004_SOIC_TSSOP" H 8712 3274 50  0000 C CNN
F 2 "Package_SO:SOIC-14_3.9x8.7mm_P1.27mm" H 8700 3000 50  0001 C CNN
F 3 "" H 8700 3000 50  0001 C CNN
F 4 "TLV9004QDRQ1" H 8700 3000 50  0001 C CNN "PartNumber"
F 5 "3000-0000001315" H 8700 3000 50  0001 C CNN "PartSpecification"
	4    8700 3000
	1    0    0    -1  
$EndComp
$Comp
L POWDER_Analog:TLV9004_SOIC_TSSOP U2401
U 5 1 612528AB
P 7000 2250
F 0 "U2401" H 7058 2296 50  0000 L CNN
F 1 "TLV9004_SOIC_TSSOP" H 7058 2205 50  0000 L CNN
F 2 "Package_SO:SOIC-14_3.9x8.7mm_P1.27mm" H 7000 2250 50  0001 C CNN
F 3 "" H 7000 2250 50  0001 C CNN
F 4 "TLV9004QDRQ1" H 7000 2250 50  0001 C CNN "PartNumber"
F 5 "3000-0000001315" H 7000 2250 50  0001 C CNN "PartSpecification"
	5    7000 2250
	1    0    0    -1  
$EndComp
Text Label 8150 700  0    50   ~ 0
GPAI0
Wire Wire Line
	9050 750  9050 1000
Wire Wire Line
	9050 1000 8400 1000
Wire Wire Line
	8400 1000 8400 800 
Wire Wire Line
	8400 1550 8400 1750
Wire Wire Line
	8400 1750 9050 1750
Wire Wire Line
	9050 1750 9050 1500
Wire Wire Line
	9050 2250 9050 2500
Wire Wire Line
	9050 2500 8400 2500
Wire Wire Line
	8400 2500 8400 2300
Wire Wire Line
	8400 3050 8400 3250
Wire Wire Line
	8400 3250 9050 3250
Wire Wire Line
	9050 3250 9050 3000
Text Label 8150 1450 0    50   ~ 0
GPAI1
Text Label 8150 2200 0    50   ~ 0
GPAI2
Text Label 8150 2950 0    50   ~ 0
GPAI3
$Comp
L 000_PreferredParts:C_100nF C2403
U 1 1 6128462C
P 9500 1000
F 0 "C2403" H 9615 1046 50  0000 L CNN
F 1 "C_100nF" H 9525 900 50  0001 L CNN
F 2 "Capacitor_SMD:C_0402_1005Metric" H 9538 850 50  0001 C CNN
F 3 "~" H 9500 1000 50  0001 C CNN
F 4 "100nF" H 9615 955 50  0000 L CNN "DisplayValue"
F 5 "3000-0000000125" H 9500 1000 50  0001 C CNN "PartSpecification"
	1    9500 1000
	1    0    0    -1  
$EndComp
$Comp
L power:GND #PWR?
U 1 1 61284632
P 9500 1250
F 0 "#PWR?" H 9500 1000 50  0001 C CNN
F 1 "GND" H 9505 1077 50  0000 C CNN
F 2 "" H 9500 1250 50  0001 C CNN
F 3 "" H 9500 1250 50  0001 C CNN
	1    9500 1250
	1    0    0    -1  
$EndComp
Wire Wire Line
	9500 1250 9500 1150
Wire Wire Line
	9500 850  9500 750 
Wire Wire Line
	9750 750  9500 750 
$Comp
L Device:R R2402
U 1 1 6128463B
P 9250 750
F 0 "R2402" V 9043 750 50  0000 C CNN
F 1 "3k" V 9134 750 50  0000 C CNN
F 2 "Resistor_SMD:R_0402_1005Metric" V 9180 750 50  0001 C CNN
F 3 "~" H 9250 750 50  0001 C CNN
F 4 "3000-0000000230" H 9250 750 50  0001 C CNN "PartSpecification"
	1    9250 750 
	0    1    1    0   
$EndComp
Wire Wire Line
	9400 750  9500 750 
Connection ~ 9500 750 
Wire Wire Line
	9100 750  9050 750 
Connection ~ 9050 750 
$Comp
L 000_PreferredParts:C_100nF C2405
U 1 1 6128B911
P 9500 1750
F 0 "C2405" H 9615 1796 50  0000 L CNN
F 1 "C_100nF" H 9525 1650 50  0001 L CNN
F 2 "Capacitor_SMD:C_0402_1005Metric" H 9538 1600 50  0001 C CNN
F 3 "~" H 9500 1750 50  0001 C CNN
F 4 "100nF" H 9615 1705 50  0000 L CNN "DisplayValue"
F 5 "3000-0000000125" H 9500 1750 50  0001 C CNN "PartSpecification"
	1    9500 1750
	1    0    0    -1  
$EndComp
$Comp
L power:GND #PWR?
U 1 1 6128B917
P 9500 2000
F 0 "#PWR?" H 9500 1750 50  0001 C CNN
F 1 "GND" H 9505 1827 50  0000 C CNN
F 2 "" H 9500 2000 50  0001 C CNN
F 3 "" H 9500 2000 50  0001 C CNN
	1    9500 2000
	1    0    0    -1  
$EndComp
Wire Wire Line
	9500 2000 9500 1900
Wire Wire Line
	9500 1600 9500 1500
Wire Wire Line
	9750 1500 9500 1500
$Comp
L Device:R R2403
U 1 1 6128B920
P 9250 1500
F 0 "R2403" V 9043 1500 50  0000 C CNN
F 1 "3k" V 9134 1500 50  0000 C CNN
F 2 "Resistor_SMD:R_0402_1005Metric" V 9180 1500 50  0001 C CNN
F 3 "~" H 9250 1500 50  0001 C CNN
F 4 "3000-0000000230" H 9250 1500 50  0001 C CNN "PartSpecification"
	1    9250 1500
	0    1    1    0   
$EndComp
Wire Wire Line
	9400 1500 9500 1500
Connection ~ 9500 1500
Wire Wire Line
	9100 1500 9050 1500
$Comp
L 000_PreferredParts:C_100nF C2412
U 1 1 612902F0
P 9500 2500
F 0 "C2412" H 9615 2546 50  0000 L CNN
F 1 "C_100nF" H 9525 2400 50  0001 L CNN
F 2 "Capacitor_SMD:C_0402_1005Metric" H 9538 2350 50  0001 C CNN
F 3 "~" H 9500 2500 50  0001 C CNN
F 4 "100nF" H 9615 2455 50  0000 L CNN "DisplayValue"
F 5 "3000-0000000125" H 9500 2500 50  0001 C CNN "PartSpecification"
	1    9500 2500
	1    0    0    -1  
$EndComp
$Comp
L power:GND #PWR?
U 1 1 612902F6
P 9500 2750
F 0 "#PWR?" H 9500 2500 50  0001 C CNN
F 1 "GND" H 9505 2577 50  0000 C CNN
F 2 "" H 9500 2750 50  0001 C CNN
F 3 "" H 9500 2750 50  0001 C CNN
	1    9500 2750
	1    0    0    -1  
$EndComp
Wire Wire Line
	9500 2750 9500 2650
Wire Wire Line
	9500 2350 9500 2250
Wire Wire Line
	9750 2250 9500 2250
$Comp
L Device:R R2405
U 1 1 612902FF
P 9250 2250
F 0 "R2405" V 9043 2250 50  0000 C CNN
F 1 "3k" V 9134 2250 50  0000 C CNN
F 2 "Resistor_SMD:R_0402_1005Metric" V 9180 2250 50  0001 C CNN
F 3 "~" H 9250 2250 50  0001 C CNN
F 4 "3000-0000000230" H 9250 2250 50  0001 C CNN "PartSpecification"
	1    9250 2250
	0    1    1    0   
$EndComp
Wire Wire Line
	9400 2250 9500 2250
Connection ~ 9500 2250
Wire Wire Line
	9100 2250 9050 2250
$Comp
L 000_PreferredParts:C_100nF C2415
U 1 1 6129506E
P 9500 3250
F 0 "C2415" H 9615 3296 50  0000 L CNN
F 1 "C_100nF" H 9525 3150 50  0001 L CNN
F 2 "Capacitor_SMD:C_0402_1005Metric" H 9538 3100 50  0001 C CNN
F 3 "~" H 9500 3250 50  0001 C CNN
F 4 "100nF" H 9615 3205 50  0000 L CNN "DisplayValue"
F 5 "3000-0000000125" H 9500 3250 50  0001 C CNN "PartSpecification"
	1    9500 3250
	1    0    0    -1  
$EndComp
$Comp
L power:GND #PWR?
U 1 1 61295074
P 9500 3500
F 0 "#PWR?" H 9500 3250 50  0001 C CNN
F 1 "GND" H 9505 3327 50  0000 C CNN
F 2 "" H 9500 3500 50  0001 C CNN
F 3 "" H 9500 3500 50  0001 C CNN
	1    9500 3500
	1    0    0    -1  
$EndComp
Wire Wire Line
	9500 3500 9500 3400
Wire Wire Line
	9500 3100 9500 3000
Wire Wire Line
	9750 3000 9500 3000
$Comp
L Device:R R2407
U 1 1 6129507D
P 9250 3000
F 0 "R2407" V 9043 3000 50  0000 C CNN
F 1 "3k" V 9134 3000 50  0000 C CNN
F 2 "Resistor_SMD:R_0402_1005Metric" V 9180 3000 50  0001 C CNN
F 3 "~" H 9250 3000 50  0001 C CNN
F 4 "3000-0000000230" H 9250 3000 50  0001 C CNN "PartSpecification"
	1    9250 3000
	0    1    1    0   
$EndComp
Wire Wire Line
	9400 3000 9500 3000
Connection ~ 9500 3000
Wire Wire Line
	9100 3000 9050 3000
Connection ~ 9050 3000
Connection ~ 9050 2250
Connection ~ 9050 1500
Text HLabel 9750 750  2    50   Output ~ 0
GPAI_F0
Text HLabel 9750 1500 2    50   Output ~ 0
GPAI_F1
Text HLabel 9750 2250 2    50   Output ~ 0
GPAI_F2
Text HLabel 9750 3000 2    50   Output ~ 0
GPAI_F3
$Comp
L power:GND #PWR?
U 1 1 6129F84C
P 7000 2650
F 0 "#PWR?" H 7000 2400 50  0001 C CNN
F 1 "GND" H 7005 2477 50  0000 C CNN
F 2 "" H 7000 2650 50  0001 C CNN
F 3 "" H 7000 2650 50  0001 C CNN
	1    7000 2650
	1    0    0    -1  
$EndComp
Wire Wire Line
	7000 2650 7000 2550
$Comp
L POWDER_PowerGlobals:+2V5_A #PWR?
U 1 1 612AA073
P 7000 1850
F 0 "#PWR?" H 7000 1700 50  0001 C CNN
F 1 "+2V5_A" H 7015 2023 50  0000 C CNN
F 2 "" H 7000 1850 50  0001 C CNN
F 3 "" H 7000 1850 50  0001 C CNN
	1    7000 1850
	1    0    0    -1  
$EndComp
Wire Wire Line
	7000 1850 7000 1950
$Comp
L 000_PreferredParts:C_10pF C2410
U 1 1 612AF929
P 6500 2250
F 0 "C2410" H 6615 2296 50  0000 L CNN
F 1 "C_10pF" H 6615 2205 50  0000 L CNN
F 2 "Capacitor_SMD:C_0402_1005Metric" H 6538 2100 50  0001 C CNN
F 3 "~" H 6500 2250 50  0001 C CNN
F 4 "3000-0000000582" H 6500 2250 50  0001 C CNN "PartSpecification"
	1    6500 2250
	1    0    0    -1  
$EndComp
$Comp
L 000_PreferredParts:C_1nF C2409
U 1 1 612B0E34
P 6000 2250
F 0 "C2409" H 6115 2296 50  0000 L CNN
F 1 "C_1nF" H 6115 2205 50  0000 L CNN
F 2 "Capacitor_SMD:C_0402_1005Metric" H 6038 2100 50  0001 C CNN
F 3 "~" H 6000 2250 50  0001 C CNN
F 4 "3000-0000000128" H 6000 2250 50  0001 C CNN "PartSpecification"
	1    6000 2250
	1    0    0    -1  
$EndComp
$Comp
L 000_PreferredParts:C_100nF C2408
U 1 1 612B6614
P 5500 2250
F 0 "C2408" H 5615 2296 50  0000 L CNN
F 1 "C_100nF" H 5525 2150 50  0001 L CNN
F 2 "Capacitor_SMD:C_0402_1005Metric" H 5538 2100 50  0001 C CNN
F 3 "~" H 5500 2250 50  0001 C CNN
F 4 "100nF" H 5615 2205 50  0000 L CNN "DisplayValue"
F 5 "3000-0000000125" H 5500 2250 50  0001 C CNN "PartSpecification"
	1    5500 2250
	1    0    0    -1  
$EndComp
$Comp
L power:GND #PWR?
U 1 1 612B6E1C
P 6500 2500
F 0 "#PWR?" H 6500 2250 50  0001 C CNN
F 1 "GND" H 6505 2327 50  0000 C CNN
F 2 "" H 6500 2500 50  0001 C CNN
F 3 "" H 6500 2500 50  0001 C CNN
	1    6500 2500
	1    0    0    -1  
$EndComp
Wire Wire Line
	6500 2400 6500 2500
$Comp
L POWDER_PowerGlobals:+2V5_A #PWR?
U 1 1 612BB52D
P 6500 2000
F 0 "#PWR?" H 6500 1850 50  0001 C CNN
F 1 "+2V5_A" H 6515 2173 50  0000 C CNN
F 2 "" H 6500 2000 50  0001 C CNN
F 3 "" H 6500 2000 50  0001 C CNN
	1    6500 2000
	1    0    0    -1  
$EndComp
Wire Wire Line
	6500 2000 6500 2100
$Comp
L POWDER_PowerGlobals:+2V5_A #PWR?
U 1 1 612C01CA
P 6000 2000
F 0 "#PWR?" H 6000 1850 50  0001 C CNN
F 1 "+2V5_A" H 6015 2173 50  0000 C CNN
F 2 "" H 6000 2000 50  0001 C CNN
F 3 "" H 6000 2000 50  0001 C CNN
	1    6000 2000
	1    0    0    -1  
$EndComp
Wire Wire Line
	6000 2000 6000 2100
$Comp
L POWDER_PowerGlobals:+2V5_A #PWR?
U 1 1 612C46A2
P 5500 2000
F 0 "#PWR?" H 5500 1850 50  0001 C CNN
F 1 "+2V5_A" H 5515 2173 50  0000 C CNN
F 2 "" H 5500 2000 50  0001 C CNN
F 3 "" H 5500 2000 50  0001 C CNN
	1    5500 2000
	1    0    0    -1  
$EndComp
Wire Wire Line
	5500 2000 5500 2100
$Comp
L power:GND #PWR?
U 1 1 612C8AAE
P 6000 2500
F 0 "#PWR?" H 6000 2250 50  0001 C CNN
F 1 "GND" H 6005 2327 50  0000 C CNN
F 2 "" H 6000 2500 50  0001 C CNN
F 3 "" H 6000 2500 50  0001 C CNN
	1    6000 2500
	1    0    0    -1  
$EndComp
Wire Wire Line
	6000 2400 6000 2500
$Comp
L power:GND #PWR?
U 1 1 612CCEDA
P 5500 2500
F 0 "#PWR?" H 5500 2250 50  0001 C CNN
F 1 "GND" H 5505 2327 50  0000 C CNN
F 2 "" H 5500 2500 50  0001 C CNN
F 3 "" H 5500 2500 50  0001 C CNN
	1    5500 2500
	1    0    0    -1  
$EndComp
Wire Wire Line
	5500 2400 5500 2500
$Comp
L POWDER_Analog:TLV9004_SOIC_TSSOP U2402
U 1 1 612F4962
P 8700 3750
F 0 "U2402" H 8712 4115 50  0000 C CNN
F 1 "TLV9004_SOIC_TSSOP" H 8712 4024 50  0000 C CNN
F 2 "Package_SO:SOIC-14_3.9x8.7mm_P1.27mm" H 8700 3750 50  0001 C CNN
F 3 "" H 8700 3750 50  0001 C CNN
F 4 "TLV9004QDRQ1" H 8700 3750 50  0001 C CNN "PartNumber"
F 5 "3000-0000001315" H 8700 3750 50  0001 C CNN "PartSpecification"
	1    8700 3750
	1    0    0    -1  
$EndComp
$Comp
L POWDER_Analog:TLV9004_SOIC_TSSOP U2402
U 2 1 612F4968
P 8700 4500
F 0 "U2402" H 8800 4650 50  0000 C CNN
F 1 "TLV9004_SOIC_TSSOP" H 8712 4774 50  0000 C CNN
F 2 "Package_SO:SOIC-14_3.9x8.7mm_P1.27mm" H 8700 4500 50  0001 C CNN
F 3 "" H 8700 4500 50  0001 C CNN
F 4 "TLV9004QDRQ1" H 8700 4500 50  0001 C CNN "PartNumber"
F 5 "3000-0000001315" H 8700 4500 50  0001 C CNN "PartSpecification"
	2    8700 4500
	1    0    0    -1  
$EndComp
$Comp
L POWDER_Analog:TLV9004_SOIC_TSSOP U2402
U 3 1 612F496E
P 8700 5250
F 0 "U2402" H 8800 5400 50  0000 C CNN
F 1 "TLV9004_SOIC_TSSOP" H 8712 5524 50  0000 C CNN
F 2 "Package_SO:SOIC-14_3.9x8.7mm_P1.27mm" H 8700 5250 50  0001 C CNN
F 3 "" H 8700 5250 50  0001 C CNN
F 4 "TLV9004QDRQ1" H 8700 5250 50  0001 C CNN "PartNumber"
F 5 "3000-0000001315" H 8700 5250 50  0001 C CNN "PartSpecification"
	3    8700 5250
	1    0    0    -1  
$EndComp
$Comp
L POWDER_Analog:TLV9004_SOIC_TSSOP U2402
U 4 1 612F4974
P 8700 6000
F 0 "U2402" H 8800 6150 50  0000 C CNN
F 1 "TLV9004_SOIC_TSSOP" H 8712 6274 50  0000 C CNN
F 2 "Package_SO:SOIC-14_3.9x8.7mm_P1.27mm" H 8700 6000 50  0001 C CNN
F 3 "" H 8700 6000 50  0001 C CNN
F 4 "TLV9004QDRQ1" H 8700 6000 50  0001 C CNN "PartNumber"
F 5 "3000-0000001315" H 8700 6000 50  0001 C CNN "PartSpecification"
	4    8700 6000
	1    0    0    -1  
$EndComp
Text Label 8150 3700 0    50   ~ 0
GPAI4
Wire Wire Line
	9050 3750 9050 4000
Wire Wire Line
	9050 4000 8400 4000
Wire Wire Line
	8400 4000 8400 3800
Wire Wire Line
	8400 4550 8400 4750
Wire Wire Line
	8400 4750 9050 4750
Wire Wire Line
	9050 4750 9050 4500
Wire Wire Line
	9050 5250 9050 5500
Wire Wire Line
	9050 5500 8400 5500
Wire Wire Line
	8400 5500 8400 5300
Wire Wire Line
	8400 6050 8400 6250
Wire Wire Line
	8400 6250 9050 6250
Wire Wire Line
	9050 6250 9050 6000
Text Label 8150 4450 0    50   ~ 0
GPAI5
Text Label 8150 5200 0    50   ~ 0
GPAI6
Text Label 8150 5950 0    50   ~ 0
GPAI7
$Comp
L 000_PreferredParts:C_100nF C2419
U 1 1 612F4990
P 9500 4000
F 0 "C2419" H 9615 4046 50  0000 L CNN
F 1 "C_100nF" H 9525 3900 50  0001 L CNN
F 2 "Capacitor_SMD:C_0402_1005Metric" H 9538 3850 50  0001 C CNN
F 3 "~" H 9500 4000 50  0001 C CNN
F 4 "100nF" H 9615 3955 50  0000 L CNN "DisplayValue"
F 5 "3000-0000000125" H 9500 4000 50  0001 C CNN "PartSpecification"
	1    9500 4000
	1    0    0    -1  
$EndComp
$Comp
L power:GND #PWR?
U 1 1 612F4996
P 9500 4250
F 0 "#PWR?" H 9500 4000 50  0001 C CNN
F 1 "GND" H 9505 4077 50  0000 C CNN
F 2 "" H 9500 4250 50  0001 C CNN
F 3 "" H 9500 4250 50  0001 C CNN
	1    9500 4250
	1    0    0    -1  
$EndComp
Wire Wire Line
	9500 4250 9500 4150
Wire Wire Line
	9500 3850 9500 3750
Wire Wire Line
	9750 3750 9500 3750
$Comp
L Device:R R2409
U 1 1 612F499F
P 9250 3750
F 0 "R2409" V 9043 3750 50  0000 C CNN
F 1 "3k" V 9134 3750 50  0000 C CNN
F 2 "Resistor_SMD:R_0402_1005Metric" V 9180 3750 50  0001 C CNN
F 3 "~" H 9250 3750 50  0001 C CNN
F 4 "3000-0000000230" H 9250 3750 50  0001 C CNN "PartSpecification"
	1    9250 3750
	0    1    1    0   
$EndComp
Wire Wire Line
	9400 3750 9500 3750
Connection ~ 9500 3750
Wire Wire Line
	9100 3750 9050 3750
Connection ~ 9050 3750
$Comp
L 000_PreferredParts:C_100nF C2421
U 1 1 612F49AB
P 9500 5500
F 0 "C2421" H 9615 5546 50  0000 L CNN
F 1 "C_100nF" H 9525 5400 50  0001 L CNN
F 2 "Capacitor_SMD:C_0402_1005Metric" H 9538 5350 50  0001 C CNN
F 3 "~" H 9500 5500 50  0001 C CNN
F 4 "100nF" H 9615 5455 50  0000 L CNN "DisplayValue"
F 5 "3000-0000000125" H 9500 5500 50  0001 C CNN "PartSpecification"
	1    9500 5500
	1    0    0    -1  
$EndComp
$Comp
L power:GND #PWR?
U 1 1 612F49B1
P 9500 5000
F 0 "#PWR?" H 9500 4750 50  0001 C CNN
F 1 "GND" H 9505 4827 50  0000 C CNN
F 2 "" H 9500 5000 50  0001 C CNN
F 3 "" H 9500 5000 50  0001 C CNN
	1    9500 5000
	1    0    0    -1  
$EndComp
Wire Wire Line
	9500 5000 9500 4900
Wire Wire Line
	9500 5350 9500 5250
Wire Wire Line
	9750 5250 9500 5250
$Comp
L Device:R R2411
U 1 1 612F49BA
P 9250 5250
F 0 "R2411" V 9043 5250 50  0000 C CNN
F 1 "3k" V 9134 5250 50  0000 C CNN
F 2 "Resistor_SMD:R_0402_1005Metric" V 9180 5250 50  0001 C CNN
F 3 "~" H 9250 5250 50  0001 C CNN
F 4 "3000-0000000230" H 9250 5250 50  0001 C CNN "PartSpecification"
	1    9250 5250
	0    1    1    0   
$EndComp
Wire Wire Line
	9400 5250 9500 5250
Connection ~ 9500 5250
Wire Wire Line
	9100 4500 9050 4500
$Comp
L 000_PreferredParts:C_100nF C2425
U 1 1 612F49C5
P 9500 4750
F 0 "C2425" H 9615 4796 50  0000 L CNN
F 1 "C_100nF" H 9525 4650 50  0001 L CNN
F 2 "Capacitor_SMD:C_0402_1005Metric" H 9538 4600 50  0001 C CNN
F 3 "~" H 9500 4750 50  0001 C CNN
F 4 "100nF" H 9615 4705 50  0000 L CNN "DisplayValue"
F 5 "3000-0000000125" H 9500 4750 50  0001 C CNN "PartSpecification"
	1    9500 4750
	1    0    0    -1  
$EndComp
$Comp
L power:GND #PWR?
U 1 1 612F49CB
P 9500 5750
F 0 "#PWR?" H 9500 5500 50  0001 C CNN
F 1 "GND" H 9505 5577 50  0000 C CNN
F 2 "" H 9500 5750 50  0001 C CNN
F 3 "" H 9500 5750 50  0001 C CNN
	1    9500 5750
	1    0    0    -1  
$EndComp
Wire Wire Line
	9500 5750 9500 5650
Wire Wire Line
	9500 4600 9500 4500
Wire Wire Line
	9750 4500 9500 4500
$Comp
L Device:R R2414
U 1 1 612F49D4
P 9250 4500
F 0 "R2414" V 9043 4500 50  0000 C CNN
F 1 "3k" V 9134 4500 50  0000 C CNN
F 2 "Resistor_SMD:R_0402_1005Metric" V 9180 4500 50  0001 C CNN
F 3 "~" H 9250 4500 50  0001 C CNN
F 4 "3000-0000000230" H 9250 4500 50  0001 C CNN "PartSpecification"
	1    9250 4500
	0    1    1    0   
$EndComp
Wire Wire Line
	9400 4500 9500 4500
Connection ~ 9500 4500
Wire Wire Line
	9100 5250 9050 5250
$Comp
L 000_PreferredParts:C_100nF C2428
U 1 1 612F49DF
P 9500 6250
F 0 "C2428" H 9615 6296 50  0000 L CNN
F 1 "C_100nF" H 9525 6150 50  0001 L CNN
F 2 "Capacitor_SMD:C_0402_1005Metric" H 9538 6100 50  0001 C CNN
F 3 "~" H 9500 6250 50  0001 C CNN
F 4 "100nF" H 9615 6205 50  0000 L CNN "DisplayValue"
F 5 "3000-0000000125" H 9500 6250 50  0001 C CNN "PartSpecification"
	1    9500 6250
	1    0    0    -1  
$EndComp
$Comp
L power:GND #PWR?
U 1 1 612F49E5
P 9500 6500
F 0 "#PWR?" H 9500 6250 50  0001 C CNN
F 1 "GND" H 9505 6327 50  0000 C CNN
F 2 "" H 9500 6500 50  0001 C CNN
F 3 "" H 9500 6500 50  0001 C CNN
	1    9500 6500
	1    0    0    -1  
$EndComp
Wire Wire Line
	9500 6500 9500 6400
Wire Wire Line
	9500 6100 9500 6000
Wire Wire Line
	9750 6000 9500 6000
$Comp
L Device:R R2416
U 1 1 612F49EE
P 9250 6000
F 0 "R2416" V 9043 6000 50  0000 C CNN
F 1 "3k" V 9134 6000 50  0000 C CNN
F 2 "Resistor_SMD:R_0402_1005Metric" V 9180 6000 50  0001 C CNN
F 3 "~" H 9250 6000 50  0001 C CNN
F 4 "3000-0000000230" H 9250 6000 50  0001 C CNN "PartSpecification"
	1    9250 6000
	0    1    1    0   
$EndComp
Wire Wire Line
	9400 6000 9500 6000
Connection ~ 9500 6000
Wire Wire Line
	9100 6000 9050 6000
Connection ~ 9050 6000
Connection ~ 9050 5250
Connection ~ 9050 4500
Text HLabel 9750 3750 2    50   Output ~ 0
GPAI_F4
Text HLabel 9750 4500 2    50   Output ~ 0
GPAI_F5
Text HLabel 9750 5250 2    50   Output ~ 0
GPAI_F6
Text HLabel 9750 6000 2    50   Output ~ 0
GPAI_F7
$Comp
L POWDER_Analog:TLV9004_SOIC_TSSOP U2402
U 5 1 61309888
P 6500 7000
F 0 "U2402" H 6558 7046 50  0000 L CNN
F 1 "TLV9004_SOIC_TSSOP" H 6558 6955 50  0000 L CNN
F 2 "Package_SO:SOIC-14_3.9x8.7mm_P1.27mm" H 6500 7000 50  0001 C CNN
F 3 "" H 6500 7000 50  0001 C CNN
F 4 "TLV9004QDRQ1" H 6500 7000 50  0001 C CNN "PartNumber"
F 5 "3000-0000001315" H 6500 7000 50  0001 C CNN "PartSpecification"
	5    6500 7000
	1    0    0    -1  
$EndComp
$Comp
L power:GND #PWR?
U 1 1 6130988E
P 6500 7400
F 0 "#PWR?" H 6500 7150 50  0001 C CNN
F 1 "GND" H 6505 7227 50  0000 C CNN
F 2 "" H 6500 7400 50  0001 C CNN
F 3 "" H 6500 7400 50  0001 C CNN
	1    6500 7400
	1    0    0    -1  
$EndComp
Wire Wire Line
	6500 7400 6500 7300
$Comp
L POWDER_PowerGlobals:+2V5_A #PWR?
U 1 1 61309895
P 6500 6600
F 0 "#PWR?" H 6500 6450 50  0001 C CNN
F 1 "+2V5_A" H 6515 6773 50  0000 C CNN
F 2 "" H 6500 6600 50  0001 C CNN
F 3 "" H 6500 6600 50  0001 C CNN
	1    6500 6600
	1    0    0    -1  
$EndComp
Wire Wire Line
	6500 6600 6500 6700
$Comp
L 000_PreferredParts:C_10pF C2433
U 1 1 6130989D
P 6000 7000
F 0 "C2433" H 6115 7046 50  0000 L CNN
F 1 "C_10pF" H 6115 6955 50  0000 L CNN
F 2 "Capacitor_SMD:C_0402_1005Metric" H 6038 6850 50  0001 C CNN
F 3 "~" H 6000 7000 50  0001 C CNN
F 4 "3000-0000000582" H 6000 7000 50  0001 C CNN "PartSpecification"
	1    6000 7000
	1    0    0    -1  
$EndComp
$Comp
L 000_PreferredParts:C_1nF C2432
U 1 1 613098A4
P 5500 7000
F 0 "C2432" H 5615 7046 50  0000 L CNN
F 1 "C_1nF" H 5615 6955 50  0000 L CNN
F 2 "Capacitor_SMD:C_0402_1005Metric" H 5538 6850 50  0001 C CNN
F 3 "~" H 5500 7000 50  0001 C CNN
F 4 "3000-0000000128" H 5500 7000 50  0001 C CNN "PartSpecification"
	1    5500 7000
	1    0    0    -1  
$EndComp
$Comp
L 000_PreferredParts:C_100nF C2431
U 1 1 613098AC
P 5000 7000
F 0 "C2431" H 5115 7046 50  0000 L CNN
F 1 "C_100nF" H 5025 6900 50  0001 L CNN
F 2 "Capacitor_SMD:C_0402_1005Metric" H 5038 6850 50  0001 C CNN
F 3 "~" H 5000 7000 50  0001 C CNN
F 4 "100nF" H 5115 6955 50  0000 L CNN "DisplayValue"
F 5 "3000-0000000125" H 5000 7000 50  0001 C CNN "PartSpecification"
	1    5000 7000
	1    0    0    -1  
$EndComp
$Comp
L power:GND #PWR?
U 1 1 613098B2
P 6000 7250
F 0 "#PWR?" H 6000 7000 50  0001 C CNN
F 1 "GND" H 6005 7077 50  0000 C CNN
F 2 "" H 6000 7250 50  0001 C CNN
F 3 "" H 6000 7250 50  0001 C CNN
	1    6000 7250
	1    0    0    -1  
$EndComp
Wire Wire Line
	6000 7150 6000 7250
$Comp
L POWDER_PowerGlobals:+2V5_A #PWR?
U 1 1 613098B9
P 6000 6750
F 0 "#PWR?" H 6000 6600 50  0001 C CNN
F 1 "+2V5_A" H 6015 6923 50  0000 C CNN
F 2 "" H 6000 6750 50  0001 C CNN
F 3 "" H 6000 6750 50  0001 C CNN
	1    6000 6750
	1    0    0    -1  
$EndComp
Wire Wire Line
	6000 6750 6000 6850
$Comp
L POWDER_PowerGlobals:+2V5_A #PWR?
U 1 1 613098C0
P 5500 6750
F 0 "#PWR?" H 5500 6600 50  0001 C CNN
F 1 "+2V5_A" H 5515 6923 50  0000 C CNN
F 2 "" H 5500 6750 50  0001 C CNN
F 3 "" H 5500 6750 50  0001 C CNN
	1    5500 6750
	1    0    0    -1  
$EndComp
Wire Wire Line
	5500 6750 5500 6850
$Comp
L POWDER_PowerGlobals:+2V5_A #PWR?
U 1 1 613098C7
P 5000 6750
F 0 "#PWR?" H 5000 6600 50  0001 C CNN
F 1 "+2V5_A" H 5015 6923 50  0000 C CNN
F 2 "" H 5000 6750 50  0001 C CNN
F 3 "" H 5000 6750 50  0001 C CNN
	1    5000 6750
	1    0    0    -1  
$EndComp
Wire Wire Line
	5000 6750 5000 6850
$Comp
L power:GND #PWR?
U 1 1 613098CE
P 5500 7250
F 0 "#PWR?" H 5500 7000 50  0001 C CNN
F 1 "GND" H 5505 7077 50  0000 C CNN
F 2 "" H 5500 7250 50  0001 C CNN
F 3 "" H 5500 7250 50  0001 C CNN
	1    5500 7250
	1    0    0    -1  
$EndComp
Wire Wire Line
	5500 7150 5500 7250
$Comp
L power:GND #PWR?
U 1 1 613098D5
P 5000 7250
F 0 "#PWR?" H 5000 7000 50  0001 C CNN
F 1 "GND" H 5005 7077 50  0000 C CNN
F 2 "" H 5000 7250 50  0001 C CNN
F 3 "" H 5000 7250 50  0001 C CNN
	1    5000 7250
	1    0    0    -1  
$EndComp
Wire Wire Line
	5000 7150 5000 7250
Wire Wire Line
	8100 5200 8400 5200
Wire Wire Line
	8100 700  8400 700 
Wire Wire Line
	8100 1450 8400 1450
Wire Wire Line
	8100 2200 8400 2200
Wire Wire Line
	8100 2950 8400 2950
Wire Wire Line
	8100 3700 8400 3700
Wire Wire Line
	8100 4450 8400 4450
Wire Wire Line
	8100 5950 8400 5950
Wire Bus Line
	8000 550  7500 550 
Text HLabel 7500 550  0    50   Input ~ 0
GPAI[0..7]
Entry Wire Line
	8000 600  8100 700 
Entry Wire Line
	8000 1350 8100 1450
Entry Wire Line
	8000 2100 8100 2200
Entry Wire Line
	8000 2850 8100 2950
Entry Wire Line
	8000 3600 8100 3700
Entry Wire Line
	8000 4350 8100 4450
Entry Wire Line
	8000 5100 8100 5200
Entry Wire Line
	8000 5850 8100 5950
Text HLabel 6000 4500 0    50   Input ~ 0
VSENSE_5VA
$Comp
L 000_PreferredParts:C_100nF C2434
U 1 1 617BADE6
P 6250 4750
F 0 "C2434" H 6365 4796 50  0000 L CNN
F 1 "C_100nF" H 6275 4650 50  0001 L CNN
F 2 "Capacitor_SMD:C_0402_1005Metric" H 6288 4600 50  0001 C CNN
F 3 "~" H 6250 4750 50  0001 C CNN
F 4 "100nF" H 6365 4705 50  0000 L CNN "DisplayValue"
F 5 "3000-0000000125" H 6250 4750 50  0001 C CNN "PartSpecification"
	1    6250 4750
	1    0    0    -1  
$EndComp
$Comp
L power:GND #PWR?
U 1 1 617BADEC
P 6250 5000
F 0 "#PWR?" H 6250 4750 50  0001 C CNN
F 1 "GND" H 6255 4827 50  0000 C CNN
F 2 "" H 6250 5000 50  0001 C CNN
F 3 "" H 6250 5000 50  0001 C CNN
	1    6250 5000
	1    0    0    -1  
$EndComp
Wire Wire Line
	6250 5000 6250 4900
Wire Wire Line
	6250 4600 6250 4500
Wire Wire Line
	6250 4500 6000 4500
Text HLabel 6500 4500 2    50   Output ~ 0
VSENSE_5VA_OUT
Wire Wire Line
	6500 4500 6250 4500
Connection ~ 6250 4500
Text Label 8800 1000 0    50   ~ 0
FB_0
Text Label 8800 1750 0    50   ~ 0
FB_1
Text Label 8800 2500 0    50   ~ 0
FB_2
Text Label 8800 3250 0    50   ~ 0
FB_3
Text Label 8800 4000 0    50   ~ 0
FB_4
Text Label 8800 4750 0    50   ~ 0
FB_5
Text Label 8800 5500 0    50   ~ 0
FB_6
Text Label 8800 6250 0    50   ~ 0
FB_7
Wire Bus Line
	8000 550  8000 5850
$EndSCHEMATC
