EESchema Schematic File Version 4
EELAYER 30 0
EELAYER END
$Descr A4 11693 8268
encoding utf-8
Sheet 15 27
Title ""
Date ""
Rev ""
Comp ""
Comment1 ""
Comment2 ""
Comment3 ""
Comment4 ""
$EndDescr
Text HLabel 7000 3100 0    50   Input ~ 0
pg[0..9]
Text HLabel 9500 3100 2    50   Output ~ 0
en[0..9]
Text HLabel 1050 3150 0    50   Input ~ 0
i_sense[0..12]
Text HLabel 1050 3250 0    50   Input ~ 0
v_sense[0..12]
$Sheet
S 3700 2400 1500 1100
U 5E19C22F
F0 "sensors" 50
F1 "sensors.sch" 50
F2 "moisture" O R 5200 2800 50 
F3 "cooler_fault" O R 5200 2900 50 
F4 "SCL" I L 3700 2800 50 
F5 "SDA" B L 3700 2900 50 
F6 "NUC_reset" I L 3700 3000 50 
F7 "charge_~discharge" O R 5200 3100 50 
F8 "imu_int1" O R 5200 3200 50 
F9 "imu_int2" O R 5200 3300 50 
F10 "fan_tach_12[0..4]" I L 3700 3400 50 
F11 "fan_tach_3_3[0..4]" O R 5200 3400 50 
F12 "GPIO_INT_B" O R 5200 2600 50 
F13 "GPIO_RESET_B" I R 5200 2500 50 
$EndSheet
$Sheet
S 7500 5000 1000 1000
U 5E1C276C
F0 "uart_serial" 50
F1 "uart_serial.sch" 50
F2 "TX_1" I R 8500 5450 50 
F3 "TX_2" I R 8500 5550 50 
F4 "RX_1" O L 7500 5450 50 
F5 "RX_2" O L 7500 5550 50 
$EndSheet
$Comp
L Device:R R1701
U 1 1 5E1D06F4
P 3100 2550
F 0 "R1701" V 3180 2550 50  0000 C CNN
F 1 "4.87k" V 3100 2550 50  0000 C CNN
F 2 "Resistor_SMD:R_0402_1005Metric" V 3030 2550 50  0001 C CNN
F 3 "~" H 3100 2550 50  0001 C CNN
F 4 "3000-0000000133" H 3100 2550 50  0001 C CNN "PartSpecification"
	1    3100 2550
	1    0    0    -1  
$EndComp
$Comp
L Device:R R1702
U 1 1 5E1D0B19
P 3550 2550
F 0 "R1702" V 3630 2550 50  0000 C CNN
F 1 "4.87k" V 3550 2550 50  0000 C CNN
F 2 "Resistor_SMD:R_0402_1005Metric" V 3480 2550 50  0001 C CNN
F 3 "~" H 3550 2550 50  0001 C CNN
F 4 "3000-0000000133" H 3550 2550 50  0001 C CNN "PartSpecification"
	1    3550 2550
	1    0    0    -1  
$EndComp
Wire Wire Line
	3700 2900 3550 2900
Wire Wire Line
	3550 2700 3550 2900
Connection ~ 3550 2900
Wire Wire Line
	3100 2700 3100 2800
Connection ~ 3100 2800
Wire Wire Line
	3100 2800 3700 2800
$Comp
L power:+3.3V #PWR?
U 1 1 5E1D0EE6
P 3100 2300
F 0 "#PWR?" H 3100 2150 50  0001 C CNN
F 1 "+3.3V" H 3100 2440 50  0000 C CNN
F 2 "" H 3100 2300 50  0001 C CNN
F 3 "" H 3100 2300 50  0001 C CNN
	1    3100 2300
	1    0    0    -1  
$EndComp
$Comp
L power:+3.3V #PWR?
U 1 1 5E1D1159
P 3550 2300
F 0 "#PWR?" H 3550 2150 50  0001 C CNN
F 1 "+3.3V" H 3550 2440 50  0000 C CNN
F 2 "" H 3550 2300 50  0001 C CNN
F 3 "" H 3550 2300 50  0001 C CNN
	1    3550 2300
	1    0    0    -1  
$EndComp
Wire Wire Line
	3550 2300 3550 2400
Wire Wire Line
	3100 2400 3100 2300
Text HLabel 7000 3600 0    50   Input ~ 0
gpsdo_ser_output
Text HLabel 7000 3700 0    50   Input ~ 0
gpsdo_nmea_txd
Text HLabel 9500 3500 2    50   Output ~ 0
gpsdo_ser_input
Text HLabel 9500 3600 2    50   Output ~ 0
gpsdo_enter_isp
Text HLabel 7000 3800 0    50   Input ~ 0
gpsdo_lock_ok
Text HLabel 7000 3900 0    50   Input ~ 0
gpsdo_pps_in
$Sheet
S 7500 2500 1500 2000
U 5E218DC0
F0 "mcu_gpio" 50
F1 "mcu_gpio.sch" 50
F2 "RST_N" O R 9000 2900 50 
F3 "ACT_LED" O R 9000 2700 50 
F4 "LINK_LED" O R 9000 2600 50 
F5 "pg[0..9]" I L 7500 3100 50 
F6 "en[0..9]" O R 9000 3100 50 
F7 "gpsdo_ser_output" I L 7500 3600 50 
F8 "gpsdo_nmea_txd" I L 7500 3700 50 
F9 "gpsdo_ser_input" O R 9000 3500 50 
F10 "gpsdo_enter_isp" O R 9000 3600 50 
F11 "gpsdo_lock_ok" I L 7500 3800 50 
F12 "gpsdo_pps_in" I L 7500 3900 50 
F13 "fan_tach[0..4]" I L 7500 3000 50 
F14 "sense[0..12]" I L 7500 3200 50 
F15 "moisture" I L 7500 2800 50 
F16 "cooler_fault" I L 7500 2900 50 
F17 "NUC_reset" O R 9000 3800 50 
F18 "TX_1" O R 9000 4000 50 
F19 "TX_2" O R 9000 4100 50 
F20 "RX_1" I L 7500 4000 50 
F21 "RX_2" I L 7500 4100 50 
F22 "amux_s" O R 9000 3200 50 
F23 "charge_~discharge" I L 7500 3300 50 
F24 "imu_int1" I L 7500 3400 50 
F25 "imu_int2" I L 7500 3500 50 
F26 "SCL" O L 7500 2600 50 
F27 "SDA" B L 7500 2700 50 
F28 "GPIO_INT_B" I L 7500 4400 50 
F29 "GPIO_RESET_B" O L 7500 4300 50 
$EndSheet
$Sheet
S 10000 2500 500  500 
U 5E21E067
F0 "mcu_eth" 50
F1 "mcu_eth.sch" 50
F2 "Y_LED" I L 10000 2700 50 
F3 "G_LED" I L 10000 2600 50 
F4 "RST_N" I L 10000 2900 50 
F5 "pg_3_3" I L 10000 2800 50 
$EndSheet
$Sheet
S 8500 1000 1000 1000
U 5E22102C
F0 "mcu_power" 50
F1 "mcu_power.sch" 50
$EndSheet
Wire Wire Line
	9000 2600 10000 2600
Wire Wire Line
	10000 2700 9000 2700
Wire Wire Line
	9000 2900 10000 2900
Text Notes 2000 1000 0    50   ~ 0
GPIO - 8+9+6+1+1 = 25\nPG - 8\nEN - 9\nGPSDO - 6\nNUC reset - 1\ncooler fault - 1
Text Notes 3300 600  0    50   ~ 0
I2C - SCL,SDA 1 channel
Text Notes 4450 600  0    50   ~ 0
UART - TX1,RX1,TX2,RX2 - 2 channels
Text Notes 3300 1300 0    50   ~ 0
Analog - 12 + 1 + 1 = 14\n12 - I sense\n1 - V sense\n1 - moisture
Text HLabel 3300 3100 0    50   Input ~ 0
fan_tach[0..4]
Wire Bus Line
	7000 3100 7500 3100
Text Label 7150 3100 0    50   ~ 0
pg[0..9]
Wire Bus Line
	9500 3100 9000 3100
Text Label 9150 3100 0    50   ~ 0
en[0..9]
Wire Wire Line
	7000 3600 7500 3600
Wire Wire Line
	7500 3700 7000 3700
Wire Wire Line
	7000 3800 7500 3800
Wire Wire Line
	7500 3900 7000 3900
Wire Wire Line
	9500 3500 9000 3500
Wire Wire Line
	9000 3600 9500 3600
Wire Wire Line
	9000 3800 9100 3800
Wire Wire Line
	9100 3800 9100 4600
Wire Wire Line
	9100 4600 3600 4600
Wire Wire Line
	3600 4600 3600 3000
Wire Wire Line
	3600 3000 3700 3000
Wire Wire Line
	7500 4000 7400 4000
Wire Wire Line
	7400 4000 7400 5450
Wire Wire Line
	7400 5450 7500 5450
Wire Wire Line
	7500 4100 7300 4100
Wire Wire Line
	7300 4100 7300 5550
Wire Wire Line
	7300 5550 7500 5550
Wire Wire Line
	9000 4000 9200 4000
Wire Wire Line
	9200 4000 9200 5450
Wire Wire Line
	9200 5450 8500 5450
Wire Wire Line
	9000 4100 9300 4100
Wire Wire Line
	9300 4100 9300 5550
Wire Wire Line
	9300 5550 8500 5550
Text Label 1450 3250 0    50   ~ 0
i_sense0
Wire Wire Line
	1400 3250 1900 3250
Entry Wire Line
	1300 3150 1400 3250
Wire Bus Line
	1050 3150 1300 3150
Wire Bus Line
	1050 3250 1100 3250
Entry Wire Line
	1100 3250 1200 3350
Entry Wire Line
	1300 3350 1400 3450
Entry Wire Line
	1300 3550 1400 3650
Entry Wire Line
	1300 3750 1400 3850
Entry Wire Line
	1300 3950 1400 4050
Entry Wire Line
	1300 4150 1400 4250
Entry Wire Line
	1300 4350 1400 4450
Entry Wire Line
	1300 4550 1400 4650
Entry Wire Line
	1300 4750 1400 4850
Entry Wire Line
	1300 4950 1400 5050
Entry Wire Line
	1300 5150 1400 5250
Entry Wire Line
	1300 5350 1400 5450
Text Label 1450 3450 0    50   ~ 0
i_sense1
Wire Wire Line
	1400 3450 1900 3450
Text Label 1450 3650 0    50   ~ 0
i_sense2
Wire Wire Line
	1400 3650 1900 3650
Text Label 1450 3850 0    50   ~ 0
i_sense3
Wire Wire Line
	1400 3850 1900 3850
Text Label 1450 4050 0    50   ~ 0
i_sense4
Wire Wire Line
	1400 4050 1900 4050
Text Label 1450 4250 0    50   ~ 0
i_sense5
Wire Wire Line
	1400 4250 1900 4250
Text Label 1450 4450 0    50   ~ 0
i_sense6
Wire Wire Line
	1400 4450 1900 4450
Text Label 1450 4650 0    50   ~ 0
i_sense7
Wire Wire Line
	1400 4650 1900 4650
Text Label 1450 4850 0    50   ~ 0
i_sense8
Wire Wire Line
	1400 4850 1900 4850
Text Label 1450 5050 0    50   ~ 0
i_sense9
Wire Wire Line
	1400 5050 1900 5050
Text Label 1450 5250 0    50   ~ 0
i_sense10
Wire Wire Line
	1400 5250 1900 5250
Text Label 1450 5450 0    50   ~ 0
i_sense11
Wire Wire Line
	1400 5450 1900 5450
Wire Wire Line
	1200 3350 1250 3350
Wire Wire Line
	1250 3350 1250 3300
Wire Wire Line
	1250 3300 1350 3300
Wire Wire Line
	1350 3350 1350 3300
Wire Wire Line
	1350 3350 1900 3350
Text Label 1450 3350 0    50   ~ 0
v_sense0
Wire Wire Line
	1200 3550 1250 3550
Wire Wire Line
	1250 3550 1250 3500
Wire Wire Line
	1250 3500 1350 3500
Wire Wire Line
	1350 3550 1350 3500
Wire Wire Line
	1350 3550 1900 3550
Text Label 1450 3550 0    50   ~ 0
v_sense1
Entry Wire Line
	1100 3450 1200 3550
Wire Wire Line
	1200 3750 1250 3750
Wire Wire Line
	1250 3750 1250 3700
Wire Wire Line
	1250 3700 1350 3700
Wire Wire Line
	1350 3750 1350 3700
Wire Wire Line
	1350 3750 1900 3750
Text Label 1450 3750 0    50   ~ 0
v_sense2
Entry Wire Line
	1100 3650 1200 3750
Wire Wire Line
	1200 3950 1250 3950
Wire Wire Line
	1250 3950 1250 3900
Wire Wire Line
	1250 3900 1350 3900
Wire Wire Line
	1350 3950 1350 3900
Wire Wire Line
	1350 3950 1900 3950
Text Label 1450 3950 0    50   ~ 0
v_sense3
Entry Wire Line
	1100 3850 1200 3950
Wire Wire Line
	1200 4150 1250 4150
Wire Wire Line
	1250 4150 1250 4100
Wire Wire Line
	1250 4100 1350 4100
Wire Wire Line
	1350 4150 1350 4100
Wire Wire Line
	1350 4150 1900 4150
Text Label 1450 4150 0    50   ~ 0
v_sense4
Entry Wire Line
	1100 4050 1200 4150
Wire Wire Line
	1200 4350 1250 4350
Wire Wire Line
	1250 4350 1250 4300
Wire Wire Line
	1250 4300 1350 4300
Wire Wire Line
	1350 4350 1350 4300
Wire Wire Line
	1350 4350 1900 4350
Text Label 1450 4350 0    50   ~ 0
v_sense5
Entry Wire Line
	1100 4250 1200 4350
Wire Wire Line
	1200 4550 1250 4550
Wire Wire Line
	1250 4550 1250 4500
Wire Wire Line
	1250 4500 1350 4500
Wire Wire Line
	1350 4550 1350 4500
Wire Wire Line
	1350 4550 1900 4550
Text Label 1450 4550 0    50   ~ 0
v_sense6
Entry Wire Line
	1100 4450 1200 4550
Wire Wire Line
	1200 4750 1250 4750
Wire Wire Line
	1250 4750 1250 4700
Wire Wire Line
	1250 4700 1350 4700
Wire Wire Line
	1350 4750 1350 4700
Wire Wire Line
	1350 4750 1900 4750
Text Label 1450 4750 0    50   ~ 0
v_sense7
Entry Wire Line
	1100 4650 1200 4750
Wire Wire Line
	1200 5550 1250 5550
Wire Wire Line
	1250 5550 1250 5500
Wire Wire Line
	1250 5500 1350 5500
Wire Wire Line
	1350 5550 1350 5500
Wire Wire Line
	1350 5550 1900 5550
Text Label 1450 5550 0    50   ~ 0
v_sense11
Entry Wire Line
	1100 5450 1200 5550
Wire Wire Line
	1200 5350 1250 5350
Wire Wire Line
	1250 5350 1250 5300
Wire Wire Line
	1250 5300 1350 5300
Wire Wire Line
	1350 5350 1350 5300
Wire Wire Line
	1350 5350 1900 5350
Text Label 1450 5350 0    50   ~ 0
v_sense10
Entry Wire Line
	1100 5250 1200 5350
Wire Wire Line
	1200 5150 1250 5150
Wire Wire Line
	1250 5150 1250 5100
Wire Wire Line
	1250 5100 1350 5100
Wire Wire Line
	1350 5150 1350 5100
Wire Wire Line
	1350 5150 1900 5150
Text Label 1450 5150 0    50   ~ 0
v_sense9
Entry Wire Line
	1100 5050 1200 5150
Wire Wire Line
	1200 4950 1250 4950
Wire Wire Line
	1250 4950 1250 4900
Wire Wire Line
	1250 4900 1350 4900
Wire Wire Line
	1350 4950 1350 4900
Wire Wire Line
	1350 4950 1900 4950
Text Label 1450 4950 0    50   ~ 0
v_sense8
Entry Wire Line
	1100 4850 1200 4950
Text Label 2850 3300 0    50   ~ 0
sense0
Entry Wire Line
	3200 3300 3300 3400
Text Label 2850 3500 0    50   ~ 0
sense1
Entry Wire Line
	3200 3500 3300 3600
Text Label 2850 3700 0    50   ~ 0
sense2
Entry Wire Line
	3200 3700 3300 3800
Text Label 2850 5500 0    50   ~ 0
sense11
Entry Wire Line
	3200 5500 3300 5600
Text Label 2850 5300 0    50   ~ 0
sense10
Entry Wire Line
	3200 5300 3300 5400
Text Label 2850 5100 0    50   ~ 0
sense9
Entry Wire Line
	3200 5100 3300 5200
Text Label 2850 4900 0    50   ~ 0
sense8
Entry Wire Line
	3200 4900 3300 5000
Text Label 2850 4700 0    50   ~ 0
sense7
Entry Wire Line
	3200 4700 3300 4800
Text Label 2850 4500 0    50   ~ 0
sense6
Entry Wire Line
	3200 4500 3300 4600
Text Label 2850 4300 0    50   ~ 0
sense5
Entry Wire Line
	3200 4300 3300 4400
Text Label 2850 4100 0    50   ~ 0
sense4
Entry Wire Line
	3200 4100 3300 4200
Text Label 2850 3900 0    50   ~ 0
sense3
Entry Wire Line
	3200 3900 3300 4000
Wire Bus Line
	7500 3200 6000 3200
Wire Bus Line
	6000 3200 6000 6650
Text Label 6150 3200 0    50   ~ 0
sense[0..12]
$Comp
L 000_PreferredParts:C_1uF C1701
U 1 1 5E376787
P 1350 2200
F 0 "C1701" H 1375 2300 50  0000 L CNN
F 1 "C_1uF" H 1375 2100 50  0000 L CNN
F 2 "Capacitor_SMD:C_0603_1608Metric" H 1388 2050 50  0001 C CNN
F 3 "~" H 1350 2200 50  0001 C CNN
F 4 "3000-0000000136" H 1350 2200 50  0001 C CNN "PartSpecification"
	1    1350 2200
	1    0    0    -1  
$EndComp
$Comp
L 000_PreferredParts:C_1nF C1702
U 1 1 5E37700D
P 1650 2200
F 0 "C1702" H 1675 2300 50  0000 L CNN
F 1 "C_1nF" H 1675 2100 50  0000 L CNN
F 2 "Capacitor_SMD:C_0402_1005Metric" H 1688 2050 50  0001 C CNN
F 3 "~" H 1650 2200 50  0001 C CNN
F 4 "3000-0000000128" H 1650 2200 50  0001 C CNN "PartSpecification"
	1    1650 2200
	1    0    0    -1  
$EndComp
Wire Wire Line
	1500 1900 1500 2000
Wire Wire Line
	1500 2000 1650 2000
Wire Wire Line
	1650 2000 1650 2050
Wire Wire Line
	1500 2000 1350 2000
Wire Wire Line
	1350 2000 1350 2050
Connection ~ 1500 2000
$Comp
L power:GND #PWR?
U 1 1 5E385599
P 1500 2500
F 0 "#PWR?" H 1500 2250 50  0001 C CNN
F 1 "GND" H 1500 2350 50  0000 C CNN
F 2 "" H 1500 2500 50  0001 C CNN
F 3 "" H 1500 2500 50  0001 C CNN
	1    1500 2500
	1    0    0    -1  
$EndComp
Wire Wire Line
	1500 2500 1500 2450
Wire Wire Line
	1500 2450 1650 2450
Wire Wire Line
	1650 2450 1650 2350
Wire Wire Line
	1500 2450 1350 2450
Wire Wire Line
	1350 2450 1350 2350
Connection ~ 1500 2450
$Comp
L POWDER_Analog:SN74CBTLV16292 U1702
U 1 1 5E237FDD
P 2350 4400
F 0 "U1702" H 2050 6050 50  0000 C CNN
F 1 "SN74CBTLV16292" H 2750 6050 50  0000 C CNN
F 2 "Package_SO:TSSOP-56_6.1x14mm_P0.5mm" H 2050 6050 50  0001 C CNN
F 3 "" H 2050 6050 50  0001 C CNN
F 4 "3000-0000000525" H 2350 4400 50  0001 C CNN "PartSpecification"
	1    2350 4400
	-1   0    0    -1  
$EndComp
$Comp
L power:+3.3V #PWR?
U 1 1 5E24B1DD
P 1500 1900
F 0 "#PWR?" H 1500 1750 50  0001 C CNN
F 1 "+3.3V" H 1500 2040 50  0000 C CNN
F 2 "" H 1500 1900 50  0001 C CNN
F 3 "" H 1500 1900 50  0001 C CNN
	1    1500 1900
	1    0    0    -1  
$EndComp
$Comp
L power:GND #PWR?
U 1 1 5E26E656
P 2200 6200
F 0 "#PWR?" H 2200 5950 50  0001 C CNN
F 1 "GND" H 2200 6050 50  0000 C CNN
F 2 "" H 2200 6200 50  0001 C CNN
F 3 "" H 2200 6200 50  0001 C CNN
	1    2200 6200
	1    0    0    -1  
$EndComp
$Comp
L power:GND #PWR?
U 1 1 5E26EDC5
P 2300 6200
F 0 "#PWR?" H 2300 5950 50  0001 C CNN
F 1 "GND" H 2300 6050 50  0000 C CNN
F 2 "" H 2300 6200 50  0001 C CNN
F 3 "" H 2300 6200 50  0001 C CNN
	1    2300 6200
	1    0    0    -1  
$EndComp
$Comp
L power:GND #PWR?
U 1 1 5E26EEC1
P 2400 6200
F 0 "#PWR?" H 2400 5950 50  0001 C CNN
F 1 "GND" H 2400 6050 50  0000 C CNN
F 2 "" H 2400 6200 50  0001 C CNN
F 3 "" H 2400 6200 50  0001 C CNN
	1    2400 6200
	1    0    0    -1  
$EndComp
$Comp
L power:GND #PWR?
U 1 1 5E26F052
P 2500 6200
F 0 "#PWR?" H 2500 5950 50  0001 C CNN
F 1 "GND" H 2500 6050 50  0000 C CNN
F 2 "" H 2500 6200 50  0001 C CNN
F 3 "" H 2500 6200 50  0001 C CNN
	1    2500 6200
	1    0    0    -1  
$EndComp
Wire Wire Line
	2500 6200 2500 6100
Wire Wire Line
	2400 6100 2400 6200
Wire Wire Line
	2200 6100 2200 6200
Wire Wire Line
	2300 6100 2300 6200
$Comp
L power:+3.3V #PWR?
U 1 1 5E2A910F
P 2350 2600
F 0 "#PWR?" H 2350 2450 50  0001 C CNN
F 1 "+3.3V" H 2350 2740 50  0000 C CNN
F 2 "" H 2350 2600 50  0001 C CNN
F 3 "" H 2350 2600 50  0001 C CNN
	1    2350 2600
	1    0    0    -1  
$EndComp
Wire Wire Line
	2350 2600 2350 2700
Wire Wire Line
	2800 5700 3000 5700
Text Label 2850 5700 0    50   ~ 0
amux_s
Wire Wire Line
	9000 3200 9200 3200
Text Label 9050 3200 0    50   ~ 0
amux_s
Wire Wire Line
	7500 3300 5900 3300
Wire Wire Line
	5900 3300 5900 3100
Wire Wire Line
	5900 3100 5200 3100
Wire Wire Line
	5800 3200 5800 3400
Wire Wire Line
	5800 3400 7500 3400
Wire Wire Line
	5700 3500 5700 3300
Wire Wire Line
	5700 3300 5200 3300
Wire Wire Line
	7500 2800 5200 2800
Wire Wire Line
	5200 2900 7500 2900
Wire Wire Line
	5200 3200 5800 3200
Wire Wire Line
	5700 3500 7500 3500
Wire Wire Line
	2850 2800 3100 2800
Wire Wire Line
	2850 2900 3550 2900
Text Label 2850 2800 0    50   ~ 0
SCL
Text Label 2850 2900 0    50   ~ 0
SDA
Wire Wire Line
	7000 2700 7500 2700
Text Label 7000 2600 0    50   ~ 0
SCL
Text Label 7000 2700 0    50   ~ 0
SDA
Wire Wire Line
	7000 2600 7500 2600
Wire Bus Line
	5200 3400 5600 3400
Wire Bus Line
	5600 3400 5600 3000
Wire Bus Line
	5600 3000 7500 3000
Text Label 5750 3000 0    50   ~ 0
fan_tach_3_3v[0..4]
Wire Bus Line
	3700 3400 3550 3400
Wire Bus Line
	3550 3400 3550 3100
Wire Bus Line
	3550 3100 3300 3100
Text Label 3550 3100 0    50   ~ 0
fan_tach_12v[0..4]
Wire Wire Line
	10000 2800 9650 2800
Text Label 9650 2800 0    50   ~ 0
pg4
$Comp
L 000_PreferredParts:C_0_1uF C?
U 1 1 5FA41B99
P 3500 3500
AR Path="/5FA41B99" Ref="C?"  Part="1" 
AR Path="/5E1922DE/5FA41B99" Ref="C1708"  Part="1" 
F 0 "C1708" H 3525 3600 50  0000 L CNN
F 1 "C_0_1uF" H 3525 3400 50  0001 L CNN
F 2 "Capacitor_SMD:C_0402_1005Metric" H 3538 3350 50  0001 C CNN
F 3 "~" H 3500 3500 50  0001 C CNN
F 4 "0.1uF" H 3650 3400 50  0000 C CNN "DisplayValue"
F 5 "3000-0000000125" H 3500 3500 50  0001 C CNN "PartSpecification"
	1    3500 3500
	1    0    0    -1  
$EndComp
$Comp
L power:GND #PWR?
U 1 1 5FA41BA0
P 3500 3800
AR Path="/5FA41BA0" Ref="#PWR?"  Part="1" 
AR Path="/5E1922DE/5FA41BA0" Ref="#PWR?"  Part="1" 
F 0 "#PWR?" H 3500 3550 50  0001 C CNN
F 1 "GND" H 3500 3650 50  0000 C CNN
F 2 "" H 3500 3800 50  0001 C CNN
F 3 "" H 3500 3800 50  0001 C CNN
	1    3500 3800
	1    0    0    -1  
$EndComp
$Comp
L 000_PreferredParts:C_0_1uF C?
U 1 1 5FA53A1B
P 3400 3700
AR Path="/5FA53A1B" Ref="C?"  Part="1" 
AR Path="/5E1922DE/5FA53A1B" Ref="C1706"  Part="1" 
F 0 "C1706" H 3425 3800 50  0000 L CNN
F 1 "C_0_1uF" H 3425 3600 50  0001 L CNN
F 2 "Capacitor_SMD:C_0402_1005Metric" H 3438 3550 50  0001 C CNN
F 3 "~" H 3400 3700 50  0001 C CNN
F 4 "0.1uF" H 3550 3600 50  0000 C CNN "DisplayValue"
F 5 "3000-0000000125" H 3400 3700 50  0001 C CNN "PartSpecification"
	1    3400 3700
	1    0    0    -1  
$EndComp
$Comp
L power:GND #PWR?
U 1 1 5FA53A22
P 3400 4000
AR Path="/5FA53A22" Ref="#PWR?"  Part="1" 
AR Path="/5E1922DE/5FA53A22" Ref="#PWR?"  Part="1" 
F 0 "#PWR?" H 3400 3750 50  0001 C CNN
F 1 "GND" H 3400 3850 50  0000 C CNN
F 2 "" H 3400 4000 50  0001 C CNN
F 3 "" H 3400 4000 50  0001 C CNN
	1    3400 4000
	1    0    0    -1  
$EndComp
$Comp
L 000_PreferredParts:C_0_1uF C?
U 1 1 5FA6659C
P 3750 3900
AR Path="/5FA6659C" Ref="C?"  Part="1" 
AR Path="/5E1922DE/5FA6659C" Ref="C1709"  Part="1" 
F 0 "C1709" H 3775 4000 50  0000 L CNN
F 1 "C_0_1uF" H 3775 3800 50  0001 L CNN
F 2 "Capacitor_SMD:C_0402_1005Metric" H 3788 3750 50  0001 C CNN
F 3 "~" H 3750 3900 50  0001 C CNN
F 4 "0.1uF" H 3900 3800 50  0000 C CNN "DisplayValue"
F 5 "3000-0000000125" H 3750 3900 50  0001 C CNN "PartSpecification"
	1    3750 3900
	1    0    0    -1  
$EndComp
$Comp
L power:GND #PWR?
U 1 1 5FA665A3
P 3750 4200
AR Path="/5FA665A3" Ref="#PWR?"  Part="1" 
AR Path="/5E1922DE/5FA665A3" Ref="#PWR?"  Part="1" 
F 0 "#PWR?" H 3750 3950 50  0001 C CNN
F 1 "GND" H 3750 4050 50  0000 C CNN
F 2 "" H 3750 4200 50  0001 C CNN
F 3 "" H 3750 4200 50  0001 C CNN
	1    3750 4200
	1    0    0    -1  
$EndComp
$Comp
L 000_PreferredParts:C_0_1uF C?
U 1 1 5FA7C58D
P 3400 5750
AR Path="/5FA7C58D" Ref="C?"  Part="1" 
AR Path="/5E1922DE/5FA7C58D" Ref="C1707"  Part="1" 
F 0 "C1707" H 3425 5850 50  0000 L CNN
F 1 "C_0_1uF" H 3425 5650 50  0001 L CNN
F 2 "Capacitor_SMD:C_0402_1005Metric" H 3438 5600 50  0001 C CNN
F 3 "~" H 3400 5750 50  0001 C CNN
F 4 "0.1uF" H 3550 5650 50  0000 C CNN "DisplayValue"
F 5 "3000-0000000125" H 3400 5750 50  0001 C CNN "PartSpecification"
	1    3400 5750
	1    0    0    -1  
$EndComp
Wire Wire Line
	3400 5600 3400 5500
$Comp
L power:GND #PWR?
U 1 1 5FA7C594
P 3400 6000
AR Path="/5FA7C594" Ref="#PWR?"  Part="1" 
AR Path="/5E1922DE/5FA7C594" Ref="#PWR?"  Part="1" 
F 0 "#PWR?" H 3400 5750 50  0001 C CNN
F 1 "GND" H 3400 5850 50  0000 C CNN
F 2 "" H 3400 6000 50  0001 C CNN
F 3 "" H 3400 6000 50  0001 C CNN
	1    3400 6000
	1    0    0    -1  
$EndComp
Wire Wire Line
	3400 5900 3400 6000
$Comp
L 000_PreferredParts:C_0_1uF C?
U 1 1 5FA867C0
P 3750 5550
AR Path="/5FA867C0" Ref="C?"  Part="1" 
AR Path="/5E1922DE/5FA867C0" Ref="C1710"  Part="1" 
F 0 "C1710" H 3775 5650 50  0000 L CNN
F 1 "C_0_1uF" H 3775 5450 50  0001 L CNN
F 2 "Capacitor_SMD:C_0402_1005Metric" H 3788 5400 50  0001 C CNN
F 3 "~" H 3750 5550 50  0001 C CNN
F 4 "0.1uF" H 3900 5450 50  0000 C CNN "DisplayValue"
F 5 "3000-0000000125" H 3750 5550 50  0001 C CNN "PartSpecification"
	1    3750 5550
	1    0    0    -1  
$EndComp
Wire Wire Line
	3750 5400 3750 5300
$Comp
L power:GND #PWR?
U 1 1 5FA867C7
P 3750 5800
AR Path="/5FA867C7" Ref="#PWR?"  Part="1" 
AR Path="/5E1922DE/5FA867C7" Ref="#PWR?"  Part="1" 
F 0 "#PWR?" H 3750 5550 50  0001 C CNN
F 1 "GND" H 3750 5650 50  0000 C CNN
F 2 "" H 3750 5800 50  0001 C CNN
F 3 "" H 3750 5800 50  0001 C CNN
	1    3750 5800
	1    0    0    -1  
$EndComp
Wire Wire Line
	3750 5700 3750 5800
$Comp
L 000_PreferredParts:C_0_1uF C?
U 1 1 5FAA4FEA
P 4100 5350
AR Path="/5FAA4FEA" Ref="C?"  Part="1" 
AR Path="/5E1922DE/5FAA4FEA" Ref="C1711"  Part="1" 
F 0 "C1711" H 4125 5450 50  0000 L CNN
F 1 "C_0_1uF" H 4125 5250 50  0001 L CNN
F 2 "Capacitor_SMD:C_0402_1005Metric" H 4138 5200 50  0001 C CNN
F 3 "~" H 4100 5350 50  0001 C CNN
F 4 "0.1uF" H 4250 5250 50  0000 C CNN "DisplayValue"
F 5 "3000-0000000125" H 4100 5350 50  0001 C CNN "PartSpecification"
	1    4100 5350
	1    0    0    -1  
$EndComp
Wire Wire Line
	4100 5200 4100 5100
$Comp
L power:GND #PWR?
U 1 1 5FAA4FF1
P 4100 5600
AR Path="/5FAA4FF1" Ref="#PWR?"  Part="1" 
AR Path="/5E1922DE/5FAA4FF1" Ref="#PWR?"  Part="1" 
F 0 "#PWR?" H 4100 5350 50  0001 C CNN
F 1 "GND" H 4100 5450 50  0000 C CNN
F 2 "" H 4100 5600 50  0001 C CNN
F 3 "" H 4100 5600 50  0001 C CNN
	1    4100 5600
	1    0    0    -1  
$EndComp
Wire Wire Line
	4100 5500 4100 5600
$Comp
L 000_PreferredParts:C_0_1uF C?
U 1 1 5FAAF2A9
P 4450 5150
AR Path="/5FAAF2A9" Ref="C?"  Part="1" 
AR Path="/5E1922DE/5FAAF2A9" Ref="C1712"  Part="1" 
F 0 "C1712" H 4475 5250 50  0000 L CNN
F 1 "C_0_1uF" H 4475 5050 50  0001 L CNN
F 2 "Capacitor_SMD:C_0402_1005Metric" H 4488 5000 50  0001 C CNN
F 3 "~" H 4450 5150 50  0001 C CNN
F 4 "0.1uF" H 4600 5050 50  0000 C CNN "DisplayValue"
F 5 "3000-0000000125" H 4450 5150 50  0001 C CNN "PartSpecification"
	1    4450 5150
	1    0    0    -1  
$EndComp
Wire Wire Line
	4450 5000 4450 4900
$Comp
L power:GND #PWR?
U 1 1 5FAAF2B0
P 4450 5400
AR Path="/5FAAF2B0" Ref="#PWR?"  Part="1" 
AR Path="/5E1922DE/5FAAF2B0" Ref="#PWR?"  Part="1" 
F 0 "#PWR?" H 4450 5150 50  0001 C CNN
F 1 "GND" H 4450 5250 50  0000 C CNN
F 2 "" H 4450 5400 50  0001 C CNN
F 3 "" H 4450 5400 50  0001 C CNN
	1    4450 5400
	1    0    0    -1  
$EndComp
Wire Wire Line
	4450 5300 4450 5400
$Comp
L 000_PreferredParts:C_0_1uF C?
U 1 1 5FAB94FB
P 4750 4950
AR Path="/5FAB94FB" Ref="C?"  Part="1" 
AR Path="/5E1922DE/5FAB94FB" Ref="C1713"  Part="1" 
F 0 "C1713" H 4775 5050 50  0000 L CNN
F 1 "C_0_1uF" H 4775 4850 50  0001 L CNN
F 2 "Capacitor_SMD:C_0402_1005Metric" H 4788 4800 50  0001 C CNN
F 3 "~" H 4750 4950 50  0001 C CNN
F 4 "0.1uF" H 4900 4850 50  0000 C CNN "DisplayValue"
F 5 "3000-0000000125" H 4750 4950 50  0001 C CNN "PartSpecification"
	1    4750 4950
	1    0    0    -1  
$EndComp
Wire Wire Line
	4750 4800 4750 4700
$Comp
L power:GND #PWR?
U 1 1 5FAB9502
P 4750 5200
AR Path="/5FAB9502" Ref="#PWR?"  Part="1" 
AR Path="/5E1922DE/5FAB9502" Ref="#PWR?"  Part="1" 
F 0 "#PWR?" H 4750 4950 50  0001 C CNN
F 1 "GND" H 4750 5050 50  0000 C CNN
F 2 "" H 4750 5200 50  0001 C CNN
F 3 "" H 4750 5200 50  0001 C CNN
	1    4750 5200
	1    0    0    -1  
$EndComp
Wire Wire Line
	4750 5100 4750 5200
$Comp
L 000_PreferredParts:C_0_1uF C?
U 1 1 5FAC3E94
P 5050 4750
AR Path="/5FAC3E94" Ref="C?"  Part="1" 
AR Path="/5E1922DE/5FAC3E94" Ref="C1714"  Part="1" 
F 0 "C1714" H 5075 4850 50  0000 L CNN
F 1 "C_0_1uF" H 5075 4650 50  0001 L CNN
F 2 "Capacitor_SMD:C_0402_1005Metric" H 5088 4600 50  0001 C CNN
F 3 "~" H 5050 4750 50  0001 C CNN
F 4 "0.1uF" H 5200 4650 50  0000 C CNN "DisplayValue"
F 5 "3000-0000000125" H 5050 4750 50  0001 C CNN "PartSpecification"
	1    5050 4750
	1    0    0    -1  
$EndComp
Wire Wire Line
	5050 4600 5050 4500
$Comp
L power:GND #PWR?
U 1 1 5FAC3E9B
P 5050 5000
AR Path="/5FAC3E9B" Ref="#PWR?"  Part="1" 
AR Path="/5E1922DE/5FAC3E9B" Ref="#PWR?"  Part="1" 
F 0 "#PWR?" H 5050 4750 50  0001 C CNN
F 1 "GND" H 5050 4850 50  0000 C CNN
F 2 "" H 5050 5000 50  0001 C CNN
F 3 "" H 5050 5000 50  0001 C CNN
	1    5050 5000
	1    0    0    -1  
$EndComp
Wire Wire Line
	5050 4900 5050 5000
$Comp
L 000_PreferredParts:C_0_1uF C?
U 1 1 5FAFA2FF
P 5350 4550
AR Path="/5FAFA2FF" Ref="C?"  Part="1" 
AR Path="/5E1922DE/5FAFA2FF" Ref="C1715"  Part="1" 
F 0 "C1715" H 5375 4650 50  0000 L CNN
F 1 "C_0_1uF" H 5375 4450 50  0001 L CNN
F 2 "Capacitor_SMD:C_0402_1005Metric" H 5388 4400 50  0001 C CNN
F 3 "~" H 5350 4550 50  0001 C CNN
F 4 "0.1uF" H 5500 4450 50  0000 C CNN "DisplayValue"
F 5 "3000-0000000125" H 5350 4550 50  0001 C CNN "PartSpecification"
	1    5350 4550
	1    0    0    -1  
$EndComp
Wire Wire Line
	5350 4400 5350 4300
$Comp
L power:GND #PWR?
U 1 1 5FAFA306
P 5350 4800
AR Path="/5FAFA306" Ref="#PWR?"  Part="1" 
AR Path="/5E1922DE/5FAFA306" Ref="#PWR?"  Part="1" 
F 0 "#PWR?" H 5350 4550 50  0001 C CNN
F 1 "GND" H 5350 4650 50  0000 C CNN
F 2 "" H 5350 4800 50  0001 C CNN
F 3 "" H 5350 4800 50  0001 C CNN
	1    5350 4800
	1    0    0    -1  
$EndComp
Wire Wire Line
	5350 4700 5350 4800
$Comp
L 000_PreferredParts:C_0_1uF C?
U 1 1 5FB05514
P 5650 4350
AR Path="/5FB05514" Ref="C?"  Part="1" 
AR Path="/5E1922DE/5FB05514" Ref="C1716"  Part="1" 
F 0 "C1716" H 5675 4450 50  0000 L CNN
F 1 "C_0_1uF" H 5675 4250 50  0001 L CNN
F 2 "Capacitor_SMD:C_0402_1005Metric" H 5688 4200 50  0001 C CNN
F 3 "~" H 5650 4350 50  0001 C CNN
F 4 "0.1uF" H 5800 4250 50  0000 C CNN "DisplayValue"
F 5 "3000-0000000125" H 5650 4350 50  0001 C CNN "PartSpecification"
	1    5650 4350
	1    0    0    -1  
$EndComp
Wire Wire Line
	5650 4200 5650 4100
$Comp
L power:GND #PWR?
U 1 1 5FB0551B
P 5650 4600
AR Path="/5FB0551B" Ref="#PWR?"  Part="1" 
AR Path="/5E1922DE/5FB0551B" Ref="#PWR?"  Part="1" 
F 0 "#PWR?" H 5650 4350 50  0001 C CNN
F 1 "GND" H 5650 4450 50  0000 C CNN
F 2 "" H 5650 4600 50  0001 C CNN
F 3 "" H 5650 4600 50  0001 C CNN
	1    5650 4600
	1    0    0    -1  
$EndComp
Wire Wire Line
	5650 4500 5650 4600
Wire Wire Line
	3500 3700 3750 3700
Wire Wire Line
	3750 4100 5650 4100
$Comp
L 000_PreferredParts:C_0_1uF C?
U 1 1 5FB3268B
P 5950 4150
AR Path="/5FB3268B" Ref="C?"  Part="1" 
AR Path="/5E1922DE/5FB3268B" Ref="C1717"  Part="1" 
F 0 "C1717" H 5975 4250 50  0000 L CNN
F 1 "C_0_1uF" H 5975 4050 50  0001 L CNN
F 2 "Capacitor_SMD:C_0402_1005Metric" H 5988 4000 50  0001 C CNN
F 3 "~" H 5950 4150 50  0001 C CNN
F 4 "0.1uF" H 6100 4050 50  0000 C CNN "DisplayValue"
F 5 "3000-0000000125" H 5950 4150 50  0001 C CNN "PartSpecification"
	1    5950 4150
	1    0    0    -1  
$EndComp
Wire Wire Line
	5950 4000 5950 3900
$Comp
L power:GND #PWR?
U 1 1 5FB32692
P 5950 4400
AR Path="/5FB32692" Ref="#PWR?"  Part="1" 
AR Path="/5E1922DE/5FB32692" Ref="#PWR?"  Part="1" 
F 0 "#PWR?" H 5950 4150 50  0001 C CNN
F 1 "GND" H 5950 4250 50  0000 C CNN
F 2 "" H 5950 4400 50  0001 C CNN
F 3 "" H 5950 4400 50  0001 C CNN
	1    5950 4400
	1    0    0    -1  
$EndComp
Wire Wire Line
	5950 4300 5950 4400
Wire Wire Line
	3400 3550 3400 3500
Wire Wire Line
	3400 3900 5950 3900
Wire Wire Line
	3400 3850 3400 4000
Wire Wire Line
	3750 3750 3750 3700
Wire Wire Line
	3750 4050 3750 4200
Wire Wire Line
	3500 3350 3500 3300
Wire Wire Line
	3500 3650 3500 3800
Wire Wire Line
	5200 2600 6100 2600
Wire Wire Line
	6100 2600 6100 4400
Wire Wire Line
	6100 4400 7500 4400
Wire Wire Line
	7500 4300 6200 4300
Wire Wire Line
	6200 4300 6200 2500
Wire Wire Line
	6200 2500 5200 2500
Wire Bus Line
	3300 6650 6000 6650
Wire Wire Line
	2800 3900 3400 3900
Wire Wire Line
	2800 4100 3750 4100
Wire Wire Line
	2800 4300 5350 4300
Wire Wire Line
	2800 4500 5050 4500
Wire Wire Line
	2800 4700 4750 4700
Wire Wire Line
	2800 4900 4450 4900
Wire Wire Line
	2800 5100 4100 5100
Wire Wire Line
	2800 5300 3750 5300
Wire Wire Line
	2800 5500 3400 5500
Wire Wire Line
	2800 3700 3500 3700
Wire Wire Line
	2800 3500 3400 3500
Wire Wire Line
	2800 3300 3500 3300
Wire Bus Line
	1100 3250 1100 5450
Wire Bus Line
	1300 3150 1300 5350
Wire Bus Line
	3300 3400 3300 6650
$EndSCHEMATC
