EESchema Schematic File Version 4
EELAYER 26 0
EELAYER END
$Descr A4 11693 8268
encoding utf-8
Sheet 1 1
Title ""
Date ""
Rev ""
Comp ""
Comment1 ""
Comment2 ""
Comment3 ""
Comment4 ""
$EndDescr
$Comp
L rf:SKY65162-70LF U1
U 1 1 5B5B5736
P 5550 3450
F 0 "U1" H 5575 3915 50  0000 C CNN
F 1 "SKY65162-70LF" H 5575 3824 50  0000 C CNN
F 2 "Package_TO_SOT_SMD:SOT-89-3" H 5550 3450 50  0001 C CNN
F 3 "" H 5550 3450 50  0001 C CNN
	1    5550 3450
	1    0    0    -1  
$EndComp
$Comp
L power:GND #PWR?
U 1 1 5B5B57A9
P 5550 3900
F 0 "#PWR?" H 5550 3650 50  0001 C CNN
F 1 "GND" H 5555 3727 50  0000 C CNN
F 2 "" H 5550 3900 50  0001 C CNN
F 3 "" H 5550 3900 50  0001 C CNN
	1    5550 3900
	1    0    0    -1  
$EndComp
Wire Wire Line
	5550 3900 5550 3700
$Comp
L Device:L L2
U 1 1 5B5B57E5
P 6250 3150
F 0 "L2" H 6303 3196 50  0000 L CNN
F 1 "L" H 6303 3105 50  0000 L CNN
F 2 "Inductor_SMD:L_0402_1005Metric" H 6250 3150 50  0001 C CNN
F 3 "~" H 6250 3150 50  0001 C CNN
	1    6250 3150
	1    0    0    -1  
$EndComp
$Comp
L Device:C C10
U 1 1 5B5B58DC
P 4900 3450
F 0 "C10" V 4648 3450 50  0000 C CNN
F 1 "C" V 4739 3450 50  0000 C CNN
F 2 "Capacitor_SMD:C_0201_0603Metric" H 4938 3300 50  0001 C CNN
F 3 "~" H 4900 3450 50  0001 C CNN
	1    4900 3450
	0    1    1    0   
$EndComp
$Comp
L Device:C C3
U 1 1 5B5B596A
P 4500 3750
F 0 "C3" H 4385 3704 50  0000 R CNN
F 1 "C" H 4385 3795 50  0000 R CNN
F 2 "Capacitor_SMD:C_0201_0603Metric" H 4538 3600 50  0001 C CNN
F 3 "~" H 4500 3750 50  0001 C CNN
	1    4500 3750
	-1   0    0    1   
$EndComp
$Comp
L Device:C C2
U 1 1 5B5B59A3
P 4150 3450
F 0 "C2" V 4402 3450 50  0000 C CNN
F 1 "C" V 4311 3450 50  0000 C CNN
F 2 "Capacitor_SMD:C_0201_0603Metric" H 4188 3300 50  0001 C CNN
F 3 "~" H 4150 3450 50  0001 C CNN
	1    4150 3450
	0    -1   -1   0   
$EndComp
$Comp
L Device:C C1
U 1 1 5B5B59DD
P 3750 3750
F 0 "C1" H 3865 3796 50  0000 L CNN
F 1 "C" H 3865 3705 50  0000 L CNN
F 2 "Capacitor_SMD:C_0201_0603Metric" H 3788 3600 50  0001 C CNN
F 3 "~" H 3750 3750 50  0001 C CNN
	1    3750 3750
	1    0    0    -1  
$EndComp
$Comp
L Device:C C14
U 1 1 5B5B5A2A
P 3050 3750
F 0 "C14" H 2935 3704 50  0000 R CNN
F 1 "C" H 2935 3795 50  0000 R CNN
F 2 "Capacitor_SMD:C_0201_0603Metric" H 3088 3600 50  0001 C CNN
F 3 "~" H 3050 3750 50  0001 C CNN
	1    3050 3750
	-1   0    0    1   
$EndComp
$Comp
L Device:C C13
U 1 1 5B5B5A88
P 2350 3750
F 0 "C13" H 2235 3704 50  0000 R CNN
F 1 "C" H 2235 3795 50  0000 R CNN
F 2 "Capacitor_SMD:C_0201_0603Metric" H 2388 3600 50  0001 C CNN
F 3 "~" H 2350 3750 50  0001 C CNN
	1    2350 3750
	-1   0    0    1   
$EndComp
$Comp
L Device:C C12
U 1 1 5B5B5AC4
P 1900 3450
F 0 "C12" V 2152 3450 50  0000 C CNN
F 1 "C" V 2061 3450 50  0000 C CNN
F 2 "Capacitor_SMD:C_0201_0603Metric" H 1938 3300 50  0001 C CNN
F 3 "~" H 1900 3450 50  0001 C CNN
	1    1900 3450
	0    -1   -1   0   
$EndComp
$Comp
L Device:L L1
U 1 1 5B5B5B12
P 2700 3450
F 0 "L1" V 2890 3450 50  0000 C CNN
F 1 "L" V 2799 3450 50  0000 C CNN
F 2 "Inductor_SMD:L_0201_0603Metric" H 2700 3450 50  0001 C CNN
F 3 "~" H 2700 3450 50  0001 C CNN
	1    2700 3450
	0    -1   -1   0   
$EndComp
$Comp
L Device:C C4
U 1 1 5B5B5CA1
P 6250 3750
F 0 "C4" H 6135 3704 50  0000 R CNN
F 1 "C" H 6135 3795 50  0000 R CNN
F 2 "Capacitor_SMD:C_0201_0603Metric" H 6288 3600 50  0001 C CNN
F 3 "~" H 6250 3750 50  0001 C CNN
	1    6250 3750
	-1   0    0    1   
$EndComp
$Comp
L Device:C C5
U 1 1 5B5B5D85
P 6700 3450
F 0 "C5" V 6952 3450 50  0000 C CNN
F 1 "C" V 6861 3450 50  0000 C CNN
F 2 "Capacitor_SMD:C_0201_0603Metric" H 6738 3300 50  0001 C CNN
F 3 "~" H 6700 3450 50  0001 C CNN
	1    6700 3450
	0    -1   -1   0   
$EndComp
$Comp
L Device:C C6
U 1 1 5B5B5DE4
P 7050 3750
F 0 "C6" H 7165 3796 50  0000 L CNN
F 1 "C" H 7165 3705 50  0000 L CNN
F 2 "Capacitor_SMD:C_0201_0603Metric" H 7088 3600 50  0001 C CNN
F 3 "~" H 7050 3750 50  0001 C CNN
	1    7050 3750
	1    0    0    -1  
$EndComp
$Comp
L Device:C C15
U 1 1 5B5B5E36
P 7700 3750
F 0 "C15" H 7585 3704 50  0000 R CNN
F 1 "C" H 7585 3795 50  0000 R CNN
F 2 "Capacitor_SMD:C_0201_0603Metric" H 7738 3600 50  0001 C CNN
F 3 "~" H 7700 3750 50  0001 C CNN
	1    7700 3750
	-1   0    0    1   
$EndComp
$Comp
L Device:C C16
U 1 1 5B5B5EEE
P 8300 3750
F 0 "C16" H 8185 3704 50  0000 R CNN
F 1 "C" H 8185 3795 50  0000 R CNN
F 2 "Capacitor_SMD:C_0201_0603Metric" H 8338 3600 50  0001 C CNN
F 3 "~" H 8300 3750 50  0001 C CNN
	1    8300 3750
	-1   0    0    1   
$EndComp
$Comp
L Device:C C17
U 1 1 5B5B5F30
P 8900 3750
F 0 "C17" H 8785 3704 50  0000 R CNN
F 1 "C" H 8785 3795 50  0000 R CNN
F 2 "Capacitor_SMD:C_0201_0603Metric" H 8938 3600 50  0001 C CNN
F 3 "~" H 8900 3750 50  0001 C CNN
	1    8900 3750
	-1   0    0    1   
$EndComp
$Comp
L Device:C C11
U 1 1 5B5B5F78
P 9350 3450
F 0 "C11" V 9602 3450 50  0000 C CNN
F 1 "C" V 9511 3450 50  0000 C CNN
F 2 "Capacitor_SMD:C_0201_0603Metric" H 9388 3300 50  0001 C CNN
F 3 "~" H 9350 3450 50  0001 C CNN
	1    9350 3450
	0    -1   -1   0   
$EndComp
$Comp
L Connector:Conn_Coaxial J2
U 1 1 5B5B606F
P 10100 3450
F 0 "J2" H 10199 3426 50  0000 L CNN
F 1 "Conn_Coaxial" H 10199 3335 50  0000 L CNN
F 2 "rf:SMA_endlaunch_SD-73251-115" H 10100 3450 50  0001 C CNN
F 3 " ~" H 10100 3450 50  0001 C CNN
	1    10100 3450
	1    0    0    -1  
$EndComp
$Comp
L Connector:Conn_Coaxial J1
U 1 1 5B5B61DB
P 1200 3450
F 0 "J1" H 1130 3688 50  0000 C CNN
F 1 "Conn_Coaxial" H 1130 3597 50  0000 C CNN
F 2 "rf:SMA_endlaunch_SD-73251-115" H 1200 3450 50  0001 C CNN
F 3 " ~" H 1200 3450 50  0001 C CNN
	1    1200 3450
	-1   0    0    -1  
$EndComp
$Comp
L power:GND #PWR?
U 1 1 5B5B635F
P 4500 4150
F 0 "#PWR?" H 4500 3900 50  0001 C CNN
F 1 "GND" H 4505 3977 50  0000 C CNN
F 2 "" H 4500 4150 50  0001 C CNN
F 3 "" H 4500 4150 50  0001 C CNN
	1    4500 4150
	1    0    0    -1  
$EndComp
$Comp
L power:GND #PWR?
U 1 1 5B5B6390
P 3750 4150
F 0 "#PWR?" H 3750 3900 50  0001 C CNN
F 1 "GND" H 3755 3977 50  0000 C CNN
F 2 "" H 3750 4150 50  0001 C CNN
F 3 "" H 3750 4150 50  0001 C CNN
	1    3750 4150
	1    0    0    -1  
$EndComp
$Comp
L power:GND #PWR?
U 1 1 5B5B63C1
P 3050 4150
F 0 "#PWR?" H 3050 3900 50  0001 C CNN
F 1 "GND" H 3055 3977 50  0000 C CNN
F 2 "" H 3050 4150 50  0001 C CNN
F 3 "" H 3050 4150 50  0001 C CNN
	1    3050 4150
	1    0    0    -1  
$EndComp
$Comp
L power:GND #PWR?
U 1 1 5B5B63F2
P 2350 4150
F 0 "#PWR?" H 2350 3900 50  0001 C CNN
F 1 "GND" H 2355 3977 50  0000 C CNN
F 2 "" H 2350 4150 50  0001 C CNN
F 3 "" H 2350 4150 50  0001 C CNN
	1    2350 4150
	1    0    0    -1  
$EndComp
$Comp
L power:GND #PWR?
U 1 1 5B5B6423
P 1200 4150
F 0 "#PWR?" H 1200 3900 50  0001 C CNN
F 1 "GND" H 1205 3977 50  0000 C CNN
F 2 "" H 1200 4150 50  0001 C CNN
F 3 "" H 1200 4150 50  0001 C CNN
	1    1200 4150
	1    0    0    -1  
$EndComp
Wire Wire Line
	1200 4150 1200 3650
Wire Wire Line
	1400 3450 1750 3450
$Comp
L Device:L L3
U 1 1 5B5B65E3
P 3400 3450
F 0 "L3" V 3590 3450 50  0000 C CNN
F 1 "L" V 3499 3450 50  0000 C CNN
F 2 "Inductor_SMD:L_0201_0603Metric" H 3400 3450 50  0001 C CNN
F 3 "~" H 3400 3450 50  0001 C CNN
	1    3400 3450
	0    -1   -1   0   
$EndComp
$Comp
L Device:L L4
U 1 1 5B5B6639
P 7400 3450
F 0 "L4" V 7590 3450 50  0000 C CNN
F 1 "L" V 7499 3450 50  0000 C CNN
F 2 "Inductor_SMD:L_0201_0603Metric" H 7400 3450 50  0001 C CNN
F 3 "~" H 7400 3450 50  0001 C CNN
	1    7400 3450
	0    -1   -1   0   
$EndComp
$Comp
L Device:L L5
U 1 1 5B5B6747
P 8000 3450
F 0 "L5" V 8190 3450 50  0000 C CNN
F 1 "L" V 8099 3450 50  0000 C CNN
F 2 "Inductor_SMD:L_0201_0603Metric" H 8000 3450 50  0001 C CNN
F 3 "~" H 8000 3450 50  0001 C CNN
	1    8000 3450
	0    -1   -1   0   
$EndComp
$Comp
L Device:L L7
U 1 1 5B5B67AB
P 8600 3450
F 0 "L7" V 8790 3450 50  0000 C CNN
F 1 "L" V 8699 3450 50  0000 C CNN
F 2 "Inductor_SMD:L_0201_0603Metric" H 8600 3450 50  0001 C CNN
F 3 "~" H 8600 3450 50  0001 C CNN
	1    8600 3450
	0    -1   -1   0   
$EndComp
$Comp
L Device:C C9
U 1 1 5B5B67FD
P 6800 2600
F 0 "C9" H 6915 2646 50  0000 L CNN
F 1 "C" H 6915 2555 50  0000 L CNN
F 2 "Capacitor_SMD:C_0402_1005Metric" H 6838 2450 50  0001 C CNN
F 3 "~" H 6800 2600 50  0001 C CNN
	1    6800 2600
	1    0    0    -1  
$EndComp
$Comp
L Device:C C8
U 1 1 5B5B6873
P 7350 2600
F 0 "C8" H 7465 2646 50  0000 L CNN
F 1 "C" H 7465 2555 50  0000 L CNN
F 2 "Capacitor_SMD:C_0402_1005Metric" H 7388 2450 50  0001 C CNN
F 3 "~" H 7350 2600 50  0001 C CNN
	1    7350 2600
	1    0    0    -1  
$EndComp
$Comp
L Device:C C7
U 1 1 5B5B68CB
P 7850 2600
F 0 "C7" H 7965 2646 50  0000 L CNN
F 1 "C" H 7965 2555 50  0000 L CNN
F 2 "Capacitor_SMD:C_0805_2012Metric" H 7888 2450 50  0001 C CNN
F 3 "~" H 7850 2600 50  0001 C CNN
	1    7850 2600
	1    0    0    -1  
$EndComp
$Comp
L Device:L L6
U 1 1 5B5B6ADD
P 8250 2300
F 0 "L6" V 8440 2300 50  0000 C CNN
F 1 "BEAD" V 8349 2300 50  0000 C CNN
F 2 "Inductor_SMD:L_0603_1608Metric" H 8250 2300 50  0001 C CNN
F 3 "~" H 8250 2300 50  0001 C CNN
	1    8250 2300
	0    -1   -1   0   
$EndComp
$Comp
L power:VCC #PWR?
U 1 1 5B5B6CBC
P 8750 2100
F 0 "#PWR?" H 8750 1950 50  0001 C CNN
F 1 "VCC" H 8767 2273 50  0000 C CNN
F 2 "" H 8750 2100 50  0001 C CNN
F 3 "" H 8750 2100 50  0001 C CNN
	1    8750 2100
	1    0    0    -1  
$EndComp
$Comp
L power:GND #PWR?
U 1 1 5B5B6DC1
P 6250 4150
F 0 "#PWR?" H 6250 3900 50  0001 C CNN
F 1 "GND" H 6255 3977 50  0000 C CNN
F 2 "" H 6250 4150 50  0001 C CNN
F 3 "" H 6250 4150 50  0001 C CNN
	1    6250 4150
	1    0    0    -1  
$EndComp
$Comp
L power:GND #PWR?
U 1 1 5B5B6E02
P 7050 4150
F 0 "#PWR?" H 7050 3900 50  0001 C CNN
F 1 "GND" H 7055 3977 50  0000 C CNN
F 2 "" H 7050 4150 50  0001 C CNN
F 3 "" H 7050 4150 50  0001 C CNN
	1    7050 4150
	1    0    0    -1  
$EndComp
$Comp
L power:GND #PWR?
U 1 1 5B5B6E43
P 7700 4150
F 0 "#PWR?" H 7700 3900 50  0001 C CNN
F 1 "GND" H 7705 3977 50  0000 C CNN
F 2 "" H 7700 4150 50  0001 C CNN
F 3 "" H 7700 4150 50  0001 C CNN
	1    7700 4150
	1    0    0    -1  
$EndComp
$Comp
L power:GND #PWR?
U 1 1 5B5B6E84
P 8300 4150
F 0 "#PWR?" H 8300 3900 50  0001 C CNN
F 1 "GND" H 8305 3977 50  0000 C CNN
F 2 "" H 8300 4150 50  0001 C CNN
F 3 "" H 8300 4150 50  0001 C CNN
	1    8300 4150
	1    0    0    -1  
$EndComp
$Comp
L power:GND #PWR?
U 1 1 5B5B6EC5
P 8900 4150
F 0 "#PWR?" H 8900 3900 50  0001 C CNN
F 1 "GND" H 8905 3977 50  0000 C CNN
F 2 "" H 8900 4150 50  0001 C CNN
F 3 "" H 8900 4150 50  0001 C CNN
	1    8900 4150
	1    0    0    -1  
$EndComp
$Comp
L power:GND #PWR?
U 1 1 5B5B6F06
P 10100 4150
F 0 "#PWR?" H 10100 3900 50  0001 C CNN
F 1 "GND" H 10105 3977 50  0000 C CNN
F 2 "" H 10100 4150 50  0001 C CNN
F 3 "" H 10100 4150 50  0001 C CNN
	1    10100 4150
	1    0    0    -1  
$EndComp
Wire Wire Line
	10100 4150 10100 3650
Wire Wire Line
	9900 3450 9500 3450
Wire Wire Line
	9200 3450 8900 3450
Wire Wire Line
	8900 3600 8900 3450
Connection ~ 8900 3450
Wire Wire Line
	8900 3450 8750 3450
Wire Wire Line
	8900 4150 8900 3900
Wire Wire Line
	8300 3600 8300 3450
Wire Wire Line
	8300 3450 8450 3450
Wire Wire Line
	8300 3900 8300 4150
Wire Wire Line
	8150 3450 8300 3450
Connection ~ 8300 3450
Wire Wire Line
	7700 4150 7700 3900
Wire Wire Line
	7050 3900 7050 4150
Wire Wire Line
	6250 4150 6250 3900
Wire Wire Line
	4500 3900 4500 4150
Wire Wire Line
	3750 4150 3750 3900
Wire Wire Line
	3050 3900 3050 4150
Wire Wire Line
	2350 4150 2350 3900
Wire Wire Line
	2350 3600 2350 3450
Wire Wire Line
	2350 3450 2050 3450
Wire Wire Line
	2550 3450 2350 3450
Connection ~ 2350 3450
Wire Wire Line
	3050 3600 3050 3450
Wire Wire Line
	3050 3450 2850 3450
Wire Wire Line
	3250 3450 3050 3450
Connection ~ 3050 3450
Wire Wire Line
	3750 3600 3750 3450
Wire Wire Line
	3750 3450 3550 3450
Wire Wire Line
	4000 3450 3750 3450
Connection ~ 3750 3450
Wire Wire Line
	4500 3600 4500 3450
Wire Wire Line
	4500 3450 4300 3450
Wire Wire Line
	4750 3450 4500 3450
Connection ~ 4500 3450
Wire Wire Line
	5200 3450 5050 3450
Wire Wire Line
	5950 3450 6250 3450
Wire Wire Line
	6250 3450 6250 3300
Wire Wire Line
	6250 3600 6250 3450
Connection ~ 6250 3450
Wire Wire Line
	6250 3450 6550 3450
Wire Wire Line
	6250 3000 6250 2300
Wire Wire Line
	6250 2300 6800 2300
Wire Wire Line
	6800 2300 6800 2450
$Comp
L power:GND #PWR?
U 1 1 5B5BB7F2
P 6800 2900
F 0 "#PWR?" H 6800 2650 50  0001 C CNN
F 1 "GND" H 6805 2727 50  0000 C CNN
F 2 "" H 6800 2900 50  0001 C CNN
F 3 "" H 6800 2900 50  0001 C CNN
	1    6800 2900
	1    0    0    -1  
$EndComp
Wire Wire Line
	6800 2900 6800 2750
Wire Wire Line
	7350 2450 7350 2300
Wire Wire Line
	7350 2300 6800 2300
Connection ~ 6800 2300
$Comp
L power:GND #PWR?
U 1 1 5B5BC921
P 7350 2900
F 0 "#PWR?" H 7350 2650 50  0001 C CNN
F 1 "GND" H 7355 2727 50  0000 C CNN
F 2 "" H 7350 2900 50  0001 C CNN
F 3 "" H 7350 2900 50  0001 C CNN
	1    7350 2900
	1    0    0    -1  
$EndComp
$Comp
L power:GND #PWR?
U 1 1 5B5BC962
P 7850 2900
F 0 "#PWR?" H 7850 2650 50  0001 C CNN
F 1 "GND" H 7855 2727 50  0000 C CNN
F 2 "" H 7850 2900 50  0001 C CNN
F 3 "" H 7850 2900 50  0001 C CNN
	1    7850 2900
	1    0    0    -1  
$EndComp
Wire Wire Line
	7850 2900 7850 2750
Wire Wire Line
	7350 2750 7350 2900
Wire Wire Line
	7850 2450 7850 2300
Wire Wire Line
	7850 2300 7350 2300
Connection ~ 7350 2300
Wire Wire Line
	8100 2300 7850 2300
Connection ~ 7850 2300
Wire Wire Line
	8400 2300 8750 2300
Wire Wire Line
	8750 2300 8750 2100
Wire Wire Line
	7250 3450 7050 3450
Wire Wire Line
	7050 3600 7050 3450
Connection ~ 7050 3450
Wire Wire Line
	7050 3450 6850 3450
Wire Wire Line
	7550 3450 7700 3450
Wire Wire Line
	7700 3450 7700 3600
Connection ~ 7700 3450
Wire Wire Line
	7700 3450 7850 3450
$Comp
L Connector:Conn_01x02_Male J3
U 1 1 5B5C3B1F
P 4550 2000
F 0 "J3" H 4656 2178 50  0000 C CNN
F 1 "Conn_01x02_Male" H 4656 2087 50  0000 C CNN
F 2 "Connector_PinHeader_2.54mm:PinHeader_1x02_P2.54mm_Vertical" H 4550 2000 50  0001 C CNN
F 3 "~" H 4550 2000 50  0001 C CNN
	1    4550 2000
	1    0    0    -1  
$EndComp
$Comp
L power:VCC #PWR?
U 1 1 5B5C3B93
P 5050 1850
F 0 "#PWR?" H 5050 1700 50  0001 C CNN
F 1 "VCC" H 5067 2023 50  0000 C CNN
F 2 "" H 5050 1850 50  0001 C CNN
F 3 "" H 5050 1850 50  0001 C CNN
	1    5050 1850
	1    0    0    -1  
$EndComp
$Comp
L power:GND #PWR?
U 1 1 5B5C3BD6
P 5050 2250
F 0 "#PWR?" H 5050 2000 50  0001 C CNN
F 1 "GND" H 5055 2077 50  0000 C CNN
F 2 "" H 5050 2250 50  0001 C CNN
F 3 "" H 5050 2250 50  0001 C CNN
	1    5050 2250
	1    0    0    -1  
$EndComp
Wire Wire Line
	5050 2250 5050 2100
Wire Wire Line
	5050 2100 4750 2100
Wire Wire Line
	4750 2000 5050 2000
Wire Wire Line
	5050 2000 5050 1850
$EndSCHEMATC
