EESchema Schematic File Version 4
LIBS:fdd_frontend_ue-cache
EELAYER 26 0
EELAYER END
$Descr A4 11693 8268
encoding utf-8
Sheet 5 5
Title ""
Date ""
Rev ""
Comp ""
Comment1 ""
Comment2 ""
Comment3 ""
Comment4 ""
$EndDescr
$Comp
L POWDER_MCU:MSP432E401YTPDTR U?
U 1 1 5D69BE6F
P 2800 2950
F 0 "U?" H 2800 4888 60  0000 C CNN
F 1 "MSP432E401YTPDTR" H 2800 4782 60  0000 C CNN
F 2 "PDT0128A" H 2800 2490 60  0001 C CNN
F 3 "" H 2800 2550 60  0000 C CNN
	1    2800 2950
	1    0    0    -1  
$EndComp
$Comp
L POWDER_MCU:MSP432E401YTPDTR U?
U 2 1 5D69BF4B
P 6300 2700
F 0 "U?" H 6325 4138 60  0000 C CNN
F 1 "MSP432E401YTPDTR" H 6325 4032 60  0000 C CNN
F 2 "PDT0128A" H 6300 2240 60  0001 C CNN
F 3 "" H 6300 2300 60  0000 C CNN
	2    6300 2700
	1    0    0    -1  
$EndComp
$Comp
L POWDER_MCU:MSP432E401YTPDTR U?
U 3 1 5D69BFA2
P 9350 2500
F 0 "U?" H 9350 3288 60  0000 C CNN
F 1 "MSP432E401YTPDTR" H 9350 3182 60  0000 C CNN
F 2 "PDT0128A" H 9350 2040 60  0001 C CNN
F 3 "" H 9350 2100 60  0000 C CNN
	3    9350 2500
	1    0    0    -1  
$EndComp
$Comp
L POWDER_MCU:MSP432E401YTPDTR U?
U 4 1 5D69C02A
P 5500 5800
F 0 "U?" H 5500 7188 60  0000 C CNN
F 1 "MSP432E401YTPDTR" H 5500 7082 60  0000 C CNN
F 2 "PDT0128A" H 5500 5340 60  0001 C CNN
F 3 "" H 5500 5400 60  0000 C CNN
	4    5500 5800
	1    0    0    -1  
$EndComp
$EndSCHEMATC
