EESchema Schematic File Version 4
LIBS:PA_SKY66293-21-cache
EELAYER 26 0
EELAYER END
$Descr A4 11693 8268
encoding utf-8
Sheet 1 1
Title ""
Date ""
Rev ""
Comp ""
Comment1 ""
Comment2 ""
Comment3 ""
Comment4 ""
$EndDescr
$Comp
L POWDER_RF:SKY66293-21 U101
U 1 1 5C76E6BF
P 4500 5100
F 0 "U101" H 4950 5700 50  0000 L CNN
F 1 "SKY66293-21" H 5050 4600 50  0000 L CNN
F 2 "POWDER_RF:SKY66293-21" H 4500 4200 50  0001 C CNN
F 3 "" H 4400 5100 50  0001 C CNN
	1    4500 5100
	1    0    0    -1  
$EndComp
$Comp
L Connector:Conn_Coaxial J102
U 1 1 5C76E85E
P 6150 5100
F 0 "J102" H 6249 5076 50  0000 L CNN
F 1 "Conn_Coaxial" H 6249 4985 50  0000 L CNN
F 2 "POWDER_RF:SMA_EndLaunch_142-0761-881" H 6150 5100 50  0001 C CNN
F 3 " ~" H 6150 5100 50  0001 C CNN
	1    6150 5100
	1    0    0    -1  
$EndComp
$Comp
L Connector:Conn_Coaxial J101
U 1 1 5C76E8E8
P 2800 5100
F 0 "J101" H 2730 5338 50  0000 C CNN
F 1 "Conn_Coaxial" H 2730 5247 50  0000 C CNN
F 2 "POWDER_RF:SMA_EndLaunch_142-0761-881" H 2800 5100 50  0001 C CNN
F 3 " ~" H 2800 5100 50  0001 C CNN
	1    2800 5100
	-1   0    0    -1  
$EndComp
$Comp
L Device:C C101
U 1 1 5C76E9BB
P 3300 5100
F 0 "C101" V 3048 5100 50  0000 C CNN
F 1 "100pF" V 3139 5100 50  0000 C CNN
F 2 "Capacitor_SMD:C_0201_0603Metric" H 3338 4950 50  0001 C CNN
F 3 "~" H 3300 5100 50  0001 C CNN
	1    3300 5100
	0    1    1    0   
$EndComp
$Comp
L Device:L L101
U 1 1 5C76EA89
P 3600 5350
F 0 "L101" H 3653 5396 50  0000 L CNN
F 1 "DNI" H 3653 5305 50  0000 L CNN
F 2 "Inductor_SMD:L_0201_0603Metric" H 3600 5350 50  0001 C CNN
F 3 "~" H 3600 5350 50  0001 C CNN
	1    3600 5350
	1    0    0    -1  
$EndComp
$Comp
L power:GND #PWR?
U 1 1 5C76EB07
P 4050 5800
F 0 "#PWR?" H 4050 5550 50  0001 C CNN
F 1 "GND" H 4055 5627 50  0000 C CNN
F 2 "" H 4050 5800 50  0001 C CNN
F 3 "" H 4050 5800 50  0001 C CNN
	1    4050 5800
	1    0    0    -1  
$EndComp
Wire Wire Line
	3150 5100 3000 5100
Wire Wire Line
	3450 5100 3600 5100
Wire Wire Line
	3600 5100 3600 5200
Connection ~ 3600 5100
Wire Wire Line
	3600 5100 3800 5100
Wire Wire Line
	3600 5500 3600 5650
$Comp
L power:GND #PWR?
U 1 1 5C76F34E
P 3600 5650
F 0 "#PWR?" H 3600 5400 50  0001 C CNN
F 1 "GND" H 3605 5477 50  0000 C CNN
F 2 "" H 3600 5650 50  0001 C CNN
F 3 "" H 3600 5650 50  0001 C CNN
	1    3600 5650
	1    0    0    -1  
$EndComp
$Comp
L power:GND #PWR?
U 1 1 5C76F38C
P 2800 5650
F 0 "#PWR?" H 2800 5400 50  0001 C CNN
F 1 "GND" H 2805 5477 50  0000 C CNN
F 2 "" H 2800 5650 50  0001 C CNN
F 3 "" H 2800 5650 50  0001 C CNN
	1    2800 5650
	1    0    0    -1  
$EndComp
Wire Wire Line
	2800 5650 2800 5300
Wire Wire Line
	4050 5650 4050 5800
$Comp
L power:GND #PWR?
U 1 1 5C76F43E
P 4150 5800
F 0 "#PWR?" H 4150 5550 50  0001 C CNN
F 1 "GND" H 4155 5627 50  0000 C CNN
F 2 "" H 4150 5800 50  0001 C CNN
F 3 "" H 4150 5800 50  0001 C CNN
	1    4150 5800
	1    0    0    -1  
$EndComp
Wire Wire Line
	4150 5650 4150 5800
$Comp
L power:GND #PWR?
U 1 1 5C76F479
P 4250 5800
F 0 "#PWR?" H 4250 5550 50  0001 C CNN
F 1 "GND" H 4255 5627 50  0000 C CNN
F 2 "" H 4250 5800 50  0001 C CNN
F 3 "" H 4250 5800 50  0001 C CNN
	1    4250 5800
	1    0    0    -1  
$EndComp
Wire Wire Line
	4250 5650 4250 5800
$Comp
L power:GND #PWR?
U 1 1 5C76F4C3
P 4350 5800
F 0 "#PWR?" H 4350 5550 50  0001 C CNN
F 1 "GND" H 4355 5627 50  0000 C CNN
F 2 "" H 4350 5800 50  0001 C CNN
F 3 "" H 4350 5800 50  0001 C CNN
	1    4350 5800
	1    0    0    -1  
$EndComp
Wire Wire Line
	4350 5650 4350 5800
$Comp
L power:GND #PWR?
U 1 1 5C76F51F
P 4450 5800
F 0 "#PWR?" H 4450 5550 50  0001 C CNN
F 1 "GND" H 4455 5627 50  0000 C CNN
F 2 "" H 4450 5800 50  0001 C CNN
F 3 "" H 4450 5800 50  0001 C CNN
	1    4450 5800
	1    0    0    -1  
$EndComp
Wire Wire Line
	4450 5650 4450 5800
$Comp
L power:GND #PWR?
U 1 1 5C76F590
P 4550 5800
F 0 "#PWR?" H 4550 5550 50  0001 C CNN
F 1 "GND" H 4555 5627 50  0000 C CNN
F 2 "" H 4550 5800 50  0001 C CNN
F 3 "" H 4550 5800 50  0001 C CNN
	1    4550 5800
	1    0    0    -1  
$EndComp
Wire Wire Line
	4550 5650 4550 5800
$Comp
L power:GND #PWR?
U 1 1 5C76F619
P 4650 5800
F 0 "#PWR?" H 4650 5550 50  0001 C CNN
F 1 "GND" H 4655 5627 50  0000 C CNN
F 2 "" H 4650 5800 50  0001 C CNN
F 3 "" H 4650 5800 50  0001 C CNN
	1    4650 5800
	1    0    0    -1  
$EndComp
Wire Wire Line
	4650 5650 4650 5800
$Comp
L power:GND #PWR?
U 1 1 5C76F6BD
P 4750 5800
F 0 "#PWR?" H 4750 5550 50  0001 C CNN
F 1 "GND" H 4755 5627 50  0000 C CNN
F 2 "" H 4750 5800 50  0001 C CNN
F 3 "" H 4750 5800 50  0001 C CNN
	1    4750 5800
	1    0    0    -1  
$EndComp
Wire Wire Line
	4750 5650 4750 5800
$Comp
L power:GND #PWR?
U 1 1 5C76F77F
P 4850 5800
F 0 "#PWR?" H 4850 5550 50  0001 C CNN
F 1 "GND" H 4855 5627 50  0000 C CNN
F 2 "" H 4850 5800 50  0001 C CNN
F 3 "" H 4850 5800 50  0001 C CNN
	1    4850 5800
	1    0    0    -1  
$EndComp
Wire Wire Line
	4850 5650 4850 5800
$Comp
L power:GND #PWR?
U 1 1 5C76F862
P 4950 5800
F 0 "#PWR?" H 4950 5550 50  0001 C CNN
F 1 "GND" H 4955 5627 50  0000 C CNN
F 2 "" H 4950 5800 50  0001 C CNN
F 3 "" H 4950 5800 50  0001 C CNN
	1    4950 5800
	1    0    0    -1  
$EndComp
Wire Wire Line
	4950 5650 4950 5800
Wire Wire Line
	5200 5100 5950 5100
$Comp
L power:GND #PWR?
U 1 1 5C76FA6F
P 6150 5450
F 0 "#PWR?" H 6150 5200 50  0001 C CNN
F 1 "GND" H 6155 5277 50  0000 C CNN
F 2 "" H 6150 5450 50  0001 C CNN
F 3 "" H 6150 5450 50  0001 C CNN
	1    6150 5450
	1    0    0    -1  
$EndComp
Wire Wire Line
	6150 5300 6150 5450
Wire Wire Line
	4850 4450 4850 4200
Wire Wire Line
	4850 4200 5350 4200
$Comp
L Device:C C105
U 1 1 5C77138A
P 5350 4500
F 0 "C105" H 5465 4546 50  0000 L CNN
F 1 "100pF" H 5465 4455 50  0000 L CNN
F 2 "Capacitor_SMD:C_0402_1005Metric" H 5388 4350 50  0001 C CNN
F 3 "~" H 5350 4500 50  0001 C CNN
	1    5350 4500
	1    0    0    -1  
$EndComp
$Comp
L Device:C C109
U 1 1 5C7713E6
P 5850 4500
F 0 "C109" H 5965 4546 50  0000 L CNN
F 1 "10nF" H 5965 4455 50  0000 L CNN
F 2 "Capacitor_SMD:C_0402_1005Metric" H 5888 4350 50  0001 C CNN
F 3 "~" H 5850 4500 50  0001 C CNN
	1    5850 4500
	1    0    0    -1  
$EndComp
Wire Wire Line
	5850 4350 5850 4200
Connection ~ 5850 4200
Wire Wire Line
	5350 4350 5350 4200
Connection ~ 5350 4200
Wire Wire Line
	5350 4200 5850 4200
$Comp
L power:GND #PWR?
U 1 1 5C771A1D
P 5350 4700
F 0 "#PWR?" H 5350 4450 50  0001 C CNN
F 1 "GND" H 5355 4527 50  0000 C CNN
F 2 "" H 5350 4700 50  0001 C CNN
F 3 "" H 5350 4700 50  0001 C CNN
	1    5350 4700
	1    0    0    -1  
$EndComp
Wire Wire Line
	5350 4650 5350 4700
$Comp
L power:GND #PWR?
U 1 1 5C771D9D
P 5850 4700
F 0 "#PWR?" H 5850 4450 50  0001 C CNN
F 1 "GND" H 5855 4527 50  0000 C CNN
F 2 "" H 5850 4700 50  0001 C CNN
F 3 "" H 5850 4700 50  0001 C CNN
	1    5850 4700
	1    0    0    -1  
$EndComp
Wire Wire Line
	5850 4650 5850 4700
Wire Wire Line
	5850 4200 6300 4200
$Comp
L Device:C C113
U 1 1 5C77348F
P 6300 4500
F 0 "C113" H 6415 4546 50  0000 L CNN
F 1 "1uF" H 6415 4455 50  0000 L CNN
F 2 "Capacitor_SMD:C_0402_1005Metric" H 6338 4350 50  0001 C CNN
F 3 "~" H 6300 4500 50  0001 C CNN
	1    6300 4500
	1    0    0    -1  
$EndComp
Wire Wire Line
	6300 4350 6300 4200
Connection ~ 6300 4200
Wire Wire Line
	6300 4200 6600 4200
$Comp
L power:GND #PWR?
U 1 1 5C7738F2
P 6300 4700
F 0 "#PWR?" H 6300 4450 50  0001 C CNN
F 1 "GND" H 6305 4527 50  0000 C CNN
F 2 "" H 6300 4700 50  0001 C CNN
F 3 "" H 6300 4700 50  0001 C CNN
	1    6300 4700
	1    0    0    -1  
$EndComp
Wire Wire Line
	6300 4700 6300 4650
$Comp
L Device:C C104
U 1 1 5C773DDD
P 5350 3650
F 0 "C104" H 5465 3696 50  0000 L CNN
F 1 "100pF" H 5465 3605 50  0000 L CNN
F 2 "Capacitor_SMD:C_0402_1005Metric" H 5388 3500 50  0001 C CNN
F 3 "~" H 5350 3650 50  0001 C CNN
	1    5350 3650
	1    0    0    -1  
$EndComp
$Comp
L Device:C C108
U 1 1 5C773DE4
P 5850 3650
F 0 "C108" H 5965 3696 50  0000 L CNN
F 1 "10nF" H 5965 3605 50  0000 L CNN
F 2 "Capacitor_SMD:C_0402_1005Metric" H 5888 3500 50  0001 C CNN
F 3 "~" H 5850 3650 50  0001 C CNN
	1    5850 3650
	1    0    0    -1  
$EndComp
Wire Wire Line
	5850 3500 5850 3350
Wire Wire Line
	5350 3500 5350 3350
$Comp
L power:GND #PWR?
U 1 1 5C773DED
P 5350 3850
F 0 "#PWR?" H 5350 3600 50  0001 C CNN
F 1 "GND" H 5355 3677 50  0000 C CNN
F 2 "" H 5350 3850 50  0001 C CNN
F 3 "" H 5350 3850 50  0001 C CNN
	1    5350 3850
	1    0    0    -1  
$EndComp
Wire Wire Line
	5350 3800 5350 3850
$Comp
L power:GND #PWR?
U 1 1 5C773DF4
P 5850 3850
F 0 "#PWR?" H 5850 3600 50  0001 C CNN
F 1 "GND" H 5855 3677 50  0000 C CNN
F 2 "" H 5850 3850 50  0001 C CNN
F 3 "" H 5850 3850 50  0001 C CNN
	1    5850 3850
	1    0    0    -1  
$EndComp
Wire Wire Line
	5850 3800 5850 3850
$Comp
L Device:C C112
U 1 1 5C773DFB
P 6300 3650
F 0 "C112" H 6415 3696 50  0000 L CNN
F 1 "1uF" H 6415 3605 50  0000 L CNN
F 2 "Capacitor_SMD:C_0402_1005Metric" H 6338 3500 50  0001 C CNN
F 3 "~" H 6300 3650 50  0001 C CNN
	1    6300 3650
	1    0    0    -1  
$EndComp
Wire Wire Line
	6300 3500 6300 3350
$Comp
L power:GND #PWR?
U 1 1 5C773E03
P 6300 3850
F 0 "#PWR?" H 6300 3600 50  0001 C CNN
F 1 "GND" H 6305 3677 50  0000 C CNN
F 2 "" H 6300 3850 50  0001 C CNN
F 3 "" H 6300 3850 50  0001 C CNN
	1    6300 3850
	1    0    0    -1  
$EndComp
Wire Wire Line
	6300 3850 6300 3800
$Comp
L Device:C C103
U 1 1 5C7752D7
P 5350 2700
F 0 "C103" H 5465 2746 50  0000 L CNN
F 1 "100pF" H 5465 2655 50  0000 L CNN
F 2 "Capacitor_SMD:C_0402_1005Metric" H 5388 2550 50  0001 C CNN
F 3 "~" H 5350 2700 50  0001 C CNN
	1    5350 2700
	1    0    0    -1  
$EndComp
$Comp
L Device:C C107
U 1 1 5C7752DE
P 5850 2700
F 0 "C107" H 5965 2746 50  0000 L CNN
F 1 "10nF" H 5965 2655 50  0000 L CNN
F 2 "Capacitor_SMD:C_0402_1005Metric" H 5888 2550 50  0001 C CNN
F 3 "~" H 5850 2700 50  0001 C CNN
	1    5850 2700
	1    0    0    -1  
$EndComp
Wire Wire Line
	5850 2550 5850 2400
Wire Wire Line
	5350 2550 5350 2400
$Comp
L power:GND #PWR?
U 1 1 5C7752E7
P 5350 2900
F 0 "#PWR?" H 5350 2650 50  0001 C CNN
F 1 "GND" H 5355 2727 50  0000 C CNN
F 2 "" H 5350 2900 50  0001 C CNN
F 3 "" H 5350 2900 50  0001 C CNN
	1    5350 2900
	1    0    0    -1  
$EndComp
Wire Wire Line
	5350 2850 5350 2900
$Comp
L power:GND #PWR?
U 1 1 5C7752EE
P 5850 2900
F 0 "#PWR?" H 5850 2650 50  0001 C CNN
F 1 "GND" H 5855 2727 50  0000 C CNN
F 2 "" H 5850 2900 50  0001 C CNN
F 3 "" H 5850 2900 50  0001 C CNN
	1    5850 2900
	1    0    0    -1  
$EndComp
Wire Wire Line
	5850 2850 5850 2900
$Comp
L Device:C C111
U 1 1 5C7752F5
P 6300 2700
F 0 "C111" H 6415 2746 50  0000 L CNN
F 1 "1uF" H 6415 2655 50  0000 L CNN
F 2 "Capacitor_SMD:C_0402_1005Metric" H 6338 2550 50  0001 C CNN
F 3 "~" H 6300 2700 50  0001 C CNN
	1    6300 2700
	1    0    0    -1  
$EndComp
Wire Wire Line
	6300 2550 6300 2400
$Comp
L power:GND #PWR?
U 1 1 5C7752FD
P 6300 2900
F 0 "#PWR?" H 6300 2650 50  0001 C CNN
F 1 "GND" H 6305 2727 50  0000 C CNN
F 2 "" H 6300 2900 50  0001 C CNN
F 3 "" H 6300 2900 50  0001 C CNN
	1    6300 2900
	1    0    0    -1  
$EndComp
Wire Wire Line
	6300 2900 6300 2850
$Comp
L Device:C C102
U 1 1 5C775D20
P 5350 1850
F 0 "C102" H 5465 1896 50  0000 L CNN
F 1 "100pF" H 5465 1805 50  0000 L CNN
F 2 "Capacitor_SMD:C_0402_1005Metric" H 5388 1700 50  0001 C CNN
F 3 "~" H 5350 1850 50  0001 C CNN
	1    5350 1850
	1    0    0    -1  
$EndComp
$Comp
L Device:C C106
U 1 1 5C775D27
P 5850 1850
F 0 "C106" H 5965 1896 50  0000 L CNN
F 1 "10nF" H 5965 1805 50  0000 L CNN
F 2 "Capacitor_SMD:C_0402_1005Metric" H 5888 1700 50  0001 C CNN
F 3 "~" H 5850 1850 50  0001 C CNN
	1    5850 1850
	1    0    0    -1  
$EndComp
Wire Wire Line
	5850 1700 5850 1550
Wire Wire Line
	5350 1700 5350 1550
$Comp
L power:GND #PWR?
U 1 1 5C775D30
P 5350 2050
F 0 "#PWR?" H 5350 1800 50  0001 C CNN
F 1 "GND" H 5355 1877 50  0000 C CNN
F 2 "" H 5350 2050 50  0001 C CNN
F 3 "" H 5350 2050 50  0001 C CNN
	1    5350 2050
	1    0    0    -1  
$EndComp
Wire Wire Line
	5350 2000 5350 2050
$Comp
L power:GND #PWR?
U 1 1 5C775D37
P 5850 2050
F 0 "#PWR?" H 5850 1800 50  0001 C CNN
F 1 "GND" H 5855 1877 50  0000 C CNN
F 2 "" H 5850 2050 50  0001 C CNN
F 3 "" H 5850 2050 50  0001 C CNN
	1    5850 2050
	1    0    0    -1  
$EndComp
Wire Wire Line
	5850 2000 5850 2050
$Comp
L Device:C C110
U 1 1 5C775D3E
P 6300 1850
F 0 "C110" H 6415 1896 50  0000 L CNN
F 1 "1uF" H 6415 1805 50  0000 L CNN
F 2 "Capacitor_SMD:C_0402_1005Metric" H 6338 1700 50  0001 C CNN
F 3 "~" H 6300 1850 50  0001 C CNN
	1    6300 1850
	1    0    0    -1  
$EndComp
Wire Wire Line
	6300 1700 6300 1550
$Comp
L power:GND #PWR?
U 1 1 5C775D46
P 6300 2050
F 0 "#PWR?" H 6300 1800 50  0001 C CNN
F 1 "GND" H 6305 1877 50  0000 C CNN
F 2 "" H 6300 2050 50  0001 C CNN
F 3 "" H 6300 2050 50  0001 C CNN
	1    6300 2050
	1    0    0    -1  
$EndComp
Wire Wire Line
	6300 2050 6300 2000
Wire Wire Line
	6600 3350 6300 3350
Wire Wire Line
	4450 3350 4450 4450
Connection ~ 5350 3350
Wire Wire Line
	5350 3350 4450 3350
Connection ~ 5850 3350
Wire Wire Line
	5850 3350 5350 3350
Connection ~ 6300 3350
Wire Wire Line
	6300 3350 5850 3350
Wire Wire Line
	4250 2400 5350 2400
Wire Wire Line
	4250 2400 4250 4450
Connection ~ 5350 2400
Wire Wire Line
	5350 2400 5850 2400
Connection ~ 5850 2400
Wire Wire Line
	5850 2400 6300 2400
Connection ~ 6300 2400
Wire Wire Line
	6300 2400 6600 2400
Wire Wire Line
	6600 1550 6300 1550
Wire Wire Line
	4150 1550 4150 4450
Connection ~ 5350 1550
Wire Wire Line
	5350 1550 4150 1550
Connection ~ 5850 1550
Wire Wire Line
	5850 1550 5350 1550
Connection ~ 6300 1550
Wire Wire Line
	6300 1550 5850 1550
Wire Wire Line
	4650 4100 4650 4450
Text Label 6500 4200 0    50   ~ 0
VCC3
Text Label 6500 3350 0    50   ~ 0
VBIAS
Text Label 6500 2400 0    50   ~ 0
VCC2
Text Label 6500 1550 0    50   ~ 0
VCC1
$Comp
L Device:C C114
U 1 1 5C77ACD8
P 7050 4400
F 0 "C114" H 7165 4446 50  0000 L CNN
F 1 "3300pF" H 7165 4355 50  0000 L CNN
F 2 "Capacitor_SMD:C_0402_1005Metric" H 7088 4250 50  0001 C CNN
F 3 "~" H 7050 4400 50  0001 C CNN
	1    7050 4400
	1    0    0    -1  
$EndComp
$Comp
L power:GND #PWR?
U 1 1 5C77ADDC
P 7050 4600
F 0 "#PWR?" H 7050 4350 50  0001 C CNN
F 1 "GND" H 7055 4427 50  0000 C CNN
F 2 "" H 7050 4600 50  0001 C CNN
F 3 "" H 7050 4600 50  0001 C CNN
	1    7050 4600
	1    0    0    -1  
$EndComp
Wire Wire Line
	7050 4600 7050 4550
Wire Wire Line
	7050 4250 7050 4100
Wire Wire Line
	4650 4100 7050 4100
Wire Wire Line
	7050 4100 7350 4100
Connection ~ 7050 4100
Text Label 7200 4100 0    50   ~ 0
PAEN
$Comp
L Connector:Conn_01x06_Male J103
U 1 1 5C780668
P 8600 3100
F 0 "J103" H 8573 2980 50  0000 R CNN
F 1 "Conn_01x06_Male" H 8573 3071 50  0000 R CNN
F 2 "Connector_PinHeader_2.54mm:PinHeader_1x06_P2.54mm_Vertical" H 8600 3100 50  0001 C CNN
F 3 "~" H 8600 3100 50  0001 C CNN
	1    8600 3100
	-1   0    0    1   
$EndComp
$Comp
L power:GND #PWR?
U 1 1 5C78094A
P 8300 3550
F 0 "#PWR?" H 8300 3300 50  0001 C CNN
F 1 "GND" H 8305 3377 50  0000 C CNN
F 2 "" H 8300 3550 50  0001 C CNN
F 3 "" H 8300 3550 50  0001 C CNN
	1    8300 3550
	1    0    0    -1  
$EndComp
Wire Wire Line
	8300 3300 8400 3300
Wire Wire Line
	8300 3300 8300 3550
Wire Wire Line
	8400 3200 7700 3200
Wire Wire Line
	8400 3100 7700 3100
Wire Wire Line
	7700 3000 8400 3000
Wire Wire Line
	7700 2900 8400 2900
Wire Wire Line
	7700 2800 8400 2800
Text Label 7800 3000 0    50   ~ 0
VCC3
Text Label 7800 2900 0    50   ~ 0
VCC2
Text Label 7800 2800 0    50   ~ 0
VCC1
Text Label 7800 3200 0    50   ~ 0
PAEN
Text Label 7800 3100 0    50   ~ 0
VBIAS
Text Label 5500 5100 0    50   ~ 0
RF_OUT
Text Label 3550 5100 0    50   ~ 0
RF_IN
Text Label 3100 5100 1    50   ~ 0
RF_IN_2
$Comp
L Connector:Conn_Coaxial J104
U 1 1 5C78BCA4
P 2850 6650
F 0 "J104" H 2780 6888 50  0000 C CNN
F 1 "Conn_Coaxial" H 2780 6797 50  0000 C CNN
F 2 "POWDER_RF:SMA_EndLaunch_142-0761-881" H 2850 6650 50  0001 C CNN
F 3 " ~" H 2850 6650 50  0001 C CNN
	1    2850 6650
	-1   0    0    -1  
$EndComp
$Comp
L power:GND #PWR?
U 1 1 5C78BD2E
P 2850 7000
F 0 "#PWR?" H 2850 6750 50  0001 C CNN
F 1 "GND" H 2855 6827 50  0000 C CNN
F 2 "" H 2850 7000 50  0001 C CNN
F 3 "" H 2850 7000 50  0001 C CNN
	1    2850 7000
	1    0    0    -1  
$EndComp
$Comp
L Connector:Conn_Coaxial J105
U 1 1 5C78BD61
P 3400 6650
F 0 "J105" H 3499 6626 50  0000 L CNN
F 1 "Conn_Coaxial" H 3499 6535 50  0000 L CNN
F 2 "POWDER_RF:SMA_EndLaunch_142-0761-881" H 3400 6650 50  0001 C CNN
F 3 " ~" H 3400 6650 50  0001 C CNN
	1    3400 6650
	1    0    0    -1  
$EndComp
Wire Wire Line
	3200 6650 3050 6650
Wire Wire Line
	2850 6850 2850 7000
$Comp
L power:GND #PWR?
U 1 1 5C78EB25
P 3400 7000
F 0 "#PWR?" H 3400 6750 50  0001 C CNN
F 1 "GND" H 3405 6827 50  0000 C CNN
F 2 "" H 3400 7000 50  0001 C CNN
F 3 "" H 3400 7000 50  0001 C CNN
	1    3400 7000
	1    0    0    -1  
$EndComp
Wire Wire Line
	3400 6850 3400 7000
Text Label 3150 6650 1    50   ~ 0
RF_THRU
$EndSCHEMATC
