EESchema Schematic File Version 4
EELAYER 30 0
EELAYER END
$Descr A4 11693 8268
encoding utf-8
Sheet 23 27
Title ""
Date ""
Rev ""
Comp ""
Comment1 ""
Comment2 ""
Comment3 ""
Comment4 ""
$EndDescr
Text HLabel 1800 1500 0    50   Input ~ 0
v_12
$Comp
L 000_PreferredParts:C_10uF_0805 C?
U 1 1 5E3343ED
P 2250 1750
AR Path="/5E179620/5E2CEBB7/5E3343ED" Ref="C?"  Part="1" 
AR Path="/5E179620/5E2CF5EB/5E3343ED" Ref="C2501"  Part="1" 
F 0 "C2501" H 2275 1850 50  0000 L CNN
F 1 "C_10uF_0805" H 2275 1650 50  0001 L CNN
F 2 "Capacitor_SMD:C_0805_2012Metric" H 2288 1600 50  0001 C CNN
F 3 "~" H 2250 1750 50  0001 C CNN
F 4 "10uF" H 2400 1650 50  0000 C CNN "DisplayValue"
F 5 "0805" H 2400 1550 50  0000 C CNN "DisplayFootprint"
F 6 "3000-0000000134" H 2250 1750 50  0001 C CNN "PartSpecification"
	1    2250 1750
	1    0    0    -1  
$EndComp
$Comp
L 000_PreferredParts:C_10uF_0805 C?
U 1 1 5E3343F6
P 2750 1750
AR Path="/5E179620/5E2CEBB7/5E3343F6" Ref="C?"  Part="1" 
AR Path="/5E179620/5E2CF5EB/5E3343F6" Ref="C2504"  Part="1" 
F 0 "C2504" H 2775 1850 50  0000 L CNN
F 1 "C_10uF_0805" H 2775 1650 50  0001 L CNN
F 2 "Capacitor_SMD:C_0805_2012Metric" H 2788 1600 50  0001 C CNN
F 3 "~" H 2750 1750 50  0001 C CNN
F 4 "10uF" H 2900 1650 50  0000 C CNN "DisplayValue"
F 5 "0805" H 2900 1550 50  0000 C CNN "DisplayFootprint"
F 6 "3000-0000000134" H 2750 1750 50  0001 C CNN "PartSpecification"
	1    2750 1750
	1    0    0    -1  
$EndComp
$Comp
L 000_PreferredParts:C_10uF_0603 C?
U 1 1 5E3343FF
P 3250 1750
AR Path="/5E179620/5E2CEBB7/5E3343FF" Ref="C?"  Part="1" 
AR Path="/5E179620/5E2CF5EB/5E3343FF" Ref="C2507"  Part="1" 
F 0 "C2507" H 3275 1850 50  0000 L CNN
F 1 "C_10uF_0603" H 3275 1650 50  0001 L CNN
F 2 "Capacitor_SMD:C_0603_1608Metric" H 3288 1600 50  0001 C CNN
F 3 "~" H 3250 1750 50  0001 C CNN
F 4 "10uF" H 3400 1650 50  0000 C CNN "DisplayValue"
F 5 "0603" H 3400 1550 50  0000 C CNN "DisplayFootprint"
F 6 "3000-0000000135" H 3250 1750 50  0001 C CNN "PartSpecification"
	1    3250 1750
	1    0    0    -1  
$EndComp
$Comp
L power:GND #PWR?
U 1 1 5E334405
P 2250 2000
AR Path="/5E179620/5E2CEBB7/5E334405" Ref="#PWR?"  Part="1" 
AR Path="/5E179620/5E2CF5EB/5E334405" Ref="#PWR?"  Part="1" 
F 0 "#PWR?" H 2250 1750 50  0001 C CNN
F 1 "GND" H 2250 1850 50  0000 C CNN
F 2 "" H 2250 2000 50  0001 C CNN
F 3 "" H 2250 2000 50  0001 C CNN
	1    2250 2000
	1    0    0    -1  
$EndComp
Wire Wire Line
	2250 2000 2250 1900
$Comp
L power:GND #PWR?
U 1 1 5E33440C
P 2750 2000
AR Path="/5E179620/5E2CEBB7/5E33440C" Ref="#PWR?"  Part="1" 
AR Path="/5E179620/5E2CF5EB/5E33440C" Ref="#PWR?"  Part="1" 
F 0 "#PWR?" H 2750 1750 50  0001 C CNN
F 1 "GND" H 2750 1850 50  0000 C CNN
F 2 "" H 2750 2000 50  0001 C CNN
F 3 "" H 2750 2000 50  0001 C CNN
	1    2750 2000
	1    0    0    -1  
$EndComp
Wire Wire Line
	2750 2000 2750 1900
$Comp
L power:GND #PWR?
U 1 1 5E334413
P 3250 2000
AR Path="/5E179620/5E2CEBB7/5E334413" Ref="#PWR?"  Part="1" 
AR Path="/5E179620/5E2CF5EB/5E334413" Ref="#PWR?"  Part="1" 
F 0 "#PWR?" H 3250 1750 50  0001 C CNN
F 1 "GND" H 3250 1850 50  0000 C CNN
F 2 "" H 3250 2000 50  0001 C CNN
F 3 "" H 3250 2000 50  0001 C CNN
	1    3250 2000
	1    0    0    -1  
$EndComp
Wire Wire Line
	3250 2000 3250 1900
Wire Wire Line
	3250 1600 3250 1500
Wire Wire Line
	3250 1500 2750 1500
Wire Wire Line
	2250 1600 2250 1500
Connection ~ 2250 1500
Wire Wire Line
	2250 1500 1800 1500
Wire Wire Line
	2750 1600 2750 1500
Connection ~ 2750 1500
Wire Wire Line
	2750 1500 2250 1500
$Comp
L POWDER_Power:TPS63070RNM U?
U 1 1 5E334424
P 5100 1800
AR Path="/5E179620/5E2CEBB7/5E334424" Ref="U?"  Part="1" 
AR Path="/5E179620/5E2CF5EB/5E334424" Ref="U2501"  Part="1" 
F 0 "U2501" H 5450 2400 60  0000 C CNN
F 1 "TPS63070RNM" H 5150 1950 60  0000 C CNN
F 2 "POWDER_Power:TPS63070RNMR" H 5200 1790 60  0001 C CNN
F 3 "" H 5200 2200 60  0000 C CNN
F 4 "Texas Instruments" H 5100 1800 50  0001 C CNN "Manufacturer"
F 5 "TPS63070RNMR" H 5100 1800 50  0001 C CNN "PartNumber"
F 6 "3000-0000000079" H 5100 1800 50  0001 C CNN "PartSpecification"
	1    5100 1800
	1    0    0    -1  
$EndComp
Wire Wire Line
	4500 1500 4350 1500
Connection ~ 3250 1500
Wire Wire Line
	4500 1400 4350 1400
Wire Wire Line
	4350 1400 4350 1500
Connection ~ 4350 1500
Wire Wire Line
	4350 1500 3750 1500
$Comp
L Device:R R?
U 1 1 5E334430
P 4000 2100
AR Path="/5E179620/5E2CEBB7/5E334430" Ref="R?"  Part="1" 
AR Path="/5E179620/5E2CF5EB/5E334430" Ref="R2501"  Part="1" 
F 0 "R2501" V 4080 2100 50  0000 C CNN
F 1 "10k" V 4000 2100 50  0000 C CNN
F 2 "Resistor_SMD:R_0402_1005Metric" V 3930 2100 50  0001 C CNN
F 3 "~" H 4000 2100 50  0001 C CNN
F 4 "3000-0000000131" H 4000 2100 50  0001 C CNN "PartSpecification"
	1    4000 2100
	0    1    1    0   
$EndComp
Wire Wire Line
	3850 2100 3750 2100
Connection ~ 3750 1500
Wire Wire Line
	3750 1500 3250 1500
Wire Wire Line
	4500 2200 4450 2200
$Comp
L power:GND #PWR?
U 1 1 5E334440
P 4450 2300
AR Path="/5E179620/5E2CEBB7/5E334440" Ref="#PWR?"  Part="1" 
AR Path="/5E179620/5E2CF5EB/5E334440" Ref="#PWR?"  Part="1" 
F 0 "#PWR?" H 4450 2050 50  0001 C CNN
F 1 "GND" H 4450 2150 50  0000 C CNN
F 2 "" H 4450 2300 50  0001 C CNN
F 3 "" H 4450 2300 50  0001 C CNN
	1    4450 2300
	1    0    0    -1  
$EndComp
Wire Wire Line
	4450 2300 4450 2200
$Comp
L 000_PreferredParts:C_100nF C?
U 1 1 5E334449
P 3600 2200
AR Path="/5E179620/5E2CEBB7/5E334449" Ref="C?"  Part="1" 
AR Path="/5E179620/5E2CF5EB/5E334449" Ref="C2510"  Part="1" 
F 0 "C2510" H 3625 2300 50  0000 L CNN
F 1 "C_100nF" H 3625 2100 50  0001 L CNN
F 2 "Capacitor_SMD:C_0402_1005Metric" H 3638 2050 50  0001 C CNN
F 3 "~" H 3600 2200 50  0001 C CNN
F 4 "100nF" H 3750 2100 50  0000 C CNN "DisplayValue"
F 5 "3000-0000000125" H 3600 2200 50  0001 C CNN "PartSpecification"
	1    3600 2200
	1    0    0    -1  
$EndComp
Wire Wire Line
	3600 2050 3600 1750
Wire Wire Line
	3600 1750 4500 1750
$Comp
L power:GND #PWR?
U 1 1 5E334451
P 3600 2450
AR Path="/5E179620/5E2CEBB7/5E334451" Ref="#PWR?"  Part="1" 
AR Path="/5E179620/5E2CF5EB/5E334451" Ref="#PWR?"  Part="1" 
F 0 "#PWR?" H 3600 2200 50  0001 C CNN
F 1 "GND" H 3600 2300 50  0000 C CNN
F 2 "" H 3600 2450 50  0001 C CNN
F 3 "" H 3600 2450 50  0001 C CNN
	1    3600 2450
	1    0    0    -1  
$EndComp
Wire Wire Line
	3600 2450 3600 2350
$Comp
L power:GND #PWR?
U 1 1 5E334458
P 5000 2600
AR Path="/5E179620/5E2CEBB7/5E334458" Ref="#PWR?"  Part="1" 
AR Path="/5E179620/5E2CF5EB/5E334458" Ref="#PWR?"  Part="1" 
F 0 "#PWR?" H 5000 2350 50  0001 C CNN
F 1 "GND" H 5000 2450 50  0000 C CNN
F 2 "" H 5000 2600 50  0001 C CNN
F 3 "" H 5000 2600 50  0001 C CNN
	1    5000 2600
	1    0    0    -1  
$EndComp
$Comp
L power:GND #PWR?
U 1 1 5E33445E
P 5200 2600
AR Path="/5E179620/5E2CEBB7/5E33445E" Ref="#PWR?"  Part="1" 
AR Path="/5E179620/5E2CF5EB/5E33445E" Ref="#PWR?"  Part="1" 
F 0 "#PWR?" H 5200 2350 50  0001 C CNN
F 1 "GND" H 5200 2450 50  0000 C CNN
F 2 "" H 5200 2600 50  0001 C CNN
F 3 "" H 5200 2600 50  0001 C CNN
	1    5200 2600
	1    0    0    -1  
$EndComp
Wire Wire Line
	5200 2600 5200 2500
Wire Wire Line
	5000 2600 5000 2500
$Comp
L Device:L L?
U 1 1 5E334467
P 5100 1000
AR Path="/5E179620/5E2CEBB7/5E334467" Ref="L?"  Part="1" 
AR Path="/5E179620/5E2CF5EB/5E334467" Ref="L2501"  Part="1" 
F 0 "L2501" V 5050 1000 50  0000 C CNN
F 1 "1.5uH" V 5175 1000 50  0000 C CNN
F 2 "Inductor_SMD:L_Taiyo-Yuden_MD-4040" H 5100 1000 50  0001 C CNN
F 3 "~" H 5100 1000 50  0001 C CNN
F 4 "3000-0000000076" V 5100 1000 50  0001 C CNN "PartSpecification"
	1    5100 1000
	0    -1   -1   0   
$EndComp
Wire Wire Line
	5250 1000 5300 1000
Wire Wire Line
	5300 1000 5300 1150
Wire Wire Line
	4950 1000 4900 1000
Wire Wire Line
	4900 1000 4900 1150
$Comp
L power:GND #PWR?
U 1 1 5E334471
P 6000 2500
AR Path="/5E179620/5E2CEBB7/5E334471" Ref="#PWR?"  Part="1" 
AR Path="/5E179620/5E2CF5EB/5E334471" Ref="#PWR?"  Part="1" 
F 0 "#PWR?" H 6000 2250 50  0001 C CNN
F 1 "GND" H 6000 2350 50  0000 C CNN
F 2 "" H 6000 2500 50  0001 C CNN
F 3 "" H 6000 2500 50  0001 C CNN
	1    6000 2500
	1    0    0    -1  
$EndComp
Wire Wire Line
	5700 1850 6000 1850
Wire Wire Line
	6000 1850 6000 2500
Wire Wire Line
	5700 2100 6500 2100
$Comp
L Device:R R?
U 1 1 5E33447A
P 6500 1850
AR Path="/5E179620/5E2CEBB7/5E33447A" Ref="R?"  Part="1" 
AR Path="/5E179620/5E2CF5EB/5E33447A" Ref="R2510"  Part="1" 
F 0 "R2510" V 6580 1850 50  0000 C CNN
F 1 "10k" V 6500 1850 50  0000 C CNN
F 2 "Resistor_SMD:R_0402_1005Metric" V 6430 1850 50  0001 C CNN
F 3 "~" H 6500 1850 50  0001 C CNN
F 4 "3000-0000000131" H 6500 1850 50  0001 C CNN "PartSpecification"
	1    6500 1850
	-1   0    0    1   
$EndComp
$Comp
L Device:R R?
U 1 1 5E334480
P 6200 1550
AR Path="/5E179620/5E2CEBB7/5E334480" Ref="R?"  Part="1" 
AR Path="/5E179620/5E2CF5EB/5E334480" Ref="R2504"  Part="1" 
F 0 "R2504" V 6280 1550 50  0000 C CNN
F 1 "976k" V 6200 1550 50  0000 C CNN
F 2 "Resistor_SMD:R_0402_1005Metric" V 6130 1550 50  0001 C CNN
F 3 "~" H 6200 1550 50  0001 C CNN
F 4 "3000-0000000578" H 6200 1550 50  0001 C CNN "PartSpecification"
	1    6200 1550
	-1   0    0    1   
$EndComp
Wire Wire Line
	5700 1750 6200 1750
Wire Wire Line
	6200 1750 6200 1700
Wire Wire Line
	5700 1500 5800 1500
Wire Wire Line
	5800 1500 5800 1400
Wire Wire Line
	5800 1400 5700 1400
Wire Wire Line
	5800 1400 6200 1400
Connection ~ 5800 1400
Connection ~ 6200 1400
Wire Wire Line
	6200 1400 6500 1400
$Comp
L Device:R R?
U 1 1 5E33448F
P 6200 2300
AR Path="/5E179620/5E2CEBB7/5E33448F" Ref="R?"  Part="1" 
AR Path="/5E179620/5E2CF5EB/5E33448F" Ref="R2505"  Part="1" 
F 0 "R2505" V 6280 2300 50  0000 C CNN
F 1 "150k" V 6200 2300 50  0000 C CNN
F 2 "Resistor_SMD:R_0402_1005Metric" V 6130 2300 50  0001 C CNN
F 3 "~" H 6200 2300 50  0001 C CNN
F 4 "3000-0000000579" H 6200 2300 50  0001 C CNN "PartSpecification"
	1    6200 2300
	-1   0    0    1   
$EndComp
$Comp
L power:GND #PWR?
U 1 1 5E334495
P 6200 2500
AR Path="/5E179620/5E2CEBB7/5E334495" Ref="#PWR?"  Part="1" 
AR Path="/5E179620/5E2CF5EB/5E334495" Ref="#PWR?"  Part="1" 
F 0 "#PWR?" H 6200 2250 50  0001 C CNN
F 1 "GND" H 6200 2350 50  0000 C CNN
F 2 "" H 6200 2500 50  0001 C CNN
F 3 "" H 6200 2500 50  0001 C CNN
	1    6200 2500
	1    0    0    -1  
$EndComp
Wire Wire Line
	6200 2500 6200 2450
Wire Wire Line
	6200 2150 6200 1750
Connection ~ 6200 1750
Wire Wire Line
	6500 2100 6500 2000
Wire Wire Line
	6500 1700 6500 1400
Connection ~ 6500 1400
$Comp
L 000_PreferredParts:C_10uF_0603 C?
U 1 1 5E3344A4
P 7250 1750
AR Path="/5E179620/5E2CEBB7/5E3344A4" Ref="C?"  Part="1" 
AR Path="/5E179620/5E2CF5EB/5E3344A4" Ref="C2513"  Part="1" 
F 0 "C2513" H 7275 1850 50  0000 L CNN
F 1 "C_10uF_0603" H 7275 1650 50  0001 L CNN
F 2 "Capacitor_SMD:C_0603_1608Metric" H 7288 1600 50  0001 C CNN
F 3 "~" H 7250 1750 50  0001 C CNN
F 4 "10uF" H 7400 1650 50  0000 C CNN "DisplayValue"
F 5 "0603" H 7400 1550 50  0000 C CNN "DisplayFootprint"
F 6 "3000-0000000135" H 7250 1750 50  0001 C CNN "PartSpecification"
	1    7250 1750
	1    0    0    -1  
$EndComp
$Comp
L 000_PreferredParts:C_10uF_0603 C?
U 1 1 5E3344AD
P 7550 1750
AR Path="/5E179620/5E2CEBB7/5E3344AD" Ref="C?"  Part="1" 
AR Path="/5E179620/5E2CF5EB/5E3344AD" Ref="C2516"  Part="1" 
F 0 "C2516" H 7575 1850 50  0000 L CNN
F 1 "C_10uF_0603" H 7575 1650 50  0001 L CNN
F 2 "Capacitor_SMD:C_0603_1608Metric" H 7588 1600 50  0001 C CNN
F 3 "~" H 7550 1750 50  0001 C CNN
F 4 "10uF" H 7700 1650 50  0000 C CNN "DisplayValue"
F 5 "0603" H 7700 1550 50  0000 C CNN "DisplayFootprint"
F 6 "3000-0000000135" H 7550 1750 50  0001 C CNN "PartSpecification"
	1    7550 1750
	1    0    0    -1  
$EndComp
$Comp
L 000_PreferredParts:C_10uF_0603 C?
U 1 1 5E3344B6
P 7850 1750
AR Path="/5E179620/5E2CEBB7/5E3344B6" Ref="C?"  Part="1" 
AR Path="/5E179620/5E2CF5EB/5E3344B6" Ref="C2519"  Part="1" 
F 0 "C2519" H 7875 1850 50  0000 L CNN
F 1 "C_10uF_0603" H 7875 1650 50  0001 L CNN
F 2 "Capacitor_SMD:C_0603_1608Metric" H 7888 1600 50  0001 C CNN
F 3 "~" H 7850 1750 50  0001 C CNN
F 4 "10uF" H 8000 1650 50  0000 C CNN "DisplayValue"
F 5 "0603" H 8000 1550 50  0000 C CNN "DisplayFootprint"
F 6 "3000-0000000135" H 7850 1750 50  0001 C CNN "PartSpecification"
	1    7850 1750
	1    0    0    -1  
$EndComp
$Comp
L 000_PreferredParts:C_10uF_0603 C?
U 1 1 5E3344BF
P 8150 1750
AR Path="/5E179620/5E2CEBB7/5E3344BF" Ref="C?"  Part="1" 
AR Path="/5E179620/5E2CF5EB/5E3344BF" Ref="C2522"  Part="1" 
F 0 "C2522" H 8175 1850 50  0000 L CNN
F 1 "C_10uF_0603" H 8175 1650 50  0001 L CNN
F 2 "Capacitor_SMD:C_0603_1608Metric" H 8188 1600 50  0001 C CNN
F 3 "~" H 8150 1750 50  0001 C CNN
F 4 "10uF" H 8300 1650 50  0000 C CNN "DisplayValue"
F 5 "0603" H 8300 1550 50  0000 C CNN "DisplayFootprint"
F 6 "3000-0000000135" H 8150 1750 50  0001 C CNN "PartSpecification"
	1    8150 1750
	1    0    0    -1  
$EndComp
$Comp
L 000_PreferredParts:C_10uF_0603 C?
U 1 1 5E3344C8
P 8450 1750
AR Path="/5E179620/5E2CEBB7/5E3344C8" Ref="C?"  Part="1" 
AR Path="/5E179620/5E2CF5EB/5E3344C8" Ref="C2525"  Part="1" 
F 0 "C2525" H 8475 1850 50  0000 L CNN
F 1 "C_10uF_0603" H 8475 1650 50  0001 L CNN
F 2 "Capacitor_SMD:C_0603_1608Metric" H 8488 1600 50  0001 C CNN
F 3 "~" H 8450 1750 50  0001 C CNN
F 4 "10uF" H 8600 1650 50  0000 C CNN "DisplayValue"
F 5 "0603" H 8600 1550 50  0000 C CNN "DisplayFootprint"
F 6 "3000-0000000135" H 8450 1750 50  0001 C CNN "PartSpecification"
	1    8450 1750
	1    0    0    -1  
$EndComp
$Comp
L 000_PreferredParts:C_10uF_0603 C?
U 1 1 5E3344D1
P 8900 1750
AR Path="/5E179620/5E2CEBB7/5E3344D1" Ref="C?"  Part="1" 
AR Path="/5E179620/5E2CF5EB/5E3344D1" Ref="C2528"  Part="1" 
F 0 "C2528" H 8925 1850 50  0000 L CNN
F 1 "C_10uF_0603" H 8925 1650 50  0001 L CNN
F 2 "Capacitor_SMD:C_0603_1608Metric" H 8938 1600 50  0001 C CNN
F 3 "~" H 8900 1750 50  0001 C CNN
F 4 "10uF" H 9050 1650 50  0000 C CNN "DisplayValue"
F 5 "0603" H 9050 1550 50  0000 C CNN "DisplayFootprint"
F 6 "3000-0000000135" H 8900 1750 50  0001 C CNN "PartSpecification"
	1    8900 1750
	1    0    0    -1  
$EndComp
$Comp
L 000_PreferredParts:C_10uF_0603 C?
U 1 1 5E3344DA
P 9200 1750
AR Path="/5E179620/5E2CEBB7/5E3344DA" Ref="C?"  Part="1" 
AR Path="/5E179620/5E2CF5EB/5E3344DA" Ref="C2531"  Part="1" 
F 0 "C2531" H 9225 1850 50  0000 L CNN
F 1 "C_10uF_0603" H 9225 1650 50  0001 L CNN
F 2 "Capacitor_SMD:C_0603_1608Metric" H 9238 1600 50  0001 C CNN
F 3 "~" H 9200 1750 50  0001 C CNN
F 4 "10uF" H 9350 1650 50  0000 C CNN "DisplayValue"
F 5 "0603" H 9350 1550 50  0000 C CNN "DisplayFootprint"
F 6 "3000-0000000135" H 9200 1750 50  0001 C CNN "PartSpecification"
	1    9200 1750
	1    0    0    -1  
$EndComp
$Comp
L power:GND #PWR?
U 1 1 5E3344E0
P 7250 2000
AR Path="/5E179620/5E2CEBB7/5E3344E0" Ref="#PWR?"  Part="1" 
AR Path="/5E179620/5E2CF5EB/5E3344E0" Ref="#PWR?"  Part="1" 
F 0 "#PWR?" H 7250 1750 50  0001 C CNN
F 1 "GND" H 7250 1850 50  0000 C CNN
F 2 "" H 7250 2000 50  0001 C CNN
F 3 "" H 7250 2000 50  0001 C CNN
	1    7250 2000
	1    0    0    -1  
$EndComp
Wire Wire Line
	7250 1900 7250 2000
$Comp
L power:GND #PWR?
U 1 1 5E3344E7
P 7550 2000
AR Path="/5E179620/5E2CEBB7/5E3344E7" Ref="#PWR?"  Part="1" 
AR Path="/5E179620/5E2CF5EB/5E3344E7" Ref="#PWR?"  Part="1" 
F 0 "#PWR?" H 7550 1750 50  0001 C CNN
F 1 "GND" H 7550 1850 50  0000 C CNN
F 2 "" H 7550 2000 50  0001 C CNN
F 3 "" H 7550 2000 50  0001 C CNN
	1    7550 2000
	1    0    0    -1  
$EndComp
Wire Wire Line
	7550 1900 7550 2000
$Comp
L power:GND #PWR?
U 1 1 5E3344EE
P 7850 2000
AR Path="/5E179620/5E2CEBB7/5E3344EE" Ref="#PWR?"  Part="1" 
AR Path="/5E179620/5E2CF5EB/5E3344EE" Ref="#PWR?"  Part="1" 
F 0 "#PWR?" H 7850 1750 50  0001 C CNN
F 1 "GND" H 7850 1850 50  0000 C CNN
F 2 "" H 7850 2000 50  0001 C CNN
F 3 "" H 7850 2000 50  0001 C CNN
	1    7850 2000
	1    0    0    -1  
$EndComp
Wire Wire Line
	7850 1900 7850 2000
$Comp
L power:GND #PWR?
U 1 1 5E3344F5
P 8150 2000
AR Path="/5E179620/5E2CEBB7/5E3344F5" Ref="#PWR?"  Part="1" 
AR Path="/5E179620/5E2CF5EB/5E3344F5" Ref="#PWR?"  Part="1" 
F 0 "#PWR?" H 8150 1750 50  0001 C CNN
F 1 "GND" H 8150 1850 50  0000 C CNN
F 2 "" H 8150 2000 50  0001 C CNN
F 3 "" H 8150 2000 50  0001 C CNN
	1    8150 2000
	1    0    0    -1  
$EndComp
Wire Wire Line
	8150 1900 8150 2000
$Comp
L power:GND #PWR?
U 1 1 5E3344FC
P 8450 2000
AR Path="/5E179620/5E2CEBB7/5E3344FC" Ref="#PWR?"  Part="1" 
AR Path="/5E179620/5E2CF5EB/5E3344FC" Ref="#PWR?"  Part="1" 
F 0 "#PWR?" H 8450 1750 50  0001 C CNN
F 1 "GND" H 8450 1850 50  0000 C CNN
F 2 "" H 8450 2000 50  0001 C CNN
F 3 "" H 8450 2000 50  0001 C CNN
	1    8450 2000
	1    0    0    -1  
$EndComp
Wire Wire Line
	8450 1900 8450 2000
$Comp
L power:GND #PWR?
U 1 1 5E334503
P 8900 2000
AR Path="/5E179620/5E2CEBB7/5E334503" Ref="#PWR?"  Part="1" 
AR Path="/5E179620/5E2CF5EB/5E334503" Ref="#PWR?"  Part="1" 
F 0 "#PWR?" H 8900 1750 50  0001 C CNN
F 1 "GND" H 8900 1850 50  0000 C CNN
F 2 "" H 8900 2000 50  0001 C CNN
F 3 "" H 8900 2000 50  0001 C CNN
	1    8900 2000
	1    0    0    -1  
$EndComp
Wire Wire Line
	8900 1900 8900 2000
$Comp
L power:GND #PWR?
U 1 1 5E33450A
P 9200 2000
AR Path="/5E179620/5E2CEBB7/5E33450A" Ref="#PWR?"  Part="1" 
AR Path="/5E179620/5E2CF5EB/5E33450A" Ref="#PWR?"  Part="1" 
F 0 "#PWR?" H 9200 1750 50  0001 C CNN
F 1 "GND" H 9200 1850 50  0000 C CNN
F 2 "" H 9200 2000 50  0001 C CNN
F 3 "" H 9200 2000 50  0001 C CNN
	1    9200 2000
	1    0    0    -1  
$EndComp
Wire Wire Line
	9200 1900 9200 2000
Wire Wire Line
	9200 1600 9200 1400
Wire Wire Line
	6500 1400 7250 1400
Wire Wire Line
	7250 1600 7250 1400
Wire Wire Line
	7250 1400 7550 1400
Wire Wire Line
	7550 1600 7550 1400
Wire Wire Line
	7850 1600 7850 1400
Wire Wire Line
	8150 1600 8150 1400
Wire Wire Line
	8450 1600 8450 1400
Wire Wire Line
	8900 1600 8900 1400
Connection ~ 7250 1400
Connection ~ 7550 1400
Wire Wire Line
	7550 1400 7850 1400
Connection ~ 7850 1400
Wire Wire Line
	7850 1400 8150 1400
Connection ~ 8150 1400
Wire Wire Line
	8150 1400 8450 1400
Connection ~ 8450 1400
Text HLabel 7000 2500 2    50   Output ~ 0
pg_b210_1
Wire Wire Line
	7000 2500 6900 2500
Connection ~ 6500 2100
$Comp
L Device:R R?
U 1 1 5E33452F
P 8700 1400
AR Path="/5E179620/5E2CEBB7/5E33452F" Ref="R?"  Part="1" 
AR Path="/5E179620/5E2CF5EB/5E33452F" Ref="R2516"  Part="1" 
F 0 "R2516" V 8780 1400 50  0000 C CNN
F 1 "3m" V 8700 1400 50  0000 C CNN
F 2 "POWDER_Power:R_0508_1220Metric" V 8630 1400 50  0001 C CNN
F 3 "~" H 8700 1400 50  0001 C CNN
F 4 "3000-0000000499" H 8700 1400 50  0001 C CNN "PartSpecification"
	1    8700 1400
	0    1    1    0   
$EndComp
Wire Wire Line
	8550 1400 8450 1400
Wire Wire Line
	8450 1000 8750 1000
Wire Wire Line
	8450 1000 8450 1400
Text HLabel 8750 1000 2    50   Output ~ 0
rsp_b210_1
Text HLabel 10600 1400 2    50   Output ~ 0
rsn_b210_1
Text HLabel 1800 3500 0    50   Input ~ 0
v_12
$Comp
L 000_PreferredParts:C_10uF_0805 C?
U 1 1 5E34099A
P 2250 3750
AR Path="/5E179620/5E2CEBB7/5E34099A" Ref="C?"  Part="1" 
AR Path="/5E179620/5E2CF5EB/5E34099A" Ref="C2502"  Part="1" 
F 0 "C2502" H 2275 3850 50  0000 L CNN
F 1 "C_10uF_0805" H 2275 3650 50  0001 L CNN
F 2 "Capacitor_SMD:C_0805_2012Metric" H 2288 3600 50  0001 C CNN
F 3 "~" H 2250 3750 50  0001 C CNN
F 4 "10uF" H 2400 3650 50  0000 C CNN "DisplayValue"
F 5 "0805" H 2400 3550 50  0000 C CNN "DisplayFootprint"
F 6 "3000-0000000134" H 2250 3750 50  0001 C CNN "PartSpecification"
	1    2250 3750
	1    0    0    -1  
$EndComp
$Comp
L 000_PreferredParts:C_10uF_0805 C?
U 1 1 5E3409A3
P 2750 3750
AR Path="/5E179620/5E2CEBB7/5E3409A3" Ref="C?"  Part="1" 
AR Path="/5E179620/5E2CF5EB/5E3409A3" Ref="C2505"  Part="1" 
F 0 "C2505" H 2775 3850 50  0000 L CNN
F 1 "C_10uF_0805" H 2775 3650 50  0001 L CNN
F 2 "Capacitor_SMD:C_0805_2012Metric" H 2788 3600 50  0001 C CNN
F 3 "~" H 2750 3750 50  0001 C CNN
F 4 "10uF" H 2900 3650 50  0000 C CNN "DisplayValue"
F 5 "0805" H 2900 3550 50  0000 C CNN "DisplayFootprint"
F 6 "3000-0000000134" H 2750 3750 50  0001 C CNN "PartSpecification"
	1    2750 3750
	1    0    0    -1  
$EndComp
$Comp
L 000_PreferredParts:C_10uF_0603 C?
U 1 1 5E3409AC
P 3250 3750
AR Path="/5E179620/5E2CEBB7/5E3409AC" Ref="C?"  Part="1" 
AR Path="/5E179620/5E2CF5EB/5E3409AC" Ref="C2508"  Part="1" 
F 0 "C2508" H 3275 3850 50  0000 L CNN
F 1 "C_10uF_0603" H 3275 3650 50  0001 L CNN
F 2 "Capacitor_SMD:C_0603_1608Metric" H 3288 3600 50  0001 C CNN
F 3 "~" H 3250 3750 50  0001 C CNN
F 4 "10uF" H 3400 3650 50  0000 C CNN "DisplayValue"
F 5 "0603" H 3400 3550 50  0000 C CNN "DisplayFootprint"
F 6 "3000-0000000135" H 3250 3750 50  0001 C CNN "PartSpecification"
	1    3250 3750
	1    0    0    -1  
$EndComp
$Comp
L power:GND #PWR?
U 1 1 5E3409B2
P 2250 4000
AR Path="/5E179620/5E2CEBB7/5E3409B2" Ref="#PWR?"  Part="1" 
AR Path="/5E179620/5E2CF5EB/5E3409B2" Ref="#PWR?"  Part="1" 
F 0 "#PWR?" H 2250 3750 50  0001 C CNN
F 1 "GND" H 2250 3850 50  0000 C CNN
F 2 "" H 2250 4000 50  0001 C CNN
F 3 "" H 2250 4000 50  0001 C CNN
	1    2250 4000
	1    0    0    -1  
$EndComp
Wire Wire Line
	2250 4000 2250 3900
$Comp
L power:GND #PWR?
U 1 1 5E3409B9
P 2750 4000
AR Path="/5E179620/5E2CEBB7/5E3409B9" Ref="#PWR?"  Part="1" 
AR Path="/5E179620/5E2CF5EB/5E3409B9" Ref="#PWR?"  Part="1" 
F 0 "#PWR?" H 2750 3750 50  0001 C CNN
F 1 "GND" H 2750 3850 50  0000 C CNN
F 2 "" H 2750 4000 50  0001 C CNN
F 3 "" H 2750 4000 50  0001 C CNN
	1    2750 4000
	1    0    0    -1  
$EndComp
Wire Wire Line
	2750 4000 2750 3900
$Comp
L power:GND #PWR?
U 1 1 5E3409C0
P 3250 4000
AR Path="/5E179620/5E2CEBB7/5E3409C0" Ref="#PWR?"  Part="1" 
AR Path="/5E179620/5E2CF5EB/5E3409C0" Ref="#PWR?"  Part="1" 
F 0 "#PWR?" H 3250 3750 50  0001 C CNN
F 1 "GND" H 3250 3850 50  0000 C CNN
F 2 "" H 3250 4000 50  0001 C CNN
F 3 "" H 3250 4000 50  0001 C CNN
	1    3250 4000
	1    0    0    -1  
$EndComp
Wire Wire Line
	3250 4000 3250 3900
Wire Wire Line
	3250 3600 3250 3500
Wire Wire Line
	3250 3500 2750 3500
Wire Wire Line
	2250 3600 2250 3500
Connection ~ 2250 3500
Wire Wire Line
	2250 3500 1800 3500
Wire Wire Line
	2750 3600 2750 3500
Connection ~ 2750 3500
Wire Wire Line
	2750 3500 2250 3500
$Comp
L POWDER_Power:TPS63070RNM U?
U 1 1 5E3409D1
P 5100 3800
AR Path="/5E179620/5E2CEBB7/5E3409D1" Ref="U?"  Part="1" 
AR Path="/5E179620/5E2CF5EB/5E3409D1" Ref="U2502"  Part="1" 
F 0 "U2502" H 5450 4400 60  0000 C CNN
F 1 "TPS63070RNM" H 5150 3950 60  0000 C CNN
F 2 "POWDER_Power:TPS63070RNMR" H 5200 3790 60  0001 C CNN
F 3 "" H 5200 4200 60  0000 C CNN
F 4 "Texas Instruments" H 5100 3800 50  0001 C CNN "Manufacturer"
F 5 "TPS63070RNMR" H 5100 3800 50  0001 C CNN "PartNumber"
F 6 "3000-0000000079" H 5100 3800 50  0001 C CNN "PartSpecification"
	1    5100 3800
	1    0    0    -1  
$EndComp
Wire Wire Line
	4500 3500 4350 3500
Connection ~ 3250 3500
Wire Wire Line
	4500 3400 4350 3400
Wire Wire Line
	4350 3400 4350 3500
Connection ~ 4350 3500
Wire Wire Line
	4350 3500 3750 3500
$Comp
L Device:R R?
U 1 1 5E3409DD
P 4000 4100
AR Path="/5E179620/5E2CEBB7/5E3409DD" Ref="R?"  Part="1" 
AR Path="/5E179620/5E2CF5EB/5E3409DD" Ref="R2502"  Part="1" 
F 0 "R2502" V 4080 4100 50  0000 C CNN
F 1 "10k" V 4000 4100 50  0000 C CNN
F 2 "Resistor_SMD:R_0402_1005Metric" V 3930 4100 50  0001 C CNN
F 3 "~" H 4000 4100 50  0001 C CNN
F 4 "3000-0000000131" H 4000 4100 50  0001 C CNN "PartSpecification"
	1    4000 4100
	0    1    1    0   
$EndComp
Wire Wire Line
	3850 4100 3750 4100
Connection ~ 3750 3500
Wire Wire Line
	3750 3500 3250 3500
Wire Wire Line
	4500 4200 4450 4200
$Comp
L power:GND #PWR?
U 1 1 5E3409ED
P 4450 4300
AR Path="/5E179620/5E2CEBB7/5E3409ED" Ref="#PWR?"  Part="1" 
AR Path="/5E179620/5E2CF5EB/5E3409ED" Ref="#PWR?"  Part="1" 
F 0 "#PWR?" H 4450 4050 50  0001 C CNN
F 1 "GND" H 4450 4150 50  0000 C CNN
F 2 "" H 4450 4300 50  0001 C CNN
F 3 "" H 4450 4300 50  0001 C CNN
	1    4450 4300
	1    0    0    -1  
$EndComp
Wire Wire Line
	4450 4300 4450 4200
$Comp
L 000_PreferredParts:C_100nF C?
U 1 1 5E3409F6
P 3600 4200
AR Path="/5E179620/5E2CEBB7/5E3409F6" Ref="C?"  Part="1" 
AR Path="/5E179620/5E2CF5EB/5E3409F6" Ref="C2511"  Part="1" 
F 0 "C2511" H 3625 4300 50  0000 L CNN
F 1 "C_100nF" H 3625 4100 50  0001 L CNN
F 2 "Capacitor_SMD:C_0402_1005Metric" H 3638 4050 50  0001 C CNN
F 3 "~" H 3600 4200 50  0001 C CNN
F 4 "100nF" H 3750 4100 50  0000 C CNN "DisplayValue"
F 5 "3000-0000000125" H 3600 4200 50  0001 C CNN "PartSpecification"
	1    3600 4200
	1    0    0    -1  
$EndComp
Wire Wire Line
	3600 4050 3600 3750
Wire Wire Line
	3600 3750 4500 3750
$Comp
L power:GND #PWR?
U 1 1 5E3409FE
P 3600 4450
AR Path="/5E179620/5E2CEBB7/5E3409FE" Ref="#PWR?"  Part="1" 
AR Path="/5E179620/5E2CF5EB/5E3409FE" Ref="#PWR?"  Part="1" 
F 0 "#PWR?" H 3600 4200 50  0001 C CNN
F 1 "GND" H 3600 4300 50  0000 C CNN
F 2 "" H 3600 4450 50  0001 C CNN
F 3 "" H 3600 4450 50  0001 C CNN
	1    3600 4450
	1    0    0    -1  
$EndComp
Wire Wire Line
	3600 4450 3600 4350
$Comp
L power:GND #PWR?
U 1 1 5E340A05
P 5000 4600
AR Path="/5E179620/5E2CEBB7/5E340A05" Ref="#PWR?"  Part="1" 
AR Path="/5E179620/5E2CF5EB/5E340A05" Ref="#PWR?"  Part="1" 
F 0 "#PWR?" H 5000 4350 50  0001 C CNN
F 1 "GND" H 5000 4450 50  0000 C CNN
F 2 "" H 5000 4600 50  0001 C CNN
F 3 "" H 5000 4600 50  0001 C CNN
	1    5000 4600
	1    0    0    -1  
$EndComp
$Comp
L power:GND #PWR?
U 1 1 5E340A0B
P 5200 4600
AR Path="/5E179620/5E2CEBB7/5E340A0B" Ref="#PWR?"  Part="1" 
AR Path="/5E179620/5E2CF5EB/5E340A0B" Ref="#PWR?"  Part="1" 
F 0 "#PWR?" H 5200 4350 50  0001 C CNN
F 1 "GND" H 5200 4450 50  0000 C CNN
F 2 "" H 5200 4600 50  0001 C CNN
F 3 "" H 5200 4600 50  0001 C CNN
	1    5200 4600
	1    0    0    -1  
$EndComp
Wire Wire Line
	5200 4600 5200 4500
Wire Wire Line
	5000 4600 5000 4500
$Comp
L Device:L L?
U 1 1 5E340A14
P 5100 3000
AR Path="/5E179620/5E2CEBB7/5E340A14" Ref="L?"  Part="1" 
AR Path="/5E179620/5E2CF5EB/5E340A14" Ref="L2502"  Part="1" 
F 0 "L2502" V 5050 3000 50  0000 C CNN
F 1 "1.5uH" V 5175 3000 50  0000 C CNN
F 2 "Inductor_SMD:L_Taiyo-Yuden_MD-4040" H 5100 3000 50  0001 C CNN
F 3 "~" H 5100 3000 50  0001 C CNN
F 4 "3000-0000000076" V 5100 3000 50  0001 C CNN "PartSpecification"
	1    5100 3000
	0    -1   -1   0   
$EndComp
Wire Wire Line
	5250 3000 5300 3000
Wire Wire Line
	5300 3000 5300 3150
Wire Wire Line
	4950 3000 4900 3000
Wire Wire Line
	4900 3000 4900 3150
$Comp
L power:GND #PWR?
U 1 1 5E340A1E
P 6000 4500
AR Path="/5E179620/5E2CEBB7/5E340A1E" Ref="#PWR?"  Part="1" 
AR Path="/5E179620/5E2CF5EB/5E340A1E" Ref="#PWR?"  Part="1" 
F 0 "#PWR?" H 6000 4250 50  0001 C CNN
F 1 "GND" H 6000 4350 50  0000 C CNN
F 2 "" H 6000 4500 50  0001 C CNN
F 3 "" H 6000 4500 50  0001 C CNN
	1    6000 4500
	1    0    0    -1  
$EndComp
Wire Wire Line
	5700 3850 6000 3850
Wire Wire Line
	6000 3850 6000 4500
Wire Wire Line
	5700 4100 6500 4100
$Comp
L Device:R R?
U 1 1 5E340A27
P 6500 3850
AR Path="/5E179620/5E2CEBB7/5E340A27" Ref="R?"  Part="1" 
AR Path="/5E179620/5E2CF5EB/5E340A27" Ref="R2511"  Part="1" 
F 0 "R2511" V 6580 3850 50  0000 C CNN
F 1 "10k" V 6500 3850 50  0000 C CNN
F 2 "Resistor_SMD:R_0402_1005Metric" V 6430 3850 50  0001 C CNN
F 3 "~" H 6500 3850 50  0001 C CNN
F 4 "3000-0000000131" H 6500 3850 50  0001 C CNN "PartSpecification"
	1    6500 3850
	-1   0    0    1   
$EndComp
$Comp
L Device:R R?
U 1 1 5E340A2D
P 6200 3550
AR Path="/5E179620/5E2CEBB7/5E340A2D" Ref="R?"  Part="1" 
AR Path="/5E179620/5E2CF5EB/5E340A2D" Ref="R2506"  Part="1" 
F 0 "R2506" V 6280 3550 50  0000 C CNN
F 1 "976k" V 6200 3550 50  0000 C CNN
F 2 "Resistor_SMD:R_0402_1005Metric" V 6130 3550 50  0001 C CNN
F 3 "~" H 6200 3550 50  0001 C CNN
F 4 "3000-0000000578" H 6200 3550 50  0001 C CNN "PartSpecification"
	1    6200 3550
	-1   0    0    1   
$EndComp
Wire Wire Line
	5700 3750 6200 3750
Wire Wire Line
	6200 3750 6200 3700
Wire Wire Line
	5700 3500 5800 3500
Wire Wire Line
	5800 3500 5800 3400
Wire Wire Line
	5800 3400 5700 3400
Wire Wire Line
	5800 3400 6200 3400
Connection ~ 5800 3400
Connection ~ 6200 3400
Wire Wire Line
	6200 3400 6500 3400
$Comp
L Device:R R?
U 1 1 5E340A3C
P 6200 4300
AR Path="/5E179620/5E2CEBB7/5E340A3C" Ref="R?"  Part="1" 
AR Path="/5E179620/5E2CF5EB/5E340A3C" Ref="R2507"  Part="1" 
F 0 "R2507" V 6280 4300 50  0000 C CNN
F 1 "150k" V 6200 4300 50  0000 C CNN
F 2 "Resistor_SMD:R_0402_1005Metric" V 6130 4300 50  0001 C CNN
F 3 "~" H 6200 4300 50  0001 C CNN
F 4 "3000-0000000579" H 6200 4300 50  0001 C CNN "PartSpecification"
	1    6200 4300
	-1   0    0    1   
$EndComp
$Comp
L power:GND #PWR?
U 1 1 5E340A42
P 6200 4500
AR Path="/5E179620/5E2CEBB7/5E340A42" Ref="#PWR?"  Part="1" 
AR Path="/5E179620/5E2CF5EB/5E340A42" Ref="#PWR?"  Part="1" 
F 0 "#PWR?" H 6200 4250 50  0001 C CNN
F 1 "GND" H 6200 4350 50  0000 C CNN
F 2 "" H 6200 4500 50  0001 C CNN
F 3 "" H 6200 4500 50  0001 C CNN
	1    6200 4500
	1    0    0    -1  
$EndComp
Wire Wire Line
	6200 4500 6200 4450
Wire Wire Line
	6200 4150 6200 3750
Connection ~ 6200 3750
Wire Wire Line
	6500 4100 6500 4000
Wire Wire Line
	6500 3700 6500 3400
Connection ~ 6500 3400
$Comp
L 000_PreferredParts:C_10uF_0603 C?
U 1 1 5E340A51
P 7250 3750
AR Path="/5E179620/5E2CEBB7/5E340A51" Ref="C?"  Part="1" 
AR Path="/5E179620/5E2CF5EB/5E340A51" Ref="C2514"  Part="1" 
F 0 "C2514" H 7275 3850 50  0000 L CNN
F 1 "C_10uF_0603" H 7275 3650 50  0001 L CNN
F 2 "Capacitor_SMD:C_0603_1608Metric" H 7288 3600 50  0001 C CNN
F 3 "~" H 7250 3750 50  0001 C CNN
F 4 "10uF" H 7400 3650 50  0000 C CNN "DisplayValue"
F 5 "0603" H 7400 3550 50  0000 C CNN "DisplayFootprint"
F 6 "3000-0000000135" H 7250 3750 50  0001 C CNN "PartSpecification"
	1    7250 3750
	1    0    0    -1  
$EndComp
$Comp
L 000_PreferredParts:C_10uF_0603 C?
U 1 1 5E340A5A
P 7550 3750
AR Path="/5E179620/5E2CEBB7/5E340A5A" Ref="C?"  Part="1" 
AR Path="/5E179620/5E2CF5EB/5E340A5A" Ref="C2517"  Part="1" 
F 0 "C2517" H 7575 3850 50  0000 L CNN
F 1 "C_10uF_0603" H 7575 3650 50  0001 L CNN
F 2 "Capacitor_SMD:C_0603_1608Metric" H 7588 3600 50  0001 C CNN
F 3 "~" H 7550 3750 50  0001 C CNN
F 4 "10uF" H 7700 3650 50  0000 C CNN "DisplayValue"
F 5 "0603" H 7700 3550 50  0000 C CNN "DisplayFootprint"
F 6 "3000-0000000135" H 7550 3750 50  0001 C CNN "PartSpecification"
	1    7550 3750
	1    0    0    -1  
$EndComp
$Comp
L 000_PreferredParts:C_10uF_0603 C?
U 1 1 5E340A63
P 7850 3750
AR Path="/5E179620/5E2CEBB7/5E340A63" Ref="C?"  Part="1" 
AR Path="/5E179620/5E2CF5EB/5E340A63" Ref="C2520"  Part="1" 
F 0 "C2520" H 7875 3850 50  0000 L CNN
F 1 "C_10uF_0603" H 7875 3650 50  0001 L CNN
F 2 "Capacitor_SMD:C_0603_1608Metric" H 7888 3600 50  0001 C CNN
F 3 "~" H 7850 3750 50  0001 C CNN
F 4 "10uF" H 8000 3650 50  0000 C CNN "DisplayValue"
F 5 "0603" H 8000 3550 50  0000 C CNN "DisplayFootprint"
F 6 "3000-0000000135" H 7850 3750 50  0001 C CNN "PartSpecification"
	1    7850 3750
	1    0    0    -1  
$EndComp
$Comp
L 000_PreferredParts:C_10uF_0603 C?
U 1 1 5E340A6C
P 8150 3750
AR Path="/5E179620/5E2CEBB7/5E340A6C" Ref="C?"  Part="1" 
AR Path="/5E179620/5E2CF5EB/5E340A6C" Ref="C2523"  Part="1" 
F 0 "C2523" H 8175 3850 50  0000 L CNN
F 1 "C_10uF_0603" H 8175 3650 50  0001 L CNN
F 2 "Capacitor_SMD:C_0603_1608Metric" H 8188 3600 50  0001 C CNN
F 3 "~" H 8150 3750 50  0001 C CNN
F 4 "10uF" H 8300 3650 50  0000 C CNN "DisplayValue"
F 5 "0603" H 8300 3550 50  0000 C CNN "DisplayFootprint"
F 6 "3000-0000000135" H 8150 3750 50  0001 C CNN "PartSpecification"
	1    8150 3750
	1    0    0    -1  
$EndComp
$Comp
L 000_PreferredParts:C_10uF_0603 C?
U 1 1 5E340A75
P 8450 3750
AR Path="/5E179620/5E2CEBB7/5E340A75" Ref="C?"  Part="1" 
AR Path="/5E179620/5E2CF5EB/5E340A75" Ref="C2526"  Part="1" 
F 0 "C2526" H 8475 3850 50  0000 L CNN
F 1 "C_10uF_0603" H 8475 3650 50  0001 L CNN
F 2 "Capacitor_SMD:C_0603_1608Metric" H 8488 3600 50  0001 C CNN
F 3 "~" H 8450 3750 50  0001 C CNN
F 4 "10uF" H 8600 3650 50  0000 C CNN "DisplayValue"
F 5 "0603" H 8600 3550 50  0000 C CNN "DisplayFootprint"
F 6 "3000-0000000135" H 8450 3750 50  0001 C CNN "PartSpecification"
	1    8450 3750
	1    0    0    -1  
$EndComp
$Comp
L 000_PreferredParts:C_10uF_0603 C?
U 1 1 5E340A7E
P 8900 3750
AR Path="/5E179620/5E2CEBB7/5E340A7E" Ref="C?"  Part="1" 
AR Path="/5E179620/5E2CF5EB/5E340A7E" Ref="C2529"  Part="1" 
F 0 "C2529" H 8925 3850 50  0000 L CNN
F 1 "C_10uF_0603" H 8925 3650 50  0001 L CNN
F 2 "Capacitor_SMD:C_0603_1608Metric" H 8938 3600 50  0001 C CNN
F 3 "~" H 8900 3750 50  0001 C CNN
F 4 "10uF" H 9050 3650 50  0000 C CNN "DisplayValue"
F 5 "0603" H 9050 3550 50  0000 C CNN "DisplayFootprint"
F 6 "3000-0000000135" H 8900 3750 50  0001 C CNN "PartSpecification"
	1    8900 3750
	1    0    0    -1  
$EndComp
$Comp
L 000_PreferredParts:C_10uF_0603 C?
U 1 1 5E340A87
P 9200 3750
AR Path="/5E179620/5E2CEBB7/5E340A87" Ref="C?"  Part="1" 
AR Path="/5E179620/5E2CF5EB/5E340A87" Ref="C2532"  Part="1" 
F 0 "C2532" H 9225 3850 50  0000 L CNN
F 1 "C_10uF_0603" H 9225 3650 50  0001 L CNN
F 2 "Capacitor_SMD:C_0603_1608Metric" H 9238 3600 50  0001 C CNN
F 3 "~" H 9200 3750 50  0001 C CNN
F 4 "10uF" H 9350 3650 50  0000 C CNN "DisplayValue"
F 5 "0603" H 9350 3550 50  0000 C CNN "DisplayFootprint"
F 6 "3000-0000000135" H 9200 3750 50  0001 C CNN "PartSpecification"
	1    9200 3750
	1    0    0    -1  
$EndComp
$Comp
L power:GND #PWR?
U 1 1 5E340A8D
P 7250 4000
AR Path="/5E179620/5E2CEBB7/5E340A8D" Ref="#PWR?"  Part="1" 
AR Path="/5E179620/5E2CF5EB/5E340A8D" Ref="#PWR?"  Part="1" 
F 0 "#PWR?" H 7250 3750 50  0001 C CNN
F 1 "GND" H 7250 3850 50  0000 C CNN
F 2 "" H 7250 4000 50  0001 C CNN
F 3 "" H 7250 4000 50  0001 C CNN
	1    7250 4000
	1    0    0    -1  
$EndComp
Wire Wire Line
	7250 3900 7250 4000
$Comp
L power:GND #PWR?
U 1 1 5E340A94
P 7550 4000
AR Path="/5E179620/5E2CEBB7/5E340A94" Ref="#PWR?"  Part="1" 
AR Path="/5E179620/5E2CF5EB/5E340A94" Ref="#PWR?"  Part="1" 
F 0 "#PWR?" H 7550 3750 50  0001 C CNN
F 1 "GND" H 7550 3850 50  0000 C CNN
F 2 "" H 7550 4000 50  0001 C CNN
F 3 "" H 7550 4000 50  0001 C CNN
	1    7550 4000
	1    0    0    -1  
$EndComp
Wire Wire Line
	7550 3900 7550 4000
$Comp
L power:GND #PWR?
U 1 1 5E340A9B
P 7850 4000
AR Path="/5E179620/5E2CEBB7/5E340A9B" Ref="#PWR?"  Part="1" 
AR Path="/5E179620/5E2CF5EB/5E340A9B" Ref="#PWR?"  Part="1" 
F 0 "#PWR?" H 7850 3750 50  0001 C CNN
F 1 "GND" H 7850 3850 50  0000 C CNN
F 2 "" H 7850 4000 50  0001 C CNN
F 3 "" H 7850 4000 50  0001 C CNN
	1    7850 4000
	1    0    0    -1  
$EndComp
Wire Wire Line
	7850 3900 7850 4000
$Comp
L power:GND #PWR?
U 1 1 5E340AA2
P 8150 4000
AR Path="/5E179620/5E2CEBB7/5E340AA2" Ref="#PWR?"  Part="1" 
AR Path="/5E179620/5E2CF5EB/5E340AA2" Ref="#PWR?"  Part="1" 
F 0 "#PWR?" H 8150 3750 50  0001 C CNN
F 1 "GND" H 8150 3850 50  0000 C CNN
F 2 "" H 8150 4000 50  0001 C CNN
F 3 "" H 8150 4000 50  0001 C CNN
	1    8150 4000
	1    0    0    -1  
$EndComp
Wire Wire Line
	8150 3900 8150 4000
$Comp
L power:GND #PWR?
U 1 1 5E340AA9
P 8450 4000
AR Path="/5E179620/5E2CEBB7/5E340AA9" Ref="#PWR?"  Part="1" 
AR Path="/5E179620/5E2CF5EB/5E340AA9" Ref="#PWR?"  Part="1" 
F 0 "#PWR?" H 8450 3750 50  0001 C CNN
F 1 "GND" H 8450 3850 50  0000 C CNN
F 2 "" H 8450 4000 50  0001 C CNN
F 3 "" H 8450 4000 50  0001 C CNN
	1    8450 4000
	1    0    0    -1  
$EndComp
Wire Wire Line
	8450 3900 8450 4000
$Comp
L power:GND #PWR?
U 1 1 5E340AB0
P 8900 4000
AR Path="/5E179620/5E2CEBB7/5E340AB0" Ref="#PWR?"  Part="1" 
AR Path="/5E179620/5E2CF5EB/5E340AB0" Ref="#PWR?"  Part="1" 
F 0 "#PWR?" H 8900 3750 50  0001 C CNN
F 1 "GND" H 8900 3850 50  0000 C CNN
F 2 "" H 8900 4000 50  0001 C CNN
F 3 "" H 8900 4000 50  0001 C CNN
	1    8900 4000
	1    0    0    -1  
$EndComp
Wire Wire Line
	8900 3900 8900 4000
$Comp
L power:GND #PWR?
U 1 1 5E340AB7
P 9200 4000
AR Path="/5E179620/5E2CEBB7/5E340AB7" Ref="#PWR?"  Part="1" 
AR Path="/5E179620/5E2CF5EB/5E340AB7" Ref="#PWR?"  Part="1" 
F 0 "#PWR?" H 9200 3750 50  0001 C CNN
F 1 "GND" H 9200 3850 50  0000 C CNN
F 2 "" H 9200 4000 50  0001 C CNN
F 3 "" H 9200 4000 50  0001 C CNN
	1    9200 4000
	1    0    0    -1  
$EndComp
Wire Wire Line
	9200 3900 9200 4000
Wire Wire Line
	9200 3600 9200 3400
Wire Wire Line
	6500 3400 7250 3400
Wire Wire Line
	7250 3600 7250 3400
Wire Wire Line
	7250 3400 7550 3400
Wire Wire Line
	7550 3600 7550 3400
Wire Wire Line
	7850 3600 7850 3400
Wire Wire Line
	8150 3600 8150 3400
Wire Wire Line
	8450 3600 8450 3400
Wire Wire Line
	8900 3600 8900 3400
Connection ~ 7250 3400
Connection ~ 7550 3400
Wire Wire Line
	7550 3400 7850 3400
Connection ~ 7850 3400
Wire Wire Line
	7850 3400 8150 3400
Connection ~ 8150 3400
Wire Wire Line
	8150 3400 8450 3400
Connection ~ 8450 3400
$Comp
L Device:R R?
U 1 1 5E340ADC
P 8700 3400
AR Path="/5E179620/5E2CEBB7/5E340ADC" Ref="R?"  Part="1" 
AR Path="/5E179620/5E2CF5EB/5E340ADC" Ref="R2517"  Part="1" 
F 0 "R2517" V 8780 3400 50  0000 C CNN
F 1 "3m" V 8700 3400 50  0000 C CNN
F 2 "POWDER_Power:R_0508_1220Metric" V 8630 3400 50  0001 C CNN
F 3 "~" H 8700 3400 50  0001 C CNN
F 4 "3000-0000000499" H 8700 3400 50  0001 C CNN "PartSpecification"
	1    8700 3400
	0    1    1    0   
$EndComp
Wire Wire Line
	8550 3400 8450 3400
Wire Wire Line
	8450 3000 8750 3000
Wire Wire Line
	8450 3000 8450 3400
Text HLabel 8750 3000 2    50   Output ~ 0
rsp_b210_2
Text HLabel 10600 3400 2    50   Output ~ 0
rsn_b210_2
$Comp
L power:GND #PWR?
U 1 1 5E34AF71
P 10500 2000
AR Path="/5E179620/5E2CEBB7/5E34AF71" Ref="#PWR?"  Part="1" 
AR Path="/5E179620/5E2CF5EB/5E34AF71" Ref="#PWR?"  Part="1" 
F 0 "#PWR?" H 10500 1750 50  0001 C CNN
F 1 "GND" H 10500 1850 50  0000 C CNN
F 2 "" H 10500 2000 50  0001 C CNN
F 3 "" H 10500 2000 50  0001 C CNN
	1    10500 2000
	1    0    0    -1  
$EndComp
Wire Wire Line
	10500 2000 10500 1800
Wire Wire Line
	10500 1400 10500 1700
Connection ~ 10500 1400
Wire Wire Line
	10500 1400 10600 1400
Wire Wire Line
	8850 1400 8900 1400
Wire Wire Line
	10650 1700 10500 1700
Wire Wire Line
	10500 1800 10650 1800
$Comp
L Connector_Generic:Conn_01x02 J?
U 1 1 5E36903F
P 10850 1800
AR Path="/5E36903F" Ref="J?"  Part="1" 
AR Path="/5E179620/5E2CF5EB/5E36903F" Ref="J2501"  Part="1" 
F 0 "J2501" H 10850 1900 50  0000 C CNN
F 1 "Conn_01x02" H 10850 1600 50  0000 C CNN
F 2 "TerminalBlock:TerminalBlock_bornier-2_P5.08mm" H 10850 1800 50  0001 C CNN
F 3 "~" H 10850 1800 50  0001 C CNN
F 4 "3000-0000000184" H 10850 1800 50  0001 C CNN "PartSpecification"
	1    10850 1800
	1    0    0    1   
$EndComp
Wire Wire Line
	8850 3400 8900 3400
$Comp
L power:GND #PWR?
U 1 1 5E37C3B2
P 10500 4000
AR Path="/5E179620/5E2CEBB7/5E37C3B2" Ref="#PWR?"  Part="1" 
AR Path="/5E179620/5E2CF5EB/5E37C3B2" Ref="#PWR?"  Part="1" 
F 0 "#PWR?" H 10500 3750 50  0001 C CNN
F 1 "GND" H 10500 3850 50  0000 C CNN
F 2 "" H 10500 4000 50  0001 C CNN
F 3 "" H 10500 4000 50  0001 C CNN
	1    10500 4000
	1    0    0    -1  
$EndComp
Wire Wire Line
	10500 4000 10500 3800
Wire Wire Line
	10500 3400 10500 3700
Wire Wire Line
	10650 3700 10500 3700
Wire Wire Line
	10500 3800 10650 3800
$Comp
L Connector_Generic:Conn_01x02 J?
U 1 1 5E37C3C1
P 10850 3800
AR Path="/5E37C3C1" Ref="J?"  Part="1" 
AR Path="/5E179620/5E2CF5EB/5E37C3C1" Ref="J2502"  Part="1" 
F 0 "J2502" H 10850 3900 50  0000 C CNN
F 1 "Conn_01x02" H 10850 3600 50  0000 C CNN
F 2 "TerminalBlock:TerminalBlock_bornier-2_P5.08mm" H 10850 3800 50  0001 C CNN
F 3 "~" H 10850 3800 50  0001 C CNN
F 4 "3000-0000000184" H 10850 3800 50  0001 C CNN "PartSpecification"
	1    10850 3800
	1    0    0    1   
$EndComp
Connection ~ 10500 3400
Wire Wire Line
	10500 3400 10600 3400
Wire Wire Line
	3750 1500 3750 2100
Wire Wire Line
	4150 2100 4500 2100
Wire Wire Line
	4400 2000 4500 2000
Text HLabel 4400 2000 0    50   Input ~ 0
en_b210_1
Wire Wire Line
	3750 3500 3750 4100
Wire Wire Line
	4150 4100 4500 4100
Wire Wire Line
	4400 4000 4500 4000
Text HLabel 4400 4000 0    50   Input ~ 0
en_b210_2
Text HLabel 8750 5000 2    50   Output ~ 0
rsp_b210_3
Wire Wire Line
	8450 5000 8750 5000
Wire Wire Line
	4950 5000 4900 5000
Wire Wire Line
	5250 5000 5300 5000
$Comp
L Device:L L?
U 1 1 5EF23EB6
P 5100 5000
AR Path="/5E179620/5E2CEBB7/5EF23EB6" Ref="L?"  Part="1" 
AR Path="/5E179620/5E2CF5EB/5EF23EB6" Ref="L2503"  Part="1" 
F 0 "L2503" V 5050 5000 50  0000 C CNN
F 1 "1.5uH" V 5175 5000 50  0000 C CNN
F 2 "Inductor_SMD:L_Taiyo-Yuden_MD-4040" H 5100 5000 50  0001 C CNN
F 3 "~" H 5100 5000 50  0001 C CNN
F 4 "3000-0000000076" V 5100 5000 50  0001 C CNN "PartSpecification"
	1    5100 5000
	0    -1   -1   0   
$EndComp
Text HLabel 4400 6000 0    50   Input ~ 0
en_b210_3
Wire Wire Line
	4400 6000 4500 6000
Wire Wire Line
	4150 6100 4500 6100
Wire Wire Line
	3750 5500 3750 6100
Wire Wire Line
	10500 5400 10600 5400
$Comp
L Connector_Generic:Conn_01x02 J?
U 1 1 5EF23F8F
P 10850 5800
AR Path="/5EF23F8F" Ref="J?"  Part="1" 
AR Path="/5E179620/5E2CF5EB/5EF23F8F" Ref="J2503"  Part="1" 
F 0 "J2503" H 10850 5900 50  0000 C CNN
F 1 "Conn_01x02" H 10850 5600 50  0000 C CNN
F 2 "TerminalBlock:TerminalBlock_bornier-2_P5.08mm" H 10850 5800 50  0001 C CNN
F 3 "~" H 10850 5800 50  0001 C CNN
F 4 "3000-0000000184" H 10850 5800 50  0001 C CNN "PartSpecification"
	1    10850 5800
	1    0    0    1   
$EndComp
Wire Wire Line
	10500 5800 10650 5800
Wire Wire Line
	10650 5700 10500 5700
Wire Wire Line
	10500 5400 10500 5700
Wire Wire Line
	10500 6000 10500 5800
$Comp
L power:GND #PWR?
U 1 1 5EF23F84
P 10500 6000
AR Path="/5E179620/5E2CEBB7/5EF23F84" Ref="#PWR?"  Part="1" 
AR Path="/5E179620/5E2CF5EB/5EF23F84" Ref="#PWR?"  Part="1" 
F 0 "#PWR?" H 10500 5750 50  0001 C CNN
F 1 "GND" H 10500 5850 50  0000 C CNN
F 2 "" H 10500 6000 50  0001 C CNN
F 3 "" H 10500 6000 50  0001 C CNN
	1    10500 6000
	1    0    0    -1  
$EndComp
Connection ~ 10500 5400
Wire Wire Line
	8850 5400 8900 5400
Text HLabel 10600 5400 2    50   Output ~ 0
rsn_b210_3
Wire Wire Line
	8450 5000 8450 5400
Connection ~ 8450 5400
Wire Wire Line
	8550 5400 8450 5400
$Comp
L Device:R R?
U 1 1 5EF23F77
P 8700 5400
AR Path="/5E179620/5E2CEBB7/5EF23F77" Ref="R?"  Part="1" 
AR Path="/5E179620/5E2CF5EB/5EF23F77" Ref="R2518"  Part="1" 
F 0 "R2518" V 8780 5400 50  0000 C CNN
F 1 "3m" V 8700 5400 50  0000 C CNN
F 2 "POWDER_Power:R_0508_1220Metric" V 8630 5400 50  0001 C CNN
F 3 "~" H 8700 5400 50  0001 C CNN
F 4 "3000-0000000499" H 8700 5400 50  0001 C CNN "PartSpecification"
	1    8700 5400
	0    1    1    0   
$EndComp
Wire Wire Line
	8900 5600 8900 5400
Wire Wire Line
	8450 5600 8450 5400
Wire Wire Line
	8150 5400 8450 5400
Connection ~ 8150 5400
Wire Wire Line
	8150 5600 8150 5400
Wire Wire Line
	7850 5400 8150 5400
Connection ~ 7850 5400
Wire Wire Line
	7850 5600 7850 5400
Wire Wire Line
	7550 5400 7850 5400
Connection ~ 7550 5400
Wire Wire Line
	7550 5600 7550 5400
Wire Wire Line
	7250 5400 7550 5400
Connection ~ 7250 5400
Wire Wire Line
	7250 5600 7250 5400
Wire Wire Line
	9200 5600 9200 5400
Wire Wire Line
	9200 5900 9200 6000
$Comp
L power:GND #PWR?
U 1 1 5EF23F59
P 9200 6000
AR Path="/5E179620/5E2CEBB7/5EF23F59" Ref="#PWR?"  Part="1" 
AR Path="/5E179620/5E2CF5EB/5EF23F59" Ref="#PWR?"  Part="1" 
F 0 "#PWR?" H 9200 5750 50  0001 C CNN
F 1 "GND" H 9200 5850 50  0000 C CNN
F 2 "" H 9200 6000 50  0001 C CNN
F 3 "" H 9200 6000 50  0001 C CNN
	1    9200 6000
	1    0    0    -1  
$EndComp
Wire Wire Line
	8900 5900 8900 6000
$Comp
L power:GND #PWR?
U 1 1 5EF23F52
P 8900 6000
AR Path="/5E179620/5E2CEBB7/5EF23F52" Ref="#PWR?"  Part="1" 
AR Path="/5E179620/5E2CF5EB/5EF23F52" Ref="#PWR?"  Part="1" 
F 0 "#PWR?" H 8900 5750 50  0001 C CNN
F 1 "GND" H 8900 5850 50  0000 C CNN
F 2 "" H 8900 6000 50  0001 C CNN
F 3 "" H 8900 6000 50  0001 C CNN
	1    8900 6000
	1    0    0    -1  
$EndComp
Wire Wire Line
	8450 5900 8450 6000
$Comp
L power:GND #PWR?
U 1 1 5EF23F4B
P 8450 6000
AR Path="/5E179620/5E2CEBB7/5EF23F4B" Ref="#PWR?"  Part="1" 
AR Path="/5E179620/5E2CF5EB/5EF23F4B" Ref="#PWR?"  Part="1" 
F 0 "#PWR?" H 8450 5750 50  0001 C CNN
F 1 "GND" H 8450 5850 50  0000 C CNN
F 2 "" H 8450 6000 50  0001 C CNN
F 3 "" H 8450 6000 50  0001 C CNN
	1    8450 6000
	1    0    0    -1  
$EndComp
Wire Wire Line
	8150 5900 8150 6000
$Comp
L power:GND #PWR?
U 1 1 5EF23F44
P 8150 6000
AR Path="/5E179620/5E2CEBB7/5EF23F44" Ref="#PWR?"  Part="1" 
AR Path="/5E179620/5E2CF5EB/5EF23F44" Ref="#PWR?"  Part="1" 
F 0 "#PWR?" H 8150 5750 50  0001 C CNN
F 1 "GND" H 8150 5850 50  0000 C CNN
F 2 "" H 8150 6000 50  0001 C CNN
F 3 "" H 8150 6000 50  0001 C CNN
	1    8150 6000
	1    0    0    -1  
$EndComp
Wire Wire Line
	7850 5900 7850 6000
$Comp
L power:GND #PWR?
U 1 1 5EF23F3D
P 7850 6000
AR Path="/5E179620/5E2CEBB7/5EF23F3D" Ref="#PWR?"  Part="1" 
AR Path="/5E179620/5E2CF5EB/5EF23F3D" Ref="#PWR?"  Part="1" 
F 0 "#PWR?" H 7850 5750 50  0001 C CNN
F 1 "GND" H 7850 5850 50  0000 C CNN
F 2 "" H 7850 6000 50  0001 C CNN
F 3 "" H 7850 6000 50  0001 C CNN
	1    7850 6000
	1    0    0    -1  
$EndComp
Wire Wire Line
	7550 5900 7550 6000
$Comp
L power:GND #PWR?
U 1 1 5EF23F36
P 7550 6000
AR Path="/5E179620/5E2CEBB7/5EF23F36" Ref="#PWR?"  Part="1" 
AR Path="/5E179620/5E2CF5EB/5EF23F36" Ref="#PWR?"  Part="1" 
F 0 "#PWR?" H 7550 5750 50  0001 C CNN
F 1 "GND" H 7550 5850 50  0000 C CNN
F 2 "" H 7550 6000 50  0001 C CNN
F 3 "" H 7550 6000 50  0001 C CNN
	1    7550 6000
	1    0    0    -1  
$EndComp
Wire Wire Line
	7250 5900 7250 6000
$Comp
L power:GND #PWR?
U 1 1 5EF23F2F
P 7250 6000
AR Path="/5E179620/5E2CEBB7/5EF23F2F" Ref="#PWR?"  Part="1" 
AR Path="/5E179620/5E2CF5EB/5EF23F2F" Ref="#PWR?"  Part="1" 
F 0 "#PWR?" H 7250 5750 50  0001 C CNN
F 1 "GND" H 7250 5850 50  0000 C CNN
F 2 "" H 7250 6000 50  0001 C CNN
F 3 "" H 7250 6000 50  0001 C CNN
	1    7250 6000
	1    0    0    -1  
$EndComp
$Comp
L 000_PreferredParts:C_10uF_0603 C?
U 1 1 5EF23F29
P 9200 5750
AR Path="/5E179620/5E2CEBB7/5EF23F29" Ref="C?"  Part="1" 
AR Path="/5E179620/5E2CF5EB/5EF23F29" Ref="C2533"  Part="1" 
F 0 "C2533" H 9225 5850 50  0000 L CNN
F 1 "C_10uF_0603" H 9225 5650 50  0001 L CNN
F 2 "Capacitor_SMD:C_0603_1608Metric" H 9238 5600 50  0001 C CNN
F 3 "~" H 9200 5750 50  0001 C CNN
F 4 "10uF" H 9350 5650 50  0000 C CNN "DisplayValue"
F 5 "0603" H 9350 5550 50  0000 C CNN "DisplayFootprint"
F 6 "3000-0000000135" H 9200 5750 50  0001 C CNN "PartSpecification"
	1    9200 5750
	1    0    0    -1  
$EndComp
$Comp
L 000_PreferredParts:C_10uF_0603 C?
U 1 1 5EF23F20
P 8900 5750
AR Path="/5E179620/5E2CEBB7/5EF23F20" Ref="C?"  Part="1" 
AR Path="/5E179620/5E2CF5EB/5EF23F20" Ref="C2530"  Part="1" 
F 0 "C2530" H 8925 5850 50  0000 L CNN
F 1 "C_10uF_0603" H 8925 5650 50  0001 L CNN
F 2 "Capacitor_SMD:C_0603_1608Metric" H 8938 5600 50  0001 C CNN
F 3 "~" H 8900 5750 50  0001 C CNN
F 4 "10uF" H 9050 5650 50  0000 C CNN "DisplayValue"
F 5 "0603" H 9050 5550 50  0000 C CNN "DisplayFootprint"
F 6 "3000-0000000135" H 8900 5750 50  0001 C CNN "PartSpecification"
	1    8900 5750
	1    0    0    -1  
$EndComp
$Comp
L 000_PreferredParts:C_10uF_0603 C?
U 1 1 5EF23F17
P 8450 5750
AR Path="/5E179620/5E2CEBB7/5EF23F17" Ref="C?"  Part="1" 
AR Path="/5E179620/5E2CF5EB/5EF23F17" Ref="C2527"  Part="1" 
F 0 "C2527" H 8475 5850 50  0000 L CNN
F 1 "C_10uF_0603" H 8475 5650 50  0001 L CNN
F 2 "Capacitor_SMD:C_0603_1608Metric" H 8488 5600 50  0001 C CNN
F 3 "~" H 8450 5750 50  0001 C CNN
F 4 "10uF" H 8600 5650 50  0000 C CNN "DisplayValue"
F 5 "0603" H 8600 5550 50  0000 C CNN "DisplayFootprint"
F 6 "3000-0000000135" H 8450 5750 50  0001 C CNN "PartSpecification"
	1    8450 5750
	1    0    0    -1  
$EndComp
$Comp
L 000_PreferredParts:C_10uF_0603 C?
U 1 1 5EF23F0E
P 8150 5750
AR Path="/5E179620/5E2CEBB7/5EF23F0E" Ref="C?"  Part="1" 
AR Path="/5E179620/5E2CF5EB/5EF23F0E" Ref="C2524"  Part="1" 
F 0 "C2524" H 8175 5850 50  0000 L CNN
F 1 "C_10uF_0603" H 8175 5650 50  0001 L CNN
F 2 "Capacitor_SMD:C_0603_1608Metric" H 8188 5600 50  0001 C CNN
F 3 "~" H 8150 5750 50  0001 C CNN
F 4 "10uF" H 8300 5650 50  0000 C CNN "DisplayValue"
F 5 "0603" H 8300 5550 50  0000 C CNN "DisplayFootprint"
F 6 "3000-0000000135" H 8150 5750 50  0001 C CNN "PartSpecification"
	1    8150 5750
	1    0    0    -1  
$EndComp
$Comp
L 000_PreferredParts:C_10uF_0603 C?
U 1 1 5EF23F05
P 7850 5750
AR Path="/5E179620/5E2CEBB7/5EF23F05" Ref="C?"  Part="1" 
AR Path="/5E179620/5E2CF5EB/5EF23F05" Ref="C2521"  Part="1" 
F 0 "C2521" H 7875 5850 50  0000 L CNN
F 1 "C_10uF_0603" H 7875 5650 50  0001 L CNN
F 2 "Capacitor_SMD:C_0603_1608Metric" H 7888 5600 50  0001 C CNN
F 3 "~" H 7850 5750 50  0001 C CNN
F 4 "10uF" H 8000 5650 50  0000 C CNN "DisplayValue"
F 5 "0603" H 8000 5550 50  0000 C CNN "DisplayFootprint"
F 6 "3000-0000000135" H 7850 5750 50  0001 C CNN "PartSpecification"
	1    7850 5750
	1    0    0    -1  
$EndComp
$Comp
L 000_PreferredParts:C_10uF_0603 C?
U 1 1 5EF23EFC
P 7550 5750
AR Path="/5E179620/5E2CEBB7/5EF23EFC" Ref="C?"  Part="1" 
AR Path="/5E179620/5E2CF5EB/5EF23EFC" Ref="C2518"  Part="1" 
F 0 "C2518" H 7575 5850 50  0000 L CNN
F 1 "C_10uF_0603" H 7575 5650 50  0001 L CNN
F 2 "Capacitor_SMD:C_0603_1608Metric" H 7588 5600 50  0001 C CNN
F 3 "~" H 7550 5750 50  0001 C CNN
F 4 "10uF" H 7700 5650 50  0000 C CNN "DisplayValue"
F 5 "0603" H 7700 5550 50  0000 C CNN "DisplayFootprint"
F 6 "3000-0000000135" H 7550 5750 50  0001 C CNN "PartSpecification"
	1    7550 5750
	1    0    0    -1  
$EndComp
$Comp
L 000_PreferredParts:C_10uF_0603 C?
U 1 1 5EF23EF3
P 7250 5750
AR Path="/5E179620/5E2CEBB7/5EF23EF3" Ref="C?"  Part="1" 
AR Path="/5E179620/5E2CF5EB/5EF23EF3" Ref="C2515"  Part="1" 
F 0 "C2515" H 7275 5850 50  0000 L CNN
F 1 "C_10uF_0603" H 7275 5650 50  0001 L CNN
F 2 "Capacitor_SMD:C_0603_1608Metric" H 7288 5600 50  0001 C CNN
F 3 "~" H 7250 5750 50  0001 C CNN
F 4 "10uF" H 7400 5650 50  0000 C CNN "DisplayValue"
F 5 "0603" H 7400 5550 50  0000 C CNN "DisplayFootprint"
F 6 "3000-0000000135" H 7250 5750 50  0001 C CNN "PartSpecification"
	1    7250 5750
	1    0    0    -1  
$EndComp
Wire Wire Line
	6500 5400 7250 5400
Connection ~ 6500 5400
Wire Wire Line
	6500 5700 6500 5400
Wire Wire Line
	6500 6100 6500 6000
Wire Wire Line
	6200 6500 6200 6450
$Comp
L power:GND #PWR?
U 1 1 5EF23EE4
P 6200 6500
AR Path="/5E179620/5E2CEBB7/5EF23EE4" Ref="#PWR?"  Part="1" 
AR Path="/5E179620/5E2CF5EB/5EF23EE4" Ref="#PWR?"  Part="1" 
F 0 "#PWR?" H 6200 6250 50  0001 C CNN
F 1 "GND" H 6200 6350 50  0000 C CNN
F 2 "" H 6200 6500 50  0001 C CNN
F 3 "" H 6200 6500 50  0001 C CNN
	1    6200 6500
	1    0    0    -1  
$EndComp
$Comp
L Device:R R?
U 1 1 5EF23EDE
P 6200 6300
AR Path="/5E179620/5E2CEBB7/5EF23EDE" Ref="R?"  Part="1" 
AR Path="/5E179620/5E2CF5EB/5EF23EDE" Ref="R2509"  Part="1" 
F 0 "R2509" V 6280 6300 50  0000 C CNN
F 1 "150k" V 6200 6300 50  0000 C CNN
F 2 "Resistor_SMD:R_0402_1005Metric" V 6130 6300 50  0001 C CNN
F 3 "~" H 6200 6300 50  0001 C CNN
F 4 "3000-0000000579" H 6200 6300 50  0001 C CNN "PartSpecification"
	1    6200 6300
	-1   0    0    1   
$EndComp
Wire Wire Line
	5800 5400 5700 5400
Connection ~ 5800 5400
Wire Wire Line
	5800 5500 5800 5400
Wire Wire Line
	5700 5500 5800 5500
Wire Wire Line
	6200 6150 6200 5750
Wire Wire Line
	6200 5750 6200 5700
Connection ~ 6200 5750
Wire Wire Line
	5700 5750 6200 5750
Wire Wire Line
	6200 5400 6500 5400
Wire Wire Line
	5800 5400 6200 5400
Connection ~ 6200 5400
$Comp
L Device:R R?
U 1 1 5EF23ECF
P 6200 5550
AR Path="/5E179620/5E2CEBB7/5EF23ECF" Ref="R?"  Part="1" 
AR Path="/5E179620/5E2CF5EB/5EF23ECF" Ref="R2508"  Part="1" 
F 0 "R2508" V 6280 5550 50  0000 C CNN
F 1 "976k" V 6200 5550 50  0000 C CNN
F 2 "Resistor_SMD:R_0402_1005Metric" V 6130 5550 50  0001 C CNN
F 3 "~" H 6200 5550 50  0001 C CNN
F 4 "3000-0000000578" H 6200 5550 50  0001 C CNN "PartSpecification"
	1    6200 5550
	-1   0    0    1   
$EndComp
$Comp
L Device:R R?
U 1 1 5EF23EC9
P 6500 5850
AR Path="/5E179620/5E2CEBB7/5EF23EC9" Ref="R?"  Part="1" 
AR Path="/5E179620/5E2CF5EB/5EF23EC9" Ref="R2512"  Part="1" 
F 0 "R2512" V 6580 5850 50  0000 C CNN
F 1 "10k" V 6500 5850 50  0000 C CNN
F 2 "Resistor_SMD:R_0402_1005Metric" V 6430 5850 50  0001 C CNN
F 3 "~" H 6500 5850 50  0001 C CNN
F 4 "3000-0000000131" H 6500 5850 50  0001 C CNN "PartSpecification"
	1    6500 5850
	-1   0    0    1   
$EndComp
Wire Wire Line
	5700 6100 6500 6100
Wire Wire Line
	6000 5850 6000 6500
Wire Wire Line
	5700 5850 6000 5850
$Comp
L power:GND #PWR?
U 1 1 5EF23EC0
P 6000 6500
AR Path="/5E179620/5E2CEBB7/5EF23EC0" Ref="#PWR?"  Part="1" 
AR Path="/5E179620/5E2CF5EB/5EF23EC0" Ref="#PWR?"  Part="1" 
F 0 "#PWR?" H 6000 6250 50  0001 C CNN
F 1 "GND" H 6000 6350 50  0000 C CNN
F 2 "" H 6000 6500 50  0001 C CNN
F 3 "" H 6000 6500 50  0001 C CNN
	1    6000 6500
	1    0    0    -1  
$EndComp
Wire Wire Line
	4900 5000 4900 5150
Wire Wire Line
	5300 5000 5300 5150
Wire Wire Line
	5000 6600 5000 6500
Wire Wire Line
	5200 6600 5200 6500
$Comp
L power:GND #PWR?
U 1 1 5EF23EAD
P 5200 6600
AR Path="/5E179620/5E2CEBB7/5EF23EAD" Ref="#PWR?"  Part="1" 
AR Path="/5E179620/5E2CF5EB/5EF23EAD" Ref="#PWR?"  Part="1" 
F 0 "#PWR?" H 5200 6350 50  0001 C CNN
F 1 "GND" H 5200 6450 50  0000 C CNN
F 2 "" H 5200 6600 50  0001 C CNN
F 3 "" H 5200 6600 50  0001 C CNN
	1    5200 6600
	1    0    0    -1  
$EndComp
$Comp
L power:GND #PWR?
U 1 1 5EF23EA7
P 5000 6600
AR Path="/5E179620/5E2CEBB7/5EF23EA7" Ref="#PWR?"  Part="1" 
AR Path="/5E179620/5E2CF5EB/5EF23EA7" Ref="#PWR?"  Part="1" 
F 0 "#PWR?" H 5000 6350 50  0001 C CNN
F 1 "GND" H 5000 6450 50  0000 C CNN
F 2 "" H 5000 6600 50  0001 C CNN
F 3 "" H 5000 6600 50  0001 C CNN
	1    5000 6600
	1    0    0    -1  
$EndComp
Wire Wire Line
	3600 6450 3600 6350
$Comp
L power:GND #PWR?
U 1 1 5EF23EA0
P 3600 6450
AR Path="/5E179620/5E2CEBB7/5EF23EA0" Ref="#PWR?"  Part="1" 
AR Path="/5E179620/5E2CF5EB/5EF23EA0" Ref="#PWR?"  Part="1" 
F 0 "#PWR?" H 3600 6200 50  0001 C CNN
F 1 "GND" H 3600 6300 50  0000 C CNN
F 2 "" H 3600 6450 50  0001 C CNN
F 3 "" H 3600 6450 50  0001 C CNN
	1    3600 6450
	1    0    0    -1  
$EndComp
Wire Wire Line
	3600 5750 4500 5750
Wire Wire Line
	3600 6050 3600 5750
$Comp
L 000_PreferredParts:C_100nF C?
U 1 1 5EF23E98
P 3600 6200
AR Path="/5E179620/5E2CEBB7/5EF23E98" Ref="C?"  Part="1" 
AR Path="/5E179620/5E2CF5EB/5EF23E98" Ref="C2512"  Part="1" 
F 0 "C2512" H 3625 6300 50  0000 L CNN
F 1 "C_100nF" H 3625 6100 50  0001 L CNN
F 2 "Capacitor_SMD:C_0402_1005Metric" H 3638 6050 50  0001 C CNN
F 3 "~" H 3600 6200 50  0001 C CNN
F 4 "100nF" H 3750 6100 50  0000 C CNN "DisplayValue"
F 5 "3000-0000000125" H 3600 6200 50  0001 C CNN "PartSpecification"
	1    3600 6200
	1    0    0    -1  
$EndComp
Wire Wire Line
	4450 6300 4450 6200
$Comp
L power:GND #PWR?
U 1 1 5EF23E8F
P 4450 6300
AR Path="/5E179620/5E2CEBB7/5EF23E8F" Ref="#PWR?"  Part="1" 
AR Path="/5E179620/5E2CF5EB/5EF23E8F" Ref="#PWR?"  Part="1" 
F 0 "#PWR?" H 4450 6050 50  0001 C CNN
F 1 "GND" H 4450 6150 50  0000 C CNN
F 2 "" H 4450 6300 50  0001 C CNN
F 3 "" H 4450 6300 50  0001 C CNN
	1    4450 6300
	1    0    0    -1  
$EndComp
Wire Wire Line
	4500 6200 4450 6200
Wire Wire Line
	3850 6100 3750 6100
$Comp
L Device:R R?
U 1 1 5EF23E85
P 4000 6100
AR Path="/5E179620/5E2CEBB7/5EF23E85" Ref="R?"  Part="1" 
AR Path="/5E179620/5E2CF5EB/5EF23E85" Ref="R2503"  Part="1" 
F 0 "R2503" V 4080 6100 50  0000 C CNN
F 1 "10k" V 4000 6100 50  0000 C CNN
F 2 "Resistor_SMD:R_0402_1005Metric" V 3930 6100 50  0001 C CNN
F 3 "~" H 4000 6100 50  0001 C CNN
F 4 "3000-0000000131" H 4000 6100 50  0001 C CNN "PartSpecification"
	1    4000 6100
	0    1    1    0   
$EndComp
Connection ~ 3750 5500
Wire Wire Line
	4350 5500 3750 5500
Wire Wire Line
	4350 5400 4350 5500
Wire Wire Line
	4500 5400 4350 5400
Connection ~ 4350 5500
Wire Wire Line
	4500 5500 4350 5500
$Comp
L POWDER_Power:TPS63070RNM U?
U 1 1 5EF23E79
P 5100 5800
AR Path="/5E179620/5E2CEBB7/5EF23E79" Ref="U?"  Part="1" 
AR Path="/5E179620/5E2CF5EB/5EF23E79" Ref="U2503"  Part="1" 
F 0 "U2503" H 5450 6400 60  0000 C CNN
F 1 "TPS63070RNM" H 5150 5950 60  0000 C CNN
F 2 "POWDER_Power:TPS63070RNMR" H 5200 5790 60  0001 C CNN
F 3 "" H 5200 6200 60  0000 C CNN
F 4 "Texas Instruments" H 5100 5800 50  0001 C CNN "Manufacturer"
F 5 "TPS63070RNMR" H 5100 5800 50  0001 C CNN "PartNumber"
F 6 "3000-0000000079" H 5100 5800 50  0001 C CNN "PartSpecification"
	1    5100 5800
	1    0    0    -1  
$EndComp
Connection ~ 2750 5500
Wire Wire Line
	2750 5600 2750 5500
Wire Wire Line
	2750 5500 2250 5500
Wire Wire Line
	2250 5500 1800 5500
Connection ~ 2250 5500
Wire Wire Line
	2250 5600 2250 5500
Wire Wire Line
	3750 5500 3250 5500
Wire Wire Line
	3250 5500 2750 5500
Connection ~ 3250 5500
Wire Wire Line
	3250 5600 3250 5500
Wire Wire Line
	3250 6000 3250 5900
$Comp
L power:GND #PWR?
U 1 1 5EF23E68
P 3250 6000
AR Path="/5E179620/5E2CEBB7/5EF23E68" Ref="#PWR?"  Part="1" 
AR Path="/5E179620/5E2CF5EB/5EF23E68" Ref="#PWR?"  Part="1" 
F 0 "#PWR?" H 3250 5750 50  0001 C CNN
F 1 "GND" H 3250 5850 50  0000 C CNN
F 2 "" H 3250 6000 50  0001 C CNN
F 3 "" H 3250 6000 50  0001 C CNN
	1    3250 6000
	1    0    0    -1  
$EndComp
Wire Wire Line
	2750 6000 2750 5900
$Comp
L power:GND #PWR?
U 1 1 5EF23E61
P 2750 6000
AR Path="/5E179620/5E2CEBB7/5EF23E61" Ref="#PWR?"  Part="1" 
AR Path="/5E179620/5E2CF5EB/5EF23E61" Ref="#PWR?"  Part="1" 
F 0 "#PWR?" H 2750 5750 50  0001 C CNN
F 1 "GND" H 2750 5850 50  0000 C CNN
F 2 "" H 2750 6000 50  0001 C CNN
F 3 "" H 2750 6000 50  0001 C CNN
	1    2750 6000
	1    0    0    -1  
$EndComp
Wire Wire Line
	2250 6000 2250 5900
$Comp
L power:GND #PWR?
U 1 1 5EF23E5A
P 2250 6000
AR Path="/5E179620/5E2CEBB7/5EF23E5A" Ref="#PWR?"  Part="1" 
AR Path="/5E179620/5E2CF5EB/5EF23E5A" Ref="#PWR?"  Part="1" 
F 0 "#PWR?" H 2250 5750 50  0001 C CNN
F 1 "GND" H 2250 5850 50  0000 C CNN
F 2 "" H 2250 6000 50  0001 C CNN
F 3 "" H 2250 6000 50  0001 C CNN
	1    2250 6000
	1    0    0    -1  
$EndComp
$Comp
L 000_PreferredParts:C_10uF_0603 C?
U 1 1 5EF23E54
P 3250 5750
AR Path="/5E179620/5E2CEBB7/5EF23E54" Ref="C?"  Part="1" 
AR Path="/5E179620/5E2CF5EB/5EF23E54" Ref="C2509"  Part="1" 
F 0 "C2509" H 3275 5850 50  0000 L CNN
F 1 "C_10uF_0603" H 3275 5650 50  0001 L CNN
F 2 "Capacitor_SMD:C_0603_1608Metric" H 3288 5600 50  0001 C CNN
F 3 "~" H 3250 5750 50  0001 C CNN
F 4 "10uF" H 3400 5650 50  0000 C CNN "DisplayValue"
F 5 "0603" H 3400 5550 50  0000 C CNN "DisplayFootprint"
F 6 "3000-0000000135" H 3250 5750 50  0001 C CNN "PartSpecification"
	1    3250 5750
	1    0    0    -1  
$EndComp
$Comp
L 000_PreferredParts:C_10uF_0805 C?
U 1 1 5EF23E4B
P 2750 5750
AR Path="/5E179620/5E2CEBB7/5EF23E4B" Ref="C?"  Part="1" 
AR Path="/5E179620/5E2CF5EB/5EF23E4B" Ref="C2506"  Part="1" 
F 0 "C2506" H 2775 5850 50  0000 L CNN
F 1 "C_10uF_0805" H 2775 5650 50  0001 L CNN
F 2 "Capacitor_SMD:C_0805_2012Metric" H 2788 5600 50  0001 C CNN
F 3 "~" H 2750 5750 50  0001 C CNN
F 4 "10uF" H 2900 5650 50  0000 C CNN "DisplayValue"
F 5 "0805" H 2900 5550 50  0000 C CNN "DisplayFootprint"
F 6 "3000-0000000134" H 2750 5750 50  0001 C CNN "PartSpecification"
	1    2750 5750
	1    0    0    -1  
$EndComp
$Comp
L 000_PreferredParts:C_10uF_0805 C?
U 1 1 5EF23E42
P 2250 5750
AR Path="/5E179620/5E2CEBB7/5EF23E42" Ref="C?"  Part="1" 
AR Path="/5E179620/5E2CF5EB/5EF23E42" Ref="C2503"  Part="1" 
F 0 "C2503" H 2275 5850 50  0000 L CNN
F 1 "C_10uF_0805" H 2275 5650 50  0001 L CNN
F 2 "Capacitor_SMD:C_0805_2012Metric" H 2288 5600 50  0001 C CNN
F 3 "~" H 2250 5750 50  0001 C CNN
F 4 "10uF" H 2400 5650 50  0000 C CNN "DisplayValue"
F 5 "0805" H 2400 5550 50  0000 C CNN "DisplayFootprint"
F 6 "3000-0000000134" H 2250 5750 50  0001 C CNN "PartSpecification"
	1    2250 5750
	1    0    0    -1  
$EndComp
Text HLabel 1800 5500 0    50   Input ~ 0
v_12
$Comp
L Device:R R?
U 1 1 5E66190A
P 9800 2200
AR Path="/5E179620/5E66190A" Ref="R?"  Part="1" 
AR Path="/5E179620/5E2CF5EB/5E66190A" Ref="R2524"  Part="1" 
F 0 "R2524" V 9880 2200 50  0000 C CNN
F 1 "R" V 9800 2200 50  0000 C CNN
F 2 "Resistor_SMD:R_0402_1005Metric" V 9730 2200 50  0001 C CNN
F 3 "~" H 9800 2200 50  0001 C CNN
	1    9800 2200
	1    0    0    -1  
$EndComp
$Comp
L Device:R R?
U 1 1 5E661910
P 9800 1800
AR Path="/5E179620/5E661910" Ref="R?"  Part="1" 
AR Path="/5E179620/5E2CF5EB/5E661910" Ref="R2523"  Part="1" 
F 0 "R2523" V 9880 1800 50  0000 C CNN
F 1 "R" V 9800 1800 50  0000 C CNN
F 2 "Resistor_SMD:R_0402_1005Metric" V 9730 1800 50  0001 C CNN
F 3 "~" H 9800 1800 50  0001 C CNN
	1    9800 1800
	1    0    0    -1  
$EndComp
Wire Wire Line
	9800 1950 9800 2000
$Comp
L power:GND #PWR?
U 1 1 5E661917
P 9800 2450
AR Path="/5E179620/5E661917" Ref="#PWR?"  Part="1" 
AR Path="/5E179620/5E2CF5EB/5E661917" Ref="#PWR?"  Part="1" 
F 0 "#PWR?" H 9800 2200 50  0001 C CNN
F 1 "GND" H 9800 2300 50  0000 C CNN
F 2 "" H 9800 2450 50  0001 C CNN
F 3 "" H 9800 2450 50  0001 C CNN
	1    9800 2450
	1    0    0    -1  
$EndComp
Wire Wire Line
	9800 2450 9800 2350
Connection ~ 9800 2000
Wire Wire Line
	9800 2000 9800 2050
Text HLabel 9950 2000 2    50   Output ~ 0
v_sense_b210_1
Wire Wire Line
	9950 2000 9800 2000
Wire Wire Line
	9800 1650 9800 1400
Connection ~ 9800 1400
Wire Wire Line
	9800 1400 10500 1400
$Comp
L Device:R R?
U 1 1 5E693E74
P 9750 4200
AR Path="/5E179620/5E693E74" Ref="R?"  Part="1" 
AR Path="/5E179620/5E2CF5EB/5E693E74" Ref="R2520"  Part="1" 
F 0 "R2520" V 9830 4200 50  0000 C CNN
F 1 "R" V 9750 4200 50  0000 C CNN
F 2 "Resistor_SMD:R_0402_1005Metric" V 9680 4200 50  0001 C CNN
F 3 "~" H 9750 4200 50  0001 C CNN
	1    9750 4200
	1    0    0    -1  
$EndComp
$Comp
L Device:R R?
U 1 1 5E693E7A
P 9750 3800
AR Path="/5E179620/5E693E7A" Ref="R?"  Part="1" 
AR Path="/5E179620/5E2CF5EB/5E693E7A" Ref="R2519"  Part="1" 
F 0 "R2519" V 9830 3800 50  0000 C CNN
F 1 "R" V 9750 3800 50  0000 C CNN
F 2 "Resistor_SMD:R_0402_1005Metric" V 9680 3800 50  0001 C CNN
F 3 "~" H 9750 3800 50  0001 C CNN
	1    9750 3800
	1    0    0    -1  
$EndComp
Wire Wire Line
	9750 3950 9750 4000
$Comp
L power:GND #PWR?
U 1 1 5E693E81
P 9750 4450
AR Path="/5E179620/5E693E81" Ref="#PWR?"  Part="1" 
AR Path="/5E179620/5E2CF5EB/5E693E81" Ref="#PWR?"  Part="1" 
F 0 "#PWR?" H 9750 4200 50  0001 C CNN
F 1 "GND" H 9750 4300 50  0000 C CNN
F 2 "" H 9750 4450 50  0001 C CNN
F 3 "" H 9750 4450 50  0001 C CNN
	1    9750 4450
	1    0    0    -1  
$EndComp
Wire Wire Line
	9750 4450 9750 4350
Connection ~ 9750 4000
Wire Wire Line
	9750 4000 9750 4050
Text HLabel 9900 4000 2    50   Output ~ 0
v_sense_b210_2
Wire Wire Line
	9900 4000 9750 4000
$Comp
L Device:R R?
U 1 1 5E6BAFDA
P 9750 6200
AR Path="/5E179620/5E6BAFDA" Ref="R?"  Part="1" 
AR Path="/5E179620/5E2CF5EB/5E6BAFDA" Ref="R2522"  Part="1" 
F 0 "R2522" V 9830 6200 50  0000 C CNN
F 1 "R" V 9750 6200 50  0000 C CNN
F 2 "Resistor_SMD:R_0402_1005Metric" V 9680 6200 50  0001 C CNN
F 3 "~" H 9750 6200 50  0001 C CNN
	1    9750 6200
	1    0    0    -1  
$EndComp
$Comp
L Device:R R?
U 1 1 5E6BAFE0
P 9750 5800
AR Path="/5E179620/5E6BAFE0" Ref="R?"  Part="1" 
AR Path="/5E179620/5E2CF5EB/5E6BAFE0" Ref="R2521"  Part="1" 
F 0 "R2521" V 9830 5800 50  0000 C CNN
F 1 "R" V 9750 5800 50  0000 C CNN
F 2 "Resistor_SMD:R_0402_1005Metric" V 9680 5800 50  0001 C CNN
F 3 "~" H 9750 5800 50  0001 C CNN
	1    9750 5800
	1    0    0    -1  
$EndComp
Wire Wire Line
	9750 5950 9750 6000
$Comp
L power:GND #PWR?
U 1 1 5E6BAFE7
P 9750 6450
AR Path="/5E179620/5E6BAFE7" Ref="#PWR?"  Part="1" 
AR Path="/5E179620/5E2CF5EB/5E6BAFE7" Ref="#PWR?"  Part="1" 
F 0 "#PWR?" H 9750 6200 50  0001 C CNN
F 1 "GND" H 9750 6300 50  0000 C CNN
F 2 "" H 9750 6450 50  0001 C CNN
F 3 "" H 9750 6450 50  0001 C CNN
	1    9750 6450
	1    0    0    -1  
$EndComp
Wire Wire Line
	9750 6450 9750 6350
Connection ~ 9750 6000
Wire Wire Line
	9750 6000 9750 6050
Text HLabel 9900 6000 2    50   Output ~ 0
v_sense_b210_3
Wire Wire Line
	9900 6000 9750 6000
Wire Wire Line
	9750 5650 9750 5400
Connection ~ 9750 5400
Wire Wire Line
	9750 5400 10500 5400
Wire Wire Line
	9750 3650 9750 3400
Connection ~ 9750 3400
Wire Wire Line
	9750 3400 10500 3400
$Comp
L POWDER_Power:EL3H7-G U2504
U 1 1 5E759E73
P 6700 2350
F 0 "U2504" H 6650 2500 50  0000 C CNN
F 1 "EL3H7-G" H 6700 2200 50  0000 C CNN
F 2 "POWDER_Power:EL3H7-G" H 6700 2050 50  0001 C CNN
F 3 "" H 6700 2350 50  0001 C CNN
F 4 "3000-0000000432" H 6700 2350 50  0001 C CNN "PartSpecification"
	1    6700 2350
	1    0    0    -1  
$EndComp
$Comp
L power:GND #PWR?
U 1 1 5E75B1AD
P 6500 2500
AR Path="/5E179620/5E2CEBB7/5E75B1AD" Ref="#PWR?"  Part="1" 
AR Path="/5E179620/5E2CF5EB/5E75B1AD" Ref="#PWR?"  Part="1" 
F 0 "#PWR?" H 6500 2250 50  0001 C CNN
F 1 "GND" H 6500 2350 50  0000 C CNN
F 2 "" H 6500 2500 50  0001 C CNN
F 3 "" H 6500 2500 50  0001 C CNN
	1    6500 2500
	1    0    0    -1  
$EndComp
Wire Wire Line
	6500 2500 6500 2400
Wire Wire Line
	6500 2100 6500 2300
$Comp
L Device:R R?
U 1 1 5E78D09A
P 6900 2750
AR Path="/5E179620/5E2CEBB7/5E78D09A" Ref="R?"  Part="1" 
AR Path="/5E179620/5E2CF5EB/5E78D09A" Ref="R2513"  Part="1" 
F 0 "R2513" V 6980 2750 50  0000 C CNN
F 1 "100k" V 6900 2750 50  0000 C CNN
F 2 "Resistor_SMD:R_0402_1005Metric" V 6830 2750 50  0001 C CNN
F 3 "~" H 6900 2750 50  0001 C CNN
F 4 "3000-0000000575" H 6900 2750 50  0001 C CNN "PartSpecification"
	1    6900 2750
	-1   0    0    1   
$EndComp
$Comp
L power:+3.3V #PWR?
U 1 1 5E78F7C4
P 6900 1900
F 0 "#PWR?" H 6900 1750 50  0001 C CNN
F 1 "+3.3V" H 6900 2040 50  0000 C CNN
F 2 "" H 6900 1900 50  0001 C CNN
F 3 "" H 6900 1900 50  0001 C CNN
	1    6900 1900
	1    0    0    -1  
$EndComp
$Comp
L power:GND #PWR?
U 1 1 5E7B0425
P 6900 3000
AR Path="/5E179620/5E2CEBB7/5E7B0425" Ref="#PWR?"  Part="1" 
AR Path="/5E179620/5E2CF5EB/5E7B0425" Ref="#PWR?"  Part="1" 
F 0 "#PWR?" H 6900 2750 50  0001 C CNN
F 1 "GND" H 6900 2850 50  0000 C CNN
F 2 "" H 6900 3000 50  0001 C CNN
F 3 "" H 6900 3000 50  0001 C CNN
	1    6900 3000
	1    0    0    -1  
$EndComp
Wire Wire Line
	6900 3000 6900 2900
$Comp
L power:GND #PWR?
U 1 1 5E86B8AB
P 6500 4500
AR Path="/5E179620/5E2CEBB7/5E86B8AB" Ref="#PWR?"  Part="1" 
AR Path="/5E179620/5E2CF5EB/5E86B8AB" Ref="#PWR?"  Part="1" 
F 0 "#PWR?" H 6500 4250 50  0001 C CNN
F 1 "GND" H 6500 4350 50  0000 C CNN
F 2 "" H 6500 4500 50  0001 C CNN
F 3 "" H 6500 4500 50  0001 C CNN
	1    6500 4500
	1    0    0    -1  
$EndComp
Wire Wire Line
	6500 4500 6500 4400
Wire Wire Line
	6500 4100 6500 4300
$Comp
L power:GND #PWR?
U 1 1 5E87E613
P 6500 6500
AR Path="/5E179620/5E2CEBB7/5E87E613" Ref="#PWR?"  Part="1" 
AR Path="/5E179620/5E2CF5EB/5E87E613" Ref="#PWR?"  Part="1" 
F 0 "#PWR?" H 6500 6250 50  0001 C CNN
F 1 "GND" H 6500 6350 50  0000 C CNN
F 2 "" H 6500 6500 50  0001 C CNN
F 3 "" H 6500 6500 50  0001 C CNN
	1    6500 6500
	1    0    0    -1  
$EndComp
Wire Wire Line
	6500 6500 6500 6400
Wire Wire Line
	6500 6100 6500 6300
Connection ~ 6500 4100
Connection ~ 6500 6100
Wire Wire Line
	9550 1950 9550 2000
$Comp
L power:+3.3V #PWR?
U 1 1 5E9EB57A
P 9550 1600
AR Path="/5E9EB57A" Ref="#PWR?"  Part="1" 
AR Path="/5E179620/5E2CF5EB/5E9EB57A" Ref="#PWR?"  Part="1" 
F 0 "#PWR?" H 9550 1450 50  0001 C CNN
F 1 "+3.3V" H 9550 1740 50  0000 C CNN
F 2 "" H 9550 1600 50  0001 C CNN
F 3 "" H 9550 1600 50  0001 C CNN
	1    9550 1600
	1    0    0    -1  
$EndComp
Wire Wire Line
	9550 1600 9550 1650
Wire Wire Line
	9550 2000 9800 2000
Wire Wire Line
	9500 3950 9500 4000
$Comp
L power:+3.3V #PWR?
U 1 1 5EA2C1B9
P 9500 3600
AR Path="/5EA2C1B9" Ref="#PWR?"  Part="1" 
AR Path="/5E179620/5E2CF5EB/5EA2C1B9" Ref="#PWR?"  Part="1" 
F 0 "#PWR?" H 9500 3450 50  0001 C CNN
F 1 "+3.3V" H 9500 3740 50  0000 C CNN
F 2 "" H 9500 3600 50  0001 C CNN
F 3 "" H 9500 3600 50  0001 C CNN
	1    9500 3600
	1    0    0    -1  
$EndComp
Wire Wire Line
	9500 3600 9500 3650
Wire Wire Line
	9500 5950 9500 6000
$Comp
L power:+3.3V #PWR?
U 1 1 5EA40862
P 9500 5600
AR Path="/5EA40862" Ref="#PWR?"  Part="1" 
AR Path="/5E179620/5E2CF5EB/5EA40862" Ref="#PWR?"  Part="1" 
F 0 "#PWR?" H 9500 5450 50  0001 C CNN
F 1 "+3.3V" H 9500 5740 50  0000 C CNN
F 2 "" H 9500 5600 50  0001 C CNN
F 3 "" H 9500 5600 50  0001 C CNN
	1    9500 5600
	1    0    0    -1  
$EndComp
Wire Wire Line
	9500 5600 9500 5650
Wire Wire Line
	9500 4000 9750 4000
Wire Wire Line
	9500 6000 9750 6000
Wire Wire Line
	6900 2600 6900 2500
Connection ~ 6900 2500
Wire Wire Line
	6900 2500 6900 2400
Wire Wire Line
	6900 1900 6900 2300
Text HLabel 7000 4500 2    50   Output ~ 0
pg_b210_2
Wire Wire Line
	7000 4500 6900 4500
$Comp
L POWDER_Power:EL3H7-G U2505
U 1 1 5F23D280
P 6700 4350
F 0 "U2505" H 6650 4500 50  0000 C CNN
F 1 "EL3H7-G" H 6700 4200 50  0000 C CNN
F 2 "POWDER_Power:EL3H7-G" H 6700 4050 50  0001 C CNN
F 3 "" H 6700 4350 50  0001 C CNN
F 4 "3000-0000000432" H 6700 4350 50  0001 C CNN "PartSpecification"
	1    6700 4350
	1    0    0    -1  
$EndComp
$Comp
L Device:R R?
U 1 1 5F23D286
P 6900 4750
AR Path="/5E179620/5E2CEBB7/5F23D286" Ref="R?"  Part="1" 
AR Path="/5E179620/5E2CF5EB/5F23D286" Ref="R2514"  Part="1" 
F 0 "R2514" V 6980 4750 50  0000 C CNN
F 1 "100k" V 6900 4750 50  0000 C CNN
F 2 "Resistor_SMD:R_0402_1005Metric" V 6830 4750 50  0001 C CNN
F 3 "~" H 6900 4750 50  0001 C CNN
F 4 "3000-0000000575" H 6900 4750 50  0001 C CNN "PartSpecification"
	1    6900 4750
	-1   0    0    1   
$EndComp
$Comp
L power:+3.3V #PWR?
U 1 1 5F23D28C
P 6900 3900
F 0 "#PWR?" H 6900 3750 50  0001 C CNN
F 1 "+3.3V" H 6900 4040 50  0000 C CNN
F 2 "" H 6900 3900 50  0001 C CNN
F 3 "" H 6900 3900 50  0001 C CNN
	1    6900 3900
	1    0    0    -1  
$EndComp
$Comp
L power:GND #PWR?
U 1 1 5F23D292
P 6900 5000
AR Path="/5E179620/5E2CEBB7/5F23D292" Ref="#PWR?"  Part="1" 
AR Path="/5E179620/5E2CF5EB/5F23D292" Ref="#PWR?"  Part="1" 
F 0 "#PWR?" H 6900 4750 50  0001 C CNN
F 1 "GND" H 6900 4850 50  0000 C CNN
F 2 "" H 6900 5000 50  0001 C CNN
F 3 "" H 6900 5000 50  0001 C CNN
	1    6900 5000
	1    0    0    -1  
$EndComp
Wire Wire Line
	6900 5000 6900 4900
Wire Wire Line
	6900 4600 6900 4500
Connection ~ 6900 4500
Wire Wire Line
	6900 4500 6900 4400
Wire Wire Line
	6900 3900 6900 4300
Text HLabel 7000 6500 2    50   Output ~ 0
pg_b210_3
Wire Wire Line
	7000 6500 6900 6500
$Comp
L POWDER_Power:EL3H7-G U2506
U 1 1 5F254425
P 6700 6350
F 0 "U2506" H 6650 6500 50  0000 C CNN
F 1 "EL3H7-G" H 6700 6200 50  0000 C CNN
F 2 "POWDER_Power:EL3H7-G" H 6700 6050 50  0001 C CNN
F 3 "" H 6700 6350 50  0001 C CNN
F 4 "3000-0000000432" H 6700 6350 50  0001 C CNN "PartSpecification"
	1    6700 6350
	1    0    0    -1  
$EndComp
$Comp
L Device:R R?
U 1 1 5F25442B
P 6900 6750
AR Path="/5E179620/5E2CEBB7/5F25442B" Ref="R?"  Part="1" 
AR Path="/5E179620/5E2CF5EB/5F25442B" Ref="R2515"  Part="1" 
F 0 "R2515" V 6980 6750 50  0000 C CNN
F 1 "100k" V 6900 6750 50  0000 C CNN
F 2 "Resistor_SMD:R_0402_1005Metric" V 6830 6750 50  0001 C CNN
F 3 "~" H 6900 6750 50  0001 C CNN
F 4 "3000-0000000575" H 6900 6750 50  0001 C CNN "PartSpecification"
	1    6900 6750
	-1   0    0    1   
$EndComp
$Comp
L power:+3.3V #PWR?
U 1 1 5F254431
P 6900 5900
F 0 "#PWR?" H 6900 5750 50  0001 C CNN
F 1 "+3.3V" H 6900 6040 50  0000 C CNN
F 2 "" H 6900 5900 50  0001 C CNN
F 3 "" H 6900 5900 50  0001 C CNN
	1    6900 5900
	1    0    0    -1  
$EndComp
$Comp
L power:GND #PWR?
U 1 1 5F254437
P 6900 7000
AR Path="/5E179620/5E2CEBB7/5F254437" Ref="#PWR?"  Part="1" 
AR Path="/5E179620/5E2CF5EB/5F254437" Ref="#PWR?"  Part="1" 
F 0 "#PWR?" H 6900 6750 50  0001 C CNN
F 1 "GND" H 6900 6850 50  0000 C CNN
F 2 "" H 6900 7000 50  0001 C CNN
F 3 "" H 6900 7000 50  0001 C CNN
	1    6900 7000
	1    0    0    -1  
$EndComp
Wire Wire Line
	6900 7000 6900 6900
Wire Wire Line
	6900 6600 6900 6500
Connection ~ 6900 6500
Wire Wire Line
	6900 6500 6900 6400
Wire Wire Line
	6900 5900 6900 6300
Text Label 4900 1000 1    50   ~ 0
L1_1
Text Label 4900 3000 1    50   ~ 0
L1_2
Text Label 4900 5000 1    50   ~ 0
L1_3
Text Label 5300 1000 0    50   ~ 0
L2_1
Text Label 5300 3000 0    50   ~ 0
L2_2
Text Label 5300 5000 0    50   ~ 0
L2_3
Text Label 4200 2100 0    50   ~ 0
PS_1
Text Label 4200 4100 0    50   ~ 0
PS_2
Text Label 4200 6100 0    50   ~ 0
PS_3
Text Label 5800 2100 0    50   ~ 0
PG_1
Text Label 5800 1750 0    50   ~ 0
FB_1
Text Label 5800 3750 0    50   ~ 0
FB_2
Text Label 5800 5750 0    50   ~ 0
FB_3
Text Label 5800 4100 0    50   ~ 0
PG_2
Text Label 5800 6100 0    50   ~ 0
PG_3
Connection ~ 8900 1400
Wire Wire Line
	8900 1400 9200 1400
Connection ~ 9200 1400
Wire Wire Line
	9200 1400 9800 1400
Connection ~ 8900 3400
Wire Wire Line
	8900 3400 9200 3400
Connection ~ 9200 3400
Wire Wire Line
	9200 3400 9750 3400
Connection ~ 8900 5400
Wire Wire Line
	8900 5400 9200 5400
Connection ~ 9200 5400
Wire Wire Line
	9200 5400 9750 5400
Text Label 4100 1750 0    50   ~ 0
VAUX_1
Text Label 4100 3750 0    50   ~ 0
VAUX_2
Text Label 4100 5750 0    50   ~ 0
VAUX_3
$Comp
L 000_PreferredDiodes:D_Schottky_60V_1A D2503
U 1 1 5F9853B1
P 9550 1800
F 0 "D2503" H 9550 1900 50  0000 C CNN
F 1 "D_Schottky_60V_1A" H 9550 1700 50  0001 C CNN
F 2 "Diode_SMD:D_SOD-123F" H 9550 1800 50  0001 C CNN
F 3 "~" H 9550 1800 50  0001 C CNN
F 4 "DSS16UTR" H 9550 1800 50  0001 C CNN "PartNumber"
F 5 "Schottky" H 9550 1700 50  0000 C CNN "DisplayValue"
F 6 "60V_1A" H 9550 1600 50  0000 C CNN "DisplayValue2"
F 7 "3000-0000000481" H 9550 1800 50  0001 C CNN "PartSpecification"
	1    9550 1800
	0    1    1    0   
$EndComp
$Comp
L 000_PreferredDiodes:D_Schottky_60V_1A D2502
U 1 1 5F985E61
P 9500 5800
F 0 "D2502" H 9500 5900 50  0000 C CNN
F 1 "D_Schottky_60V_1A" H 9500 5700 50  0001 C CNN
F 2 "Diode_SMD:D_SOD-123F" H 9500 5800 50  0001 C CNN
F 3 "~" H 9500 5800 50  0001 C CNN
F 4 "DSS16UTR" H 9500 5800 50  0001 C CNN "PartNumber"
F 5 "Schottky" H 9500 5700 50  0000 C CNN "DisplayValue"
F 6 "60V_1A" H 9500 5600 50  0000 C CNN "DisplayValue2"
F 7 "3000-0000000481" H 9500 5800 50  0001 C CNN "PartSpecification"
	1    9500 5800
	0    1    1    0   
$EndComp
$Comp
L 000_PreferredDiodes:D_Schottky_60V_1A D2501
U 1 1 5F987D82
P 9500 3800
F 0 "D2501" H 9500 3900 50  0000 C CNN
F 1 "D_Schottky_60V_1A" H 9500 3700 50  0001 C CNN
F 2 "Diode_SMD:D_SOD-123F" H 9500 3800 50  0001 C CNN
F 3 "~" H 9500 3800 50  0001 C CNN
F 4 "DSS16UTR" H 9500 3800 50  0001 C CNN "PartNumber"
F 5 "Schottky" H 9500 3700 50  0000 C CNN "DisplayValue"
F 6 "60V_1A" H 9500 3600 50  0000 C CNN "DisplayValue2"
F 7 "3000-0000000481" H 9500 3800 50  0001 C CNN "PartSpecification"
	1    9500 3800
	0    1    1    0   
$EndComp
$EndSCHEMATC
