EESchema Schematic File Version 4
LIBS:fixed_endpoint_monitor-cache
EELAYER 26 0
EELAYER END
$Descr A4 11693 8268
encoding utf-8
Sheet 2 5
Title ""
Date ""
Rev ""
Comp ""
Comment1 ""
Comment2 ""
Comment3 ""
Comment4 ""
$EndDescr
$Comp
L Connector:Conn_Coaxial J208
U 1 1 5CA26670
P 8150 3700
AR Path="/5CA067DF/5CA26670" Ref="J208"  Part="1" 
AR Path="/5CB2EF3D/5CA26670" Ref="J308"  Part="1" 
AR Path="/5CB39532/5CA26670" Ref="J408"  Part="1" 
AR Path="/5CB3953A/5CA26670" Ref="J508"  Part="1" 
F 0 "J208" H 8249 3676 50  0000 L CNN
F 1 "Conn_Coaxial" H 8249 3585 50  0000 L CNN
F 2 "POWDER_RF:SMA_EndLaunch_142-0761-881" H 8150 3700 50  0001 C CNN
F 3 " ~" H 8150 3700 50  0001 C CNN
	1    8150 3700
	1    0    0    -1  
$EndComp
$Comp
L Connector:Conn_Coaxial J206
U 1 1 5CA26677
P 7650 4000
AR Path="/5CA067DF/5CA26677" Ref="J206"  Part="1" 
AR Path="/5CB2EF3D/5CA26677" Ref="J306"  Part="1" 
AR Path="/5CB39532/5CA26677" Ref="J406"  Part="1" 
AR Path="/5CB3953A/5CA26677" Ref="J506"  Part="1" 
F 0 "J206" H 7749 3976 50  0000 L CNN
F 1 "Conn_Coaxial" H 7749 3885 50  0000 L CNN
F 2 "POWDER_RF:SMA_EndLaunch_142-0761-881" H 7650 4000 50  0001 C CNN
F 3 " ~" H 7650 4000 50  0001 C CNN
	1    7650 4000
	1    0    0    -1  
$EndComp
$Comp
L power:GND #PWR?
U 1 1 5CA2668B
P 8150 4000
AR Path="/5CA067DF/5CA2668B" Ref="#PWR?"  Part="1" 
AR Path="/5CB2EF3D/5CA2668B" Ref="#PWR?"  Part="1" 
AR Path="/5CB39532/5CA2668B" Ref="#PWR?"  Part="1" 
AR Path="/5CB3953A/5CA2668B" Ref="#PWR?"  Part="1" 
F 0 "#PWR?" H 8150 3750 50  0001 C CNN
F 1 "GND" H 8155 3827 50  0000 C CNN
F 2 "" H 8150 4000 50  0001 C CNN
F 3 "" H 8150 4000 50  0001 C CNN
	1    8150 4000
	1    0    0    -1  
$EndComp
$Comp
L power:GND #PWR?
U 1 1 5CA26691
P 7650 4500
AR Path="/5CA067DF/5CA26691" Ref="#PWR?"  Part="1" 
AR Path="/5CB2EF3D/5CA26691" Ref="#PWR?"  Part="1" 
AR Path="/5CB39532/5CA26691" Ref="#PWR?"  Part="1" 
AR Path="/5CB3953A/5CA26691" Ref="#PWR?"  Part="1" 
F 0 "#PWR?" H 7650 4250 50  0001 C CNN
F 1 "GND" H 7655 4327 50  0000 C CNN
F 2 "" H 7650 4500 50  0001 C CNN
F 3 "" H 7650 4500 50  0001 C CNN
	1    7650 4500
	1    0    0    -1  
$EndComp
Wire Wire Line
	7650 4500 7650 4200
Wire Wire Line
	8150 4000 8150 3900
$Comp
L power:GND #PWR?
U 1 1 5CA26699
P 5450 4700
AR Path="/5CA067DF/5CA26699" Ref="#PWR?"  Part="1" 
AR Path="/5CB2EF3D/5CA26699" Ref="#PWR?"  Part="1" 
AR Path="/5CB39532/5CA26699" Ref="#PWR?"  Part="1" 
AR Path="/5CB3953A/5CA26699" Ref="#PWR?"  Part="1" 
F 0 "#PWR?" H 5450 4450 50  0001 C CNN
F 1 "GND" H 5455 4527 50  0000 C CNN
F 2 "" H 5450 4700 50  0001 C CNN
F 3 "" H 5450 4700 50  0001 C CNN
	1    5450 4700
	1    0    0    -1  
$EndComp
$Comp
L power:VDD #PWR?
U 1 1 5CA266A0
P 5050 2450
AR Path="/5CA067DF/5CA266A0" Ref="#PWR?"  Part="1" 
AR Path="/5CB2EF3D/5CA266A0" Ref="#PWR?"  Part="1" 
AR Path="/5CB39532/5CA266A0" Ref="#PWR?"  Part="1" 
AR Path="/5CB3953A/5CA266A0" Ref="#PWR?"  Part="1" 
F 0 "#PWR?" H 5050 2300 50  0001 C CNN
F 1 "VDD" H 5067 2623 50  0000 C CNN
F 2 "" H 5050 2450 50  0001 C CNN
F 3 "" H 5050 2450 50  0001 C CNN
	1    5050 2450
	1    0    0    -1  
$EndComp
Wire Wire Line
	5050 2450 5050 2500
$Comp
L POWDER_RF:coupler U201
U 1 1 5CA266A7
P 3950 2950
AR Path="/5CA067DF/5CA266A7" Ref="U201"  Part="1" 
AR Path="/5CB2EF3D/5CA266A7" Ref="U301"  Part="1" 
AR Path="/5CB39532/5CA266A7" Ref="U401"  Part="1" 
AR Path="/5CB3953A/5CA266A7" Ref="U501"  Part="1" 
F 0 "U201" H 3950 3325 50  0000 C CNN
F 1 "coupler" H 3950 3234 50  0000 C CNN
F 2 "POWDER_RF:coupler_1" H 3950 2950 50  0001 C CNN
F 3 "" H 3950 2950 50  0001 C CNN
	1    3950 2950
	-1   0    0    -1  
$EndComp
$Comp
L Connector:Conn_Coaxial J203
U 1 1 5CA266AF
P 2550 3100
AR Path="/5CA067DF/5CA266AF" Ref="J203"  Part="1" 
AR Path="/5CB2EF3D/5CA266AF" Ref="J303"  Part="1" 
AR Path="/5CB39532/5CA266AF" Ref="J403"  Part="1" 
AR Path="/5CB3953A/5CA266AF" Ref="J503"  Part="1" 
F 0 "J203" H 2480 3338 50  0000 C CNN
F 1 "Conn_Coaxial" H 2480 3247 50  0000 C CNN
F 2 "POWDER_RF:SMA_EndLaunch_142-0761-881" H 2550 3100 50  0001 C CNN
F 3 " ~" H 2550 3100 50  0001 C CNN
	1    2550 3100
	-1   0    0    -1  
$EndComp
$Comp
L power:GND #PWR?
U 1 1 5CA266B6
P 2550 3400
AR Path="/5CA067DF/5CA266B6" Ref="#PWR?"  Part="1" 
AR Path="/5CB2EF3D/5CA266B6" Ref="#PWR?"  Part="1" 
AR Path="/5CB39532/5CA266B6" Ref="#PWR?"  Part="1" 
AR Path="/5CB3953A/5CA266B6" Ref="#PWR?"  Part="1" 
F 0 "#PWR?" H 2550 3150 50  0001 C CNN
F 1 "GND" H 2555 3227 50  0000 C CNN
F 2 "" H 2550 3400 50  0001 C CNN
F 3 "" H 2550 3400 50  0001 C CNN
	1    2550 3400
	1    0    0    -1  
$EndComp
Wire Wire Line
	2550 3400 2550 3300
Wire Wire Line
	2750 3100 3050 3100
$Comp
L Device:R R205
U 1 1 5CA266BE
P 2800 2450
AR Path="/5CA067DF/5CA266BE" Ref="R205"  Part="1" 
AR Path="/5CB2EF3D/5CA266BE" Ref="R305"  Part="1" 
AR Path="/5CB39532/5CA266BE" Ref="R405"  Part="1" 
AR Path="/5CB3953A/5CA266BE" Ref="R505"  Part="1" 
F 0 "R205" H 2870 2496 50  0000 L CNN
F 1 "61.9" H 2870 2405 50  0000 L CNN
F 2 "Resistor_SMD:R_0201_0603Metric" V 2730 2450 50  0001 C CNN
F 3 "~" H 2800 2450 50  0001 C CNN
F 4 "Yageo" H 650 0   50  0001 C CNN "Manufacturer"
F 5 "RC0201FR-0762RL" H 650 0   50  0001 C CNN "PartNumber"
	1    2800 2450
	1    0    0    -1  
$EndComp
$Comp
L Device:R R203
U 1 1 5CA266C5
P 2400 2450
AR Path="/5CA067DF/5CA266C5" Ref="R203"  Part="1" 
AR Path="/5CB2EF3D/5CA266C5" Ref="R303"  Part="1" 
AR Path="/5CB39532/5CA266C5" Ref="R403"  Part="1" 
AR Path="/5CB3953A/5CA266C5" Ref="R503"  Part="1" 
F 0 "R203" H 2470 2496 50  0000 L CNN
F 1 "30.1" H 2470 2405 50  0000 L CNN
F 2 "Resistor_SMD:R_0201_0603Metric" V 2330 2450 50  0001 C CNN
F 3 "~" H 2400 2450 50  0001 C CNN
F 4 "Yageo" H 650 0   50  0001 C CNN "Manufacturer"
F 5 "RC0201FR-0730RL" H 650 0   50  0001 C CNN "PartNumber"
	1    2400 2450
	1    0    0    -1  
$EndComp
$Comp
L Device:R R201
U 1 1 5CA266CC
P 2000 2450
AR Path="/5CA067DF/5CA266CC" Ref="R201"  Part="1" 
AR Path="/5CB2EF3D/5CA266CC" Ref="R301"  Part="1" 
AR Path="/5CB39532/5CA266CC" Ref="R401"  Part="1" 
AR Path="/5CB3953A/5CA266CC" Ref="R501"  Part="1" 
F 0 "R201" H 2070 2496 50  0000 L CNN
F 1 "61.9" H 2070 2405 50  0000 L CNN
F 2 "Resistor_SMD:R_0201_0603Metric" V 1930 2450 50  0001 C CNN
F 3 "~" H 2000 2450 50  0001 C CNN
F 4 "Yageo" H 650 0   50  0001 C CNN "Manufacturer"
F 5 "RC0201FR-0762RL" H 650 0   50  0001 C CNN "PartNumber"
	1    2000 2450
	1    0    0    -1  
$EndComp
$Comp
L Device:R R202
U 1 1 5CA266D3
P 2200 2200
AR Path="/5CA067DF/5CA266D3" Ref="R202"  Part="1" 
AR Path="/5CB2EF3D/5CA266D3" Ref="R302"  Part="1" 
AR Path="/5CB39532/5CA266D3" Ref="R402"  Part="1" 
AR Path="/5CB3953A/5CA266D3" Ref="R502"  Part="1" 
F 0 "R202" V 1993 2200 50  0000 C CNN
F 1 "249" V 2084 2200 50  0000 C CNN
F 2 "Resistor_SMD:R_0201_0603Metric" V 2130 2200 50  0001 C CNN
F 3 "~" H 2200 2200 50  0001 C CNN
F 4 "Stackpole Electronics Inc" H 650 0   50  0001 C CNN "Manufacturer"
F 5 "RMCF0201FG240R" H 650 0   50  0001 C CNN "PartNumber"
	1    2200 2200
	0    1    1    0   
$EndComp
$Comp
L Device:R R204
U 1 1 5CA266DA
P 2600 2200
AR Path="/5CA067DF/5CA266DA" Ref="R204"  Part="1" 
AR Path="/5CB2EF3D/5CA266DA" Ref="R304"  Part="1" 
AR Path="/5CB39532/5CA266DA" Ref="R404"  Part="1" 
AR Path="/5CB3953A/5CA266DA" Ref="R504"  Part="1" 
F 0 "R204" V 2393 2200 50  0000 C CNN
F 1 "249" V 2484 2200 50  0000 C CNN
F 2 "Resistor_SMD:R_0201_0603Metric" V 2530 2200 50  0001 C CNN
F 3 "~" H 2600 2200 50  0001 C CNN
F 4 "Stackpole Electronics Inc" H 650 0   50  0001 C CNN "Manufacturer"
F 5 "RMCF0201FG240R" H 650 0   50  0001 C CNN "PartNumber"
	1    2600 2200
	0    1    1    0   
$EndComp
Wire Wire Line
	2800 2300 2800 2200
Wire Wire Line
	2800 2200 2750 2200
Wire Wire Line
	2350 2200 2400 2200
Wire Wire Line
	2400 2300 2400 2200
Connection ~ 2400 2200
Wire Wire Line
	2400 2200 2450 2200
Wire Wire Line
	2000 2300 2000 2200
Wire Wire Line
	2000 2200 2050 2200
$Comp
L power:GND #PWR?
U 1 1 5CA266E9
P 2800 2700
AR Path="/5CA067DF/5CA266E9" Ref="#PWR?"  Part="1" 
AR Path="/5CB2EF3D/5CA266E9" Ref="#PWR?"  Part="1" 
AR Path="/5CB39532/5CA266E9" Ref="#PWR?"  Part="1" 
AR Path="/5CB3953A/5CA266E9" Ref="#PWR?"  Part="1" 
F 0 "#PWR?" H 2800 2450 50  0001 C CNN
F 1 "GND" H 2805 2527 50  0000 C CNN
F 2 "" H 2800 2700 50  0001 C CNN
F 3 "" H 2800 2700 50  0001 C CNN
	1    2800 2700
	1    0    0    -1  
$EndComp
$Comp
L power:GND #PWR?
U 1 1 5CA266EF
P 2400 2700
AR Path="/5CA067DF/5CA266EF" Ref="#PWR?"  Part="1" 
AR Path="/5CB2EF3D/5CA266EF" Ref="#PWR?"  Part="1" 
AR Path="/5CB39532/5CA266EF" Ref="#PWR?"  Part="1" 
AR Path="/5CB3953A/5CA266EF" Ref="#PWR?"  Part="1" 
F 0 "#PWR?" H 2400 2450 50  0001 C CNN
F 1 "GND" H 2405 2527 50  0000 C CNN
F 2 "" H 2400 2700 50  0001 C CNN
F 3 "" H 2400 2700 50  0001 C CNN
	1    2400 2700
	1    0    0    -1  
$EndComp
$Comp
L power:GND #PWR?
U 1 1 5CA266F5
P 2000 2700
AR Path="/5CA067DF/5CA266F5" Ref="#PWR?"  Part="1" 
AR Path="/5CB2EF3D/5CA266F5" Ref="#PWR?"  Part="1" 
AR Path="/5CB39532/5CA266F5" Ref="#PWR?"  Part="1" 
AR Path="/5CB3953A/5CA266F5" Ref="#PWR?"  Part="1" 
F 0 "#PWR?" H 2000 2450 50  0001 C CNN
F 1 "GND" H 2005 2527 50  0000 C CNN
F 2 "" H 2000 2700 50  0001 C CNN
F 3 "" H 2000 2700 50  0001 C CNN
	1    2000 2700
	1    0    0    -1  
$EndComp
Wire Wire Line
	2800 2700 2800 2600
Wire Wire Line
	2400 2700 2400 2600
Wire Wire Line
	2000 2700 2000 2600
Wire Wire Line
	2800 2200 3150 2200
Wire Wire Line
	3150 2200 3150 2800
Wire Wire Line
	3150 2800 3450 2800
Connection ~ 2800 2200
Wire Wire Line
	1550 2200 1350 2200
$Comp
L Device:R R212
U 1 1 5CA26704
P 5550 1650
AR Path="/5CA067DF/5CA26704" Ref="R212"  Part="1" 
AR Path="/5CB2EF3D/5CA26704" Ref="R312"  Part="1" 
AR Path="/5CB39532/5CA26704" Ref="R412"  Part="1" 
AR Path="/5CB3953A/5CA26704" Ref="R512"  Part="1" 
F 0 "R212" H 5620 1696 50  0000 L CNN
F 1 "61.9" H 5620 1605 50  0000 L CNN
F 2 "Resistor_SMD:R_0201_0603Metric" V 5480 1650 50  0001 C CNN
F 3 "~" H 5550 1650 50  0001 C CNN
F 4 "Yageo" H 650 0   50  0001 C CNN "Manufacturer"
F 5 "RC0201FR-0762RL" H 650 0   50  0001 C CNN "PartNumber"
	1    5550 1650
	1    0    0    -1  
$EndComp
$Comp
L Device:R R210
U 1 1 5CA2670B
P 5150 1650
AR Path="/5CA067DF/5CA2670B" Ref="R210"  Part="1" 
AR Path="/5CB2EF3D/5CA2670B" Ref="R310"  Part="1" 
AR Path="/5CB39532/5CA2670B" Ref="R410"  Part="1" 
AR Path="/5CB3953A/5CA2670B" Ref="R510"  Part="1" 
F 0 "R210" H 5220 1696 50  0000 L CNN
F 1 "30.1" H 5220 1605 50  0000 L CNN
F 2 "Resistor_SMD:R_0201_0603Metric" V 5080 1650 50  0001 C CNN
F 3 "~" H 5150 1650 50  0001 C CNN
F 4 "Yageo" H 650 0   50  0001 C CNN "Manufacturer"
F 5 "RC0201FR-0730RL" H 650 0   50  0001 C CNN "PartNumber"
	1    5150 1650
	1    0    0    -1  
$EndComp
$Comp
L Device:R R208
U 1 1 5CA26712
P 4750 1650
AR Path="/5CA067DF/5CA26712" Ref="R208"  Part="1" 
AR Path="/5CB2EF3D/5CA26712" Ref="R308"  Part="1" 
AR Path="/5CB39532/5CA26712" Ref="R408"  Part="1" 
AR Path="/5CB3953A/5CA26712" Ref="R508"  Part="1" 
F 0 "R208" H 4820 1696 50  0000 L CNN
F 1 "61.9" H 4820 1605 50  0000 L CNN
F 2 "Resistor_SMD:R_0201_0603Metric" V 4680 1650 50  0001 C CNN
F 3 "~" H 4750 1650 50  0001 C CNN
F 4 "Yageo" H 650 0   50  0001 C CNN "Manufacturer"
F 5 "RC0201FR-0762RL" H 650 0   50  0001 C CNN "PartNumber"
	1    4750 1650
	1    0    0    -1  
$EndComp
$Comp
L Device:R R209
U 1 1 5CA26719
P 4950 1400
AR Path="/5CA067DF/5CA26719" Ref="R209"  Part="1" 
AR Path="/5CB2EF3D/5CA26719" Ref="R309"  Part="1" 
AR Path="/5CB39532/5CA26719" Ref="R409"  Part="1" 
AR Path="/5CB3953A/5CA26719" Ref="R509"  Part="1" 
F 0 "R209" V 4743 1400 50  0000 C CNN
F 1 "249" V 4834 1400 50  0000 C CNN
F 2 "Resistor_SMD:R_0201_0603Metric" V 4880 1400 50  0001 C CNN
F 3 "~" H 4950 1400 50  0001 C CNN
F 4 "Stackpole Electronics Inc" H 650 0   50  0001 C CNN "Manufacturer"
F 5 "RMCF0201FG240R" H 650 0   50  0001 C CNN "PartNumber"
	1    4950 1400
	0    1    1    0   
$EndComp
$Comp
L Device:R R211
U 1 1 5CA26720
P 5350 1400
AR Path="/5CA067DF/5CA26720" Ref="R211"  Part="1" 
AR Path="/5CB2EF3D/5CA26720" Ref="R311"  Part="1" 
AR Path="/5CB39532/5CA26720" Ref="R411"  Part="1" 
AR Path="/5CB3953A/5CA26720" Ref="R511"  Part="1" 
F 0 "R211" V 5143 1400 50  0000 C CNN
F 1 "249" V 5234 1400 50  0000 C CNN
F 2 "Resistor_SMD:R_0201_0603Metric" V 5280 1400 50  0001 C CNN
F 3 "~" H 5350 1400 50  0001 C CNN
F 4 "Stackpole Electronics Inc" H 650 0   50  0001 C CNN "Manufacturer"
F 5 "RMCF0201FG240R" H 650 0   50  0001 C CNN "PartNumber"
	1    5350 1400
	0    1    1    0   
$EndComp
Wire Wire Line
	5550 1500 5550 1400
Wire Wire Line
	5550 1400 5500 1400
Wire Wire Line
	5100 1400 5150 1400
Wire Wire Line
	5150 1500 5150 1400
Connection ~ 5150 1400
Wire Wire Line
	5150 1400 5200 1400
Wire Wire Line
	4750 1500 4750 1400
Wire Wire Line
	4750 1400 4800 1400
$Comp
L power:GND #PWR?
U 1 1 5CA2672F
P 5550 1900
AR Path="/5CA067DF/5CA2672F" Ref="#PWR?"  Part="1" 
AR Path="/5CB2EF3D/5CA2672F" Ref="#PWR?"  Part="1" 
AR Path="/5CB39532/5CA2672F" Ref="#PWR?"  Part="1" 
AR Path="/5CB3953A/5CA2672F" Ref="#PWR?"  Part="1" 
F 0 "#PWR?" H 5550 1650 50  0001 C CNN
F 1 "GND" H 5555 1727 50  0000 C CNN
F 2 "" H 5550 1900 50  0001 C CNN
F 3 "" H 5550 1900 50  0001 C CNN
	1    5550 1900
	1    0    0    -1  
$EndComp
$Comp
L power:GND #PWR?
U 1 1 5CA26735
P 5150 1900
AR Path="/5CA067DF/5CA26735" Ref="#PWR?"  Part="1" 
AR Path="/5CB2EF3D/5CA26735" Ref="#PWR?"  Part="1" 
AR Path="/5CB39532/5CA26735" Ref="#PWR?"  Part="1" 
AR Path="/5CB3953A/5CA26735" Ref="#PWR?"  Part="1" 
F 0 "#PWR?" H 5150 1650 50  0001 C CNN
F 1 "GND" H 5155 1727 50  0000 C CNN
F 2 "" H 5150 1900 50  0001 C CNN
F 3 "" H 5150 1900 50  0001 C CNN
	1    5150 1900
	1    0    0    -1  
$EndComp
$Comp
L power:GND #PWR?
U 1 1 5CA2673B
P 4750 1900
AR Path="/5CA067DF/5CA2673B" Ref="#PWR?"  Part="1" 
AR Path="/5CB2EF3D/5CA2673B" Ref="#PWR?"  Part="1" 
AR Path="/5CB39532/5CA2673B" Ref="#PWR?"  Part="1" 
AR Path="/5CB3953A/5CA2673B" Ref="#PWR?"  Part="1" 
F 0 "#PWR?" H 4750 1650 50  0001 C CNN
F 1 "GND" H 4755 1727 50  0000 C CNN
F 2 "" H 4750 1900 50  0001 C CNN
F 3 "" H 4750 1900 50  0001 C CNN
	1    4750 1900
	1    0    0    -1  
$EndComp
Wire Wire Line
	5550 1900 5550 1800
Wire Wire Line
	5150 1900 5150 1800
Wire Wire Line
	4750 1900 4750 1800
Wire Wire Line
	4750 1400 4550 1400
Connection ~ 4750 1400
Wire Wire Line
	4450 2800 4550 2800
Wire Wire Line
	4550 2800 4550 1400
Text Label 4500 3100 0    50   ~ 0
rf_tx_in
Text Label 2800 3100 0    50   ~ 0
rf_tx_out
Text Label 7450 3700 0    50   ~ 0
rf_tx_in_1
Text Label 6850 4000 0    50   ~ 0
rf_tx_in_2
Text Label 3150 2450 0    50   ~ 0
rf_isolated_int
Text Label 4550 2550 1    50   ~ 0
rf_coupled_1_int
Text Label 2400 2200 1    50   ~ 0
rf_isolated_att_mid
Text Label 2000 2200 1    50   ~ 0
rf_isolated_att
Text Label 5150 1400 1    50   ~ 0
rf_coupled_att_mid
Text Label 5550 1400 1    50   ~ 0
rf_coupled_att
Wire Wire Line
	5450 3050 6200 3050
Text Label 5550 3050 0    50   ~ 0
radio_switch_1
$Comp
L power:GND #PWR?
U 1 1 5CA26757
P 3950 3300
AR Path="/5CA067DF/5CA26757" Ref="#PWR?"  Part="1" 
AR Path="/5CB2EF3D/5CA26757" Ref="#PWR?"  Part="1" 
AR Path="/5CB39532/5CA26757" Ref="#PWR?"  Part="1" 
AR Path="/5CB3953A/5CA26757" Ref="#PWR?"  Part="1" 
F 0 "#PWR?" H 3950 3050 50  0001 C CNN
F 1 "GND" H 3955 3127 50  0000 C CNN
F 2 "" H 3950 3300 50  0001 C CNN
F 3 "" H 3950 3300 50  0001 C CNN
	1    3950 3300
	1    0    0    -1  
$EndComp
Wire Wire Line
	3950 3300 3950 3200
$Comp
L Device:C C201
U 1 1 5CA26772
P 6800 2650
AR Path="/5CA067DF/5CA26772" Ref="C201"  Part="1" 
AR Path="/5CB2EF3D/5CA26772" Ref="C301"  Part="1" 
AR Path="/5CB39532/5CA26772" Ref="C401"  Part="1" 
AR Path="/5CB3953A/5CA26772" Ref="C501"  Part="1" 
F 0 "C201" H 6915 2696 50  0000 L CNN
F 1 "1n" H 6915 2605 50  0000 L CNN
F 2 "Capacitor_SMD:C_0402_1005Metric" H 6838 2500 50  0001 C CNN
F 3 "~" H 6800 2650 50  0001 C CNN
	1    6800 2650
	1    0    0    -1  
$EndComp
$Comp
L Device:C C202
U 1 1 5CA26779
P 7250 2650
AR Path="/5CA067DF/5CA26779" Ref="C202"  Part="1" 
AR Path="/5CB2EF3D/5CA26779" Ref="C302"  Part="1" 
AR Path="/5CB39532/5CA26779" Ref="C402"  Part="1" 
AR Path="/5CB3953A/5CA26779" Ref="C502"  Part="1" 
F 0 "C202" H 7365 2696 50  0000 L CNN
F 1 "10p" H 7365 2605 50  0000 L CNN
F 2 "Capacitor_SMD:C_0402_1005Metric" H 7288 2500 50  0001 C CNN
F 3 "~" H 7250 2650 50  0001 C CNN
	1    7250 2650
	1    0    0    -1  
$EndComp
Wire Wire Line
	7250 2500 6800 2500
Connection ~ 6800 2500
Connection ~ 5050 2500
$Comp
L power:GND #PWR?
U 1 1 5CA26787
P 6950 2900
AR Path="/5CA067DF/5CA26787" Ref="#PWR?"  Part="1" 
AR Path="/5CB2EF3D/5CA26787" Ref="#PWR?"  Part="1" 
AR Path="/5CB39532/5CA26787" Ref="#PWR?"  Part="1" 
AR Path="/5CB3953A/5CA26787" Ref="#PWR?"  Part="1" 
F 0 "#PWR?" H 6950 2650 50  0001 C CNN
F 1 "GND" H 6955 2727 50  0000 C CNN
F 2 "" H 6950 2900 50  0001 C CNN
F 3 "" H 6950 2900 50  0001 C CNN
	1    6950 2900
	1    0    0    -1  
$EndComp
Wire Wire Line
	6950 2900 6950 2850
Wire Wire Line
	6950 2850 6800 2850
Wire Wire Line
	6800 2850 6800 2800
Wire Wire Line
	7250 2800 7250 2850
Wire Wire Line
	7250 2850 6950 2850
Connection ~ 6950 2850
Text HLabel 1350 2200 0    50   Output ~ 0
rf_isolated
Text HLabel 6650 1400 2    50   Output ~ 0
rf_coupled
$Comp
L POWDER_RF:SKY13575-639LF U?
U 1 1 5CA36F4C
P 5250 3750
AR Path="/5CA36F4C" Ref="U?"  Part="1" 
AR Path="/5CA067DF/5CA36F4C" Ref="U203"  Part="1" 
AR Path="/5CB2EF3D/5CA36F4C" Ref="U303"  Part="1" 
AR Path="/5CB39532/5CA36F4C" Ref="U403"  Part="1" 
AR Path="/5CB3953A/5CA36F4C" Ref="U503"  Part="1" 
F 0 "U203" H 5841 3621 50  0000 L CNN
F 1 "SKY13575-639LF" H 5700 2950 50  0000 L CNN
F 2 "POWDER_RF:SKY13575-639LF" H 5300 3750 50  0001 C CNN
F 3 "" H 5300 3750 50  0001 C CNN
F 4 "Skyworks Solutions Inc." H 650 0   50  0001 C CNN "Manufacturer"
F 5 "SKY13575-639LF" H 650 0   50  0001 C CNN "PartNumber"
	1    5250 3750
	1    0    0    -1  
$EndComp
Wire Wire Line
	5050 2500 5050 3300
Wire Wire Line
	5250 3100 5250 3300
Wire Wire Line
	4450 3100 5250 3100
Wire Wire Line
	5450 3050 5450 3300
Wire Wire Line
	5550 3200 6200 3200
Wire Wire Line
	5550 3200 5550 3300
Text Label 5550 3200 0    50   ~ 0
radio_switch_2
Wire Wire Line
	5450 4700 5450 4550
$Comp
L power:GND #PWR?
U 1 1 5CA56E70
P 5550 4700
AR Path="/5CA067DF/5CA56E70" Ref="#PWR?"  Part="1" 
AR Path="/5CB2EF3D/5CA56E70" Ref="#PWR?"  Part="1" 
AR Path="/5CB39532/5CA56E70" Ref="#PWR?"  Part="1" 
AR Path="/5CB3953A/5CA56E70" Ref="#PWR?"  Part="1" 
F 0 "#PWR?" H 5550 4450 50  0001 C CNN
F 1 "GND" H 5555 4527 50  0000 C CNN
F 2 "" H 5550 4700 50  0001 C CNN
F 3 "" H 5550 4700 50  0001 C CNN
	1    5550 4700
	1    0    0    -1  
$EndComp
Wire Wire Line
	5550 4700 5550 4550
$Comp
L power:GND #PWR?
U 1 1 5CA57AE3
P 5250 4700
AR Path="/5CA067DF/5CA57AE3" Ref="#PWR?"  Part="1" 
AR Path="/5CB2EF3D/5CA57AE3" Ref="#PWR?"  Part="1" 
AR Path="/5CB39532/5CA57AE3" Ref="#PWR?"  Part="1" 
AR Path="/5CB3953A/5CA57AE3" Ref="#PWR?"  Part="1" 
F 0 "#PWR?" H 5250 4450 50  0001 C CNN
F 1 "GND" H 5255 4527 50  0000 C CNN
F 2 "" H 5250 4700 50  0001 C CNN
F 3 "" H 5250 4700 50  0001 C CNN
	1    5250 4700
	1    0    0    -1  
$EndComp
Wire Wire Line
	5250 4700 5250 4550
$Comp
L power:GND #PWR?
U 1 1 5CA57AEA
P 5350 4700
AR Path="/5CA067DF/5CA57AEA" Ref="#PWR?"  Part="1" 
AR Path="/5CB2EF3D/5CA57AEA" Ref="#PWR?"  Part="1" 
AR Path="/5CB39532/5CA57AEA" Ref="#PWR?"  Part="1" 
AR Path="/5CB3953A/5CA57AEA" Ref="#PWR?"  Part="1" 
F 0 "#PWR?" H 5350 4450 50  0001 C CNN
F 1 "GND" H 5355 4527 50  0000 C CNN
F 2 "" H 5350 4700 50  0001 C CNN
F 3 "" H 5350 4700 50  0001 C CNN
	1    5350 4700
	1    0    0    -1  
$EndComp
Wire Wire Line
	5350 4700 5350 4550
$Comp
L power:GND #PWR?
U 1 1 5CA5884A
P 5050 4700
AR Path="/5CA067DF/5CA5884A" Ref="#PWR?"  Part="1" 
AR Path="/5CB2EF3D/5CA5884A" Ref="#PWR?"  Part="1" 
AR Path="/5CB39532/5CA5884A" Ref="#PWR?"  Part="1" 
AR Path="/5CB3953A/5CA5884A" Ref="#PWR?"  Part="1" 
F 0 "#PWR?" H 5050 4450 50  0001 C CNN
F 1 "GND" H 5055 4527 50  0000 C CNN
F 2 "" H 5050 4700 50  0001 C CNN
F 3 "" H 5050 4700 50  0001 C CNN
	1    5050 4700
	1    0    0    -1  
$EndComp
Wire Wire Line
	5050 4700 5050 4550
$Comp
L power:GND #PWR?
U 1 1 5CA58851
P 5150 4700
AR Path="/5CA067DF/5CA58851" Ref="#PWR?"  Part="1" 
AR Path="/5CB2EF3D/5CA58851" Ref="#PWR?"  Part="1" 
AR Path="/5CB39532/5CA58851" Ref="#PWR?"  Part="1" 
AR Path="/5CB3953A/5CA58851" Ref="#PWR?"  Part="1" 
F 0 "#PWR?" H 5150 4450 50  0001 C CNN
F 1 "GND" H 5155 4527 50  0000 C CNN
F 2 "" H 5150 4700 50  0001 C CNN
F 3 "" H 5150 4700 50  0001 C CNN
	1    5150 4700
	1    0    0    -1  
$EndComp
Wire Wire Line
	5150 4700 5150 4550
$Comp
L power:GND #PWR?
U 1 1 5CA59700
P 4950 4700
AR Path="/5CA067DF/5CA59700" Ref="#PWR?"  Part="1" 
AR Path="/5CB2EF3D/5CA59700" Ref="#PWR?"  Part="1" 
AR Path="/5CB39532/5CA59700" Ref="#PWR?"  Part="1" 
AR Path="/5CB3953A/5CA59700" Ref="#PWR?"  Part="1" 
F 0 "#PWR?" H 4950 4450 50  0001 C CNN
F 1 "GND" H 4955 4527 50  0000 C CNN
F 2 "" H 4950 4700 50  0001 C CNN
F 3 "" H 4950 4700 50  0001 C CNN
	1    4950 4700
	1    0    0    -1  
$EndComp
Wire Wire Line
	4950 4700 4950 4550
$Comp
L Connector:Conn_Coaxial J202
U 1 1 5CA5CAC8
P 2350 4000
AR Path="/5CA067DF/5CA5CAC8" Ref="J202"  Part="1" 
AR Path="/5CB2EF3D/5CA5CAC8" Ref="J302"  Part="1" 
AR Path="/5CB39532/5CA5CAC8" Ref="J402"  Part="1" 
AR Path="/5CB3953A/5CA5CAC8" Ref="J502"  Part="1" 
F 0 "J202" H 2449 3976 50  0000 L CNN
F 1 "Conn_Coaxial" H 2449 3885 50  0000 L CNN
F 2 "POWDER_RF:SMA_EndLaunch_142-0761-881" H 2350 4000 50  0001 C CNN
F 3 " ~" H 2350 4000 50  0001 C CNN
	1    2350 4000
	-1   0    0    -1  
$EndComp
$Comp
L power:GND #PWR?
U 1 1 5CA5CACE
P 2350 4300
AR Path="/5CA067DF/5CA5CACE" Ref="#PWR?"  Part="1" 
AR Path="/5CB2EF3D/5CA5CACE" Ref="#PWR?"  Part="1" 
AR Path="/5CB39532/5CA5CACE" Ref="#PWR?"  Part="1" 
AR Path="/5CB3953A/5CA5CACE" Ref="#PWR?"  Part="1" 
F 0 "#PWR?" H 2350 4050 50  0001 C CNN
F 1 "GND" H 2355 4127 50  0000 C CNN
F 2 "" H 2350 4300 50  0001 C CNN
F 3 "" H 2350 4300 50  0001 C CNN
	1    2350 4300
	-1   0    0    -1  
$EndComp
Wire Wire Line
	2350 4300 2350 4200
Wire Wire Line
	4300 3700 4700 3700
Text Label 3400 4000 0    50   ~ 0
rf_tx_in_3
$Comp
L Connector:Conn_Coaxial J207
U 1 1 5CA74A9B
P 6850 6200
AR Path="/5CA067DF/5CA74A9B" Ref="J207"  Part="1" 
AR Path="/5CB2EF3D/5CA74A9B" Ref="J307"  Part="1" 
AR Path="/5CB39532/5CA74A9B" Ref="J407"  Part="1" 
AR Path="/5CB3953A/5CA74A9B" Ref="J507"  Part="1" 
F 0 "J207" H 6949 6176 50  0000 L CNN
F 1 "Conn_Coaxial" H 6949 6085 50  0000 L CNN
F 2 "POWDER_RF:SMA_EndLaunch_142-0761-881" H 6850 6200 50  0001 C CNN
F 3 " ~" H 6850 6200 50  0001 C CNN
	1    6850 6200
	1    0    0    -1  
$EndComp
$Comp
L Connector:Conn_Coaxial J205
U 1 1 5CA74AA1
P 6250 6500
AR Path="/5CA067DF/5CA74AA1" Ref="J205"  Part="1" 
AR Path="/5CB2EF3D/5CA74AA1" Ref="J305"  Part="1" 
AR Path="/5CB39532/5CA74AA1" Ref="J405"  Part="1" 
AR Path="/5CB3953A/5CA74AA1" Ref="J505"  Part="1" 
F 0 "J205" H 6349 6476 50  0000 L CNN
F 1 "Conn_Coaxial" H 6349 6385 50  0000 L CNN
F 2 "POWDER_RF:SMA_EndLaunch_142-0761-881" H 6250 6500 50  0001 C CNN
F 3 " ~" H 6250 6500 50  0001 C CNN
	1    6250 6500
	1    0    0    -1  
$EndComp
$Comp
L power:GND #PWR?
U 1 1 5CA74AA7
P 6850 6500
AR Path="/5CA067DF/5CA74AA7" Ref="#PWR?"  Part="1" 
AR Path="/5CB2EF3D/5CA74AA7" Ref="#PWR?"  Part="1" 
AR Path="/5CB39532/5CA74AA7" Ref="#PWR?"  Part="1" 
AR Path="/5CB3953A/5CA74AA7" Ref="#PWR?"  Part="1" 
F 0 "#PWR?" H 6850 6250 50  0001 C CNN
F 1 "GND" H 6855 6327 50  0000 C CNN
F 2 "" H 6850 6500 50  0001 C CNN
F 3 "" H 6850 6500 50  0001 C CNN
	1    6850 6500
	1    0    0    -1  
$EndComp
$Comp
L power:GND #PWR?
U 1 1 5CA74AAD
P 6250 7000
AR Path="/5CA067DF/5CA74AAD" Ref="#PWR?"  Part="1" 
AR Path="/5CB2EF3D/5CA74AAD" Ref="#PWR?"  Part="1" 
AR Path="/5CB39532/5CA74AAD" Ref="#PWR?"  Part="1" 
AR Path="/5CB3953A/5CA74AAD" Ref="#PWR?"  Part="1" 
F 0 "#PWR?" H 6250 6750 50  0001 C CNN
F 1 "GND" H 6255 6827 50  0000 C CNN
F 2 "" H 6250 7000 50  0001 C CNN
F 3 "" H 6250 7000 50  0001 C CNN
	1    6250 7000
	1    0    0    -1  
$EndComp
Wire Wire Line
	6250 7000 6250 6700
Wire Wire Line
	6850 6500 6850 6400
$Comp
L power:GND #PWR?
U 1 1 5CA74AB5
P 3700 7200
AR Path="/5CA067DF/5CA74AB5" Ref="#PWR?"  Part="1" 
AR Path="/5CB2EF3D/5CA74AB5" Ref="#PWR?"  Part="1" 
AR Path="/5CB39532/5CA74AB5" Ref="#PWR?"  Part="1" 
AR Path="/5CB3953A/5CA74AB5" Ref="#PWR?"  Part="1" 
F 0 "#PWR?" H 3700 6950 50  0001 C CNN
F 1 "GND" H 3705 7027 50  0000 C CNN
F 2 "" H 3700 7200 50  0001 C CNN
F 3 "" H 3700 7200 50  0001 C CNN
	1    3700 7200
	1    0    0    -1  
$EndComp
$Comp
L Connector:Conn_Coaxial J204
U 1 1 5CA74AC1
P 1500 5600
AR Path="/5CA067DF/5CA74AC1" Ref="J204"  Part="1" 
AR Path="/5CB2EF3D/5CA74AC1" Ref="J304"  Part="1" 
AR Path="/5CB39532/5CA74AC1" Ref="J404"  Part="1" 
AR Path="/5CB3953A/5CA74AC1" Ref="J504"  Part="1" 
F 0 "J204" H 1430 5838 50  0000 C CNN
F 1 "Conn_Coaxial" H 1430 5747 50  0000 C CNN
F 2 "POWDER_RF:SMA_EndLaunch_142-0761-881" H 1500 5600 50  0001 C CNN
F 3 " ~" H 1500 5600 50  0001 C CNN
	1    1500 5600
	-1   0    0    -1  
$EndComp
$Comp
L power:GND #PWR?
U 1 1 5CA74AC7
P 1500 5900
AR Path="/5CA067DF/5CA74AC7" Ref="#PWR?"  Part="1" 
AR Path="/5CB2EF3D/5CA74AC7" Ref="#PWR?"  Part="1" 
AR Path="/5CB39532/5CA74AC7" Ref="#PWR?"  Part="1" 
AR Path="/5CB3953A/5CA74AC7" Ref="#PWR?"  Part="1" 
F 0 "#PWR?" H 1500 5650 50  0001 C CNN
F 1 "GND" H 1505 5727 50  0000 C CNN
F 2 "" H 1500 5900 50  0001 C CNN
F 3 "" H 1500 5900 50  0001 C CNN
	1    1500 5900
	1    0    0    -1  
$EndComp
Wire Wire Line
	1500 5900 1500 5800
Text Label 1750 5600 0    50   ~ 0
rf_rx_ant
Text Label 5600 6200 0    50   ~ 0
rf_rx_radio_1
Text Label 5500 6500 0    50   ~ 0
rf_rx_radio_2
Wire Wire Line
	3700 5550 4450 5550
Text Label 3800 5550 0    50   ~ 0
radio_switch_3
$Comp
L POWDER_RF:SKY13575-639LF U?
U 1 1 5CA74ADC
P 3500 6250
AR Path="/5CA74ADC" Ref="U?"  Part="1" 
AR Path="/5CA067DF/5CA74ADC" Ref="U202"  Part="1" 
AR Path="/5CB2EF3D/5CA74ADC" Ref="U302"  Part="1" 
AR Path="/5CB39532/5CA74ADC" Ref="U402"  Part="1" 
AR Path="/5CB3953A/5CA74ADC" Ref="U502"  Part="1" 
F 0 "U202" H 4091 6121 50  0000 L CNN
F 1 "SKY13575-639LF" H 3950 5450 50  0000 L CNN
F 2 "POWDER_RF:SKY13575-639LF" H 3550 6250 50  0001 C CNN
F 3 "" H 3550 6250 50  0001 C CNN
F 4 "Skyworks Solutions Inc." H -1050 0   50  0001 C CNN "Manufacturer"
F 5 "SKY13575-639LF" H -1050 0   50  0001 C CNN "PartNumber"
	1    3500 6250
	1    0    0    -1  
$EndComp
Wire Wire Line
	3500 5600 3500 5800
Wire Wire Line
	3700 5550 3700 5800
Wire Wire Line
	3800 5700 4450 5700
Wire Wire Line
	3800 5700 3800 5800
Text Label 3800 5700 0    50   ~ 0
radio_switch_4
Wire Wire Line
	3700 7200 3700 7050
$Comp
L power:GND #PWR?
U 1 1 5CA74AEC
P 3800 7200
AR Path="/5CA067DF/5CA74AEC" Ref="#PWR?"  Part="1" 
AR Path="/5CB2EF3D/5CA74AEC" Ref="#PWR?"  Part="1" 
AR Path="/5CB39532/5CA74AEC" Ref="#PWR?"  Part="1" 
AR Path="/5CB3953A/5CA74AEC" Ref="#PWR?"  Part="1" 
F 0 "#PWR?" H 3800 6950 50  0001 C CNN
F 1 "GND" H 3805 7027 50  0000 C CNN
F 2 "" H 3800 7200 50  0001 C CNN
F 3 "" H 3800 7200 50  0001 C CNN
	1    3800 7200
	1    0    0    -1  
$EndComp
Wire Wire Line
	3800 7200 3800 7050
$Comp
L power:GND #PWR?
U 1 1 5CA74AF3
P 3500 7200
AR Path="/5CA067DF/5CA74AF3" Ref="#PWR?"  Part="1" 
AR Path="/5CB2EF3D/5CA74AF3" Ref="#PWR?"  Part="1" 
AR Path="/5CB39532/5CA74AF3" Ref="#PWR?"  Part="1" 
AR Path="/5CB3953A/5CA74AF3" Ref="#PWR?"  Part="1" 
F 0 "#PWR?" H 3500 6950 50  0001 C CNN
F 1 "GND" H 3505 7027 50  0000 C CNN
F 2 "" H 3500 7200 50  0001 C CNN
F 3 "" H 3500 7200 50  0001 C CNN
	1    3500 7200
	1    0    0    -1  
$EndComp
Wire Wire Line
	3500 7200 3500 7050
$Comp
L power:GND #PWR?
U 1 1 5CA74AFA
P 3600 7200
AR Path="/5CA067DF/5CA74AFA" Ref="#PWR?"  Part="1" 
AR Path="/5CB2EF3D/5CA74AFA" Ref="#PWR?"  Part="1" 
AR Path="/5CB39532/5CA74AFA" Ref="#PWR?"  Part="1" 
AR Path="/5CB3953A/5CA74AFA" Ref="#PWR?"  Part="1" 
F 0 "#PWR?" H 3600 6950 50  0001 C CNN
F 1 "GND" H 3605 7027 50  0000 C CNN
F 2 "" H 3600 7200 50  0001 C CNN
F 3 "" H 3600 7200 50  0001 C CNN
	1    3600 7200
	1    0    0    -1  
$EndComp
Wire Wire Line
	3600 7200 3600 7050
$Comp
L power:GND #PWR?
U 1 1 5CA74B01
P 3300 7200
AR Path="/5CA067DF/5CA74B01" Ref="#PWR?"  Part="1" 
AR Path="/5CB2EF3D/5CA74B01" Ref="#PWR?"  Part="1" 
AR Path="/5CB39532/5CA74B01" Ref="#PWR?"  Part="1" 
AR Path="/5CB3953A/5CA74B01" Ref="#PWR?"  Part="1" 
F 0 "#PWR?" H 3300 6950 50  0001 C CNN
F 1 "GND" H 3305 7027 50  0000 C CNN
F 2 "" H 3300 7200 50  0001 C CNN
F 3 "" H 3300 7200 50  0001 C CNN
	1    3300 7200
	1    0    0    -1  
$EndComp
Wire Wire Line
	3300 7200 3300 7050
$Comp
L power:GND #PWR?
U 1 1 5CA74B08
P 3400 7200
AR Path="/5CA067DF/5CA74B08" Ref="#PWR?"  Part="1" 
AR Path="/5CB2EF3D/5CA74B08" Ref="#PWR?"  Part="1" 
AR Path="/5CB39532/5CA74B08" Ref="#PWR?"  Part="1" 
AR Path="/5CB3953A/5CA74B08" Ref="#PWR?"  Part="1" 
F 0 "#PWR?" H 3400 6950 50  0001 C CNN
F 1 "GND" H 3405 7027 50  0000 C CNN
F 2 "" H 3400 7200 50  0001 C CNN
F 3 "" H 3400 7200 50  0001 C CNN
	1    3400 7200
	1    0    0    -1  
$EndComp
Wire Wire Line
	3400 7200 3400 7050
$Comp
L power:GND #PWR?
U 1 1 5CA74B0F
P 3200 7200
AR Path="/5CA067DF/5CA74B0F" Ref="#PWR?"  Part="1" 
AR Path="/5CB2EF3D/5CA74B0F" Ref="#PWR?"  Part="1" 
AR Path="/5CB39532/5CA74B0F" Ref="#PWR?"  Part="1" 
AR Path="/5CB3953A/5CA74B0F" Ref="#PWR?"  Part="1" 
F 0 "#PWR?" H 3200 6950 50  0001 C CNN
F 1 "GND" H 3205 7027 50  0000 C CNN
F 2 "" H 3200 7200 50  0001 C CNN
F 3 "" H 3200 7200 50  0001 C CNN
	1    3200 7200
	1    0    0    -1  
$EndComp
Wire Wire Line
	3200 7200 3200 7050
$Comp
L Connector:Conn_Coaxial J201
U 1 1 5CA74B16
P 1150 6500
AR Path="/5CA067DF/5CA74B16" Ref="J201"  Part="1" 
AR Path="/5CB2EF3D/5CA74B16" Ref="J301"  Part="1" 
AR Path="/5CB39532/5CA74B16" Ref="J401"  Part="1" 
AR Path="/5CB3953A/5CA74B16" Ref="J501"  Part="1" 
F 0 "J201" H 1249 6476 50  0000 L CNN
F 1 "Conn_Coaxial" H 1249 6385 50  0000 L CNN
F 2 "POWDER_RF:SMA_EndLaunch_142-0761-881" H 1150 6500 50  0001 C CNN
F 3 " ~" H 1150 6500 50  0001 C CNN
	1    1150 6500
	-1   0    0    -1  
$EndComp
$Comp
L power:GND #PWR?
U 1 1 5CA74B1C
P 1150 6800
AR Path="/5CA067DF/5CA74B1C" Ref="#PWR?"  Part="1" 
AR Path="/5CB2EF3D/5CA74B1C" Ref="#PWR?"  Part="1" 
AR Path="/5CB39532/5CA74B1C" Ref="#PWR?"  Part="1" 
AR Path="/5CB3953A/5CA74B1C" Ref="#PWR?"  Part="1" 
F 0 "#PWR?" H 1150 6550 50  0001 C CNN
F 1 "GND" H 1155 6627 50  0000 C CNN
F 2 "" H 1150 6800 50  0001 C CNN
F 3 "" H 1150 6800 50  0001 C CNN
	1    1150 6800
	-1   0    0    -1  
$EndComp
Wire Wire Line
	1150 6800 1150 6700
Wire Wire Line
	2550 6200 2950 6200
Text Label 1350 6500 0    50   ~ 0
rf_rx_radio_3
$Comp
L power:VDD #PWR?
U 1 1 5CA77105
P 3300 5250
AR Path="/5CA067DF/5CA77105" Ref="#PWR?"  Part="1" 
AR Path="/5CB2EF3D/5CA77105" Ref="#PWR?"  Part="1" 
AR Path="/5CB39532/5CA77105" Ref="#PWR?"  Part="1" 
AR Path="/5CB3953A/5CA77105" Ref="#PWR?"  Part="1" 
F 0 "#PWR?" H 3300 5100 50  0001 C CNN
F 1 "VDD" H 3317 5423 50  0000 C CNN
F 2 "" H 3300 5250 50  0001 C CNN
F 3 "" H 3300 5250 50  0001 C CNN
	1    3300 5250
	1    0    0    -1  
$EndComp
Wire Wire Line
	3300 5250 3300 5350
$Comp
L Device:C C203
U 1 1 5CA772C6
P 5050 5500
AR Path="/5CA067DF/5CA772C6" Ref="C203"  Part="1" 
AR Path="/5CB2EF3D/5CA772C6" Ref="C303"  Part="1" 
AR Path="/5CB39532/5CA772C6" Ref="C403"  Part="1" 
AR Path="/5CB3953A/5CA772C6" Ref="C503"  Part="1" 
F 0 "C203" H 5165 5546 50  0000 L CNN
F 1 "1n" H 5165 5455 50  0000 L CNN
F 2 "Capacitor_SMD:C_0402_1005Metric" H 5088 5350 50  0001 C CNN
F 3 "~" H 5050 5500 50  0001 C CNN
	1    5050 5500
	1    0    0    -1  
$EndComp
$Comp
L Device:C C204
U 1 1 5CA772CC
P 5500 5500
AR Path="/5CA067DF/5CA772CC" Ref="C204"  Part="1" 
AR Path="/5CB2EF3D/5CA772CC" Ref="C304"  Part="1" 
AR Path="/5CB39532/5CA772CC" Ref="C404"  Part="1" 
AR Path="/5CB3953A/5CA772CC" Ref="C504"  Part="1" 
F 0 "C204" H 5615 5546 50  0000 L CNN
F 1 "10p" H 5615 5455 50  0000 L CNN
F 2 "Capacitor_SMD:C_0402_1005Metric" H 5538 5350 50  0001 C CNN
F 3 "~" H 5500 5500 50  0001 C CNN
	1    5500 5500
	1    0    0    -1  
$EndComp
Wire Wire Line
	5500 5350 5050 5350
Connection ~ 5050 5350
$Comp
L power:GND #PWR?
U 1 1 5CA772D7
P 5200 5750
AR Path="/5CA067DF/5CA772D7" Ref="#PWR?"  Part="1" 
AR Path="/5CB2EF3D/5CA772D7" Ref="#PWR?"  Part="1" 
AR Path="/5CB39532/5CA772D7" Ref="#PWR?"  Part="1" 
AR Path="/5CB3953A/5CA772D7" Ref="#PWR?"  Part="1" 
F 0 "#PWR?" H 5200 5500 50  0001 C CNN
F 1 "GND" H 5205 5577 50  0000 C CNN
F 2 "" H 5200 5750 50  0001 C CNN
F 3 "" H 5200 5750 50  0001 C CNN
	1    5200 5750
	1    0    0    -1  
$EndComp
Wire Wire Line
	5200 5750 5200 5700
Wire Wire Line
	5200 5700 5050 5700
Wire Wire Line
	5050 5700 5050 5650
Wire Wire Line
	5500 5650 5500 5700
Wire Wire Line
	5500 5700 5200 5700
Connection ~ 5200 5700
Connection ~ 3300 5350
Wire Wire Line
	3300 5350 3300 5800
Wire Wire Line
	3300 5350 5050 5350
Wire Wire Line
	5050 2500 6800 2500
Text HLabel 6200 3050 2    50   Input ~ 0
tx_sw_1
Text HLabel 6200 3200 2    50   Input ~ 0
tx_sw_2
Text HLabel 4450 5550 2    50   Input ~ 0
rx_sw_1
Text HLabel 4450 5700 2    50   Input ~ 0
rx_sw_2
Text Label 4400 3700 0    50   ~ 0
nc1
Text Label 2700 6200 0    50   ~ 0
nc2
$Comp
L Device:C C207
U 1 1 5D636D04
P 3950 4000
AR Path="/5CA067DF/5D636D04" Ref="C207"  Part="1" 
AR Path="/5CB2EF3D/5D636D04" Ref="C307"  Part="1" 
AR Path="/5CB39532/5D636D04" Ref="C407"  Part="1" 
AR Path="/5CB3953A/5D636D04" Ref="C507"  Part="1" 
F 0 "C207" H 4065 4046 50  0000 L CNN
F 1 "1n" H 4065 3955 50  0000 L CNN
F 2 "Capacitor_SMD:C_0201_0603Metric" H 3988 3850 50  0001 C CNN
F 3 "~" H 3950 4000 50  0001 C CNN
	1    3950 4000
	0    1    1    0   
$EndComp
Wire Wire Line
	4100 4000 4700 4000
Wire Wire Line
	3800 4000 2550 4000
$Comp
L Device:C C206
U 1 1 5D63F36F
P 2000 6500
AR Path="/5CA067DF/5D63F36F" Ref="C206"  Part="1" 
AR Path="/5CB2EF3D/5D63F36F" Ref="C306"  Part="1" 
AR Path="/5CB39532/5D63F36F" Ref="C406"  Part="1" 
AR Path="/5CB3953A/5D63F36F" Ref="C506"  Part="1" 
F 0 "C206" H 2115 6546 50  0000 L CNN
F 1 "1n" H 2115 6455 50  0000 L CNN
F 2 "Capacitor_SMD:C_0201_0603Metric" H 2038 6350 50  0001 C CNN
F 3 "~" H 2000 6500 50  0001 C CNN
	1    2000 6500
	0    1    1    0   
$EndComp
$Comp
L Device:C C211
U 1 1 5D63F46C
P 6600 4000
AR Path="/5CA067DF/5D63F46C" Ref="C211"  Part="1" 
AR Path="/5CB2EF3D/5D63F46C" Ref="C311"  Part="1" 
AR Path="/5CB39532/5D63F46C" Ref="C411"  Part="1" 
AR Path="/5CB3953A/5D63F46C" Ref="C511"  Part="1" 
F 0 "C211" H 6715 4046 50  0000 L CNN
F 1 "1n" H 6715 3955 50  0000 L CNN
F 2 "Capacitor_SMD:C_0201_0603Metric" H 6638 3850 50  0001 C CNN
F 3 "~" H 6600 4000 50  0001 C CNN
	1    6600 4000
	0    1    1    0   
$EndComp
Wire Wire Line
	1350 6500 1850 6500
$Comp
L Device:C C209
U 1 1 5D64E462
P 5200 6500
AR Path="/5CA067DF/5D64E462" Ref="C209"  Part="1" 
AR Path="/5CB2EF3D/5D64E462" Ref="C309"  Part="1" 
AR Path="/5CB39532/5D64E462" Ref="C409"  Part="1" 
AR Path="/5CB3953A/5D64E462" Ref="C509"  Part="1" 
F 0 "C209" H 5315 6546 50  0000 L CNN
F 1 "1n" H 5315 6455 50  0000 L CNN
F 2 "Capacitor_SMD:C_0201_0603Metric" H 5238 6350 50  0001 C CNN
F 3 "~" H 5200 6500 50  0001 C CNN
	1    5200 6500
	0    1    1    0   
$EndComp
$Comp
L Device:C C208
U 1 1 5D64E4FE
P 5350 6200
AR Path="/5CA067DF/5D64E4FE" Ref="C208"  Part="1" 
AR Path="/5CB2EF3D/5D64E4FE" Ref="C308"  Part="1" 
AR Path="/5CB39532/5D64E4FE" Ref="C408"  Part="1" 
AR Path="/5CB3953A/5D64E4FE" Ref="C508"  Part="1" 
F 0 "C208" H 5465 6246 50  0000 L CNN
F 1 "1n" H 5465 6155 50  0000 L CNN
F 2 "Capacitor_SMD:C_0201_0603Metric" H 5388 6050 50  0001 C CNN
F 3 "~" H 5350 6200 50  0001 C CNN
	1    5350 6200
	0    1    1    0   
$EndComp
Wire Wire Line
	5350 6500 6050 6500
Wire Wire Line
	6650 6200 5500 6200
$Comp
L Device:C C212
U 1 1 5D659B6B
P 6750 3700
AR Path="/5CA067DF/5D659B6B" Ref="C212"  Part="1" 
AR Path="/5CB2EF3D/5D659B6B" Ref="C312"  Part="1" 
AR Path="/5CB39532/5D659B6B" Ref="C412"  Part="1" 
AR Path="/5CB3953A/5D659B6B" Ref="C512"  Part="1" 
F 0 "C212" H 6865 3746 50  0000 L CNN
F 1 "1n" H 6865 3655 50  0000 L CNN
F 2 "Capacitor_SMD:C_0201_0603Metric" H 6788 3550 50  0001 C CNN
F 3 "~" H 6750 3700 50  0001 C CNN
	1    6750 3700
	0    1    1    0   
$EndComp
Wire Wire Line
	6600 3700 5800 3700
Wire Wire Line
	6750 4000 7450 4000
Wire Wire Line
	6900 3700 7950 3700
$Comp
L Device:C C210
U 1 1 5D66A993
P 6000 1400
AR Path="/5CA067DF/5D66A993" Ref="C210"  Part="1" 
AR Path="/5CB2EF3D/5D66A993" Ref="C310"  Part="1" 
AR Path="/5CB39532/5D66A993" Ref="C410"  Part="1" 
AR Path="/5CB3953A/5D66A993" Ref="C510"  Part="1" 
F 0 "C210" H 6115 1446 50  0000 L CNN
F 1 "1n" H 6115 1355 50  0000 L CNN
F 2 "Capacitor_SMD:C_0201_0603Metric" H 6038 1250 50  0001 C CNN
F 3 "~" H 6000 1400 50  0001 C CNN
	1    6000 1400
	0    1    1    0   
$EndComp
Wire Wire Line
	6150 1400 6650 1400
Wire Wire Line
	5850 1400 5550 1400
Connection ~ 5550 1400
$Comp
L Device:C C205
U 1 1 5D674F2A
P 1700 2200
AR Path="/5CA067DF/5D674F2A" Ref="C205"  Part="1" 
AR Path="/5CB2EF3D/5D674F2A" Ref="C305"  Part="1" 
AR Path="/5CB39532/5D674F2A" Ref="C405"  Part="1" 
AR Path="/5CB3953A/5D674F2A" Ref="C505"  Part="1" 
F 0 "C205" H 1815 2246 50  0000 L CNN
F 1 "1n" H 1815 2155 50  0000 L CNN
F 2 "Capacitor_SMD:C_0201_0603Metric" H 1738 2050 50  0001 C CNN
F 3 "~" H 1700 2200 50  0001 C CNN
	1    1700 2200
	0    1    1    0   
$EndComp
Wire Wire Line
	1850 2200 2000 2200
Connection ~ 2000 2200
Text Label 4150 4000 0    50   ~ 0
rf_tx_in_3_mid
Text Label 5950 3700 0    50   ~ 0
rf_tx_in_1_mid
Wire Wire Line
	5800 4000 6450 4000
Text Label 5900 4000 0    50   ~ 0
rf_tx_in_2_mid
Wire Wire Line
	4050 6200 5200 6200
Wire Wire Line
	4050 6500 5050 6500
Text Label 4300 6200 0    50   ~ 0
rf_rx_radio_1_mid
Text Label 4300 6500 0    50   ~ 0
rf_rx_radio_2_mid
Wire Wire Line
	2150 6500 2950 6500
Text Label 2200 6500 0    50   ~ 0
rf_rx_radio_3_mid
$Comp
L Device:C C214
U 1 1 5D6ACAC4
P 3200 3100
AR Path="/5CA067DF/5D6ACAC4" Ref="C214"  Part="1" 
AR Path="/5CB2EF3D/5D6ACAC4" Ref="C314"  Part="1" 
AR Path="/5CB39532/5D6ACAC4" Ref="C414"  Part="1" 
AR Path="/5CB3953A/5D6ACAC4" Ref="C514"  Part="1" 
F 0 "C214" H 3315 3146 50  0000 L CNN
F 1 "1n" H 3315 3055 50  0000 L CNN
F 2 "Capacitor_SMD:C_0201_0603Metric" H 3238 2950 50  0001 C CNN
F 3 "~" H 3200 3100 50  0001 C CNN
	1    3200 3100
	0    1    1    0   
$EndComp
Wire Wire Line
	3350 3100 3450 3100
$Comp
L Device:C C213
U 1 1 5D6B21F9
P 2350 5600
AR Path="/5CA067DF/5D6B21F9" Ref="C213"  Part="1" 
AR Path="/5CB2EF3D/5D6B21F9" Ref="C313"  Part="1" 
AR Path="/5CB39532/5D6B21F9" Ref="C413"  Part="1" 
AR Path="/5CB3953A/5D6B21F9" Ref="C513"  Part="1" 
F 0 "C213" H 2465 5646 50  0000 L CNN
F 1 "1n" H 2465 5555 50  0000 L CNN
F 2 "Capacitor_SMD:C_0201_0603Metric" H 2388 5450 50  0001 C CNN
F 3 "~" H 2350 5600 50  0001 C CNN
	1    2350 5600
	0    1    1    0   
$EndComp
Wire Wire Line
	2200 5600 1700 5600
Text Label 3350 3100 0    50   ~ 0
rf_tx_out_mid
Text Label 2550 5600 0    50   ~ 0
rf_rx_ant_mid
Wire Wire Line
	2500 5600 3500 5600
$EndSCHEMATC
