(kicad_sch (version 20211123) (generator eeschema)

  (uuid a10e87a2-4f3b-43e3-b217-b88f261b1396)

  (paper "A4")

  (lib_symbols
    (symbol "000_PreferredParts:C_100nF" (pin_numbers hide) (pin_names (offset 0.254)) (in_bom yes) (on_board yes)
      (property "Reference" "C" (id 0) (at 0.635 2.54 0)
        (effects (font (size 1.27 1.27)) (justify left))
      )
      (property "Value" "C_100nF" (id 1) (at 0.635 -2.54 0)
        (effects (font (size 1.27 1.27)) (justify left) hide)
      )
      (property "Footprint" "Capacitor_SMD:C_0402_1005Metric" (id 2) (at 0.9652 -3.81 0)
        (effects (font (size 1.27 1.27)) hide)
      )
      (property "Datasheet" "~" (id 3) (at 0 0 0)
        (effects (font (size 1.27 1.27)) hide)
      )
      (property "DisplayValue" "100nF" (id 4) (at 3.81 -2.54 0)
        (effects (font (size 1.27 1.27)))
      )
      (property "PartSpecification" "3000-0000000125" (id 5) (at 0 0 0)
        (effects (font (size 1.27 1.27)) hide)
      )
      (property "ki_keywords" "cap capacitor" (id 6) (at 0 0 0)
        (effects (font (size 1.27 1.27)) hide)
      )
      (property "ki_description" "Unpolarized capacitor" (id 7) (at 0 0 0)
        (effects (font (size 1.27 1.27)) hide)
      )
      (property "ki_fp_filters" "C_*" (id 8) (at 0 0 0)
        (effects (font (size 1.27 1.27)) hide)
      )
      (symbol "C_100nF_0_1"
        (polyline
          (pts
            (xy -2.032 -0.762)
            (xy 2.032 -0.762)
          )
          (stroke (width 0.508) (type default) (color 0 0 0 0))
          (fill (type none))
        )
        (polyline
          (pts
            (xy -2.032 0.762)
            (xy 2.032 0.762)
          )
          (stroke (width 0.508) (type default) (color 0 0 0 0))
          (fill (type none))
        )
      )
      (symbol "C_100nF_1_1"
        (pin passive line (at 0 3.81 270) (length 2.794)
          (name "~" (effects (font (size 1.27 1.27))))
          (number "1" (effects (font (size 1.27 1.27))))
        )
        (pin passive line (at 0 -3.81 90) (length 2.794)
          (name "~" (effects (font (size 1.27 1.27))))
          (number "2" (effects (font (size 1.27 1.27))))
        )
      )
    )
    (symbol "000_PreferredParts:C_10uF_0805" (pin_numbers hide) (pin_names (offset 0.254)) (in_bom yes) (on_board yes)
      (property "Reference" "C" (id 0) (at 0.635 2.54 0)
        (effects (font (size 1.27 1.27)) (justify left))
      )
      (property "Value" "C_10uF_0805" (id 1) (at 0.635 -2.54 0)
        (effects (font (size 1.27 1.27)) (justify left) hide)
      )
      (property "Footprint" "Capacitor_SMD:C_0805_2012Metric" (id 2) (at 0.9652 -3.81 0)
        (effects (font (size 1.27 1.27)) hide)
      )
      (property "Datasheet" "~" (id 3) (at 0 0 0)
        (effects (font (size 1.27 1.27)) hide)
      )
      (property "DisplayValue" "10uF" (id 4) (at 3.81 -2.54 0)
        (effects (font (size 1.27 1.27)))
      )
      (property "DisplayFootprint" "0805" (id 5) (at 3.81 -5.08 0)
        (effects (font (size 1.27 1.27)))
      )
      (property "PartSpecification" "3000-0000000134" (id 6) (at 0 0 0)
        (effects (font (size 1.27 1.27)) hide)
      )
      (property "ki_keywords" "cap capacitor" (id 7) (at 0 0 0)
        (effects (font (size 1.27 1.27)) hide)
      )
      (property "ki_description" "Unpolarized capacitor" (id 8) (at 0 0 0)
        (effects (font (size 1.27 1.27)) hide)
      )
      (property "ki_fp_filters" "C_*" (id 9) (at 0 0 0)
        (effects (font (size 1.27 1.27)) hide)
      )
      (symbol "C_10uF_0805_0_1"
        (polyline
          (pts
            (xy -2.032 -0.762)
            (xy 2.032 -0.762)
          )
          (stroke (width 0.508) (type default) (color 0 0 0 0))
          (fill (type none))
        )
        (polyline
          (pts
            (xy -2.032 0.762)
            (xy 2.032 0.762)
          )
          (stroke (width 0.508) (type default) (color 0 0 0 0))
          (fill (type none))
        )
      )
      (symbol "C_10uF_0805_1_1"
        (pin passive line (at 0 3.81 270) (length 2.794)
          (name "~" (effects (font (size 1.27 1.27))))
          (number "1" (effects (font (size 1.27 1.27))))
        )
        (pin passive line (at 0 -3.81 90) (length 2.794)
          (name "~" (effects (font (size 1.27 1.27))))
          (number "2" (effects (font (size 1.27 1.27))))
        )
      )
    )
    (symbol "Device:C" (pin_numbers hide) (pin_names (offset 0.254)) (in_bom yes) (on_board yes)
      (property "Reference" "C" (id 0) (at 0.635 2.54 0)
        (effects (font (size 1.27 1.27)) (justify left))
      )
      (property "Value" "C" (id 1) (at 0.635 -2.54 0)
        (effects (font (size 1.27 1.27)) (justify left))
      )
      (property "Footprint" "" (id 2) (at 0.9652 -3.81 0)
        (effects (font (size 1.27 1.27)) hide)
      )
      (property "Datasheet" "~" (id 3) (at 0 0 0)
        (effects (font (size 1.27 1.27)) hide)
      )
      (property "ki_keywords" "cap capacitor" (id 4) (at 0 0 0)
        (effects (font (size 1.27 1.27)) hide)
      )
      (property "ki_description" "Unpolarized capacitor" (id 5) (at 0 0 0)
        (effects (font (size 1.27 1.27)) hide)
      )
      (property "ki_fp_filters" "C_*" (id 6) (at 0 0 0)
        (effects (font (size 1.27 1.27)) hide)
      )
      (symbol "C_0_1"
        (polyline
          (pts
            (xy -2.032 -0.762)
            (xy 2.032 -0.762)
          )
          (stroke (width 0.508) (type default) (color 0 0 0 0))
          (fill (type none))
        )
        (polyline
          (pts
            (xy -2.032 0.762)
            (xy 2.032 0.762)
          )
          (stroke (width 0.508) (type default) (color 0 0 0 0))
          (fill (type none))
        )
      )
      (symbol "C_1_1"
        (pin passive line (at 0 3.81 270) (length 2.794)
          (name "~" (effects (font (size 1.27 1.27))))
          (number "1" (effects (font (size 1.27 1.27))))
        )
        (pin passive line (at 0 -3.81 90) (length 2.794)
          (name "~" (effects (font (size 1.27 1.27))))
          (number "2" (effects (font (size 1.27 1.27))))
        )
      )
    )
    (symbol "Device:L" (pin_numbers hide) (pin_names (offset 1.016) hide) (in_bom yes) (on_board yes)
      (property "Reference" "L" (id 0) (at -1.27 0 90)
        (effects (font (size 1.27 1.27)))
      )
      (property "Value" "L" (id 1) (at 1.905 0 90)
        (effects (font (size 1.27 1.27)))
      )
      (property "Footprint" "" (id 2) (at 0 0 0)
        (effects (font (size 1.27 1.27)) hide)
      )
      (property "Datasheet" "~" (id 3) (at 0 0 0)
        (effects (font (size 1.27 1.27)) hide)
      )
      (property "ki_keywords" "inductor choke coil reactor magnetic" (id 4) (at 0 0 0)
        (effects (font (size 1.27 1.27)) hide)
      )
      (property "ki_description" "Inductor" (id 5) (at 0 0 0)
        (effects (font (size 1.27 1.27)) hide)
      )
      (property "ki_fp_filters" "Choke_* *Coil* Inductor_* L_*" (id 6) (at 0 0 0)
        (effects (font (size 1.27 1.27)) hide)
      )
      (symbol "L_0_1"
        (arc (start 0 -2.54) (mid 0.635 -1.905) (end 0 -1.27)
          (stroke (width 0) (type default) (color 0 0 0 0))
          (fill (type none))
        )
        (arc (start 0 -1.27) (mid 0.635 -0.635) (end 0 0)
          (stroke (width 0) (type default) (color 0 0 0 0))
          (fill (type none))
        )
        (arc (start 0 0) (mid 0.635 0.635) (end 0 1.27)
          (stroke (width 0) (type default) (color 0 0 0 0))
          (fill (type none))
        )
        (arc (start 0 1.27) (mid 0.635 1.905) (end 0 2.54)
          (stroke (width 0) (type default) (color 0 0 0 0))
          (fill (type none))
        )
      )
      (symbol "L_1_1"
        (pin passive line (at 0 3.81 270) (length 1.27)
          (name "1" (effects (font (size 1.27 1.27))))
          (number "1" (effects (font (size 1.27 1.27))))
        )
        (pin passive line (at 0 -3.81 90) (length 1.27)
          (name "2" (effects (font (size 1.27 1.27))))
          (number "2" (effects (font (size 1.27 1.27))))
        )
      )
    )
    (symbol "Device:R" (pin_numbers hide) (pin_names (offset 0)) (in_bom yes) (on_board yes)
      (property "Reference" "R" (id 0) (at 2.032 0 90)
        (effects (font (size 1.27 1.27)))
      )
      (property "Value" "R" (id 1) (at 0 0 90)
        (effects (font (size 1.27 1.27)))
      )
      (property "Footprint" "" (id 2) (at -1.778 0 90)
        (effects (font (size 1.27 1.27)) hide)
      )
      (property "Datasheet" "~" (id 3) (at 0 0 0)
        (effects (font (size 1.27 1.27)) hide)
      )
      (property "ki_keywords" "R res resistor" (id 4) (at 0 0 0)
        (effects (font (size 1.27 1.27)) hide)
      )
      (property "ki_description" "Resistor" (id 5) (at 0 0 0)
        (effects (font (size 1.27 1.27)) hide)
      )
      (property "ki_fp_filters" "R_*" (id 6) (at 0 0 0)
        (effects (font (size 1.27 1.27)) hide)
      )
      (symbol "R_0_1"
        (rectangle (start -1.016 -2.54) (end 1.016 2.54)
          (stroke (width 0.254) (type default) (color 0 0 0 0))
          (fill (type none))
        )
      )
      (symbol "R_1_1"
        (pin passive line (at 0 3.81 270) (length 1.27)
          (name "~" (effects (font (size 1.27 1.27))))
          (number "1" (effects (font (size 1.27 1.27))))
        )
        (pin passive line (at 0 -3.81 90) (length 1.27)
          (name "~" (effects (font (size 1.27 1.27))))
          (number "2" (effects (font (size 1.27 1.27))))
        )
      )
    )
    (symbol "POWDER_Power:TPS63070RNM" (pin_names (offset 0.254)) (in_bom yes) (on_board yes)
      (property "Reference" "U" (id 0) (at 8.89 15.24 0)
        (effects (font (size 1.524 1.524)))
      )
      (property "Value" "TPS63070RNM" (id 1) (at 1.27 3.81 0)
        (effects (font (size 1.524 1.524)))
      )
      (property "Footprint" "POWDER_Power:TPS63070RNMR" (id 2) (at 2.54 -0.254 0)
        (effects (font (size 1.524 1.524)) hide)
      )
      (property "Datasheet" "" (id 3) (at 2.54 10.16 0)
        (effects (font (size 1.524 1.524)))
      )
      (property "Manufacturer" "Texas Instruments" (id 4) (at 0 0 0)
        (effects (font (size 1.27 1.27)) hide)
      )
      (property "PartNumber" "TPS63070RNMR" (id 5) (at 0 0 0)
        (effects (font (size 1.27 1.27)) hide)
      )
      (property "ki_description" "2-V to 16-V Buck-Boost Converter With 3.6-A Switch Current" (id 6) (at 0 0 0)
        (effects (font (size 1.27 1.27)) hide)
      )
      (property "ki_fp_filters" "RNM0015A" (id 7) (at 0 0 0)
        (effects (font (size 1.27 1.27)) hide)
      )
      (symbol "TPS63070RNM_0_0"
        (rectangle (start -12.7 13.97) (end 12.7 -15.24)
          (stroke (width 0.2032) (type default) (color 0 0 0 0))
          (fill (type background))
        )
      )
      (symbol "TPS63070RNM_1_0"
        (pin input line (at -15.24 -7.62 0) (length 2.54)
          (name "PS_SYNC" (effects (font (size 1.27 1.27))))
          (number "1" (effects (font (size 1.27 1.27))))
        )
        (pin power_in line (at 2.54 -17.78 90) (length 2.54)
          (name "PGND" (effects (font (size 1.27 1.27))))
          (number "10" (effects (font (size 1.27 1.27))))
        )
        (pin bidirectional line (at -5.08 16.51 270) (length 2.54)
          (name "L1" (effects (font (size 1.27 1.27))))
          (number "11" (effects (font (size 1.27 1.27))))
        )
        (pin power_in line (at -15.24 10.16 0) (length 2.54)
          (name "VIN" (effects (font (size 1.27 1.27))))
          (number "12" (effects (font (size 1.27 1.27))))
        )
        (pin power_in line (at -15.24 7.62 0) (length 2.54)
          (name "VIN" (effects (font (size 1.27 1.27))))
          (number "13" (effects (font (size 1.27 1.27))))
        )
        (pin input line (at -15.24 -5.08 0) (length 2.54)
          (name "EN" (effects (font (size 1.27 1.27))))
          (number "14" (effects (font (size 1.27 1.27))))
        )
        (pin input line (at -15.24 -10.16 0) (length 2.54)
          (name "VSEL" (effects (font (size 1.27 1.27))))
          (number "15" (effects (font (size 1.27 1.27))))
        )
        (pin output line (at 15.24 -7.62 180) (length 2.54)
          (name "PG" (effects (font (size 1.27 1.27))))
          (number "2" (effects (font (size 1.27 1.27))))
        )
        (pin passive line (at -15.24 1.27 0) (length 2.54)
          (name "VAUX" (effects (font (size 1.27 1.27))))
          (number "3" (effects (font (size 1.27 1.27))))
        )
        (pin power_in line (at -2.54 -17.78 90) (length 2.54)
          (name "GND" (effects (font (size 1.27 1.27))))
          (number "4" (effects (font (size 1.27 1.27))))
        )
        (pin input line (at 15.24 1.27 180) (length 2.54)
          (name "FB" (effects (font (size 1.27 1.27))))
          (number "5" (effects (font (size 1.27 1.27))))
        )
        (pin input line (at 15.24 -1.27 180) (length 2.54)
          (name "FB2" (effects (font (size 1.27 1.27))))
          (number "6" (effects (font (size 1.27 1.27))))
        )
        (pin power_out line (at 15.24 7.62 180) (length 2.54)
          (name "VOUT" (effects (font (size 1.27 1.27))))
          (number "7" (effects (font (size 1.27 1.27))))
        )
        (pin power_out line (at 15.24 10.16 180) (length 2.54)
          (name "VOUT" (effects (font (size 1.27 1.27))))
          (number "8" (effects (font (size 1.27 1.27))))
        )
        (pin bidirectional line (at 5.08 16.51 270) (length 2.54)
          (name "L2" (effects (font (size 1.27 1.27))))
          (number "9" (effects (font (size 1.27 1.27))))
        )
      )
    )
    (symbol "power:+12V" (power) (pin_names (offset 0)) (in_bom yes) (on_board yes)
      (property "Reference" "#PWR" (id 0) (at 0 -3.81 0)
        (effects (font (size 1.27 1.27)) hide)
      )
      (property "Value" "+12V" (id 1) (at 0 3.556 0)
        (effects (font (size 1.27 1.27)))
      )
      (property "Footprint" "" (id 2) (at 0 0 0)
        (effects (font (size 1.27 1.27)) hide)
      )
      (property "Datasheet" "" (id 3) (at 0 0 0)
        (effects (font (size 1.27 1.27)) hide)
      )
      (property "ki_keywords" "power-flag" (id 4) (at 0 0 0)
        (effects (font (size 1.27 1.27)) hide)
      )
      (property "ki_description" "Power symbol creates a global label with name \"+12V\"" (id 5) (at 0 0 0)
        (effects (font (size 1.27 1.27)) hide)
      )
      (symbol "+12V_0_1"
        (polyline
          (pts
            (xy -0.762 1.27)
            (xy 0 2.54)
          )
          (stroke (width 0) (type default) (color 0 0 0 0))
          (fill (type none))
        )
        (polyline
          (pts
            (xy 0 0)
            (xy 0 2.54)
          )
          (stroke (width 0) (type default) (color 0 0 0 0))
          (fill (type none))
        )
        (polyline
          (pts
            (xy 0 2.54)
            (xy 0.762 1.27)
          )
          (stroke (width 0) (type default) (color 0 0 0 0))
          (fill (type none))
        )
      )
      (symbol "+12V_1_1"
        (pin power_in line (at 0 0 90) (length 0) hide
          (name "+12V" (effects (font (size 1.27 1.27))))
          (number "1" (effects (font (size 1.27 1.27))))
        )
      )
    )
    (symbol "power:GND" (power) (pin_names (offset 0)) (in_bom yes) (on_board yes)
      (property "Reference" "#PWR" (id 0) (at 0 -6.35 0)
        (effects (font (size 1.27 1.27)) hide)
      )
      (property "Value" "GND" (id 1) (at 0 -3.81 0)
        (effects (font (size 1.27 1.27)))
      )
      (property "Footprint" "" (id 2) (at 0 0 0)
        (effects (font (size 1.27 1.27)) hide)
      )
      (property "Datasheet" "" (id 3) (at 0 0 0)
        (effects (font (size 1.27 1.27)) hide)
      )
      (property "ki_keywords" "power-flag" (id 4) (at 0 0 0)
        (effects (font (size 1.27 1.27)) hide)
      )
      (property "ki_description" "Power symbol creates a global label with name \"GND\" , ground" (id 5) (at 0 0 0)
        (effects (font (size 1.27 1.27)) hide)
      )
      (symbol "GND_0_1"
        (polyline
          (pts
            (xy 0 0)
            (xy 0 -1.27)
            (xy 1.27 -1.27)
            (xy 0 -2.54)
            (xy -1.27 -1.27)
            (xy 0 -1.27)
          )
          (stroke (width 0) (type default) (color 0 0 0 0))
          (fill (type none))
        )
      )
      (symbol "GND_1_1"
        (pin power_in line (at 0 0 270) (length 0) hide
          (name "GND" (effects (font (size 1.27 1.27))))
          (number "1" (effects (font (size 1.27 1.27))))
        )
      )
    )
  )

  (junction (at 54.61 38.1) (diameter 0) (color 0 0 0 0)
    (uuid 1ecd3853-2ecf-4b11-9575-0de4e4aa7142)
  )
  (junction (at 82.55 57.15) (diameter 0) (color 0 0 0 0)
    (uuid 9588cf33-2400-4262-9263-c875f1753878)
  )
  (junction (at 196.85 38.1) (diameter 0) (color 0 0 0 0)
    (uuid 9d9699b3-2d53-4e0c-aebb-f768151971a6)
  )
  (junction (at 31.75 38.1) (diameter 0) (color 0 0 0 0)
    (uuid a2815da1-a7c7-4190-b4a1-f8bbbe041fa6)
  )
  (junction (at 88.9 38.1) (diameter 0) (color 0 0 0 0)
    (uuid c1df9c1f-1cff-4d61-b755-69c485948541)
  )
  (junction (at 176.53 38.1) (diameter 0) (color 0 0 0 0)
    (uuid c62b99cc-4bca-4e63-bb58-698123a6c1c9)
  )
  (junction (at 176.53 57.15) (diameter 0) (color 0 0 0 0)
    (uuid c9111bf4-5feb-4dd1-9e96-377b9a3b5c60)
  )
  (junction (at 152.4 48.26) (diameter 0) (color 0 0 0 0)
    (uuid ca235a15-98be-4211-9a3f-88d5d5462b39)
  )
  (junction (at 152.4 38.1) (diameter 0) (color 0 0 0 0)
    (uuid cbb249aa-dbbe-4175-bb97-0ebf2a58b18f)
  )
  (junction (at 217.17 38.1) (diameter 0) (color 0 0 0 0)
    (uuid d22e5469-889c-40e0-8a4d-0c13a0470584)
  )
  (junction (at 163.83 38.1) (diameter 0) (color 0 0 0 0)
    (uuid e3978438-1ee1-40a2-aea7-099b4d2e4656)
  )
  (junction (at 129.54 38.1) (diameter 0) (color 0 0 0 0)
    (uuid e4da6bb8-2af4-4a9a-8e1c-4d3af04a2dfc)
  )
  (junction (at 43.18 38.1) (diameter 0) (color 0 0 0 0)
    (uuid e663a179-f756-4f47-bd5d-e3958b1bf183)
  )
  (junction (at 172.72 38.1) (diameter 0) (color 0 0 0 0)
    (uuid ea87688b-8b42-49a7-a484-4042caf712b0)
  )
  (junction (at 237.49 38.1) (diameter 0) (color 0 0 0 0)
    (uuid fa41b00d-43a8-4d34-9323-6a1dae3f248b)
  )

  (wire (pts (xy 196.85 38.1) (xy 217.17 38.1))
    (stroke (width 0) (type default) (color 0 0 0 0))
    (uuid 004d39a2-2856-4e48-a4cd-642d7ee5f874)
  )
  (wire (pts (xy 176.53 38.1) (xy 172.72 38.1))
    (stroke (width 0) (type default) (color 0 0 0 0))
    (uuid 013ba58f-53ea-4a60-80c6-6e3648317be1)
  )
  (wire (pts (xy 93.98 38.1) (xy 88.9 38.1))
    (stroke (width 0) (type default) (color 0 0 0 0))
    (uuid 01740046-26aa-4706-bce7-ea380778d3c0)
  )
  (wire (pts (xy 237.49 39.37) (xy 237.49 38.1))
    (stroke (width 0) (type default) (color 0 0 0 0))
    (uuid 057805c9-460f-4a05-95b6-7ea15da8ddef)
  )
  (wire (pts (xy 217.17 39.37) (xy 217.17 38.1))
    (stroke (width 0) (type default) (color 0 0 0 0))
    (uuid 0b8ba9a3-14db-471b-a56f-7fb91a5d82d5)
  )
  (wire (pts (xy 43.18 38.1) (xy 31.75 38.1))
    (stroke (width 0) (type default) (color 0 0 0 0))
    (uuid 0f6a7a94-1068-40c8-9b36-f59674a10696)
  )
  (wire (pts (xy 43.18 38.1) (xy 43.18 43.18))
    (stroke (width 0) (type default) (color 0 0 0 0))
    (uuid 11c7d80a-19b9-4ac7-8615-cb528144807c)
  )
  (wire (pts (xy 176.53 49.53) (xy 176.53 46.99))
    (stroke (width 0) (type default) (color 0 0 0 0))
    (uuid 131c8b3b-0256-4c7a-a9b6-f04894303327)
  )
  (wire (pts (xy 91.44 58.42) (xy 91.44 55.88))
    (stroke (width 0) (type default) (color 0 0 0 0))
    (uuid 140ee331-9d9b-4035-88d8-52bbf0a699ac)
  )
  (wire (pts (xy 127 46.99) (xy 124.46 46.99))
    (stroke (width 0) (type default) (color 0 0 0 0))
    (uuid 1adf84d7-d06f-47db-9309-c60c51fe71f7)
  )
  (wire (pts (xy 113.03 25.4) (xy 114.3 25.4))
    (stroke (width 0) (type default) (color 0 0 0 0))
    (uuid 214cd333-31a6-45b6-9ead-36fcc9982e55)
  )
  (wire (pts (xy 217.17 38.1) (xy 237.49 38.1))
    (stroke (width 0) (type default) (color 0 0 0 0))
    (uuid 25ee904f-19cb-4d7a-832c-b6009c1a99ca)
  )
  (wire (pts (xy 124.46 35.56) (xy 129.54 35.56))
    (stroke (width 0) (type default) (color 0 0 0 0))
    (uuid 296e48a6-434f-4dc7-a323-6113d515d1e8)
  )
  (wire (pts (xy 152.4 38.1) (xy 163.83 38.1))
    (stroke (width 0) (type default) (color 0 0 0 0))
    (uuid 2a620647-c341-432e-9551-988fdd098ec8)
  )
  (wire (pts (xy 82.55 76.2) (xy 82.55 73.66))
    (stroke (width 0) (type default) (color 0 0 0 0))
    (uuid 2f06c145-dff8-41da-963f-e195160e99ec)
  )
  (wire (pts (xy 93.98 35.56) (xy 88.9 35.56))
    (stroke (width 0) (type default) (color 0 0 0 0))
    (uuid 2faa3f19-96a9-4dd7-b09d-189d0ea1d9a1)
  )
  (wire (pts (xy 176.53 57.15) (xy 196.85 57.15))
    (stroke (width 0) (type default) (color 0 0 0 0))
    (uuid 2fb4bab1-ad61-4308-9718-55e2a4892872)
  )
  (wire (pts (xy 31.75 33.02) (xy 31.75 38.1))
    (stroke (width 0) (type default) (color 0 0 0 0))
    (uuid 33112462-586c-4764-95c0-4633c05cdfca)
  )
  (wire (pts (xy 31.75 53.34) (xy 31.75 50.8))
    (stroke (width 0) (type default) (color 0 0 0 0))
    (uuid 3497265b-398a-4cbe-afe1-5d1f8cda4fed)
  )
  (wire (pts (xy 237.49 38.1) (xy 254 38.1))
    (stroke (width 0) (type default) (color 0 0 0 0))
    (uuid 34a4b9bb-7e51-4950-a63b-b81e6d058f38)
  )
  (wire (pts (xy 82.55 66.04) (xy 82.55 57.15))
    (stroke (width 0) (type default) (color 0 0 0 0))
    (uuid 3bc98faf-39a7-4dd0-a9d4-90e9308bf2ad)
  )
  (wire (pts (xy 196.85 49.53) (xy 196.85 46.99))
    (stroke (width 0) (type default) (color 0 0 0 0))
    (uuid 3d2d8f96-6152-4668-b5ef-b88b8286a94c)
  )
  (wire (pts (xy 54.61 38.1) (xy 43.18 38.1))
    (stroke (width 0) (type default) (color 0 0 0 0))
    (uuid 43847696-2206-4b0f-aa6c-990e04458d84)
  )
  (wire (pts (xy 77.47 57.15) (xy 82.55 57.15))
    (stroke (width 0) (type default) (color 0 0 0 0))
    (uuid 45ead97e-921f-4ab8-b9d6-d024bde090be)
  )
  (wire (pts (xy 86.36 50.8) (xy 93.98 50.8))
    (stroke (width 0) (type default) (color 0 0 0 0))
    (uuid 48be4979-c4f8-4e89-982e-4d4b834d87ec)
  )
  (wire (pts (xy 91.44 55.88) (xy 93.98 55.88))
    (stroke (width 0) (type default) (color 0 0 0 0))
    (uuid 50582e1d-911e-4274-ad71-b1c093ea15c4)
  )
  (wire (pts (xy 54.61 38.1) (xy 88.9 38.1))
    (stroke (width 0) (type default) (color 0 0 0 0))
    (uuid 5706f22f-942f-481a-b976-1e0c61bc44da)
  )
  (wire (pts (xy 88.9 59.69) (xy 88.9 53.34))
    (stroke (width 0) (type default) (color 0 0 0 0))
    (uuid 5c30973f-1f87-471d-9227-8e7c3a8f9f31)
  )
  (wire (pts (xy 176.53 38.1) (xy 196.85 38.1))
    (stroke (width 0) (type default) (color 0 0 0 0))
    (uuid 68405f2b-5051-49f3-a732-3e31bc90a171)
  )
  (wire (pts (xy 196.85 39.37) (xy 196.85 38.1))
    (stroke (width 0) (type default) (color 0 0 0 0))
    (uuid 6dea0c90-e093-42fa-9c1b-4f5bb1c98b89)
  )
  (wire (pts (xy 176.53 57.15) (xy 172.72 57.15))
    (stroke (width 0) (type default) (color 0 0 0 0))
    (uuid 715279e4-9e09-4fa1-9298-602c8900f899)
  )
  (wire (pts (xy 128.27 53.34) (xy 124.46 53.34))
    (stroke (width 0) (type default) (color 0 0 0 0))
    (uuid 74f13431-2daa-486a-a505-86428176b345)
  )
  (wire (pts (xy 111.76 67.31) (xy 111.76 63.5))
    (stroke (width 0) (type default) (color 0 0 0 0))
    (uuid 786f5c64-a448-4f1a-be72-546c3998addd)
  )
  (wire (pts (xy 114.3 25.4) (xy 114.3 29.21))
    (stroke (width 0) (type default) (color 0 0 0 0))
    (uuid 7b1f1303-78bc-40fe-bb0a-f1e04367817a)
  )
  (wire (pts (xy 77.47 59.69) (xy 88.9 59.69))
    (stroke (width 0) (type default) (color 0 0 0 0))
    (uuid 83fd40b5-8e3b-4813-bce0-3b85de40ca1f)
  )
  (wire (pts (xy 31.75 38.1) (xy 31.75 43.18))
    (stroke (width 0) (type default) (color 0 0 0 0))
    (uuid 85ebcf79-1c2d-43c5-87e4-5d1c2e33ccbd)
  )
  (wire (pts (xy 64.77 48.26) (xy 64.77 44.45))
    (stroke (width 0) (type default) (color 0 0 0 0))
    (uuid 865689b3-dfc8-41c7-8f28-4c4923c44893)
  )
  (wire (pts (xy 176.53 58.42) (xy 176.53 57.15))
    (stroke (width 0) (type default) (color 0 0 0 0))
    (uuid 8684e95b-7d01-4327-b900-b4064a8b53ff)
  )
  (wire (pts (xy 237.49 49.53) (xy 237.49 46.99))
    (stroke (width 0) (type default) (color 0 0 0 0))
    (uuid 86a560fe-41b1-44a4-89de-d3c6d84b1d88)
  )
  (wire (pts (xy 54.61 38.1) (xy 54.61 43.18))
    (stroke (width 0) (type default) (color 0 0 0 0))
    (uuid 89a1210b-84df-44b7-89db-8924dfea74cb)
  )
  (wire (pts (xy 54.61 53.34) (xy 54.61 50.8))
    (stroke (width 0) (type default) (color 0 0 0 0))
    (uuid 89f635a1-ab93-47bd-aa9c-03d1ebd3c719)
  )
  (wire (pts (xy 124.46 38.1) (xy 129.54 38.1))
    (stroke (width 0) (type default) (color 0 0 0 0))
    (uuid 8a4d54a6-1920-4302-a26d-1d029eccfdb5)
  )
  (wire (pts (xy 163.83 49.53) (xy 163.83 46.99))
    (stroke (width 0) (type default) (color 0 0 0 0))
    (uuid 8ebd91ad-1327-4292-a74c-de1606a93cef)
  )
  (wire (pts (xy 163.83 39.37) (xy 163.83 38.1))
    (stroke (width 0) (type default) (color 0 0 0 0))
    (uuid 90e15297-10ed-4ef9-bca7-1c9c8973c98c)
  )
  (wire (pts (xy 143.51 48.26) (xy 143.51 44.45))
    (stroke (width 0) (type default) (color 0 0 0 0))
    (uuid 9174aaed-40e9-4402-860c-76e1a21fcb27)
  )
  (wire (pts (xy 129.54 35.56) (xy 129.54 38.1))
    (stroke (width 0) (type default) (color 0 0 0 0))
    (uuid 9453180d-834f-481d-9d8f-0440a99fb234)
  )
  (wire (pts (xy 152.4 46.99) (xy 152.4 48.26))
    (stroke (width 0) (type default) (color 0 0 0 0))
    (uuid 96bcba6f-086a-4c72-8c94-b6cdd12a5ad5)
  )
  (wire (pts (xy 86.36 50.8) (xy 86.36 57.15))
    (stroke (width 0) (type default) (color 0 0 0 0))
    (uuid 9f19bf45-e510-4fd1-8f09-31f008745516)
  )
  (wire (pts (xy 152.4 48.26) (xy 152.4 49.53))
    (stroke (width 0) (type default) (color 0 0 0 0))
    (uuid a5fa8b77-5ff9-4d00-85c5-e8e2bcd6888d)
  )
  (wire (pts (xy 217.17 49.53) (xy 217.17 46.99))
    (stroke (width 0) (type default) (color 0 0 0 0))
    (uuid b31b3ebb-0817-4c06-bdbb-7a689f265b30)
  )
  (wire (pts (xy 106.68 63.5) (xy 106.68 67.31))
    (stroke (width 0) (type default) (color 0 0 0 0))
    (uuid bb245c7e-ec50-452a-a17f-bf93af815a5a)
  )
  (wire (pts (xy 43.18 53.34) (xy 43.18 50.8))
    (stroke (width 0) (type default) (color 0 0 0 0))
    (uuid bd7b1ded-478c-4924-a9c4-f3f74cecf8d7)
  )
  (wire (pts (xy 124.46 44.45) (xy 143.51 44.45))
    (stroke (width 0) (type default) (color 0 0 0 0))
    (uuid c47c6b10-272a-42d7-b4c0-cc1e013a7d97)
  )
  (wire (pts (xy 64.77 59.69) (xy 64.77 55.88))
    (stroke (width 0) (type default) (color 0 0 0 0))
    (uuid c63fd1ab-5af8-4239-9b17-846aa410ce27)
  )
  (wire (pts (xy 88.9 35.56) (xy 88.9 38.1))
    (stroke (width 0) (type default) (color 0 0 0 0))
    (uuid c963f4c6-d21d-40d3-b7f4-a8e9eae54f11)
  )
  (wire (pts (xy 105.41 25.4) (xy 104.14 25.4))
    (stroke (width 0) (type default) (color 0 0 0 0))
    (uuid cb11e705-85e4-4ddb-98d6-4ec309febc75)
  )
  (wire (pts (xy 129.54 38.1) (xy 152.4 38.1))
    (stroke (width 0) (type default) (color 0 0 0 0))
    (uuid cf1e3d06-d7e1-476d-8938-ac843825c9fe)
  )
  (wire (pts (xy 143.51 48.26) (xy 152.4 48.26))
    (stroke (width 0) (type default) (color 0 0 0 0))
    (uuid cfdb472a-a326-42c8-878d-6ec723d27334)
  )
  (wire (pts (xy 172.72 38.1) (xy 172.72 57.15))
    (stroke (width 0) (type default) (color 0 0 0 0))
    (uuid d041332e-66db-411d-b2b0-8f5f23494a71)
  )
  (wire (pts (xy 64.77 44.45) (xy 93.98 44.45))
    (stroke (width 0) (type default) (color 0 0 0 0))
    (uuid d7afeacf-a666-4beb-bb81-270275c2cb05)
  )
  (wire (pts (xy 152.4 39.37) (xy 152.4 38.1))
    (stroke (width 0) (type default) (color 0 0 0 0))
    (uuid d93e2fbc-9cb0-4e83-b26a-3df1718271eb)
  )
  (wire (pts (xy 172.72 38.1) (xy 163.83 38.1))
    (stroke (width 0) (type default) (color 0 0 0 0))
    (uuid da9c7976-1757-49b7-ac42-eb14be04e2ac)
  )
  (wire (pts (xy 152.4 59.69) (xy 152.4 57.15))
    (stroke (width 0) (type default) (color 0 0 0 0))
    (uuid dcb05ee6-2136-4f60-9f9a-1f72d57f18c6)
  )
  (wire (pts (xy 176.53 39.37) (xy 176.53 38.1))
    (stroke (width 0) (type default) (color 0 0 0 0))
    (uuid de8f7cd3-a88d-4df3-977e-e06743b940e2)
  )
  (wire (pts (xy 104.14 25.4) (xy 104.14 29.21))
    (stroke (width 0) (type default) (color 0 0 0 0))
    (uuid e011c297-361e-4d37-908e-0908c1ea3506)
  )
  (wire (pts (xy 82.55 57.15) (xy 86.36 57.15))
    (stroke (width 0) (type default) (color 0 0 0 0))
    (uuid e9d6cc9b-2ca0-4bdc-855e-ae28fd4e7aaa)
  )
  (wire (pts (xy 176.53 68.58) (xy 176.53 66.04))
    (stroke (width 0) (type default) (color 0 0 0 0))
    (uuid eefa62b0-7985-4153-9454-98c24aeb544a)
  )
  (wire (pts (xy 196.85 58.42) (xy 196.85 57.15))
    (stroke (width 0) (type default) (color 0 0 0 0))
    (uuid f54b214d-5c79-4c00-9a80-3327043a80b8)
  )
  (wire (pts (xy 88.9 53.34) (xy 93.98 53.34))
    (stroke (width 0) (type default) (color 0 0 0 0))
    (uuid f594118f-f9b1-42ad-a9ba-304673dbb34e)
  )
  (wire (pts (xy 196.85 68.58) (xy 196.85 66.04))
    (stroke (width 0) (type default) (color 0 0 0 0))
    (uuid f59c2b07-b892-4219-96e2-4a24e8514865)
  )

  (label "V_AUX" (at 67.31 44.45 0)
    (effects (font (size 1.27 1.27)) (justify left bottom))
    (uuid 35eedeed-866f-4dca-a2ec-c99d7e05f252)
  )
  (label "DCDC_OUT" (at 184.15 38.1 0)
    (effects (font (size 1.27 1.27)) (justify left bottom))
    (uuid 553557fc-7862-454d-a06b-e8554b945d75)
  )
  (label "L2" (at 114.3 25.4 0)
    (effects (font (size 1.27 1.27)) (justify left bottom))
    (uuid 657f65c6-4bd1-4c35-9518-8314bb2fb5dd)
  )
  (label "L1" (at 104.14 25.4 0)
    (effects (font (size 1.27 1.27)) (justify left bottom))
    (uuid 9d268bf4-acbb-4606-bb88-6343f0a1976e)
  )
  (label "FB" (at 129.54 44.45 0)
    (effects (font (size 1.27 1.27)) (justify left bottom))
    (uuid f1e0a969-3f31-43e1-8ed5-c932669903f1)
  )

  (hierarchical_label "MAX10_6V" (shape output) (at 254 38.1 0)
    (effects (font (size 1.27 1.27)) (justify left))
    (uuid 0f0720d2-71fa-4978-b705-1c34b30263cc)
  )
  (hierarchical_label "DCDC_PG" (shape output) (at 128.27 53.34 0)
    (effects (font (size 1.27 1.27)) (justify left))
    (uuid 4e6c9f91-89d1-4d59-b1ef-8f1891ea767d)
  )
  (hierarchical_label "EN" (shape input) (at 77.47 57.15 180)
    (effects (font (size 1.27 1.27)) (justify right))
    (uuid c002961d-2241-4f3c-bd93-0e143909bf1b)
  )
  (hierarchical_label "PS_SYNC" (shape input) (at 77.47 59.69 180)
    (effects (font (size 1.27 1.27)) (justify right))
    (uuid c581271b-42f0-4e3f-b8c9-a824614bb7e7)
  )

  (symbol (lib_id "power:GND") (at 106.68 67.31 0)
    (in_bom yes) (on_board yes)
    (uuid 00000000-0000-0000-0000-0000606722b7)
    (property "Reference" "#PWR?" (id 0) (at 106.68 73.66 0)
      (effects (font (size 1.27 1.27)) hide)
    )
    (property "Value" "GND" (id 1) (at 106.807 71.7042 0))
    (property "Footprint" "" (id 2) (at 106.68 67.31 0)
      (effects (font (size 1.27 1.27)) hide)
    )
    (property "Datasheet" "" (id 3) (at 106.68 67.31 0)
      (effects (font (size 1.27 1.27)) hide)
    )
    (pin "1" (uuid f9b7bcbb-4b48-4232-a901-1d761ddbbe54))
  )

  (symbol (lib_id "power:GND") (at 111.76 67.31 0)
    (in_bom yes) (on_board yes)
    (uuid 00000000-0000-0000-0000-0000606722bd)
    (property "Reference" "#PWR?" (id 0) (at 111.76 73.66 0)
      (effects (font (size 1.27 1.27)) hide)
    )
    (property "Value" "GND" (id 1) (at 111.887 71.7042 0))
    (property "Footprint" "" (id 2) (at 111.76 67.31 0)
      (effects (font (size 1.27 1.27)) hide)
    )
    (property "Datasheet" "" (id 3) (at 111.76 67.31 0)
      (effects (font (size 1.27 1.27)) hide)
    )
    (pin "1" (uuid 312fd197-8dd1-4254-86ba-432fa00957c8))
  )

  (symbol (lib_id "000_PreferredParts:C_100nF") (at 64.77 52.07 0)
    (in_bom yes) (on_board yes)
    (uuid 00000000-0000-0000-0000-0000606722c9)
    (property "Reference" "C3509" (id 0) (at 67.691 50.9016 0)
      (effects (font (size 1.27 1.27)) (justify left))
    )
    (property "Value" "C_100nF" (id 1) (at 65.405 54.61 0)
      (effects (font (size 1.27 1.27)) (justify left) hide)
    )
    (property "Footprint" "Capacitor_SMD:C_0402_1005Metric" (id 2) (at 65.7352 55.88 0)
      (effects (font (size 1.27 1.27)) hide)
    )
    (property "Datasheet" "~" (id 3) (at 64.77 52.07 0)
      (effects (font (size 1.27 1.27)) hide)
    )
    (property "Manufacturer" "Murata Electronics" (id 4) (at 64.77 52.07 0)
      (effects (font (size 1.27 1.27)) hide)
    )
    (property "PartNumber" "GRM155R62A104KE14D" (id 5) (at 64.77 52.07 0)
      (effects (font (size 1.27 1.27)) hide)
    )
    (property "DisplayValue" "100nF" (id 6) (at 68.58 54.61 0))
    (property "PartSpecification" "3000-0000000125" (id 7) (at 64.77 52.07 0)
      (effects (font (size 1.27 1.27)) hide)
    )
    (pin "1" (uuid 60970c7c-561a-4309-9b48-67c9b2ff1c5e))
    (pin "2" (uuid 3695653e-e359-48e0-8c75-963c3de8e8c3))
  )

  (symbol (lib_id "power:GND") (at 64.77 59.69 0)
    (in_bom yes) (on_board yes)
    (uuid 00000000-0000-0000-0000-0000606722d0)
    (property "Reference" "#PWR?" (id 0) (at 64.77 66.04 0)
      (effects (font (size 1.27 1.27)) hide)
    )
    (property "Value" "GND" (id 1) (at 64.897 64.0842 0))
    (property "Footprint" "" (id 2) (at 64.77 59.69 0)
      (effects (font (size 1.27 1.27)) hide)
    )
    (property "Datasheet" "" (id 3) (at 64.77 59.69 0)
      (effects (font (size 1.27 1.27)) hide)
    )
    (pin "1" (uuid 63084d79-e788-42a9-babc-c7b45d215314))
  )

  (symbol (lib_id "Device:C") (at 54.61 46.99 0)
    (in_bom yes) (on_board yes)
    (uuid 00000000-0000-0000-0000-0000606722da)
    (property "Reference" "C3508" (id 0) (at 57.531 45.8216 0)
      (effects (font (size 1.27 1.27)) (justify left))
    )
    (property "Value" "10uF" (id 1) (at 57.531 48.133 0)
      (effects (font (size 1.27 1.27)) (justify left))
    )
    (property "Footprint" "Capacitor_SMD:C_0603_1608Metric" (id 2) (at 55.5752 50.8 0)
      (effects (font (size 1.27 1.27)) hide)
    )
    (property "Datasheet" "~" (id 3) (at 54.61 46.99 0)
      (effects (font (size 1.27 1.27)) hide)
    )
    (property "Manufacturer" "Murata Electronics" (id 4) (at 54.61 46.99 0)
      (effects (font (size 1.27 1.27)) hide)
    )
    (property "PartNumber" "GRM188R6YA106MA73D" (id 5) (at 54.61 46.99 0)
      (effects (font (size 1.27 1.27)) hide)
    )
    (property "PartSpecification" "3000-0000000135" (id 6) (at 54.61 46.99 0)
      (effects (font (size 1.27 1.27)) hide)
    )
    (pin "1" (uuid fe39a8ff-1df2-4510-83ff-8c62cfcf1241))
    (pin "2" (uuid aeb4e1ec-f811-4c71-ba60-0d8a3d80763a))
  )

  (symbol (lib_id "Device:C") (at 43.18 46.99 0)
    (in_bom yes) (on_board yes)
    (uuid 00000000-0000-0000-0000-0000606722e3)
    (property "Reference" "C3507" (id 0) (at 46.101 45.8216 0)
      (effects (font (size 1.27 1.27)) (justify left))
    )
    (property "Value" "10uF" (id 1) (at 46.101 48.133 0)
      (effects (font (size 1.27 1.27)) (justify left))
    )
    (property "Footprint" "Capacitor_SMD:C_0805_2012Metric" (id 2) (at 44.1452 50.8 0)
      (effects (font (size 1.27 1.27)) hide)
    )
    (property "Datasheet" "~" (id 3) (at 43.18 46.99 0)
      (effects (font (size 1.27 1.27)) hide)
    )
    (property "Manufacturer" "Murata Electronics" (id 4) (at 43.18 46.99 0)
      (effects (font (size 1.27 1.27)) hide)
    )
    (property "PartNumber" "GRM21BC8YA106ME11L" (id 5) (at 43.18 46.99 0)
      (effects (font (size 1.27 1.27)) hide)
    )
    (property "PartSpecification" "3000-0000000134" (id 6) (at 43.18 46.99 0)
      (effects (font (size 1.27 1.27)) hide)
    )
    (pin "1" (uuid 1f8ab699-e437-40aa-b95c-d01f46520a15))
    (pin "2" (uuid a6f7428d-2d41-4566-8d5b-4de61a7676e4))
  )

  (symbol (lib_id "Device:C") (at 31.75 46.99 0)
    (in_bom yes) (on_board yes)
    (uuid 00000000-0000-0000-0000-0000606722ec)
    (property "Reference" "C3506" (id 0) (at 34.671 45.8216 0)
      (effects (font (size 1.27 1.27)) (justify left))
    )
    (property "Value" "10uF" (id 1) (at 34.671 48.133 0)
      (effects (font (size 1.27 1.27)) (justify left))
    )
    (property "Footprint" "Capacitor_SMD:C_0805_2012Metric" (id 2) (at 32.7152 50.8 0)
      (effects (font (size 1.27 1.27)) hide)
    )
    (property "Datasheet" "~" (id 3) (at 31.75 46.99 0)
      (effects (font (size 1.27 1.27)) hide)
    )
    (property "Manufacturer" "Murata Electronics" (id 4) (at 31.75 46.99 0)
      (effects (font (size 1.27 1.27)) hide)
    )
    (property "PartNumber" "GRM21BC8YA106ME11L" (id 5) (at 31.75 46.99 0)
      (effects (font (size 1.27 1.27)) hide)
    )
    (property "PartSpecification" "3000-0000000134" (id 6) (at 31.75 46.99 0)
      (effects (font (size 1.27 1.27)) hide)
    )
    (pin "1" (uuid ca9d9fa6-c081-4934-a0c1-f1cde7f12c16))
    (pin "2" (uuid e0bb0700-657a-4c88-80a4-765cf81ea311))
  )

  (symbol (lib_id "power:GND") (at 54.61 53.34 0)
    (in_bom yes) (on_board yes)
    (uuid 00000000-0000-0000-0000-0000606722f2)
    (property "Reference" "#PWR?" (id 0) (at 54.61 59.69 0)
      (effects (font (size 1.27 1.27)) hide)
    )
    (property "Value" "GND" (id 1) (at 54.737 57.7342 0))
    (property "Footprint" "" (id 2) (at 54.61 53.34 0)
      (effects (font (size 1.27 1.27)) hide)
    )
    (property "Datasheet" "" (id 3) (at 54.61 53.34 0)
      (effects (font (size 1.27 1.27)) hide)
    )
    (pin "1" (uuid ad1a5065-4157-45e5-b370-c34bb58a64d7))
  )

  (symbol (lib_id "power:GND") (at 43.18 53.34 0)
    (in_bom yes) (on_board yes)
    (uuid 00000000-0000-0000-0000-0000606722f8)
    (property "Reference" "#PWR?" (id 0) (at 43.18 59.69 0)
      (effects (font (size 1.27 1.27)) hide)
    )
    (property "Value" "GND" (id 1) (at 43.307 57.7342 0))
    (property "Footprint" "" (id 2) (at 43.18 53.34 0)
      (effects (font (size 1.27 1.27)) hide)
    )
    (property "Datasheet" "" (id 3) (at 43.18 53.34 0)
      (effects (font (size 1.27 1.27)) hide)
    )
    (pin "1" (uuid c009b415-7e81-4273-b499-6854b83d5a11))
  )

  (symbol (lib_id "power:GND") (at 31.75 53.34 0)
    (in_bom yes) (on_board yes)
    (uuid 00000000-0000-0000-0000-0000606722fe)
    (property "Reference" "#PWR?" (id 0) (at 31.75 59.69 0)
      (effects (font (size 1.27 1.27)) hide)
    )
    (property "Value" "GND" (id 1) (at 31.877 57.7342 0))
    (property "Footprint" "" (id 2) (at 31.75 53.34 0)
      (effects (font (size 1.27 1.27)) hide)
    )
    (property "Datasheet" "" (id 3) (at 31.75 53.34 0)
      (effects (font (size 1.27 1.27)) hide)
    )
    (pin "1" (uuid 93fc29d0-9be1-495f-920c-1773b1217514))
  )

  (symbol (lib_id "Device:L") (at 109.22 25.4 90)
    (in_bom yes) (on_board yes)
    (uuid 00000000-0000-0000-0000-000060672318)
    (property "Reference" "L3501" (id 0) (at 109.22 20.574 90))
    (property "Value" "1.5uH" (id 1) (at 109.22 22.8854 90))
    (property "Footprint" "Inductor_SMD:L_Taiyo-Yuden_MD-4040" (id 2) (at 109.22 25.4 0)
      (effects (font (size 1.27 1.27)) hide)
    )
    (property "Datasheet" "~" (id 3) (at 109.22 25.4 0)
      (effects (font (size 1.27 1.27)) hide)
    )
    (property "Manufacturer" "ABRACON" (id 4) (at 109.22 25.4 0)
      (effects (font (size 1.27 1.27)) hide)
    )
    (property "PartNumber" "ASPI-4030S-1R5N-T" (id 5) (at 109.22 25.4 0)
      (effects (font (size 1.27 1.27)) hide)
    )
    (property "PartSpecification" "3000-0000000076" (id 6) (at 109.22 25.4 90)
      (effects (font (size 1.27 1.27)) hide)
    )
    (pin "1" (uuid 7c9209fd-1386-4701-b9fd-bf8285e592ce))
    (pin "2" (uuid 33b00c2f-c4cb-497d-b7cb-e329687994e5))
  )

  (symbol (lib_id "Device:C") (at 163.83 43.18 0)
    (in_bom yes) (on_board yes)
    (uuid 00000000-0000-0000-0000-000060672325)
    (property "Reference" "C3501" (id 0) (at 166.751 42.0116 0)
      (effects (font (size 1.27 1.27)) (justify left))
    )
    (property "Value" "10uF" (id 1) (at 166.751 44.323 0)
      (effects (font (size 1.27 1.27)) (justify left))
    )
    (property "Footprint" "Capacitor_SMD:C_0603_1608Metric" (id 2) (at 164.7952 46.99 0)
      (effects (font (size 1.27 1.27)) hide)
    )
    (property "Datasheet" "~" (id 3) (at 163.83 43.18 0)
      (effects (font (size 1.27 1.27)) hide)
    )
    (property "Manufacturer" "Murata Electronics" (id 4) (at 163.83 43.18 0)
      (effects (font (size 1.27 1.27)) hide)
    )
    (property "PartNumber" "GRM188R6YA106MA73D" (id 5) (at 163.83 43.18 0)
      (effects (font (size 1.27 1.27)) hide)
    )
    (property "PartSpecification" "3000-0000000135" (id 6) (at 163.83 43.18 0)
      (effects (font (size 1.27 1.27)) hide)
    )
    (pin "1" (uuid 33b54418-1667-4e02-bdfc-31f358f8994d))
    (pin "2" (uuid 9cd795ef-320a-44cb-bff1-52c1e2efa902))
  )

  (symbol (lib_id "Device:R") (at 152.4 43.18 0)
    (in_bom yes) (on_board yes)
    (uuid 00000000-0000-0000-0000-00006067232e)
    (property "Reference" "R3501" (id 0) (at 154.178 42.0116 0)
      (effects (font (size 1.27 1.27)) (justify left))
    )
    (property "Value" "1M" (id 1) (at 154.178 44.323 0)
      (effects (font (size 1.27 1.27)) (justify left))
    )
    (property "Footprint" "Resistor_SMD:R_0402_1005Metric" (id 2) (at 150.622 43.18 90)
      (effects (font (size 1.27 1.27)) hide)
    )
    (property "Datasheet" "~" (id 3) (at 152.4 43.18 0)
      (effects (font (size 1.27 1.27)) hide)
    )
    (property "Manufacturer" "" (id 4) (at 152.4 43.18 0)
      (effects (font (size 1.27 1.27)) hide)
    )
    (property "PartNumber" "" (id 5) (at 152.4 43.18 0)
      (effects (font (size 1.27 1.27)) hide)
    )
    (property "PartSpecification" "3000-0000000139" (id 6) (at 152.4 43.18 0)
      (effects (font (size 1.27 1.27)) hide)
    )
    (pin "1" (uuid a4f3942a-5db6-4b6b-bd30-5a5c7b1d1a55))
    (pin "2" (uuid e75f6a8c-0774-484d-8bf7-730910475109))
  )

  (symbol (lib_id "Device:R") (at 152.4 53.34 0)
    (in_bom yes) (on_board yes)
    (uuid 00000000-0000-0000-0000-00006067233a)
    (property "Reference" "R3502" (id 0) (at 154.178 52.1716 0)
      (effects (font (size 1.27 1.27)) (justify left))
    )
    (property "Value" "150k" (id 1) (at 154.178 54.483 0)
      (effects (font (size 1.27 1.27)) (justify left))
    )
    (property "Footprint" "Resistor_SMD:R_0402_1005Metric" (id 2) (at 150.622 53.34 90)
      (effects (font (size 1.27 1.27)) hide)
    )
    (property "Datasheet" "~" (id 3) (at 152.4 53.34 0)
      (effects (font (size 1.27 1.27)) hide)
    )
    (property "Manufacturer" "Stackpole Electronics Inc" (id 4) (at 152.4 53.34 0)
      (effects (font (size 1.27 1.27)) hide)
    )
    (property "PartNumber" "" (id 5) (at 152.4 53.34 0)
      (effects (font (size 1.27 1.27)) hide)
    )
    (property "PartSpecification" "3000-0000000579" (id 6) (at 152.4 53.34 0)
      (effects (font (size 1.27 1.27)) hide)
    )
    (pin "1" (uuid 9b99687f-2e0c-46fa-8ab0-c2f7a1a8ae6b))
    (pin "2" (uuid 60e1e47b-625d-4891-8b1e-870f5529a6b4))
  )

  (symbol (lib_id "power:GND") (at 152.4 59.69 0)
    (in_bom yes) (on_board yes)
    (uuid 00000000-0000-0000-0000-000060672346)
    (property "Reference" "#PWR?" (id 0) (at 152.4 66.04 0)
      (effects (font (size 1.27 1.27)) hide)
    )
    (property "Value" "GND" (id 1) (at 152.527 64.0842 0))
    (property "Footprint" "" (id 2) (at 152.4 59.69 0)
      (effects (font (size 1.27 1.27)) hide)
    )
    (property "Datasheet" "" (id 3) (at 152.4 59.69 0)
      (effects (font (size 1.27 1.27)) hide)
    )
    (pin "1" (uuid d1914eaf-348f-4217-ad17-66148783cd06))
  )

  (symbol (lib_id "power:GND") (at 163.83 49.53 0)
    (in_bom yes) (on_board yes)
    (uuid 00000000-0000-0000-0000-00006067234f)
    (property "Reference" "#PWR?" (id 0) (at 163.83 55.88 0)
      (effects (font (size 1.27 1.27)) hide)
    )
    (property "Value" "GND" (id 1) (at 163.957 53.9242 0))
    (property "Footprint" "" (id 2) (at 163.83 49.53 0)
      (effects (font (size 1.27 1.27)) hide)
    )
    (property "Datasheet" "" (id 3) (at 163.83 49.53 0)
      (effects (font (size 1.27 1.27)) hide)
    )
    (pin "1" (uuid f63e77f5-e0ff-4927-8a8a-d1a4eddec609))
  )

  (symbol (lib_id "power:GND") (at 176.53 49.53 0)
    (in_bom yes) (on_board yes)
    (uuid 00000000-0000-0000-0000-000060672356)
    (property "Reference" "#PWR?" (id 0) (at 176.53 55.88 0)
      (effects (font (size 1.27 1.27)) hide)
    )
    (property "Value" "GND" (id 1) (at 176.657 53.9242 0))
    (property "Footprint" "" (id 2) (at 176.53 49.53 0)
      (effects (font (size 1.27 1.27)) hide)
    )
    (property "Datasheet" "" (id 3) (at 176.53 49.53 0)
      (effects (font (size 1.27 1.27)) hide)
    )
    (pin "1" (uuid 1360beef-6834-457f-8167-560d9631e7a6))
  )

  (symbol (lib_id "power:GND") (at 196.85 49.53 0)
    (in_bom yes) (on_board yes)
    (uuid 00000000-0000-0000-0000-000060672360)
    (property "Reference" "#PWR?" (id 0) (at 196.85 55.88 0)
      (effects (font (size 1.27 1.27)) hide)
    )
    (property "Value" "GND" (id 1) (at 196.977 53.9242 0))
    (property "Footprint" "" (id 2) (at 196.85 49.53 0)
      (effects (font (size 1.27 1.27)) hide)
    )
    (property "Datasheet" "" (id 3) (at 196.85 49.53 0)
      (effects (font (size 1.27 1.27)) hide)
    )
    (pin "1" (uuid 31fd2802-ad18-4796-b4ef-a3a01596dbbc))
  )

  (symbol (lib_id "power:GND") (at 217.17 49.53 0)
    (in_bom yes) (on_board yes)
    (uuid 00000000-0000-0000-0000-000060672368)
    (property "Reference" "#PWR?" (id 0) (at 217.17 55.88 0)
      (effects (font (size 1.27 1.27)) hide)
    )
    (property "Value" "GND" (id 1) (at 217.297 53.9242 0))
    (property "Footprint" "" (id 2) (at 217.17 49.53 0)
      (effects (font (size 1.27 1.27)) hide)
    )
    (property "Datasheet" "" (id 3) (at 217.17 49.53 0)
      (effects (font (size 1.27 1.27)) hide)
    )
    (pin "1" (uuid 98678816-af92-4ac4-8382-61ff1b890508))
  )

  (symbol (lib_id "000_PreferredParts:C_10uF_0805") (at 176.53 43.18 0)
    (in_bom yes) (on_board yes)
    (uuid 00000000-0000-0000-0000-00006067237b)
    (property "Reference" "C3502" (id 0) (at 179.451 42.0116 0)
      (effects (font (size 1.27 1.27)) (justify left))
    )
    (property "Value" "C_10uF_0805" (id 1) (at 179.451 44.323 0)
      (effects (font (size 1.27 1.27)) (justify left))
    )
    (property "Footprint" "Capacitor_SMD:C_0805_2012Metric" (id 2) (at 177.4952 46.99 0)
      (effects (font (size 1.27 1.27)) hide)
    )
    (property "Datasheet" "~" (id 3) (at 176.53 43.18 0)
      (effects (font (size 1.27 1.27)) hide)
    )
    (property "Manufacturer" "Murata Electronics" (id 4) (at 176.53 43.18 0)
      (effects (font (size 1.27 1.27)) hide)
    )
    (property "PartNumber" "GRM21BC8YA106ME11L" (id 5) (at 176.53 43.18 0)
      (effects (font (size 1.27 1.27)) hide)
    )
    (property "PartSpecification" "3000-0000000134" (id 6) (at 176.53 43.18 0)
      (effects (font (size 1.27 1.27)) hide)
    )
    (pin "1" (uuid 2af82de2-6670-48f9-bb25-dbb30ec98efb))
    (pin "2" (uuid 73744201-b9b2-404a-86c8-acb0ddbb9c69))
  )

  (symbol (lib_id "000_PreferredParts:C_10uF_0805") (at 196.85 43.18 0)
    (in_bom yes) (on_board yes)
    (uuid 00000000-0000-0000-0000-000060672384)
    (property "Reference" "C3503" (id 0) (at 199.771 42.0116 0)
      (effects (font (size 1.27 1.27)) (justify left))
    )
    (property "Value" "C_10uF_0805" (id 1) (at 199.771 44.323 0)
      (effects (font (size 1.27 1.27)) (justify left))
    )
    (property "Footprint" "Capacitor_SMD:C_0805_2012Metric" (id 2) (at 197.8152 46.99 0)
      (effects (font (size 1.27 1.27)) hide)
    )
    (property "Datasheet" "~" (id 3) (at 196.85 43.18 0)
      (effects (font (size 1.27 1.27)) hide)
    )
    (property "Manufacturer" "Murata Electronics" (id 4) (at 196.85 43.18 0)
      (effects (font (size 1.27 1.27)) hide)
    )
    (property "PartNumber" "GRM21BC8YA106ME11L" (id 5) (at 196.85 43.18 0)
      (effects (font (size 1.27 1.27)) hide)
    )
    (property "PartSpecification" "3000-0000000134" (id 6) (at 196.85 43.18 0)
      (effects (font (size 1.27 1.27)) hide)
    )
    (pin "1" (uuid 57ebe5ce-bf2d-47d7-8def-415a89d31231))
    (pin "2" (uuid 9b29ad62-5bec-4c65-ba52-09f04a9ffabf))
  )

  (symbol (lib_id "000_PreferredParts:C_10uF_0805") (at 217.17 43.18 0)
    (in_bom yes) (on_board yes)
    (uuid 00000000-0000-0000-0000-00006067238d)
    (property "Reference" "C3504" (id 0) (at 220.091 42.0116 0)
      (effects (font (size 1.27 1.27)) (justify left))
    )
    (property "Value" "C_10uF_0805" (id 1) (at 220.091 44.323 0)
      (effects (font (size 1.27 1.27)) (justify left))
    )
    (property "Footprint" "Capacitor_SMD:C_0805_2012Metric" (id 2) (at 218.1352 46.99 0)
      (effects (font (size 1.27 1.27)) hide)
    )
    (property "Datasheet" "~" (id 3) (at 217.17 43.18 0)
      (effects (font (size 1.27 1.27)) hide)
    )
    (property "Manufacturer" "Murata Electronics" (id 4) (at 217.17 43.18 0)
      (effects (font (size 1.27 1.27)) hide)
    )
    (property "PartNumber" "GRM21BC8YA106ME11L" (id 5) (at 217.17 43.18 0)
      (effects (font (size 1.27 1.27)) hide)
    )
    (property "PartSpecification" "3000-0000000134" (id 6) (at 217.17 43.18 0)
      (effects (font (size 1.27 1.27)) hide)
    )
    (pin "1" (uuid d0c4cbca-3b82-4433-bb88-ab0135c77e33))
    (pin "2" (uuid 98b47629-c5fe-474a-8b88-7e2aef84780a))
  )

  (symbol (lib_id "power:GND") (at 176.53 68.58 0)
    (in_bom yes) (on_board yes)
    (uuid 00000000-0000-0000-0000-000060672393)
    (property "Reference" "#PWR?" (id 0) (at 176.53 74.93 0)
      (effects (font (size 1.27 1.27)) hide)
    )
    (property "Value" "GND" (id 1) (at 176.657 72.9742 0))
    (property "Footprint" "" (id 2) (at 176.53 68.58 0)
      (effects (font (size 1.27 1.27)) hide)
    )
    (property "Datasheet" "" (id 3) (at 176.53 68.58 0)
      (effects (font (size 1.27 1.27)) hide)
    )
    (pin "1" (uuid 7dcc2f81-6f88-4736-89ee-908a68a6b0ec))
  )

  (symbol (lib_id "power:GND") (at 196.85 68.58 0)
    (in_bom yes) (on_board yes)
    (uuid 00000000-0000-0000-0000-00006067239c)
    (property "Reference" "#PWR?" (id 0) (at 196.85 74.93 0)
      (effects (font (size 1.27 1.27)) hide)
    )
    (property "Value" "GND" (id 1) (at 196.977 72.9742 0))
    (property "Footprint" "" (id 2) (at 196.85 68.58 0)
      (effects (font (size 1.27 1.27)) hide)
    )
    (property "Datasheet" "" (id 3) (at 196.85 68.58 0)
      (effects (font (size 1.27 1.27)) hide)
    )
    (pin "1" (uuid 3a01815e-4b06-404e-9a51-2b3d96f17dce))
  )

  (symbol (lib_id "power:GND") (at 237.49 49.53 0)
    (in_bom yes) (on_board yes)
    (uuid 00000000-0000-0000-0000-0000606723a4)
    (property "Reference" "#PWR?" (id 0) (at 237.49 55.88 0)
      (effects (font (size 1.27 1.27)) hide)
    )
    (property "Value" "GND" (id 1) (at 237.617 53.9242 0))
    (property "Footprint" "" (id 2) (at 237.49 49.53 0)
      (effects (font (size 1.27 1.27)) hide)
    )
    (property "Datasheet" "" (id 3) (at 237.49 49.53 0)
      (effects (font (size 1.27 1.27)) hide)
    )
    (pin "1" (uuid 8aa1c708-6d2b-4ad3-afc9-18757d89301f))
  )

  (symbol (lib_id "000_PreferredParts:C_10uF_0805") (at 176.53 62.23 0)
    (in_bom yes) (on_board yes)
    (uuid 00000000-0000-0000-0000-0000606723b2)
    (property "Reference" "C3510" (id 0) (at 179.451 61.0616 0)
      (effects (font (size 1.27 1.27)) (justify left))
    )
    (property "Value" "C_10uF_0805" (id 1) (at 179.451 63.373 0)
      (effects (font (size 1.27 1.27)) (justify left))
    )
    (property "Footprint" "Capacitor_SMD:C_0805_2012Metric" (id 2) (at 177.4952 66.04 0)
      (effects (font (size 1.27 1.27)) hide)
    )
    (property "Datasheet" "~" (id 3) (at 176.53 62.23 0)
      (effects (font (size 1.27 1.27)) hide)
    )
    (property "Manufacturer" "Murata Electronics" (id 4) (at 176.53 62.23 0)
      (effects (font (size 1.27 1.27)) hide)
    )
    (property "PartNumber" "GRM21BC8YA106ME11L" (id 5) (at 176.53 62.23 0)
      (effects (font (size 1.27 1.27)) hide)
    )
    (property "PartSpecification" "3000-0000000134" (id 6) (at 176.53 62.23 0)
      (effects (font (size 1.27 1.27)) hide)
    )
    (pin "1" (uuid 862cc289-e8a3-4ed6-bc66-88ac66966564))
    (pin "2" (uuid e5e2479a-bbb7-462a-b974-5372719588d9))
  )

  (symbol (lib_id "000_PreferredParts:C_10uF_0805") (at 196.85 62.23 0)
    (in_bom yes) (on_board yes)
    (uuid 00000000-0000-0000-0000-0000606723bb)
    (property "Reference" "C3511" (id 0) (at 199.771 61.0616 0)
      (effects (font (size 1.27 1.27)) (justify left))
    )
    (property "Value" "C_10uF_0805" (id 1) (at 199.771 63.373 0)
      (effects (font (size 1.27 1.27)) (justify left))
    )
    (property "Footprint" "Capacitor_SMD:C_0805_2012Metric" (id 2) (at 197.8152 66.04 0)
      (effects (font (size 1.27 1.27)) hide)
    )
    (property "Datasheet" "~" (id 3) (at 196.85 62.23 0)
      (effects (font (size 1.27 1.27)) hide)
    )
    (property "Manufacturer" "Murata Electronics" (id 4) (at 196.85 62.23 0)
      (effects (font (size 1.27 1.27)) hide)
    )
    (property "PartNumber" "GRM21BC8YA106ME11L" (id 5) (at 196.85 62.23 0)
      (effects (font (size 1.27 1.27)) hide)
    )
    (property "PartSpecification" "3000-0000000134" (id 6) (at 196.85 62.23 0)
      (effects (font (size 1.27 1.27)) hide)
    )
    (pin "1" (uuid f243645e-602c-412c-b8b7-adc035fc9ae6))
    (pin "2" (uuid 0742f372-76d8-4747-bdfe-018f17358b27))
  )

  (symbol (lib_id "000_PreferredParts:C_10uF_0805") (at 237.49 43.18 0)
    (in_bom yes) (on_board yes)
    (uuid 00000000-0000-0000-0000-0000606723c4)
    (property "Reference" "C3505" (id 0) (at 240.411 42.0116 0)
      (effects (font (size 1.27 1.27)) (justify left))
    )
    (property "Value" "C_10uF_0805" (id 1) (at 240.411 44.323 0)
      (effects (font (size 1.27 1.27)) (justify left))
    )
    (property "Footprint" "Capacitor_SMD:C_0805_2012Metric" (id 2) (at 238.4552 46.99 0)
      (effects (font (size 1.27 1.27)) hide)
    )
    (property "Datasheet" "~" (id 3) (at 237.49 43.18 0)
      (effects (font (size 1.27 1.27)) hide)
    )
    (property "Manufacturer" "Murata Electronics" (id 4) (at 237.49 43.18 0)
      (effects (font (size 1.27 1.27)) hide)
    )
    (property "PartNumber" "GRM21BC8YA106ME11L" (id 5) (at 237.49 43.18 0)
      (effects (font (size 1.27 1.27)) hide)
    )
    (property "PartSpecification" "3000-0000000134" (id 6) (at 237.49 43.18 0)
      (effects (font (size 1.27 1.27)) hide)
    )
    (pin "1" (uuid 64ef7d6a-b645-4c6a-a9ef-0e3b435a11a7))
    (pin "2" (uuid a7143987-7732-4ac1-ba8b-0e6ea46e01cc))
  )

  (symbol (lib_id "POWDER_Power:TPS63070RNM") (at 109.22 45.72 0)
    (in_bom yes) (on_board yes)
    (uuid 00000000-0000-0000-0000-0000606723e2)
    (property "Reference" "U3501" (id 0) (at 118.11 30.48 0)
      (effects (font (size 1.524 1.524)))
    )
    (property "Value" "TPS63070RNM" (id 1) (at 109.22 40.64 0)
      (effects (font (size 1.524 1.524)))
    )
    (property "Footprint" "POWDER_Power:TPS63070RNMR" (id 2) (at 109.22 47.244 0)
      (effects (font (size 1.524 1.524)) hide)
    )
    (property "Datasheet" "" (id 3) (at 109.22 45.72 0)
      (effects (font (size 1.524 1.524)))
    )
    (property "Manufacturer" "Texas Instruments" (id 4) (at 109.22 45.72 0)
      (effects (font (size 1.27 1.27)) hide)
    )
    (property "PartNumber" "TPS63070RNMR" (id 5) (at 109.22 45.72 0)
      (effects (font (size 1.27 1.27)) hide)
    )
    (property "PartSpecification" "3000-0000000079" (id 6) (at 109.22 45.72 0)
      (effects (font (size 1.27 1.27)) hide)
    )
    (pin "1" (uuid d8a9aacf-4f24-4ea8-b41b-b2fed63bd8ac))
    (pin "10" (uuid da30b145-ffde-421f-8474-fa15e745e5f7))
    (pin "11" (uuid 7bf46448-1ad5-4885-9e4c-4923913b4e94))
    (pin "12" (uuid fc2670f6-cdf3-455e-ae52-a069fed426b9))
    (pin "13" (uuid 5fdea24e-408c-4aa0-856d-c76fa753c719))
    (pin "14" (uuid f6708d8b-8d54-4e78-97cc-f54a3f64b0e8))
    (pin "15" (uuid 17d5d998-d7c1-49f6-a800-2854d34bf5f5))
    (pin "2" (uuid 68c11373-6c42-4fc5-98ed-fce6130a217e))
    (pin "3" (uuid aab6e9cd-c426-49f1-97f4-27d9866ef69a))
    (pin "4" (uuid 3d9e7600-ca0b-4697-bdec-a347e17a7132))
    (pin "5" (uuid 91f4e768-dcf5-49ba-80cd-0c050f801a74))
    (pin "6" (uuid 6c39c839-6c48-4d1c-ad43-396fc89afe00))
    (pin "7" (uuid 35e13365-0867-4de2-ac34-30b742fdf90e))
    (pin "8" (uuid 2f9b27af-7dd3-4ea7-b04c-35de1b61a65c))
    (pin "9" (uuid 6a5da910-c435-4d90-91aa-15ae2b8c3534))
  )

  (symbol (lib_id "power:GND") (at 127 46.99 0)
    (in_bom yes) (on_board yes)
    (uuid 00000000-0000-0000-0000-000060672401)
    (property "Reference" "#PWR?" (id 0) (at 127 53.34 0)
      (effects (font (size 1.27 1.27)) hide)
    )
    (property "Value" "GND" (id 1) (at 127.127 51.3842 0))
    (property "Footprint" "" (id 2) (at 127 46.99 0)
      (effects (font (size 1.27 1.27)) hide)
    )
    (property "Datasheet" "" (id 3) (at 127 46.99 0)
      (effects (font (size 1.27 1.27)) hide)
    )
    (pin "1" (uuid e006ef14-be03-4168-96b4-6203c3856fb6))
  )

  (symbol (lib_id "power:GND") (at 91.44 58.42 0)
    (in_bom yes) (on_board yes)
    (uuid 00000000-0000-0000-0000-00006067240e)
    (property "Reference" "#PWR?" (id 0) (at 91.44 64.77 0)
      (effects (font (size 1.27 1.27)) hide)
    )
    (property "Value" "GND" (id 1) (at 91.567 62.8142 0))
    (property "Footprint" "" (id 2) (at 91.44 58.42 0)
      (effects (font (size 1.27 1.27)) hide)
    )
    (property "Datasheet" "" (id 3) (at 91.44 58.42 0)
      (effects (font (size 1.27 1.27)) hide)
    )
    (pin "1" (uuid aa280bd7-1d71-4c87-9e43-f8215473fa43))
  )

  (symbol (lib_id "power:+12V") (at 31.75 33.02 0) (unit 1)
    (in_bom yes) (on_board yes)
    (uuid 00000000-0000-0000-0000-000060679f73)
    (property "Reference" "#PWR?" (id 0) (at 31.75 36.83 0)
      (effects (font (size 1.27 1.27)) hide)
    )
    (property "Value" "+12V" (id 1) (at 32.131 28.6258 0))
    (property "Footprint" "" (id 2) (at 31.75 33.02 0)
      (effects (font (size 1.27 1.27)) hide)
    )
    (property "Datasheet" "" (id 3) (at 31.75 33.02 0)
      (effects (font (size 1.27 1.27)) hide)
    )
    (pin "1" (uuid 79ea77ca-3362-425c-9d8c-162ae78375a9))
  )

  (symbol (lib_id "Device:R") (at 82.55 69.85 0)
    (in_bom yes) (on_board yes)
    (uuid 00000000-0000-0000-0000-000060a8cc1c)
    (property "Reference" "R3303" (id 0) (at 84.582 69.85 90))
    (property "Value" "10k" (id 1) (at 82.55 69.85 90))
    (property "Footprint" "Resistor_SMD:R_0402_1005Metric" (id 2) (at 80.772 69.85 90)
      (effects (font (size 1.27 1.27)) hide)
    )
    (property "Datasheet" "~" (id 3) (at 82.55 69.85 0)
      (effects (font (size 1.27 1.27)) hide)
    )
    (property "PartSpecification" "3000-0000000131" (id 4) (at 82.55 69.85 0)
      (effects (font (size 1.27 1.27)) hide)
    )
    (pin "1" (uuid 59a83b0d-aed2-4e4f-984b-778ffae4cc06))
    (pin "2" (uuid f2a5654b-dfd6-4009-93ed-8da8b6565abd))
  )

  (symbol (lib_id "power:GND") (at 82.55 76.2 0)
    (in_bom yes) (on_board yes)
    (uuid 00000000-0000-0000-0000-000060a8df40)
    (property "Reference" "#PWR?" (id 0) (at 82.55 82.55 0)
      (effects (font (size 1.27 1.27)) hide)
    )
    (property "Value" "GND" (id 1) (at 82.677 80.5942 0))
    (property "Footprint" "" (id 2) (at 82.55 76.2 0)
      (effects (font (size 1.27 1.27)) hide)
    )
    (property "Datasheet" "" (id 3) (at 82.55 76.2 0)
      (effects (font (size 1.27 1.27)) hide)
    )
    (pin "1" (uuid f484a3b4-b784-4842-869a-c9a5cc41b26a))
  )
)
