EESchema Schematic File Version 4
EELAYER 26 0
EELAYER END
$Descr A4 11693 8268
encoding utf-8
Sheet 4 7
Title ""
Date ""
Rev ""
Comp ""
Comment1 ""
Comment2 ""
Comment3 ""
Comment4 ""
$EndDescr
$Comp
L POWDER_RF:MAAL-011078 U501
U 1 1 5B5677FE
P 5400 4250
AR Path="/5BBFAE41/5B5677FE" Ref="U501"  Part="1" 
AR Path="/5B62603D/5B5677FE" Ref="U401"  Part="1" 
F 0 "U401" H 5941 4296 50  0000 L CNN
F 1 "MAAL-011078" H 5941 4205 50  0000 L CNN
F 2 "Package_DFN_QFN:DFN-8-1EP_2x2mm_P0.5mm_EP1.05x1.75mm" H 5400 4250 50  0001 C CNN
F 3 "" H 5400 4250 50  0001 C CNN
	1    5400 4250
	1    0    0    -1  
$EndComp
$Comp
L Device:C C505
U 1 1 5B567978
P 3900 4250
AR Path="/5BBFAE41/5B567978" Ref="C505"  Part="1" 
AR Path="/5B62603D/5B567978" Ref="C405"  Part="1" 
F 0 "C405" V 3648 4250 50  0000 C CNN
F 1 "C" V 3739 4250 50  0000 C CNN
F 2 "Capacitor_SMD:C_0201_0603Metric" H 3938 4100 50  0001 C CNN
F 3 "~" H 3900 4250 50  0001 C CNN
	1    3900 4250
	0    1    1    0   
$EndComp
$Comp
L Device:C C506
U 1 1 5B5679C9
P 4250 4600
AR Path="/5BBFAE41/5B5679C9" Ref="C506"  Part="1" 
AR Path="/5B62603D/5B5679C9" Ref="C406"  Part="1" 
F 0 "C406" H 4365 4646 50  0000 L CNN
F 1 "C" H 4365 4555 50  0000 L CNN
F 2 "Capacitor_SMD:C_0201_0603Metric" H 4288 4450 50  0001 C CNN
F 3 "~" H 4250 4600 50  0001 C CNN
	1    4250 4600
	1    0    0    -1  
$EndComp
$Comp
L Device:L L503
U 1 1 5B567A19
P 4650 4250
AR Path="/5BBFAE41/5B567A19" Ref="L503"  Part="1" 
AR Path="/5B62603D/5B567A19" Ref="L403"  Part="1" 
F 0 "L403" V 4840 4250 50  0000 C CNN
F 1 "L" V 4749 4250 50  0000 C CNN
F 2 "Inductor_SMD:L_0201_0603Metric" H 4650 4250 50  0001 C CNN
F 3 "~" H 4650 4250 50  0001 C CNN
	1    4650 4250
	0    -1   -1   0   
$EndComp
$Comp
L Device:C C504
U 1 1 5B567A76
P 3550 4600
AR Path="/5BBFAE41/5B567A76" Ref="C504"  Part="1" 
AR Path="/5B62603D/5B567A76" Ref="C404"  Part="1" 
F 0 "C404" H 3665 4646 50  0000 L CNN
F 1 "C" H 3665 4555 50  0000 L CNN
F 2 "Capacitor_SMD:C_0201_0603Metric" H 3588 4450 50  0001 C CNN
F 3 "~" H 3550 4600 50  0001 C CNN
	1    3550 4600
	1    0    0    -1  
$EndComp
$Comp
L power:GND #PWR?
U 1 1 5B567B1A
P 5400 4950
AR Path="/5BBFAE41/5B567B1A" Ref="#PWR?"  Part="1" 
AR Path="/5B62603D/5B567B1A" Ref="#PWR?"  Part="1" 
F 0 "#PWR?" H 5400 4700 50  0001 C CNN
F 1 "GND" H 5405 4777 50  0000 C CNN
F 2 "" H 5400 4950 50  0001 C CNN
F 3 "" H 5400 4950 50  0001 C CNN
	1    5400 4950
	1    0    0    -1  
$EndComp
Wire Wire Line
	5400 4950 5400 4600
$Comp
L Device:C C503
U 1 1 5B567B3D
P 2850 4600
AR Path="/5BBFAE41/5B567B3D" Ref="C503"  Part="1" 
AR Path="/5B62603D/5B567B3D" Ref="C403"  Part="1" 
F 0 "C403" H 2965 4646 50  0000 L CNN
F 1 "C" H 2965 4555 50  0000 L CNN
F 2 "Capacitor_SMD:C_0201_0603Metric" H 2888 4450 50  0001 C CNN
F 3 "~" H 2850 4600 50  0001 C CNN
	1    2850 4600
	1    0    0    -1  
$EndComp
$Comp
L Device:L L502
U 1 1 5B567B71
P 3200 4250
AR Path="/5BBFAE41/5B567B71" Ref="L502"  Part="1" 
AR Path="/5B62603D/5B567B71" Ref="L402"  Part="1" 
F 0 "L402" V 3390 4250 50  0000 C CNN
F 1 "L" V 3299 4250 50  0000 C CNN
F 2 "Inductor_SMD:L_0201_0603Metric" H 3200 4250 50  0001 C CNN
F 3 "~" H 3200 4250 50  0001 C CNN
	1    3200 4250
	0    -1   -1   0   
$EndComp
$Comp
L Device:L L501
U 1 1 5B567BA9
P 2500 4250
AR Path="/5BBFAE41/5B567BA9" Ref="L501"  Part="1" 
AR Path="/5B62603D/5B567BA9" Ref="L401"  Part="1" 
F 0 "L401" V 2690 4250 50  0000 C CNN
F 1 "L" V 2599 4250 50  0000 C CNN
F 2 "Inductor_SMD:L_0201_0603Metric" H 2500 4250 50  0001 C CNN
F 3 "~" H 2500 4250 50  0001 C CNN
	1    2500 4250
	0    -1   -1   0   
$EndComp
$Comp
L Device:C C502
U 1 1 5B567BE9
P 2200 4600
AR Path="/5BBFAE41/5B567BE9" Ref="C502"  Part="1" 
AR Path="/5B62603D/5B567BE9" Ref="C402"  Part="1" 
F 0 "C402" H 2315 4646 50  0000 L CNN
F 1 "C" H 2315 4555 50  0000 L CNN
F 2 "Capacitor_SMD:C_0201_0603Metric" H 2238 4450 50  0001 C CNN
F 3 "~" H 2200 4600 50  0001 C CNN
	1    2200 4600
	1    0    0    -1  
$EndComp
$Comp
L Device:C C501
U 1 1 5B567D50
P 1900 4250
AR Path="/5BBFAE41/5B567D50" Ref="C501"  Part="1" 
AR Path="/5B62603D/5B567D50" Ref="C401"  Part="1" 
F 0 "C401" V 1648 4250 50  0000 C CNN
F 1 "C" V 1739 4250 50  0000 C CNN
F 2 "Capacitor_SMD:C_0201_0603Metric" H 1938 4100 50  0001 C CNN
F 3 "~" H 1900 4250 50  0001 C CNN
	1    1900 4250
	0    1    1    0   
$EndComp
$Comp
L power:GND #PWR?
U 1 1 5B567DDC
P 4250 4950
AR Path="/5BBFAE41/5B567DDC" Ref="#PWR?"  Part="1" 
AR Path="/5B62603D/5B567DDC" Ref="#PWR?"  Part="1" 
F 0 "#PWR?" H 4250 4700 50  0001 C CNN
F 1 "GND" H 4255 4777 50  0000 C CNN
F 2 "" H 4250 4950 50  0001 C CNN
F 3 "" H 4250 4950 50  0001 C CNN
	1    4250 4950
	1    0    0    -1  
$EndComp
$Comp
L power:GND #PWR?
U 1 1 5B567DFB
P 3550 4950
AR Path="/5BBFAE41/5B567DFB" Ref="#PWR?"  Part="1" 
AR Path="/5B62603D/5B567DFB" Ref="#PWR?"  Part="1" 
F 0 "#PWR?" H 3550 4700 50  0001 C CNN
F 1 "GND" H 3555 4777 50  0000 C CNN
F 2 "" H 3550 4950 50  0001 C CNN
F 3 "" H 3550 4950 50  0001 C CNN
	1    3550 4950
	1    0    0    -1  
$EndComp
Wire Wire Line
	1400 4250 1750 4250
Wire Wire Line
	2050 4250 2200 4250
Wire Wire Line
	2200 4450 2200 4250
Connection ~ 2200 4250
Wire Wire Line
	2200 4250 2350 4250
Wire Wire Line
	2850 4450 2850 4250
Wire Wire Line
	2850 4250 2650 4250
Wire Wire Line
	3050 4250 2850 4250
Connection ~ 2850 4250
Wire Wire Line
	3550 4450 3550 4250
Wire Wire Line
	3550 4250 3350 4250
Wire Wire Line
	3750 4250 3550 4250
Connection ~ 3550 4250
Wire Wire Line
	4250 4450 4250 4250
Wire Wire Line
	4250 4250 4050 4250
Wire Wire Line
	4500 4250 4250 4250
Connection ~ 4250 4250
Wire Wire Line
	4900 4250 4800 4250
$Comp
L power:GND #PWR?
U 1 1 5B568257
P 2850 4950
AR Path="/5BBFAE41/5B568257" Ref="#PWR?"  Part="1" 
AR Path="/5B62603D/5B568257" Ref="#PWR?"  Part="1" 
F 0 "#PWR?" H 2850 4700 50  0001 C CNN
F 1 "GND" H 2855 4777 50  0000 C CNN
F 2 "" H 2850 4950 50  0001 C CNN
F 3 "" H 2850 4950 50  0001 C CNN
	1    2850 4950
	1    0    0    -1  
$EndComp
$Comp
L power:GND #PWR?
U 1 1 5B568278
P 2200 4950
AR Path="/5BBFAE41/5B568278" Ref="#PWR?"  Part="1" 
AR Path="/5B62603D/5B568278" Ref="#PWR?"  Part="1" 
F 0 "#PWR?" H 2200 4700 50  0001 C CNN
F 1 "GND" H 2205 4777 50  0000 C CNN
F 2 "" H 2200 4950 50  0001 C CNN
F 3 "" H 2200 4950 50  0001 C CNN
	1    2200 4950
	1    0    0    -1  
$EndComp
Wire Wire Line
	2200 4950 2200 4750
Wire Wire Line
	4250 4950 4250 4750
Wire Wire Line
	3550 4750 3550 4950
Wire Wire Line
	2850 4950 2850 4750
$Comp
L Device:R R502
U 1 1 5B568923
P 5400 3400
AR Path="/5BBFAE41/5B568923" Ref="R502"  Part="1" 
AR Path="/5B62603D/5B568923" Ref="R402"  Part="1" 
F 0 "R402" H 5470 3446 50  0000 L CNN
F 1 "R" H 5470 3355 50  0000 L CNN
F 2 "Resistor_SMD:R_0402_1005Metric" V 5330 3400 50  0001 C CNN
F 3 "~" H 5400 3400 50  0001 C CNN
	1    5400 3400
	1    0    0    -1  
$EndComp
$Comp
L Device:R R503
U 1 1 5B5689A1
P 5700 3700
AR Path="/5BBFAE41/5B5689A1" Ref="R503"  Part="1" 
AR Path="/5B62603D/5B5689A1" Ref="R403"  Part="1" 
F 0 "R403" V 5493 3700 50  0000 C CNN
F 1 "R" V 5584 3700 50  0000 C CNN
F 2 "Resistor_SMD:R_0402_1005Metric" V 5630 3700 50  0001 C CNN
F 3 "~" H 5700 3700 50  0001 C CNN
	1    5700 3700
	0    1    1    0   
$EndComp
$Comp
L Device:L L504
U 1 1 5B5689F1
P 6200 4000
AR Path="/5BBFAE41/5B5689F1" Ref="L504"  Part="1" 
AR Path="/5B62603D/5B5689F1" Ref="L404"  Part="1" 
F 0 "L404" H 6253 4046 50  0000 L CNN
F 1 "L" H 6253 3955 50  0000 L CNN
F 2 "Inductor_SMD:L_0201_0603Metric" H 6200 4000 50  0001 C CNN
F 3 "~" H 6200 4000 50  0001 C CNN
	1    6200 4000
	1    0    0    -1  
$EndComp
Wire Wire Line
	5900 4250 6200 4250
Wire Wire Line
	6200 4250 6200 4150
Wire Wire Line
	6200 3850 6200 3700
Wire Wire Line
	6200 3700 5850 3700
Wire Wire Line
	5550 3700 5400 3700
Wire Wire Line
	5400 3700 5400 3900
Wire Wire Line
	5400 3700 5400 3650
Connection ~ 5400 3700
$Comp
L Device:C C507
U 1 1 5B5693BF
P 4850 3450
AR Path="/5BBFAE41/5B5693BF" Ref="C507"  Part="1" 
AR Path="/5B62603D/5B5693BF" Ref="C407"  Part="1" 
F 0 "C407" H 4965 3496 50  0000 L CNN
F 1 "C" H 4965 3405 50  0000 L CNN
F 2 "Capacitor_SMD:C_0402_1005Metric" H 4888 3300 50  0001 C CNN
F 3 "~" H 4850 3450 50  0001 C CNN
	1    4850 3450
	1    0    0    -1  
$EndComp
$Comp
L power:GND #PWR?
U 1 1 5B56942D
P 4850 3750
AR Path="/5BBFAE41/5B56942D" Ref="#PWR?"  Part="1" 
AR Path="/5B62603D/5B56942D" Ref="#PWR?"  Part="1" 
F 0 "#PWR?" H 4850 3500 50  0001 C CNN
F 1 "GND" H 4855 3577 50  0000 C CNN
F 2 "" H 4850 3750 50  0001 C CNN
F 3 "" H 4850 3750 50  0001 C CNN
	1    4850 3750
	1    0    0    -1  
$EndComp
Wire Wire Line
	4850 3750 4850 3600
Wire Wire Line
	4850 3300 4850 3150
Wire Wire Line
	4850 3150 5400 3150
Wire Wire Line
	5400 3150 5400 3250
$Comp
L Device:R R501
U 1 1 5B569A68
P 5400 2850
AR Path="/5BBFAE41/5B569A68" Ref="R501"  Part="1" 
AR Path="/5B62603D/5B569A68" Ref="R401"  Part="1" 
F 0 "R401" H 5470 2896 50  0000 L CNN
F 1 "R" H 5470 2805 50  0000 L CNN
F 2 "Resistor_SMD:R_0402_1005Metric" V 5330 2850 50  0001 C CNN
F 3 "~" H 5400 2850 50  0001 C CNN
	1    5400 2850
	1    0    0    -1  
$EndComp
Wire Wire Line
	5400 3000 5400 3150
Connection ~ 5400 3150
Wire Wire Line
	5400 2700 5400 2450
Text Label 5200 2450 0    50   ~ 0
Vbias
$Comp
L Device:C C509
U 1 1 5B56A2B9
P 6700 4250
AR Path="/5BBFAE41/5B56A2B9" Ref="C509"  Part="1" 
AR Path="/5B62603D/5B56A2B9" Ref="C409"  Part="1" 
F 0 "C409" V 6448 4250 50  0000 C CNN
F 1 "C" V 6539 4250 50  0000 C CNN
F 2 "Capacitor_SMD:C_0201_0603Metric" H 6738 4100 50  0001 C CNN
F 3 "~" H 6700 4250 50  0001 C CNN
	1    6700 4250
	0    1    1    0   
$EndComp
Wire Wire Line
	6550 4250 6200 4250
Connection ~ 6200 4250
$Comp
L Device:C C511
U 1 1 5B56A797
P 7000 4600
AR Path="/5BBFAE41/5B56A797" Ref="C511"  Part="1" 
AR Path="/5B62603D/5B56A797" Ref="C411"  Part="1" 
F 0 "C411" H 7115 4646 50  0000 L CNN
F 1 "C" H 7115 4555 50  0000 L CNN
F 2 "Capacitor_SMD:C_0201_0603Metric" H 7038 4450 50  0001 C CNN
F 3 "~" H 7000 4600 50  0001 C CNN
	1    7000 4600
	1    0    0    -1  
$EndComp
Wire Wire Line
	7000 4450 7000 4250
Wire Wire Line
	7000 4250 6850 4250
$Comp
L power:GND #PWR?
U 1 1 5B56AD96
P 7000 4950
AR Path="/5BBFAE41/5B56AD96" Ref="#PWR?"  Part="1" 
AR Path="/5B62603D/5B56AD96" Ref="#PWR?"  Part="1" 
F 0 "#PWR?" H 7000 4700 50  0001 C CNN
F 1 "GND" H 7005 4777 50  0000 C CNN
F 2 "" H 7000 4950 50  0001 C CNN
F 3 "" H 7000 4950 50  0001 C CNN
	1    7000 4950
	1    0    0    -1  
$EndComp
Wire Wire Line
	7000 4950 7000 4750
$Comp
L Device:R R504
U 1 1 5B56B305
P 7350 4250
AR Path="/5BBFAE41/5B56B305" Ref="R504"  Part="1" 
AR Path="/5B62603D/5B56B305" Ref="R404"  Part="1" 
F 0 "R404" V 7143 4250 50  0000 C CNN
F 1 "R" V 7234 4250 50  0000 C CNN
F 2 "Resistor_SMD:R_0201_0603Metric" V 7280 4250 50  0001 C CNN
F 3 "~" H 7350 4250 50  0001 C CNN
	1    7350 4250
	0    1    1    0   
$EndComp
$Comp
L Device:C C513
U 1 1 5B56B4BA
P 7700 4600
AR Path="/5BBFAE41/5B56B4BA" Ref="C513"  Part="1" 
AR Path="/5B62603D/5B56B4BA" Ref="C413"  Part="1" 
F 0 "C413" H 7815 4646 50  0000 L CNN
F 1 "C" H 7815 4555 50  0000 L CNN
F 2 "Capacitor_SMD:C_0201_0603Metric" H 7738 4450 50  0001 C CNN
F 3 "~" H 7700 4600 50  0001 C CNN
	1    7700 4600
	1    0    0    -1  
$EndComp
Wire Wire Line
	7200 4250 7000 4250
Connection ~ 7000 4250
Wire Wire Line
	7700 4450 7700 4250
Wire Wire Line
	7700 4250 7500 4250
$Comp
L power:GND #PWR?
U 1 1 5B56BFD6
P 7700 4950
AR Path="/5BBFAE41/5B56BFD6" Ref="#PWR?"  Part="1" 
AR Path="/5B62603D/5B56BFD6" Ref="#PWR?"  Part="1" 
F 0 "#PWR?" H 7700 4700 50  0001 C CNN
F 1 "GND" H 7705 4777 50  0000 C CNN
F 2 "" H 7700 4950 50  0001 C CNN
F 3 "" H 7700 4950 50  0001 C CNN
	1    7700 4950
	1    0    0    -1  
$EndComp
Wire Wire Line
	7700 4950 7700 4750
$Comp
L Device:L L505
U 1 1 5B56C5C6
P 8050 4250
AR Path="/5BBFAE41/5B56C5C6" Ref="L505"  Part="1" 
AR Path="/5B62603D/5B56C5C6" Ref="L405"  Part="1" 
F 0 "L405" V 8240 4250 50  0000 C CNN
F 1 "L" V 8149 4250 50  0000 C CNN
F 2 "Inductor_SMD:L_0201_0603Metric" H 8050 4250 50  0001 C CNN
F 3 "~" H 8050 4250 50  0001 C CNN
	1    8050 4250
	0    -1   -1   0   
$EndComp
$Comp
L Device:L L506
U 1 1 5B56C706
P 8750 4250
AR Path="/5BBFAE41/5B56C706" Ref="L506"  Part="1" 
AR Path="/5B62603D/5B56C706" Ref="L406"  Part="1" 
F 0 "L406" V 8940 4250 50  0000 C CNN
F 1 "L" V 8849 4250 50  0000 C CNN
F 2 "Inductor_SMD:L_0201_0603Metric" H 8750 4250 50  0001 C CNN
F 3 "~" H 8750 4250 50  0001 C CNN
	1    8750 4250
	0    -1   -1   0   
$EndComp
$Comp
L Device:C C516
U 1 1 5B56C75E
P 9400 4250
AR Path="/5BBFAE41/5B56C75E" Ref="C516"  Part="1" 
AR Path="/5B62603D/5B56C75E" Ref="C416"  Part="1" 
F 0 "C416" V 9148 4250 50  0000 C CNN
F 1 "C" V 9239 4250 50  0000 C CNN
F 2 "Capacitor_SMD:C_0201_0603Metric" H 9438 4100 50  0001 C CNN
F 3 "~" H 9400 4250 50  0001 C CNN
	1    9400 4250
	0    1    1    0   
$EndComp
$Comp
L Device:C C514
U 1 1 5B56DAD1
P 8400 4600
AR Path="/5BBFAE41/5B56DAD1" Ref="C514"  Part="1" 
AR Path="/5B62603D/5B56DAD1" Ref="C414"  Part="1" 
F 0 "C414" H 8515 4646 50  0000 L CNN
F 1 "C" H 8515 4555 50  0000 L CNN
F 2 "Capacitor_SMD:C_0201_0603Metric" H 8438 4450 50  0001 C CNN
F 3 "~" H 8400 4600 50  0001 C CNN
	1    8400 4600
	1    0    0    -1  
$EndComp
Wire Wire Line
	8400 4450 8400 4250
$Comp
L power:GND #PWR?
U 1 1 5B56DAD8
P 8400 4950
AR Path="/5BBFAE41/5B56DAD8" Ref="#PWR?"  Part="1" 
AR Path="/5B62603D/5B56DAD8" Ref="#PWR?"  Part="1" 
F 0 "#PWR?" H 8400 4700 50  0001 C CNN
F 1 "GND" H 8405 4777 50  0000 C CNN
F 2 "" H 8400 4950 50  0001 C CNN
F 3 "" H 8400 4950 50  0001 C CNN
	1    8400 4950
	1    0    0    -1  
$EndComp
Wire Wire Line
	8400 4950 8400 4750
$Comp
L Device:C C515
U 1 1 5B56E1A3
P 9050 4600
AR Path="/5BBFAE41/5B56E1A3" Ref="C515"  Part="1" 
AR Path="/5B62603D/5B56E1A3" Ref="C415"  Part="1" 
F 0 "C415" H 9165 4646 50  0000 L CNN
F 1 "C" H 9165 4555 50  0000 L CNN
F 2 "Capacitor_SMD:C_0201_0603Metric" H 9088 4450 50  0001 C CNN
F 3 "~" H 9050 4600 50  0001 C CNN
	1    9050 4600
	1    0    0    -1  
$EndComp
Wire Wire Line
	9050 4450 9050 4250
$Comp
L power:GND #PWR?
U 1 1 5B56E1AA
P 9050 4950
AR Path="/5BBFAE41/5B56E1AA" Ref="#PWR?"  Part="1" 
AR Path="/5B62603D/5B56E1AA" Ref="#PWR?"  Part="1" 
F 0 "#PWR?" H 9050 4700 50  0001 C CNN
F 1 "GND" H 9055 4777 50  0000 C CNN
F 2 "" H 9050 4950 50  0001 C CNN
F 3 "" H 9050 4950 50  0001 C CNN
	1    9050 4950
	1    0    0    -1  
$EndComp
Wire Wire Line
	9050 4950 9050 4750
Wire Wire Line
	9850 4250 9550 4250
Wire Wire Line
	9250 4250 9050 4250
Connection ~ 9050 4250
Wire Wire Line
	9050 4250 8900 4250
Wire Wire Line
	8200 4250 8400 4250
Connection ~ 8400 4250
Wire Wire Line
	8400 4250 8600 4250
Wire Wire Line
	7700 4250 7900 4250
Connection ~ 7700 4250
$Comp
L Device:C C508
U 1 1 5B5711D7
P 6550 3500
AR Path="/5BBFAE41/5B5711D7" Ref="C508"  Part="1" 
AR Path="/5B62603D/5B5711D7" Ref="C408"  Part="1" 
F 0 "C408" H 6665 3546 50  0000 L CNN
F 1 "C" H 6665 3455 50  0000 L CNN
F 2 "Capacitor_SMD:C_0402_1005Metric" H 6588 3350 50  0001 C CNN
F 3 "~" H 6550 3500 50  0001 C CNN
	1    6550 3500
	1    0    0    -1  
$EndComp
$Comp
L Device:C C510
U 1 1 5B571263
P 7000 3500
AR Path="/5BBFAE41/5B571263" Ref="C510"  Part="1" 
AR Path="/5B62603D/5B571263" Ref="C410"  Part="1" 
F 0 "C410" H 7115 3546 50  0000 L CNN
F 1 "C" H 7115 3455 50  0000 L CNN
F 2 "Capacitor_SMD:C_0201_0603Metric" H 7038 3350 50  0001 C CNN
F 3 "~" H 7000 3500 50  0001 C CNN
	1    7000 3500
	1    0    0    -1  
$EndComp
$Comp
L Device:C C512
U 1 1 5B5712C1
P 7450 3500
AR Path="/5BBFAE41/5B5712C1" Ref="C512"  Part="1" 
AR Path="/5B62603D/5B5712C1" Ref="C412"  Part="1" 
F 0 "C412" H 7565 3546 50  0000 L CNN
F 1 "C" H 7565 3455 50  0000 L CNN
F 2 "Capacitor_SMD:C_0201_0603Metric" H 7488 3350 50  0001 C CNN
F 3 "~" H 7450 3500 50  0001 C CNN
	1    7450 3500
	1    0    0    -1  
$EndComp
$Comp
L power:GND #PWR?
U 1 1 5B571444
P 6550 3750
AR Path="/5BBFAE41/5B571444" Ref="#PWR?"  Part="1" 
AR Path="/5B62603D/5B571444" Ref="#PWR?"  Part="1" 
F 0 "#PWR?" H 6550 3500 50  0001 C CNN
F 1 "GND" H 6555 3577 50  0000 C CNN
F 2 "" H 6550 3750 50  0001 C CNN
F 3 "" H 6550 3750 50  0001 C CNN
	1    6550 3750
	1    0    0    -1  
$EndComp
$Comp
L power:GND #PWR?
U 1 1 5B571489
P 7000 3750
AR Path="/5BBFAE41/5B571489" Ref="#PWR?"  Part="1" 
AR Path="/5B62603D/5B571489" Ref="#PWR?"  Part="1" 
F 0 "#PWR?" H 7000 3500 50  0001 C CNN
F 1 "GND" H 7005 3577 50  0000 C CNN
F 2 "" H 7000 3750 50  0001 C CNN
F 3 "" H 7000 3750 50  0001 C CNN
	1    7000 3750
	1    0    0    -1  
$EndComp
$Comp
L power:GND #PWR?
U 1 1 5B5714CE
P 7450 3750
AR Path="/5BBFAE41/5B5714CE" Ref="#PWR?"  Part="1" 
AR Path="/5B62603D/5B5714CE" Ref="#PWR?"  Part="1" 
F 0 "#PWR?" H 7450 3500 50  0001 C CNN
F 1 "GND" H 7455 3577 50  0000 C CNN
F 2 "" H 7450 3750 50  0001 C CNN
F 3 "" H 7450 3750 50  0001 C CNN
	1    7450 3750
	1    0    0    -1  
$EndComp
Wire Wire Line
	7450 3750 7450 3650
Wire Wire Line
	7000 3750 7000 3650
Wire Wire Line
	6550 3750 6550 3650
Wire Wire Line
	6550 3350 6550 3250
Wire Wire Line
	6550 3250 7000 3250
Wire Wire Line
	7450 3250 7450 3350
Wire Wire Line
	7000 3350 7000 3250
Connection ~ 7000 3250
Wire Wire Line
	7000 3250 7450 3250
Wire Wire Line
	6550 3250 6200 3250
Wire Wire Line
	6200 3250 6200 3700
Connection ~ 6550 3250
Connection ~ 6200 3700
Connection ~ 7450 3250
Text Label 1550 4250 0    50   ~ 0
RFin
Text Label 9600 4250 0    50   ~ 0
RFout
Text Label 2100 4250 0    50   ~ 0
RFin1
Text Label 2750 4250 0    50   ~ 0
RFin2
Text Label 3450 4250 0    50   ~ 0
RFin3
Text Label 4200 4250 0    50   ~ 0
RFin4
Text Label 4850 4250 0    50   ~ 0
RFin5
Text Label 8950 4250 0    50   ~ 0
RFout1
Text Label 8300 4250 0    50   ~ 0
RFout2
Text Label 7600 4250 0    50   ~ 0
RFout3
Text Label 6900 4250 0    50   ~ 0
RFout4
Text Label 6250 4250 0    50   ~ 0
RFout5
Text Label 4950 3150 0    50   ~ 0
Vbias_decoupled
Text Label 5400 3850 0    50   ~ 0
Vbias_LNA
$Comp
L Connector:Conn_01x03_Male J501
U 1 1 5B576D65
P 4400 2450
AR Path="/5BBFAE41/5B576D65" Ref="J501"  Part="1" 
AR Path="/5B62603D/5B576D65" Ref="J401"  Part="1" 
F 0 "J401" H 4506 2728 50  0000 C CNN
F 1 "Conn_01x03_Male" H 4506 2637 50  0000 C CNN
F 2 "Connector_PinHeader_2.54mm:PinHeader_1x03_P2.54mm_Vertical" H 4400 2450 50  0001 C CNN
F 3 "~" H 4400 2450 50  0001 C CNN
	1    4400 2450
	1    0    0    -1  
$EndComp
Wire Wire Line
	4600 2450 5400 2450
$Comp
L power:GND #PWR?
U 1 1 5B577D0F
P 4950 2650
AR Path="/5BBFAE41/5B577D0F" Ref="#PWR?"  Part="1" 
AR Path="/5B62603D/5B577D0F" Ref="#PWR?"  Part="1" 
F 0 "#PWR?" H 4950 2400 50  0001 C CNN
F 1 "GND" H 4955 2477 50  0000 C CNN
F 2 "" H 4950 2650 50  0001 C CNN
F 3 "" H 4950 2650 50  0001 C CNN
	1    4950 2650
	1    0    0    -1  
$EndComp
Wire Wire Line
	4950 2650 4950 2550
Wire Wire Line
	4950 2550 4600 2550
Wire Wire Line
	4600 2350 4950 2350
Wire Wire Line
	4950 2350 4950 2150
Wire Wire Line
	7450 2150 4950 2150
Wire Wire Line
	7450 2150 7450 3250
Text Label 5750 2150 0    50   ~ 0
LNA_VDD
Text HLabel 1400 4250 0    50   Input ~ 0
in
Text HLabel 9850 4250 2    50   Output ~ 0
out
$Comp
L Connector:TestPoint TP401
U 1 1 5BBE0E64
P 4850 3000
AR Path="/5B62603D/5BBE0E64" Ref="TP401"  Part="1" 
AR Path="/5BBFAE41/5BBE0E64" Ref="TP501"  Part="1" 
F 0 "TP401" H 4908 3120 50  0000 L CNN
F 1 "TestPoint" H 4908 3029 50  0000 L CNN
F 2 "TestPoint:TestPoint_Pad_D1.0mm" H 5050 3000 50  0001 C CNN
F 3 "~" H 5050 3000 50  0001 C CNN
	1    4850 3000
	1    0    0    -1  
$EndComp
Wire Wire Line
	4850 3000 4850 3150
Connection ~ 4850 3150
$Comp
L Connector:TestPoint TP402
U 1 1 5BBE2061
P 5150 3650
AR Path="/5B62603D/5BBE2061" Ref="TP402"  Part="1" 
AR Path="/5BBFAE41/5BBE2061" Ref="TP502"  Part="1" 
F 0 "TP402" H 5208 3770 50  0000 L CNN
F 1 "TestPoint" H 5208 3679 50  0000 L CNN
F 2 "TestPoint:TestPoint_Pad_D1.0mm" H 5350 3650 50  0001 C CNN
F 3 "~" H 5350 3650 50  0001 C CNN
	1    5150 3650
	1    0    0    -1  
$EndComp
Wire Wire Line
	5150 3650 5400 3650
Connection ~ 5400 3650
Wire Wire Line
	5400 3650 5400 3550
$EndSCHEMATC
