EESchema Schematic File Version 4
EELAYER 30 0
EELAYER END
$Descr A4 11693 8268
encoding utf-8
Sheet 9 27
Title ""
Date ""
Rev ""
Comp ""
Comment1 ""
Comment2 ""
Comment3 ""
Comment4 ""
$EndDescr
$Comp
L Connector:Conn_Coaxial J1003
U 1 1 5C4FA82E
P 5350 4750
F 0 "J1003" H 5449 4726 50  0000 L CNN
F 1 "Conn_Coaxial" H 5449 4635 50  0000 L CNN
F 2 "POWDER_RF:SMP_RA_MSLD-PCS17T" H 5350 4750 50  0001 C CNN
F 3 " ~" H 5350 4750 50  0001 C CNN
F 4 "Molex" H 0   0   50  0001 C CNN "Manufacturer"
F 5 "SMP-MSLD-PCS17T" H 0   0   50  0001 C CNN "PartNumber"
F 6 "3000-0000000485" H 5350 4750 50  0001 C CNN "PartSpecification"
	1    5350 4750
	1    0    0    -1  
$EndComp
Text Label 5050 4750 2    50   ~ 0
ANT_INPUT
Wire Wire Line
	5100 4650 5100 4850
Connection ~ 5100 4850
Wire Wire Line
	5100 4850 5100 5050
Text Label 5050 4650 2    50   ~ 0
GND
Text Label 5050 4850 2    50   ~ 0
GND
Wire Wire Line
	5350 4950 5350 5050
$Comp
L power:GND #PWR?
U 1 1 5C4FACF5
P 5100 5050
F 0 "#PWR?" H 5100 4800 50  0001 C CNN
F 1 "GND" H 5105 4877 50  0000 C CNN
F 2 "" H 5100 5050 50  0001 C CNN
F 3 "" H 5100 5050 50  0001 C CNN
	1    5100 5050
	1    0    0    -1  
$EndComp
$Comp
L power:GND #PWR?
U 1 1 5C4FAD38
P 5350 5050
F 0 "#PWR?" H 5350 4800 50  0001 C CNN
F 1 "GND" H 5355 4877 50  0000 C CNN
F 2 "" H 5350 5050 50  0001 C CNN
F 3 "" H 5350 5050 50  0001 C CNN
	1    5350 5050
	1    0    0    -1  
$EndComp
Text Label 5050 4550 2    50   ~ 0
NMEA_TXD
Text Label 5050 4450 2    50   ~ 0
ENTER_ISP#
Text Label 5050 4350 2    50   ~ 0
SER_INPUT
Text Label 5050 4250 2    50   ~ 0
SER_OUTPUT
Wire Wire Line
	4550 4650 5100 4650
Wire Wire Line
	4550 4750 5150 4750
Wire Wire Line
	4550 4850 5100 4850
Wire Wire Line
	4550 4450 5050 4450
Wire Wire Line
	4550 4350 5050 4350
Wire Wire Line
	4550 4250 5050 4250
Wire Wire Line
	3250 4450 2750 4450
Text Label 2750 4250 0    50   ~ 0
GND
Text Label 2750 4450 0    50   ~ 0
LOCK_OK
Text Label 2750 4650 0    50   ~ 0
1PPS_IN
Text Label 2750 4750 0    50   ~ 0
5V_OUTPUT
Text Label 2750 4850 0    50   ~ 0
GND
Text Label 2750 4950 0    50   ~ 0
3.3V_VDD_IN
Wire Wire Line
	2700 4250 2700 4850
Wire Wire Line
	2700 4250 3250 4250
Wire Wire Line
	2700 4850 3250 4850
$Comp
L power:GND #PWR?
U 1 1 5C4FE0A4
P 2700 5450
F 0 "#PWR?" H 2700 5200 50  0001 C CNN
F 1 "GND" H 2705 5277 50  0000 C CNN
F 2 "" H 2700 5450 50  0001 C CNN
F 3 "" H 2700 5450 50  0001 C CNN
	1    2700 5450
	1    0    0    -1  
$EndComp
$Comp
L power:GND #PWR?
U 1 1 5C4FEBBF
P 950 5450
F 0 "#PWR?" H 950 5200 50  0001 C CNN
F 1 "GND" H 955 5277 50  0000 C CNN
F 2 "" H 950 5450 50  0001 C CNN
F 3 "" H 950 5450 50  0001 C CNN
	1    950  5450
	1    0    0    -1  
$EndComp
$Comp
L power:GND #PWR?
U 1 1 5C4FEF16
P 2350 5450
F 0 "#PWR?" H 2350 5200 50  0001 C CNN
F 1 "GND" H 2355 5277 50  0000 C CNN
F 2 "" H 2350 5450 50  0001 C CNN
F 3 "" H 2350 5450 50  0001 C CNN
	1    2350 5450
	1    0    0    -1  
$EndComp
$Sheet
S 6950 1550 900  750 
U 5C53436C
F0 "Buffer_Section_1" 50
F1 "Buffer_Section.sch" 50
F2 "NMEA_TXD" I L 6950 1700 50 
F3 "LOCK_OK" I L 6950 1850 50 
F4 "10MHz" I L 6950 2000 50 
F5 "1PPS" I L 6950 2150 50 
$EndSheet
$Comp
L power:+3.3V #PWR?
U 1 1 5C52A0BC
P 10400 2250
F 0 "#PWR?" H 10400 2100 50  0001 C CNN
F 1 "+3.3V" H 10415 2423 50  0000 C CNN
F 2 "" H 10400 2250 50  0001 C CNN
F 3 "" H 10400 2250 50  0001 C CNN
	1    10400 2250
	1    0    0    -1  
$EndComp
Wire Wire Line
	10300 2450 10400 2450
$Comp
L power:GND #PWR?
U 1 1 5C52A4C1
P 9500 3250
F 0 "#PWR?" H 9500 3000 50  0001 C CNN
F 1 "GND" H 9505 3077 50  0000 C CNN
F 2 "" H 9500 3250 50  0001 C CNN
F 3 "" H 9500 3250 50  0001 C CNN
	1    9500 3250
	1    0    0    -1  
$EndComp
Wire Wire Line
	9500 3050 9600 3050
Wire Wire Line
	10400 2250 10400 2450
Wire Wire Line
	9500 3050 9500 3250
Text Label 9050 2450 0    50   ~ 0
LOCK_OK
Text Label 9050 2750 0    50   ~ 0
LOCK_OK_1
Text Label 9050 4250 0    50   ~ 0
NMEA_TXD_1
Text Label 9050 2950 0    50   ~ 0
LOCK_OK_2
$Comp
L power:+3.3V #PWR?
U 1 1 5C54FA8A
P 10400 3750
F 0 "#PWR?" H 10400 3600 50  0001 C CNN
F 1 "+3.3V" H 10415 3923 50  0000 C CNN
F 2 "" H 10400 3750 50  0001 C CNN
F 3 "" H 10400 3750 50  0001 C CNN
	1    10400 3750
	1    0    0    -1  
$EndComp
Wire Wire Line
	10300 3950 10400 3950
$Comp
L power:GND #PWR?
U 1 1 5C54FA91
P 9500 4750
F 0 "#PWR?" H 9500 4500 50  0001 C CNN
F 1 "GND" H 9505 4577 50  0000 C CNN
F 2 "" H 9500 4750 50  0001 C CNN
F 3 "" H 9500 4750 50  0001 C CNN
	1    9500 4750
	1    0    0    -1  
$EndComp
Wire Wire Line
	9500 4550 9600 4550
Wire Wire Line
	9600 4050 9550 4050
Wire Wire Line
	9550 4050 9550 4150
Wire Wire Line
	9550 4150 9600 4150
Wire Wire Line
	9550 4650 10350 4650
Wire Wire Line
	10350 4650 10350 4450
Wire Wire Line
	10350 4450 10300 4450
Wire Wire Line
	10400 3750 10400 3950
Wire Wire Line
	9500 4550 9500 4750
Text Label 9050 3950 0    50   ~ 0
NMEA_TXD
Text Label 9050 4450 0    50   ~ 0
NMEA_TXD_2
Wire Wire Line
	10300 4550 10850 4550
Wire Wire Line
	10300 4350 10850 4350
Text Label 10850 3050 2    50   ~ 0
LOCK_OK_3
Wire Wire Line
	9050 2750 9600 2750
Wire Wire Line
	9050 2450 9600 2450
Wire Wire Line
	9050 3950 9600 3950
Wire Wire Line
	9050 4250 9600 4250
Text Label 10850 4550 2    50   ~ 0
NMEA_TXD_3
Text Label 10850 2850 2    50   ~ 0
LOCK_OK_4
Text Label 10850 4350 2    50   ~ 0
NMEA_TXD_4
$Sheet
S 6950 2600 900  750 
U 5C566284
F0 "Buffer_Section_2" 50
F1 "Buffer_Section.sch" 50
F2 "NMEA_TXD" I L 6950 2750 50 
F3 "LOCK_OK" I L 6950 2900 50 
F4 "10MHz" I L 6950 3050 50 
F5 "1PPS" I L 6950 3200 50 
$EndSheet
$Sheet
S 6950 3650 900  750 
U 5C5662B1
F0 "Buffer_Section_3" 50
F1 "Buffer_Section.sch" 50
F2 "NMEA_TXD" I L 6950 3800 50 
F3 "LOCK_OK" I L 6950 3950 50 
F4 "10MHz" I L 6950 4100 50 
F5 "1PPS" I L 6950 4250 50 
$EndSheet
$Sheet
S 6950 4700 900  750 
U 5C5662C4
F0 "Buffer_Section_4" 50
F1 "Buffer_Section.sch" 50
F2 "NMEA_TXD" I L 6950 4850 50 
F3 "LOCK_OK" I L 6950 5000 50 
F4 "10MHz" I L 6950 5150 50 
F5 "1PPS" I L 6950 5300 50 
$EndSheet
Wire Wire Line
	6950 1700 6450 1700
Wire Wire Line
	6950 1850 6450 1850
Text Label 6450 1700 0    50   ~ 0
NMEA_TXD_1
Text Label 6450 1850 0    50   ~ 0
LOCK_OK_1
Wire Wire Line
	6950 2750 6450 2750
Wire Wire Line
	6950 2900 6450 2900
Text Label 6450 2750 0    50   ~ 0
NMEA_TXD_2
Text Label 6450 2900 0    50   ~ 0
LOCK_OK_2
Wire Wire Line
	6950 3800 6450 3800
Wire Wire Line
	6950 3950 6450 3950
Text Label 6450 3800 0    50   ~ 0
NMEA_TXD_3
Text Label 6450 3950 0    50   ~ 0
LOCK_OK_3
Wire Wire Line
	6950 4850 6450 4850
Wire Wire Line
	6950 5000 6450 5000
Text Label 6450 4850 0    50   ~ 0
NMEA_TXD_4
Text Label 6450 5000 0    50   ~ 0
LOCK_OK_4
$Comp
L power:GND #PWR?
U 1 1 5C55509D
P 1950 5450
F 0 "#PWR?" H 1950 5200 50  0001 C CNN
F 1 "GND" H 1955 5277 50  0000 C CNN
F 2 "" H 1950 5450 50  0001 C CNN
F 3 "" H 1950 5450 50  0001 C CNN
	1    1950 5450
	1    0    0    -1  
$EndComp
$Comp
L Device:R_Small R1001
U 1 1 5C55800E
P 1950 5150
F 0 "R1001" H 2009 5196 50  0000 L CNN
F 1 "1k" H 2009 5105 50  0000 L CNN
F 2 "Resistor_SMD:R_0402_1005Metric" H 1950 5150 50  0001 C CNN
F 3 "~" H 1950 5150 50  0001 C CNN
F 4 "Yageo" H 0   0   50  0001 C CNN "Manufacturer"
F 5 "" H 0   0   50  0001 C CNN "PartNumber"
F 6 "3000-0000000156" H 1950 5150 50  0001 C CNN "PartSpecification"
	1    1950 5150
	1    0    0    -1  
$EndComp
Wire Wire Line
	4550 4550 5050 4550
Wire Wire Line
	1500 2300 2000 2300
Text Label 2000 2300 2    50   ~ 0
SER_INPUT
$Comp
L power:+3.3V #PWR?
U 1 1 5C59BBAE
P 8250 2350
AR Path="/5C59BBAE" Ref="#PWR?"  Part="1" 
AR Path="/5C53436C/5C59BBAE" Ref="#PWR?"  Part="1" 
AR Path="/5C536099/5C59BBAE" Ref="#PWR?"  Part="1" 
AR Path="/5C566284/5C59BBAE" Ref="#PWR?"  Part="1" 
AR Path="/5C5662B1/5C59BBAE" Ref="#PWR?"  Part="1" 
AR Path="/5C5662C4/5C59BBAE" Ref="#PWR?"  Part="1" 
AR Path="/5E186189/5C59BBAE" Ref="#PWR?"  Part="1" 
F 0 "#PWR?" H 8250 2200 50  0001 C CNN
F 1 "+3.3V" H 8265 2523 50  0000 C CNN
F 2 "" H 8250 2350 50  0001 C CNN
F 3 "" H 8250 2350 50  0001 C CNN
	1    8250 2350
	1    0    0    -1  
$EndComp
Wire Wire Line
	8250 2350 8250 2450
$Comp
L power:GND #PWR?
U 1 1 5C59BBB6
P 8250 2950
AR Path="/5C59BBB6" Ref="#PWR?"  Part="1" 
AR Path="/5C53436C/5C59BBB6" Ref="#PWR?"  Part="1" 
AR Path="/5C536099/5C59BBB6" Ref="#PWR?"  Part="1" 
AR Path="/5C566284/5C59BBB6" Ref="#PWR?"  Part="1" 
AR Path="/5C5662B1/5C59BBB6" Ref="#PWR?"  Part="1" 
AR Path="/5C5662C4/5C59BBB6" Ref="#PWR?"  Part="1" 
AR Path="/5E186189/5C59BBB6" Ref="#PWR?"  Part="1" 
F 0 "#PWR?" H 8250 2700 50  0001 C CNN
F 1 "GND" H 8255 2777 50  0000 C CNN
F 2 "" H 8250 2950 50  0001 C CNN
F 3 "" H 8250 2950 50  0001 C CNN
	1    8250 2950
	1    0    0    -1  
$EndComp
Wire Wire Line
	8250 2850 8250 2950
Wire Wire Line
	8250 2450 8600 2450
Wire Wire Line
	8600 2850 8250 2850
$Comp
L power:+3.3V #PWR?
U 1 1 5C5A3DE0
P 8250 3850
AR Path="/5C5A3DE0" Ref="#PWR?"  Part="1" 
AR Path="/5C53436C/5C5A3DE0" Ref="#PWR?"  Part="1" 
AR Path="/5C536099/5C5A3DE0" Ref="#PWR?"  Part="1" 
AR Path="/5C566284/5C5A3DE0" Ref="#PWR?"  Part="1" 
AR Path="/5C5662B1/5C5A3DE0" Ref="#PWR?"  Part="1" 
AR Path="/5C5662C4/5C5A3DE0" Ref="#PWR?"  Part="1" 
AR Path="/5E186189/5C5A3DE0" Ref="#PWR?"  Part="1" 
F 0 "#PWR?" H 8250 3700 50  0001 C CNN
F 1 "+3.3V" H 8265 4023 50  0000 C CNN
F 2 "" H 8250 3850 50  0001 C CNN
F 3 "" H 8250 3850 50  0001 C CNN
	1    8250 3850
	1    0    0    -1  
$EndComp
Wire Wire Line
	8250 3850 8250 3950
$Comp
L power:GND #PWR?
U 1 1 5C5A3DE8
P 8250 4450
AR Path="/5C5A3DE8" Ref="#PWR?"  Part="1" 
AR Path="/5C53436C/5C5A3DE8" Ref="#PWR?"  Part="1" 
AR Path="/5C536099/5C5A3DE8" Ref="#PWR?"  Part="1" 
AR Path="/5C566284/5C5A3DE8" Ref="#PWR?"  Part="1" 
AR Path="/5C5662B1/5C5A3DE8" Ref="#PWR?"  Part="1" 
AR Path="/5C5662C4/5C5A3DE8" Ref="#PWR?"  Part="1" 
AR Path="/5E186189/5C5A3DE8" Ref="#PWR?"  Part="1" 
F 0 "#PWR?" H 8250 4200 50  0001 C CNN
F 1 "GND" H 8255 4277 50  0000 C CNN
F 2 "" H 8250 4450 50  0001 C CNN
F 3 "" H 8250 4450 50  0001 C CNN
	1    8250 4450
	1    0    0    -1  
$EndComp
Wire Wire Line
	8250 4350 8250 4450
Wire Wire Line
	8250 3950 8600 3950
Wire Wire Line
	8600 4350 8250 4350
Wire Wire Line
	9600 2550 9550 2550
Wire Wire Line
	9550 2650 9600 2650
Wire Wire Line
	9550 2550 9550 2650
Wire Wire Line
	9550 2650 9550 2850
Wire Wire Line
	9550 2850 9600 2850
Connection ~ 9550 2650
Wire Wire Line
	9050 2950 9600 2950
Wire Wire Line
	9550 2850 9550 3150
Wire Wire Line
	9550 3150 10350 3150
Wire Wire Line
	10350 3150 10350 2950
Wire Wire Line
	10350 2950 10300 2950
Connection ~ 9550 2850
Wire Wire Line
	10850 3050 10300 3050
Wire Wire Line
	10350 2950 10350 2750
Wire Wire Line
	10350 2750 10300 2750
Connection ~ 10350 2950
Wire Wire Line
	10300 2850 10850 2850
Wire Wire Line
	10400 2450 10400 2550
Wire Wire Line
	10400 2550 10300 2550
Connection ~ 10400 2450
NoConn ~ 10300 2650
Wire Wire Line
	9550 4150 9550 4350
Wire Wire Line
	9550 4350 9600 4350
Connection ~ 9550 4150
Wire Wire Line
	9550 4350 9550 4650
Connection ~ 9550 4350
Wire Wire Line
	9600 4450 9050 4450
NoConn ~ 10300 4150
Wire Wire Line
	10300 4050 10400 4050
Wire Wire Line
	10400 4050 10400 3950
Connection ~ 10400 3950
Wire Wire Line
	10300 4250 10350 4250
Wire Wire Line
	10350 4250 10350 4450
Connection ~ 10350 4450
$Comp
L Device:Ferrite_Bead_Small FB1001
U 1 1 5C5F842B
P 950 4750
F 0 "FB1001" H 1050 4796 50  0000 L CNN
F 1 "MI1206K601R−10" H 1050 4705 50  0000 L CNN
F 2 "Inductor_SMD:L_1206_3216Metric" V 880 4750 50  0001 C CNN
F 3 "~" H 950 4750 50  0001 C CNN
F 4 "Laird-Signal Integrity Products" H 0   0   50  0001 C CNN "Manufacturer"
F 5 "MI1206K601R-10" H 0   0   50  0001 C CNN "PartNumber"
F 6 "3000-0000000484" H 950 4750 50  0001 C CNN "PartSpecification"
	1    950  4750
	1    0    0    -1  
$EndComp
Wire Wire Line
	950  4850 950  4950
Wire Wire Line
	950  5350 1350 5350
Wire Wire Line
	950  5350 950  5450
$Comp
L power:+3.3V #PWR?
U 1 1 5C61A9BA
P 950 4550
F 0 "#PWR?" H 950 4400 50  0001 C CNN
F 1 "+3.3V" H 965 4723 50  0000 C CNN
F 2 "" H 950 4550 50  0001 C CNN
F 3 "" H 950 4550 50  0001 C CNN
	1    950  4550
	1    0    0    -1  
$EndComp
Wire Wire Line
	950  4550 950  4650
Wire Wire Line
	2350 4750 3250 4750
Wire Wire Line
	1950 4650 3250 4650
Wire Wire Line
	1950 5250 1950 5450
Wire Wire Line
	2350 5250 2350 5450
Wire Wire Line
	2700 5450 2700 4850
Connection ~ 2700 4850
Wire Wire Line
	2350 4750 2350 5050
Wire Wire Line
	1950 4650 1950 5050
$Comp
L Device:C_Small C1004
U 1 1 5C67E192
P 2350 5150
F 0 "C1004" H 2442 5196 50  0000 L CNN
F 1 "47uF" H 2442 5105 50  0000 L CNN
F 2 "Capacitor_SMD:C_0805_2012Metric" H 2350 5150 50  0001 C CNN
F 3 "~" H 2350 5150 50  0001 C CNN
F 4 "" H 0   0   50  0001 C CNN "Manufacturer"
F 5 "JMK212BBJ476MG-T" H 0   0   50  0001 C CNN "PartNumber"
F 6 "3000-0000000476" H 2350 5150 50  0001 C CNN "PartSpecification"
	1    2350 5150
	1    0    0    -1  
$EndComp
Text Label 2750 4350 0    50   ~ 0
10MHz_5V
Text Label 2750 4550 0    50   ~ 0
1PPS_OUTPUT
Text Label 5100 1650 2    50   ~ 0
10MHz_1
Text Label 5100 1750 2    50   ~ 0
10MHz_2
Text Label 5100 1850 2    50   ~ 0
10MHz_3
Text Label 5100 1950 2    50   ~ 0
10MHz_4
Wire Wire Line
	6950 5150 6450 5150
Wire Wire Line
	6450 5300 6950 5300
Wire Wire Line
	6950 4100 6450 4100
Wire Wire Line
	6450 4250 6950 4250
Wire Wire Line
	6450 3050 6950 3050
Wire Wire Line
	6450 3200 6950 3200
Wire Wire Line
	6950 2000 6450 2000
Wire Wire Line
	6450 2150 6950 2150
Text Label 6450 2000 0    50   ~ 0
10MHz_1
Text Label 6450 2150 0    50   ~ 0
1PPS_1
Text Label 6450 3050 0    50   ~ 0
10MHz_2
Text Label 6450 3200 0    50   ~ 0
1PPS_2
Text Label 6450 4100 0    50   ~ 0
10MHz_3
Text Label 6450 4250 0    50   ~ 0
1PPS_3
Text Label 6450 5150 0    50   ~ 0
10MHz_4
Text Label 6450 5300 0    50   ~ 0
1PPS_4
Wire Wire Line
	2750 4350 3250 4350
Wire Wire Line
	3250 4550 2750 4550
$Sheet
S 3600 1550 1000 1350
U 5D753A3E
F0 "Pre_Buffer" 50
F1 "Pre_Buffer.sch" 50
F2 "~10MHz" I L 3600 2050 50 
F3 "1PPS" I L 3600 2250 50 
F4 "10MHz_1" O R 4600 1650 50 
F5 "10MHz_2" O R 4600 1750 50 
F6 "10MHz_3" O R 4600 1850 50 
F7 "10MHz_4" O R 4600 1950 50 
F8 "1PPS_2" O R 4600 2250 50 
F9 "1PPS_1" O R 4600 2150 50 
F10 "1PPS_4" O R 4600 2450 50 
F11 "1PPS_3" O R 4600 2350 50 
F12 "1PPS_MCU" O L 3600 2450 50 
$EndSheet
Wire Wire Line
	4600 1650 5100 1650
Wire Wire Line
	4600 1750 5100 1750
Wire Wire Line
	4600 1850 5100 1850
Wire Wire Line
	4600 1950 5100 1950
Wire Wire Line
	3100 2050 3600 2050
Wire Wire Line
	3100 2250 3600 2250
Wire Wire Line
	4600 2350 5100 2350
Wire Wire Line
	5100 2450 4600 2450
Text Label 5100 2350 2    50   ~ 0
1PPS_3
Text Label 5100 2450 2    50   ~ 0
1PPS_4
$Comp
L POWDER_Digital:SN74AC14-Q1 U1003
U 1 1 5E1E0893
P 9950 2750
F 0 "U1003" H 9950 3275 50  0000 C CNN
F 1 "SN74AC14-Q1" H 9950 3184 50  0000 C CNN
F 2 "Package_SO:TSSOP-14_4.4x5mm_P0.65mm" H 9950 2400 50  0001 C CNN
F 3 "" H 9950 2400 50  0001 C CNN
F 4 "3000-0000000523" H 9950 2750 50  0001 C CNN "PartSpecification"
	1    9950 2750
	1    0    0    -1  
$EndComp
$Comp
L POWDER_Digital:SN74AC14-Q1 U1004
U 1 1 5E1E0EE3
P 9950 4250
F 0 "U1004" H 9950 4775 50  0000 C CNN
F 1 "SN74AC14-Q1" H 9950 4684 50  0000 C CNN
F 2 "Package_SO:TSSOP-14_4.4x5mm_P0.65mm" H 9950 3900 50  0001 C CNN
F 3 "" H 9950 3900 50  0001 C CNN
F 4 "3000-0000000523" H 9950 4250 50  0001 C CNN "PartSpecification"
	1    9950 4250
	1    0    0    -1  
$EndComp
$Comp
L POWDER_Misc:XO_GPSDO U1002
U 1 1 5E1E3A8A
P 3900 4600
F 0 "U1002" H 3900 5175 50  0000 C CNN
F 1 "XO_GPSDO" H 3900 5084 50  0000 C CNN
F 2 "POWDER_RF:XO_GPSDO" H 4000 4250 50  0001 C CNN
F 3 "" H 4000 4250 50  0001 C CNN
	1    3900 4600
	1    0    0    -1  
$EndComp
Text HLabel 1500 2400 0    50   Output ~ 0
ser_tx
Text HLabel 1500 2500 0    50   Output ~ 0
nmea_txd
Text HLabel 1500 2600 0    50   Output ~ 0
lock_ok
Text HLabel 1500 2700 0    50   Output ~ 0
pps_out
Text HLabel 1500 2300 0    50   Input ~ 0
ser_rx
Text HLabel 1500 2800 0    50   Input ~ 0
enter_isp
Wire Wire Line
	1500 2400 2000 2400
Text Label 2000 2400 2    50   ~ 0
SER_OUTPUT
Text Label 2000 2800 2    50   ~ 0
ENTER_ISP#
Wire Wire Line
	1500 2800 2000 2800
Text Label 3100 2250 0    50   ~ 0
1PPS_OUTPUT
Text Label 2500 3700 0    50   ~ 0
10MHz_3v3
Text Label 3100 2050 0    50   ~ 0
10MHz_3v3
Text Label 1700 3700 2    50   ~ 0
10MHz_5V
Wire Wire Line
	1700 3700 1850 3700
Wire Wire Line
	2500 3700 2350 3700
Text Label 2000 2600 2    50   ~ 0
LOCK_OK
Wire Wire Line
	1500 2600 2000 2600
Wire Wire Line
	1500 2700 2000 2700
Wire Wire Line
	1500 2500 2000 2500
Text Label 2000 2500 2    50   ~ 0
NMEA_TXD
Text Notes 3800 3100 0    50   ~ 0
I'm not sure what connectors you wanted for these signals
Text Label 2000 2700 2    50   ~ 0
1PPS_MCU
Wire Wire Line
	3600 2450 3100 2450
Text Label 3100 2450 0    50   ~ 0
1PPS_MCU
Text Notes 1850 3000 0    50   ~ 0
TODO BUFFER 5V to 3v3 SN74LVC1T45-Q1
$Comp
L POWDER_Digital:SN74LV1T04 U1001
U 1 1 5E2062FE
P 2100 3700
F 0 "U1001" H 2200 4000 50  0000 C CNN
F 1 "SN74LV1T04" H 2400 3400 50  0000 C CNN
F 2 "POWDER_Digital:SC70" H 2350 4100 50  0001 C CNN
F 3 "" H 2350 4100 50  0001 C CNN
F 4 "3000-0000000522" H 2100 3700 50  0001 C CNN "PartSpecification"
	1    2100 3700
	1    0    0    -1  
$EndComp
$Comp
L power:GND #PWR?
U 1 1 5E211C2D
P 2100 4150
F 0 "#PWR?" H 2100 3900 50  0001 C CNN
F 1 "GND" H 2105 3977 50  0000 C CNN
F 2 "" H 2100 4150 50  0001 C CNN
F 3 "" H 2100 4150 50  0001 C CNN
	1    2100 4150
	1    0    0    -1  
$EndComp
Wire Wire Line
	2100 4150 2100 4050
$Comp
L power:+3.3V #PWR?
U 1 1 5E21BB2D
P 2100 3250
F 0 "#PWR?" H 2100 3100 50  0001 C CNN
F 1 "+3.3V" H 2100 3390 50  0000 C CNN
F 2 "" H 2100 3250 50  0001 C CNN
F 3 "" H 2100 3250 50  0001 C CNN
	1    2100 3250
	1    0    0    -1  
$EndComp
Wire Wire Line
	2100 3250 2100 3350
$Comp
L 000_PreferredParts:C_0_1uF C1002
U 1 1 5F7E516E
P 1350 5150
F 0 "C1002" H 1375 5250 50  0000 L CNN
F 1 "C_0_1uF" H 1375 5050 50  0001 L CNN
F 2 "Capacitor_SMD:C_0402_1005Metric" H 1388 5000 50  0001 C CNN
F 3 "~" H 1350 5150 50  0001 C CNN
F 4 "0.1uF" H 1500 5050 50  0000 C CNN "DisplayValue"
F 5 "3000-0000000125" H 1350 5150 50  0001 C CNN "PartSpecification"
F 6 "100V" H 1350 5150 50  0001 C CNN "Voltage"
	1    1350 5150
	1    0    0    -1  
$EndComp
Wire Wire Line
	950  4950 1350 4950
Wire Wire Line
	1350 5000 1350 4950
Connection ~ 1350 4950
Wire Wire Line
	1350 4950 1700 4950
Wire Wire Line
	1350 5300 1350 5350
$Comp
L 000_PreferredParts:C_10uF_0603 C1003
U 1 1 5F7F9FB2
P 1700 5150
F 0 "C1003" H 1725 5250 50  0000 L CNN
F 1 "C_10uF_0603" H 1725 5050 50  0001 L CNN
F 2 "Capacitor_SMD:C_0603_1608Metric" H 1738 5000 50  0001 C CNN
F 3 "~" H 1700 5150 50  0001 C CNN
F 4 "10uF" H 1850 5050 50  0000 C CNN "DisplayValue"
F 5 "0603" H 1850 4950 50  0000 C CNN "DisplayFootprint"
F 6 "3000-0000000135" H 1700 5150 50  0001 C CNN "PartSpecification"
	1    1700 5150
	1    0    0    -1  
$EndComp
$Comp
L 000_PreferredParts:C_10uF_0603 C1001
U 1 1 5F7FA90C
P 950 5150
F 0 "C1001" H 975 5250 50  0000 L CNN
F 1 "C_10uF_0603" H 975 5050 50  0001 L CNN
F 2 "Capacitor_SMD:C_0603_1608Metric" H 988 5000 50  0001 C CNN
F 3 "~" H 950 5150 50  0001 C CNN
F 4 "10uF" H 1100 5050 50  0000 C CNN "DisplayValue"
F 5 "0603" H 1100 4950 50  0000 C CNN "DisplayFootprint"
F 6 "3000-0000000135" H 950 5150 50  0001 C CNN "PartSpecification"
	1    950  5150
	1    0    0    -1  
$EndComp
Wire Wire Line
	950  5300 950  5350
Connection ~ 950  5350
Wire Wire Line
	950  5000 950  4950
Connection ~ 950  4950
Wire Wire Line
	1350 5350 1700 5350
Wire Wire Line
	1700 5350 1700 5300
Connection ~ 1350 5350
Wire Wire Line
	1700 5000 1700 4950
Connection ~ 1700 4950
Wire Wire Line
	1700 4950 3250 4950
$Comp
L 000_PreferredParts:C_1uF C1005
U 1 1 5F82BE0E
P 8250 2650
F 0 "C1005" H 8275 2750 50  0000 L CNN
F 1 "C_1uF" H 8275 2550 50  0000 L CNN
F 2 "Capacitor_SMD:C_0603_1608Metric" H 8288 2500 50  0001 C CNN
F 3 "~" H 8250 2650 50  0001 C CNN
F 4 "3000-0000000136" H 8250 2650 50  0001 C CNN "PartSpecification"
	1    8250 2650
	1    0    0    -1  
$EndComp
Wire Wire Line
	8250 2800 8250 2850
Connection ~ 8250 2850
Wire Wire Line
	8250 2500 8250 2450
Connection ~ 8250 2450
$Comp
L 000_PreferredParts:C_1uF C1006
U 1 1 5F846030
P 8250 4150
F 0 "C1006" H 8275 4250 50  0000 L CNN
F 1 "C_1uF" H 8275 4050 50  0000 L CNN
F 2 "Capacitor_SMD:C_0603_1608Metric" H 8288 4000 50  0001 C CNN
F 3 "~" H 8250 4150 50  0001 C CNN
F 4 "3000-0000000136" H 8250 4150 50  0001 C CNN "PartSpecification"
	1    8250 4150
	1    0    0    -1  
$EndComp
Wire Wire Line
	8250 4300 8250 4350
Wire Wire Line
	8250 4000 8250 3950
$Comp
L 000_PreferredParts:C_10nF C1007
U 1 1 5F8513D2
P 8600 2650
F 0 "C1007" H 8625 2750 50  0000 L CNN
F 1 "C_10nF" H 8625 2550 50  0001 L CNN
F 2 "Capacitor_SMD:C_0402_1005Metric" H 8638 2500 50  0001 C CNN
F 3 "~" H 8600 2650 50  0001 C CNN
F 4 "10nF" H 8750 2550 50  0000 C CNN "DisplayValue"
F 5 "3000-0000000203" H 8600 2650 50  0001 C CNN "PartSpecification"
F 6 "50V" H 8600 2650 50  0001 C CNN "Voltage"
	1    8600 2650
	1    0    0    -1  
$EndComp
Wire Wire Line
	8600 2500 8600 2450
Wire Wire Line
	8600 2800 8600 2850
$Comp
L 000_PreferredParts:C_10nF C1008
U 1 1 5F8687D8
P 8600 4150
F 0 "C1008" H 8625 4250 50  0000 L CNN
F 1 "C_10nF" H 8625 4050 50  0001 L CNN
F 2 "Capacitor_SMD:C_0402_1005Metric" H 8638 4000 50  0001 C CNN
F 3 "~" H 8600 4150 50  0001 C CNN
F 4 "10nF" H 8750 4050 50  0000 C CNN "DisplayValue"
F 5 "3000-0000000203" H 8600 4150 50  0001 C CNN "PartSpecification"
F 6 "50V" H 8600 4150 50  0001 C CNN "Voltage"
	1    8600 4150
	1    0    0    -1  
$EndComp
Wire Wire Line
	8600 4000 8600 3950
Wire Wire Line
	8600 4300 8600 4350
Connection ~ 8250 3950
Connection ~ 8250 4350
$Comp
L power:+3.3V #PWR?
U 1 1 5FC2F278
P 3000 3450
AR Path="/5FC2F278" Ref="#PWR?"  Part="1" 
AR Path="/5C53436C/5FC2F278" Ref="#PWR?"  Part="1" 
AR Path="/5C536099/5FC2F278" Ref="#PWR?"  Part="1" 
AR Path="/5C566284/5FC2F278" Ref="#PWR?"  Part="1" 
AR Path="/5C5662B1/5FC2F278" Ref="#PWR?"  Part="1" 
AR Path="/5C5662C4/5FC2F278" Ref="#PWR?"  Part="1" 
AR Path="/5E186189/5FC2F278" Ref="#PWR?"  Part="1" 
F 0 "#PWR?" H 3000 3300 50  0001 C CNN
F 1 "+3.3V" H 3015 3623 50  0000 C CNN
F 2 "" H 3000 3450 50  0001 C CNN
F 3 "" H 3000 3450 50  0001 C CNN
	1    3000 3450
	1    0    0    -1  
$EndComp
Wire Wire Line
	3000 3450 3000 3550
$Comp
L power:GND #PWR?
U 1 1 5FC2F27F
P 3000 4050
AR Path="/5FC2F27F" Ref="#PWR?"  Part="1" 
AR Path="/5C53436C/5FC2F27F" Ref="#PWR?"  Part="1" 
AR Path="/5C536099/5FC2F27F" Ref="#PWR?"  Part="1" 
AR Path="/5C566284/5FC2F27F" Ref="#PWR?"  Part="1" 
AR Path="/5C5662B1/5FC2F27F" Ref="#PWR?"  Part="1" 
AR Path="/5C5662C4/5FC2F27F" Ref="#PWR?"  Part="1" 
AR Path="/5E186189/5FC2F27F" Ref="#PWR?"  Part="1" 
F 0 "#PWR?" H 3000 3800 50  0001 C CNN
F 1 "GND" H 3005 3877 50  0000 C CNN
F 2 "" H 3000 4050 50  0001 C CNN
F 3 "" H 3000 4050 50  0001 C CNN
	1    3000 4050
	1    0    0    -1  
$EndComp
Wire Wire Line
	3000 3950 3000 4050
Wire Wire Line
	3000 3550 3350 3550
Wire Wire Line
	3350 3950 3000 3950
$Comp
L 000_PreferredParts:C_1uF C1009
U 1 1 5FC2F289
P 3000 3750
F 0 "C1009" H 3025 3850 50  0000 L CNN
F 1 "C_1uF" H 3025 3650 50  0000 L CNN
F 2 "Capacitor_SMD:C_0603_1608Metric" H 3038 3600 50  0001 C CNN
F 3 "~" H 3000 3750 50  0001 C CNN
F 4 "3000-0000000136" H 3000 3750 50  0001 C CNN "PartSpecification"
	1    3000 3750
	1    0    0    -1  
$EndComp
Wire Wire Line
	3000 3900 3000 3950
Wire Wire Line
	3000 3600 3000 3550
$Comp
L 000_PreferredParts:C_10nF C1010
U 1 1 5FC2F294
P 3350 3750
F 0 "C1010" H 3375 3850 50  0000 L CNN
F 1 "C_10nF" H 3375 3650 50  0001 L CNN
F 2 "Capacitor_SMD:C_0402_1005Metric" H 3388 3600 50  0001 C CNN
F 3 "~" H 3350 3750 50  0001 C CNN
F 4 "10nF" H 3500 3650 50  0000 C CNN "DisplayValue"
F 5 "3000-0000000203" H 3350 3750 50  0001 C CNN "PartSpecification"
F 6 "50V" H 3350 3750 50  0001 C CNN "Voltage"
	1    3350 3750
	1    0    0    -1  
$EndComp
Wire Wire Line
	3350 3600 3350 3550
Wire Wire Line
	3350 3900 3350 3950
Connection ~ 3000 3550
Connection ~ 3000 3950
Text Label 10350 4250 0    50   ~ 0
NMEA_TXD_B
Text Label 5100 2150 2    50   ~ 0
1PPS_1
Wire Wire Line
	4600 2150 5100 2150
Text Label 5100 2250 2    50   ~ 0
1PPS_2
Wire Wire Line
	5100 2250 4600 2250
Text Label 10350 2750 0    50   ~ 0
LOCK_OK_B
$EndSCHEMATC
