EESchema Schematic File Version 4
LIBS:fdd_frontend_basestation-cache
EELAYER 30 0
EELAYER END
$Descr A4 11693 8268
encoding utf-8
Sheet 13 14
Title ""
Date ""
Rev ""
Comp ""
Comment1 ""
Comment2 ""
Comment3 ""
Comment4 ""
$EndDescr
$Comp
L POWDER_Power:INA4180-Q1 U?
U 1 1 5D974465
P 4850 3100
AR Path="/5D974465" Ref="U?"  Part="1" 
AR Path="/5D949534/5D974465" Ref="U1301"  Part="1" 
F 0 "U1301" H 5100 3800 50  0000 L CNN
F 1 "INA4180-Q1" H 5000 2400 50  0000 L CNN
F 2 "Package_SO:TSSOP-14_4.4x5mm_P0.65mm" H 6750 3950 100 0001 C CNN
F 3 "" H 5100 3800 100 0001 C CNN
F 4 "3000-0000000185" H 4850 3100 50  0001 C CNN "PartSpecification"
	1    4850 3100
	-1   0    0    -1  
$EndComp
$Comp
L power:+3.3V #PWR?
U 1 1 5D97446B
P 4850 2300
AR Path="/5D97446B" Ref="#PWR?"  Part="1" 
AR Path="/5D949534/5D97446B" Ref="#PWR?"  Part="1" 
F 0 "#PWR?" H 4850 2150 50  0001 C CNN
F 1 "+3.3V" H 4865 2473 50  0000 C CNN
F 2 "" H 4850 2300 50  0001 C CNN
F 3 "" H 4850 2300 50  0001 C CNN
	1    4850 2300
	1    0    0    -1  
$EndComp
Wire Wire Line
	4850 2300 4850 2350
$Comp
L power:GND #PWR?
U 1 1 5D974472
P 4850 3900
AR Path="/5D974472" Ref="#PWR?"  Part="1" 
AR Path="/5D949534/5D974472" Ref="#PWR?"  Part="1" 
F 0 "#PWR?" H 4850 3650 50  0001 C CNN
F 1 "GND" H 4855 3727 50  0000 C CNN
F 2 "" H 4850 3900 50  0001 C CNN
F 3 "" H 4850 3900 50  0001 C CNN
	1    4850 3900
	1    0    0    -1  
$EndComp
Wire Wire Line
	4850 3900 4850 3800
Text HLabel 2750 2650 0    50   Output ~ 0
OUT_1
Text HLabel 2750 2950 0    50   Output ~ 0
OUT_2
Text HLabel 2750 3250 0    50   Output ~ 0
OUT_3
Text HLabel 2750 3550 0    50   Output ~ 0
OUT_4
Text HLabel 5000 1500 0    50   Input ~ 0
IN_P
Wire Wire Line
	5300 2700 5350 2700
Wire Wire Line
	5300 2900 5700 2900
Wire Wire Line
	5300 3300 6500 3300
Wire Wire Line
	5300 3500 7000 3500
$Comp
L Device:R R?
U 1 1 5D9889BE
P 5350 2300
AR Path="/5D69D382/5D9889BE" Ref="R?"  Part="1" 
AR Path="/5D9889BE" Ref="R?"  Part="1" 
AR Path="/5D949534/5D9889BE" Ref="R1301"  Part="1" 
F 0 "R1301" H 5420 2346 50  0000 L CNN
F 1 "100" H 5420 2255 50  0000 L CNN
F 2 "Resistor_SMD:R_0402_1005Metric" V 5280 2300 50  0001 C CNN
F 3 "~" H 5350 2300 50  0001 C CNN
F 4 "" H 5350 2300 50  0001 C CNN "Manufacturer"
F 5 "" H 5350 2300 50  0001 C CNN "PartNumber"
F 6 "3000-0000000149" H 5350 2300 50  0001 C CNN "PartSpecification"
	1    5350 2300
	1    0    0    -1  
$EndComp
Wire Wire Line
	5350 2450 5350 2700
Wire Wire Line
	6200 2700 6100 2700
Wire Wire Line
	5700 2450 5700 2900
Wire Wire Line
	6500 2450 6500 3300
Wire Wire Line
	6900 3300 6850 3300
Wire Wire Line
	7000 2450 7000 3500
Wire Wire Line
	5000 1500 5350 1500
Wire Wire Line
	5350 1500 5350 2150
Wire Wire Line
	5700 2150 5700 1500
Wire Wire Line
	6500 2150 6500 1500
Wire Wire Line
	7000 2150 7000 1500
Wire Wire Line
	5300 3600 7500 3600
Wire Wire Line
	5300 3200 6900 3200
Wire Wire Line
	5300 3000 6400 3000
Wire Wire Line
	5300 2600 6200 2600
Text HLabel 8100 2600 2    50   Input ~ 0
IN_M_1
Text HLabel 8100 3000 2    50   Input ~ 0
IN_M_2
Text HLabel 8100 3200 2    50   Input ~ 0
IN_M_3
Text HLabel 8100 3600 2    50   Input ~ 0
IN_M_4
Wire Wire Line
	8100 3600 8000 3600
Wire Wire Line
	8000 3200 8100 3200
Wire Wire Line
	8100 3000 7700 3000
Wire Wire Line
	7700 2600 8100 2600
Wire Wire Line
	2750 2650 4400 2650
Wire Wire Line
	2750 2950 4400 2950
Wire Wire Line
	2750 3250 4400 3250
Wire Wire Line
	2750 3550 4400 3550
$Comp
L 000_PreferredParts:C_100nF C1301
U 1 1 5D99CE2F
P 5950 2700
F 0 "C1301" H 5975 2800 50  0000 L CNN
F 1 "C_100nF" H 5975 2600 50  0001 L CNN
F 2 "Capacitor_SMD:C_0402_1005Metric" H 5988 2550 50  0001 C CNN
F 3 "~" H 5950 2700 50  0001 C CNN
F 4 "100nF" H 6100 2600 50  0000 C CNN "DisplayValue"
F 5 "3000-0000000125" H 0   0   50  0001 C CNN "PartSpecification"
	1    5950 2700
	0    1    1    0   
$EndComp
$Comp
L 000_PreferredParts:C_100nF C1303
U 1 1 5D99D1F3
P 6150 2900
F 0 "C1303" H 6175 3000 50  0000 L CNN
F 1 "C_100nF" H 6175 2800 50  0001 L CNN
F 2 "Capacitor_SMD:C_0402_1005Metric" H 6188 2750 50  0001 C CNN
F 3 "~" H 6150 2900 50  0001 C CNN
F 4 "100nF" H 6300 2800 50  0000 C CNN "DisplayValue"
F 5 "3000-0000000125" H 0   0   50  0001 C CNN "PartSpecification"
	1    6150 2900
	0    1    1    0   
$EndComp
$Comp
L 000_PreferredParts:C_100nF C1302
U 1 1 5D99D3DA
P 6700 3300
F 0 "C1302" H 6725 3400 50  0000 L CNN
F 1 "C_100nF" H 6725 3200 50  0001 L CNN
F 2 "Capacitor_SMD:C_0402_1005Metric" H 6738 3150 50  0001 C CNN
F 3 "~" H 6700 3300 50  0001 C CNN
F 4 "100nF" H 6850 3200 50  0000 C CNN "DisplayValue"
F 5 "3000-0000000125" H 0   0   50  0001 C CNN "PartSpecification"
	1    6700 3300
	0    1    1    0   
$EndComp
$Comp
L 000_PreferredParts:C_100nF C1304
U 1 1 5D99D665
P 7250 3500
F 0 "C1304" H 7275 3600 50  0000 L CNN
F 1 "C_100nF" H 7275 3400 50  0001 L CNN
F 2 "Capacitor_SMD:C_0402_1005Metric" H 7288 3350 50  0001 C CNN
F 3 "~" H 7250 3500 50  0001 C CNN
F 4 "100nF" H 7400 3400 50  0000 C CNN "DisplayValue"
F 5 "3000-0000000125" H 0   0   50  0001 C CNN "PartSpecification"
	1    7250 3500
	0    1    1    0   
$EndComp
$Comp
L Device:R R?
U 1 1 5D99DDCE
P 5700 2300
AR Path="/5D69D382/5D99DDCE" Ref="R?"  Part="1" 
AR Path="/5D99DDCE" Ref="R?"  Part="1" 
AR Path="/5D949534/5D99DDCE" Ref="R1302"  Part="1" 
F 0 "R1302" H 5770 2346 50  0000 L CNN
F 1 "100" H 5770 2255 50  0000 L CNN
F 2 "Resistor_SMD:R_0402_1005Metric" V 5630 2300 50  0001 C CNN
F 3 "~" H 5700 2300 50  0001 C CNN
F 4 "" H 5700 2300 50  0001 C CNN "Manufacturer"
F 5 "" H 5700 2300 50  0001 C CNN "PartNumber"
F 6 "3000-0000000149" H 5700 2300 50  0001 C CNN "PartSpecification"
	1    5700 2300
	1    0    0    -1  
$EndComp
$Comp
L Device:R R?
U 1 1 5D99DFB0
P 6500 2300
AR Path="/5D69D382/5D99DFB0" Ref="R?"  Part="1" 
AR Path="/5D99DFB0" Ref="R?"  Part="1" 
AR Path="/5D949534/5D99DFB0" Ref="R1303"  Part="1" 
F 0 "R1303" H 6570 2346 50  0000 L CNN
F 1 "100" H 6570 2255 50  0000 L CNN
F 2 "Resistor_SMD:R_0402_1005Metric" V 6430 2300 50  0001 C CNN
F 3 "~" H 6500 2300 50  0001 C CNN
F 4 "" H 6500 2300 50  0001 C CNN "Manufacturer"
F 5 "" H 6500 2300 50  0001 C CNN "PartNumber"
F 6 "3000-0000000149" H 6500 2300 50  0001 C CNN "PartSpecification"
	1    6500 2300
	1    0    0    -1  
$EndComp
$Comp
L Device:R R?
U 1 1 5D99E228
P 7000 2300
AR Path="/5D69D382/5D99E228" Ref="R?"  Part="1" 
AR Path="/5D99E228" Ref="R?"  Part="1" 
AR Path="/5D949534/5D99E228" Ref="R1304"  Part="1" 
F 0 "R1304" H 7070 2346 50  0000 L CNN
F 1 "100" H 7070 2255 50  0000 L CNN
F 2 "Resistor_SMD:R_0402_1005Metric" V 6930 2300 50  0001 C CNN
F 3 "~" H 7000 2300 50  0001 C CNN
F 4 "" H 7000 2300 50  0001 C CNN "Manufacturer"
F 5 "" H 7000 2300 50  0001 C CNN "PartNumber"
F 6 "3000-0000000149" H 7000 2300 50  0001 C CNN "PartSpecification"
	1    7000 2300
	1    0    0    -1  
$EndComp
$Comp
L Device:R R?
U 1 1 5D99E393
P 7550 2600
AR Path="/5D69D382/5D99E393" Ref="R?"  Part="1" 
AR Path="/5D99E393" Ref="R?"  Part="1" 
AR Path="/5D949534/5D99E393" Ref="R1305"  Part="1" 
F 0 "R1305" H 7620 2646 50  0000 L CNN
F 1 "100" H 7620 2555 50  0000 L CNN
F 2 "Resistor_SMD:R_0402_1005Metric" V 7480 2600 50  0001 C CNN
F 3 "~" H 7550 2600 50  0001 C CNN
F 4 "" H 7550 2600 50  0001 C CNN "Manufacturer"
F 5 "" H 7550 2600 50  0001 C CNN "PartNumber"
F 6 "3000-0000000149" H 7550 2600 50  0001 C CNN "PartSpecification"
	1    7550 2600
	0    1    1    0   
$EndComp
$Comp
L Device:R R?
U 1 1 5D99ED8A
P 7550 3000
AR Path="/5D69D382/5D99ED8A" Ref="R?"  Part="1" 
AR Path="/5D99ED8A" Ref="R?"  Part="1" 
AR Path="/5D949534/5D99ED8A" Ref="R1306"  Part="1" 
F 0 "R1306" H 7620 3046 50  0000 L CNN
F 1 "100" H 7620 2955 50  0000 L CNN
F 2 "Resistor_SMD:R_0402_1005Metric" V 7480 3000 50  0001 C CNN
F 3 "~" H 7550 3000 50  0001 C CNN
F 4 "" H 7550 3000 50  0001 C CNN "Manufacturer"
F 5 "" H 7550 3000 50  0001 C CNN "PartNumber"
F 6 "3000-0000000149" H 7550 3000 50  0001 C CNN "PartSpecification"
	1    7550 3000
	0    1    1    0   
$EndComp
$Comp
L Device:R R?
U 1 1 5D99EFF1
P 7850 3200
AR Path="/5D69D382/5D99EFF1" Ref="R?"  Part="1" 
AR Path="/5D99EFF1" Ref="R?"  Part="1" 
AR Path="/5D949534/5D99EFF1" Ref="R1307"  Part="1" 
F 0 "R1307" H 7920 3246 50  0000 L CNN
F 1 "100" H 7920 3155 50  0000 L CNN
F 2 "Resistor_SMD:R_0402_1005Metric" V 7780 3200 50  0001 C CNN
F 3 "~" H 7850 3200 50  0001 C CNN
F 4 "" H 7850 3200 50  0001 C CNN "Manufacturer"
F 5 "" H 7850 3200 50  0001 C CNN "PartNumber"
F 6 "3000-0000000149" H 7850 3200 50  0001 C CNN "PartSpecification"
	1    7850 3200
	0    1    1    0   
$EndComp
$Comp
L Device:R R?
U 1 1 5D99F234
P 7850 3600
AR Path="/5D69D382/5D99F234" Ref="R?"  Part="1" 
AR Path="/5D99F234" Ref="R?"  Part="1" 
AR Path="/5D949534/5D99F234" Ref="R1308"  Part="1" 
F 0 "R1308" H 7920 3646 50  0000 L CNN
F 1 "100" H 7920 3555 50  0000 L CNN
F 2 "Resistor_SMD:R_0402_1005Metric" V 7780 3600 50  0001 C CNN
F 3 "~" H 7850 3600 50  0001 C CNN
F 4 "" H 7850 3600 50  0001 C CNN "Manufacturer"
F 5 "" H 7850 3600 50  0001 C CNN "PartNumber"
F 6 "3000-0000000149" H 7850 3600 50  0001 C CNN "PartSpecification"
	1    7850 3600
	0    1    1    0   
$EndComp
Wire Wire Line
	6200 2700 6200 2600
Connection ~ 6200 2600
Wire Wire Line
	6200 2600 7400 2600
Connection ~ 5350 1500
Connection ~ 5350 2700
Wire Wire Line
	5350 2700 5800 2700
Wire Wire Line
	5350 1500 5700 1500
Connection ~ 5700 1500
Connection ~ 5700 2900
Wire Wire Line
	5700 2900 6000 2900
Wire Wire Line
	5700 1500 6500 1500
Wire Wire Line
	6400 2900 6400 3000
Wire Wire Line
	6400 2900 6300 2900
Connection ~ 6400 3000
Wire Wire Line
	6400 3000 7400 3000
Connection ~ 6500 1500
Connection ~ 6500 3300
Wire Wire Line
	6500 3300 6550 3300
Wire Wire Line
	6500 1500 7000 1500
Wire Wire Line
	6900 3300 6900 3200
Connection ~ 6900 3200
Wire Wire Line
	6900 3200 7700 3200
Connection ~ 7000 3500
Wire Wire Line
	7100 3500 7000 3500
Wire Wire Line
	7400 3500 7500 3500
Wire Wire Line
	7500 3500 7500 3600
Connection ~ 7500 3600
Wire Wire Line
	7500 3600 7700 3600
Text Label 6200 2600 0    50   ~ 0
IN_M_1_F
Text Label 5450 2700 0    50   ~ 0
IN_P_1_F
Text Label 5350 2900 0    50   ~ 0
IN_P_2_F
Text Label 5350 3000 0    50   ~ 0
IN_M_2_F
Text Label 5350 3200 0    50   ~ 0
IN_M_3_F
Text Label 5350 3300 0    50   ~ 0
IN_P_3_F
Text Label 5350 3500 0    50   ~ 0
IN_P_4_F
Text Label 5350 3600 0    50   ~ 0
IN_M_4_F
$Comp
L 000_PreferredParts:C_0_1uF C1305
U 1 1 5ECFE980
P 4200 2200
F 0 "C1305" H 4225 2300 50  0000 L CNN
F 1 "C_0_1uF" H 4225 2100 50  0001 L CNN
F 2 "Capacitor_SMD:C_0402_1005Metric" H 4238 2050 50  0001 C CNN
F 3 "~" H 4200 2200 50  0001 C CNN
F 4 "0.1uF" H 4350 2100 50  0000 C CNN "DisplayValue"
F 5 "3000-0000000125" H 0   0   50  0001 C CNN "PartSpecification"
	1    4200 2200
	1    0    0    -1  
$EndComp
$Comp
L power:GND #PWR?
U 1 1 5ED0106D
P 4200 2450
AR Path="/5ED0106D" Ref="#PWR?"  Part="1" 
AR Path="/5D949534/5ED0106D" Ref="#PWR?"  Part="1" 
F 0 "#PWR?" H 4200 2200 50  0001 C CNN
F 1 "GND" H 4205 2277 50  0000 C CNN
F 2 "" H 4200 2450 50  0001 C CNN
F 3 "" H 4200 2450 50  0001 C CNN
	1    4200 2450
	1    0    0    -1  
$EndComp
Wire Wire Line
	4200 2450 4200 2350
Wire Wire Line
	4200 2050 4200 2000
Wire Wire Line
	4200 2000 4700 2000
Wire Wire Line
	4700 2000 4700 2350
Wire Wire Line
	4700 2350 4850 2350
Connection ~ 4850 2350
Wire Wire Line
	4850 2350 4850 2400
$EndSCHEMATC
