EESchema Schematic File Version 4
EELAYER 30 0
EELAYER END
$Descr A4 11693 8268
encoding utf-8
Sheet 5 27
Title ""
Date ""
Rev ""
Comp ""
Comment1 ""
Comment2 ""
Comment3 ""
Comment4 ""
$EndDescr
Text HLabel 800  1000 0    50   Input ~ 0
v_in
Text HLabel 10950 700  2    50   Output ~ 0
v_out
Text HLabel 3100 2550 0    50   Input ~ 0
sync
$Comp
L power:GND #PWR?
U 1 1 5F78B0E1
P 2100 1500
AR Path="/5E179620/5E179864/5F78B0E1" Ref="#PWR?"  Part="1" 
AR Path="/5E182A9D/5F777EC8/5F78B0E1" Ref="#PWR?"  Part="1" 
F 0 "#PWR?" H 2100 1250 50  0001 C CNN
F 1 "GND" H 2100 1350 50  0000 C CNN
F 2 "" H 2100 1500 50  0001 C CNN
F 3 "" H 2100 1500 50  0001 C CNN
	1    2100 1500
	1    0    0    -1  
$EndComp
$Comp
L power:GND #PWR?
U 1 1 5F78B0E7
P 1800 1500
AR Path="/5E179620/5E179864/5F78B0E7" Ref="#PWR?"  Part="1" 
AR Path="/5E182A9D/5F777EC8/5F78B0E7" Ref="#PWR?"  Part="1" 
F 0 "#PWR?" H 1800 1250 50  0001 C CNN
F 1 "GND" H 1800 1350 50  0000 C CNN
F 2 "" H 1800 1500 50  0001 C CNN
F 3 "" H 1800 1500 50  0001 C CNN
	1    1800 1500
	1    0    0    -1  
$EndComp
Wire Wire Line
	1800 1400 1800 1500
Wire Wire Line
	2100 1500 2100 1400
Wire Wire Line
	1800 1100 1800 1000
Connection ~ 1800 1000
Wire Wire Line
	1800 1000 2100 1000
Wire Wire Line
	2100 1100 2100 1000
Connection ~ 2100 1000
Wire Wire Line
	2100 1000 2350 1000
Wire Wire Line
	3100 2250 5300 2250
Wire Wire Line
	2800 2250 2350 2250
Wire Wire Line
	2350 2250 2350 1000
Connection ~ 2350 1000
Wire Wire Line
	2350 1000 2500 1000
Wire Wire Line
	2550 2300 2550 2050
Wire Wire Line
	2550 2050 2500 2050
Wire Wire Line
	2550 2050 5300 2050
Connection ~ 2550 2050
Wire Wire Line
	2500 1100 2500 1000
Connection ~ 2500 1000
$Comp
L power:GND #PWR?
U 1 1 5F78B128
P 2550 2700
AR Path="/5E179620/5E179864/5F78B128" Ref="#PWR?"  Part="1" 
AR Path="/5E182A9D/5F777EC8/5F78B128" Ref="#PWR?"  Part="1" 
F 0 "#PWR?" H 2550 2450 50  0001 C CNN
F 1 "GND" H 2550 2550 50  0000 C CNN
F 2 "" H 2550 2700 50  0001 C CNN
F 3 "" H 2550 2700 50  0001 C CNN
	1    2550 2700
	1    0    0    -1  
$EndComp
Wire Wire Line
	2550 2700 2550 2600
$Comp
L power:GND #PWR?
U 1 1 5F78B136
P 6400 1750
AR Path="/5E179620/5E179864/5F78B136" Ref="#PWR?"  Part="1" 
AR Path="/5E182A9D/5F777EC8/5F78B136" Ref="#PWR?"  Part="1" 
F 0 "#PWR?" H 6400 1500 50  0001 C CNN
F 1 "GND" H 6400 1600 50  0000 C CNN
F 2 "" H 6400 1750 50  0001 C CNN
F 3 "" H 6400 1750 50  0001 C CNN
	1    6400 1750
	1    0    0    -1  
$EndComp
Wire Wire Line
	6400 1750 6400 1650
Wire Wire Line
	6400 1350 6100 1350
Wire Wire Line
	6100 1350 6100 1750
Text HLabel 3100 2450 0    50   Input ~ 0
en
Wire Wire Line
	3100 2450 5300 2450
Wire Wire Line
	3600 2650 3600 2550
Wire Wire Line
	3600 2550 5300 2550
$Comp
L power:GND #PWR?
U 1 1 5F78B149
P 3600 3050
AR Path="/5E179620/5E179864/5F78B149" Ref="#PWR?"  Part="1" 
AR Path="/5E182A9D/5F777EC8/5F78B149" Ref="#PWR?"  Part="1" 
F 0 "#PWR?" H 3600 2800 50  0001 C CNN
F 1 "GND" H 3600 2900 50  0000 C CNN
F 2 "" H 3600 3050 50  0001 C CNN
F 3 "" H 3600 3050 50  0001 C CNN
	1    3600 3050
	1    0    0    -1  
$EndComp
Wire Wire Line
	3600 3050 3600 2950
Wire Wire Line
	3100 2550 3200 2550
Connection ~ 3600 2550
Wire Wire Line
	3500 2550 3600 2550
Wire Wire Line
	4200 2750 5300 2750
$Comp
L power:GND #PWR?
U 1 1 5F78B164
P 4200 3150
AR Path="/5E179620/5E179864/5F78B164" Ref="#PWR?"  Part="1" 
AR Path="/5E182A9D/5F777EC8/5F78B164" Ref="#PWR?"  Part="1" 
F 0 "#PWR?" H 4200 2900 50  0001 C CNN
F 1 "GND" H 4200 3000 50  0000 C CNN
F 2 "" H 4200 3150 50  0001 C CNN
F 3 "" H 4200 3150 50  0001 C CNN
	1    4200 3150
	1    0    0    -1  
$EndComp
Wire Wire Line
	4200 3150 4200 3050
$Comp
L power:GND #PWR?
U 1 1 5F78B171
P 3900 3150
AR Path="/5E179620/5E179864/5F78B171" Ref="#PWR?"  Part="1" 
AR Path="/5E182A9D/5F777EC8/5F78B171" Ref="#PWR?"  Part="1" 
F 0 "#PWR?" H 3900 2900 50  0001 C CNN
F 1 "GND" H 3900 3000 50  0000 C CNN
F 2 "" H 3900 3150 50  0001 C CNN
F 3 "" H 3900 3150 50  0001 C CNN
	1    3900 3150
	1    0    0    -1  
$EndComp
Wire Wire Line
	3900 3150 3900 3050
Wire Wire Line
	3900 2750 3900 2650
Wire Wire Line
	3900 2650 5300 2650
$Comp
L power:GND #PWR?
U 1 1 5F78B17A
P 4500 2950
AR Path="/5E179620/5E179864/5F78B17A" Ref="#PWR?"  Part="1" 
AR Path="/5E182A9D/5F777EC8/5F78B17A" Ref="#PWR?"  Part="1" 
F 0 "#PWR?" H 4500 2700 50  0001 C CNN
F 1 "GND" H 4500 2800 50  0000 C CNN
F 2 "" H 4500 2950 50  0001 C CNN
F 3 "" H 4500 2950 50  0001 C CNN
	1    4500 2950
	1    0    0    -1  
$EndComp
Wire Wire Line
	4500 2950 4500 2850
Wire Wire Line
	4500 2850 5300 2850
Wire Wire Line
	7500 2050 6700 2050
Wire Wire Line
	6700 2450 6850 2450
Wire Wire Line
	7900 2450 7900 2250
Wire Wire Line
	8100 2450 7900 2450
Connection ~ 7900 2450
Wire Wire Line
	6700 2550 7400 2550
Wire Wire Line
	7400 2550 7400 2850
Wire Wire Line
	7400 2850 7500 2850
Wire Wire Line
	7700 2650 7800 2650
Wire Wire Line
	7900 2650 7800 2650
Connection ~ 7800 2650
Wire Wire Line
	7900 2650 8000 2650
Connection ~ 7900 2650
Wire Wire Line
	7900 2650 7900 2450
Wire Wire Line
	7700 2250 7800 2250
Wire Wire Line
	7800 2250 7900 2250
Connection ~ 7800 2250
Connection ~ 7900 2250
Wire Wire Line
	7700 3050 7800 3050
Wire Wire Line
	7800 3050 7900 3050
Connection ~ 7800 3050
Wire Wire Line
	8600 2450 8600 2250
Connection ~ 8600 2450
Wire Wire Line
	9100 2850 9000 2850
Wire Wire Line
	8800 2650 8700 2650
Wire Wire Line
	8600 2650 8700 2650
Connection ~ 8700 2650
Wire Wire Line
	8600 2650 8500 2650
Connection ~ 8600 2650
Wire Wire Line
	8600 2650 8600 2450
Wire Wire Line
	8800 2250 8700 2250
Wire Wire Line
	8700 2250 8600 2250
Connection ~ 8700 2250
Connection ~ 8600 2250
Wire Wire Line
	8800 3050 8700 3050
Wire Wire Line
	8700 3050 8600 3050
Connection ~ 8700 3050
$Comp
L power:GND #PWR?
U 1 1 5F78B1D8
P 10450 1200
AR Path="/5E179620/5E179864/5F78B1D8" Ref="#PWR?"  Part="1" 
AR Path="/5E182A9D/5F777EC8/5F78B1D8" Ref="#PWR?"  Part="1" 
F 0 "#PWR?" H 10450 950 50  0001 C CNN
F 1 "GND" H 10450 1050 50  0000 C CNN
F 2 "" H 10450 1200 50  0001 C CNN
F 3 "" H 10450 1200 50  0001 C CNN
	1    10450 1200
	1    0    0    -1  
$EndComp
$Comp
L power:GND #PWR?
U 1 1 5F78B1DE
P 10150 1200
AR Path="/5E179620/5E179864/5F78B1DE" Ref="#PWR?"  Part="1" 
AR Path="/5E182A9D/5F777EC8/5F78B1DE" Ref="#PWR?"  Part="1" 
F 0 "#PWR?" H 10150 950 50  0001 C CNN
F 1 "GND" H 10150 1050 50  0000 C CNN
F 2 "" H 10150 1200 50  0001 C CNN
F 3 "" H 10150 1200 50  0001 C CNN
	1    10150 1200
	1    0    0    -1  
$EndComp
Wire Wire Line
	10150 1200 10150 1100
Wire Wire Line
	10450 1100 10450 1200
Wire Wire Line
	10150 800  10150 700 
Wire Wire Line
	10450 800  10450 700 
$Comp
L power:GND #PWR?
U 1 1 5F78B1FA
P 9850 1200
AR Path="/5E179620/5E179864/5F78B1FA" Ref="#PWR?"  Part="1" 
AR Path="/5E182A9D/5F777EC8/5F78B1FA" Ref="#PWR?"  Part="1" 
F 0 "#PWR?" H 9850 950 50  0001 C CNN
F 1 "GND" H 9850 1050 50  0000 C CNN
F 2 "" H 9850 1200 50  0001 C CNN
F 3 "" H 9850 1200 50  0001 C CNN
	1    9850 1200
	1    0    0    -1  
$EndComp
$Comp
L power:GND #PWR?
U 1 1 5F78B200
P 9550 1200
AR Path="/5E179620/5E179864/5F78B200" Ref="#PWR?"  Part="1" 
AR Path="/5E182A9D/5F777EC8/5F78B200" Ref="#PWR?"  Part="1" 
F 0 "#PWR?" H 9550 950 50  0001 C CNN
F 1 "GND" H 9550 1050 50  0000 C CNN
F 2 "" H 9550 1200 50  0001 C CNN
F 3 "" H 9550 1200 50  0001 C CNN
	1    9550 1200
	1    0    0    -1  
$EndComp
Wire Wire Line
	9550 1200 9550 1100
Wire Wire Line
	9850 1100 9850 1200
Wire Wire Line
	9550 800  9550 700 
Wire Wire Line
	9850 800  9850 700 
Wire Wire Line
	9550 700  9850 700 
Connection ~ 9850 700 
Connection ~ 10150 700 
Wire Wire Line
	10150 700  10450 700 
Connection ~ 10450 700 
Wire Wire Line
	9300 2050 9000 2050
Wire Wire Line
	8400 2450 8600 2450
Wire Wire Line
	8250 3200 8250 3150
Wire Wire Line
	8250 3100 7900 3100
Wire Wire Line
	7900 3100 7900 3050
Connection ~ 7900 3050
Wire Wire Line
	8250 3100 8600 3100
Wire Wire Line
	8600 3100 8600 3050
Connection ~ 8250 3100
Connection ~ 8600 3050
$Comp
L power:GND #PWR?
U 1 1 5F78B21F
P 8450 3600
AR Path="/5E179620/5E179864/5F78B21F" Ref="#PWR?"  Part="1" 
AR Path="/5E182A9D/5F777EC8/5F78B21F" Ref="#PWR?"  Part="1" 
F 0 "#PWR?" H 8450 3350 50  0001 C CNN
F 1 "GND" H 8450 3450 50  0000 C CNN
F 2 "" H 8450 3600 50  0001 C CNN
F 3 "" H 8450 3600 50  0001 C CNN
	1    8450 3600
	1    0    0    -1  
$EndComp
Wire Wire Line
	8250 3600 8250 3550
Wire Wire Line
	9100 2850 9100 3850
Wire Wire Line
	6700 3850 9100 3850
Wire Wire Line
	6700 3950 6850 3950
Wire Wire Line
	9200 3950 9200 2450
Wire Wire Line
	9200 2450 8600 2450
Wire Wire Line
	6700 4350 9300 4350
Wire Wire Line
	9300 4350 9300 2050
Wire Wire Line
	7050 3550 6850 3550
Wire Wire Line
	6850 3500 6850 3550
Connection ~ 6850 3550
Wire Wire Line
	6850 3550 6700 3550
Wire Wire Line
	7050 3150 6850 3150
Wire Wire Line
	6850 3200 6850 3150
Connection ~ 6850 3150
Wire Wire Line
	6850 3150 6700 3150
Wire Wire Line
	7350 3150 8250 3150
Connection ~ 8250 3150
Wire Wire Line
	8250 3150 8250 3100
Connection ~ 8250 3550
Wire Wire Line
	8250 3550 8250 3500
Connection ~ 6850 2450
Wire Wire Line
	6850 2450 7900 2450
Wire Wire Line
	6850 2150 6700 2150
Wire Wire Line
	6850 1950 6850 2150
Connection ~ 6850 2150
Wire Wire Line
	6850 1350 6400 1350
Connection ~ 6400 1350
Wire Wire Line
	6850 1350 6850 1650
Connection ~ 6850 3950
Wire Wire Line
	6850 3950 9200 3950
Wire Wire Line
	6700 4250 6850 4250
Wire Wire Line
	7000 4250 6850 4250
Connection ~ 6850 4250
Wire Wire Line
	6850 1350 7200 1350
Connection ~ 6850 1350
Text Label 7200 1350 0    50   ~ 0
VCC
Text Label 7400 4250 0    50   ~ 0
VCC
Wire Wire Line
	7400 4250 7300 4250
Wire Wire Line
	7700 1850 7800 1850
Connection ~ 7800 1850
Wire Wire Line
	7800 1850 7900 1850
Connection ~ 7900 1850
Wire Wire Line
	7900 1850 8000 1850
Wire Wire Line
	8000 1850 8000 1000
Wire Wire Line
	2500 1000 7500 1000
Connection ~ 8000 1850
Wire Wire Line
	8500 1850 8600 1850
Connection ~ 8600 1850
Wire Wire Line
	8600 1850 8700 1850
Connection ~ 8700 1850
Wire Wire Line
	8700 1850 8800 1850
Connection ~ 8800 1850
Wire Wire Line
	8800 1850 9400 1850
Wire Wire Line
	9850 700  10150 700 
Wire Wire Line
	10450 700  10850 700 
Wire Wire Line
	10850 1850 10850 700 
Connection ~ 10850 700 
Wire Wire Line
	10850 700  10950 700 
Wire Wire Line
	5300 2950 4700 2950
$Comp
L power:GND #PWR?
U 1 1 5F78B2AE
P 4700 3350
AR Path="/5E179620/5E179864/5F78B2AE" Ref="#PWR?"  Part="1" 
AR Path="/5E182A9D/5F777EC8/5F78B2AE" Ref="#PWR?"  Part="1" 
F 0 "#PWR?" H 4700 3100 50  0001 C CNN
F 1 "GND" H 4700 3200 50  0000 C CNN
F 2 "" H 4700 3350 50  0001 C CNN
F 3 "" H 4700 3350 50  0001 C CNN
	1    4700 3350
	1    0    0    -1  
$EndComp
Wire Wire Line
	4700 3350 4700 3250
Wire Wire Line
	5200 1900 5200 3250
Wire Wire Line
	5200 3250 5300 3250
Connection ~ 5200 3250
Wire Wire Line
	5200 1350 5200 1600
Wire Wire Line
	5200 1350 6100 1350
Connection ~ 6100 1350
$Comp
L power:GND #PWR?
U 1 1 5F78B2D4
P 4000 4650
AR Path="/5E179620/5E179864/5F78B2D4" Ref="#PWR?"  Part="1" 
AR Path="/5E182A9D/5F777EC8/5F78B2D4" Ref="#PWR?"  Part="1" 
F 0 "#PWR?" H 4000 4400 50  0001 C CNN
F 1 "GND" H 4000 4500 50  0000 C CNN
F 2 "" H 4000 4650 50  0001 C CNN
F 3 "" H 4000 4650 50  0001 C CNN
	1    4000 4650
	1    0    0    -1  
$EndComp
$Comp
L power:GND #PWR?
U 1 1 5F78B2DA
P 4500 5150
AR Path="/5E179620/5E179864/5F78B2DA" Ref="#PWR?"  Part="1" 
AR Path="/5E182A9D/5F777EC8/5F78B2DA" Ref="#PWR?"  Part="1" 
F 0 "#PWR?" H 4500 4900 50  0001 C CNN
F 1 "GND" H 4500 5000 50  0000 C CNN
F 2 "" H 4500 5150 50  0001 C CNN
F 3 "" H 4500 5150 50  0001 C CNN
	1    4500 5150
	1    0    0    -1  
$EndComp
Wire Wire Line
	4500 5150 4500 5050
Wire Wire Line
	4500 4750 4500 4550
Wire Wire Line
	4000 4650 4000 4550
Wire Wire Line
	4000 4250 4000 4150
Wire Wire Line
	4000 4150 4500 4150
Wire Wire Line
	4500 4150 4500 4250
Wire Wire Line
	4500 4150 4500 3750
Wire Wire Line
	4500 3750 5300 3750
Connection ~ 4500 4150
$Comp
L power:GND #PWR?
U 1 1 5F78B2E9
P 5900 5800
AR Path="/5E179620/5E179864/5F78B2E9" Ref="#PWR?"  Part="1" 
AR Path="/5E182A9D/5F777EC8/5F78B2E9" Ref="#PWR?"  Part="1" 
F 0 "#PWR?" H 5900 5550 50  0001 C CNN
F 1 "GND" H 5900 5650 50  0000 C CNN
F 2 "" H 5900 5800 50  0001 C CNN
F 3 "" H 5900 5800 50  0001 C CNN
	1    5900 5800
	1    0    0    -1  
$EndComp
$Comp
L power:GND #PWR?
U 1 1 5F78B2EF
P 6000 5800
AR Path="/5E179620/5E179864/5F78B2EF" Ref="#PWR?"  Part="1" 
AR Path="/5E182A9D/5F777EC8/5F78B2EF" Ref="#PWR?"  Part="1" 
F 0 "#PWR?" H 6000 5550 50  0001 C CNN
F 1 "GND" H 6000 5650 50  0000 C CNN
F 2 "" H 6000 5800 50  0001 C CNN
F 3 "" H 6000 5800 50  0001 C CNN
	1    6000 5800
	1    0    0    -1  
$EndComp
$Comp
L power:GND #PWR?
U 1 1 5F78B2F5
P 6100 5800
AR Path="/5E179620/5E179864/5F78B2F5" Ref="#PWR?"  Part="1" 
AR Path="/5E182A9D/5F777EC8/5F78B2F5" Ref="#PWR?"  Part="1" 
F 0 "#PWR?" H 6100 5550 50  0001 C CNN
F 1 "GND" H 6100 5650 50  0000 C CNN
F 2 "" H 6100 5800 50  0001 C CNN
F 3 "" H 6100 5800 50  0001 C CNN
	1    6100 5800
	1    0    0    -1  
$EndComp
Connection ~ 10850 1850
Wire Wire Line
	10850 1850 10850 4550
Wire Wire Line
	3700 3650 3700 3550
Wire Wire Line
	3700 3550 5300 3550
$Comp
L power:GND #PWR?
U 1 1 5F78B323
P 3700 4050
AR Path="/5E179620/5E179864/5F78B323" Ref="#PWR?"  Part="1" 
AR Path="/5E182A9D/5F777EC8/5F78B323" Ref="#PWR?"  Part="1" 
F 0 "#PWR?" H 3700 3800 50  0001 C CNN
F 1 "GND" H 3700 3900 50  0000 C CNN
F 2 "" H 3700 4050 50  0001 C CNN
F 3 "" H 3700 4050 50  0001 C CNN
	1    3700 4050
	1    0    0    -1  
$EndComp
Wire Wire Line
	3700 4050 3700 3950
Wire Wire Line
	6700 4550 7650 4550
Connection ~ 7650 4550
Wire Wire Line
	7650 4550 10000 4550
Wire Wire Line
	6700 4850 7650 4850
Connection ~ 7650 4850
$Comp
L power:GND #PWR?
U 1 1 5F78B33E
P 7650 5950
AR Path="/5E179620/5E179864/5F78B33E" Ref="#PWR?"  Part="1" 
AR Path="/5E182A9D/5F777EC8/5F78B33E" Ref="#PWR?"  Part="1" 
F 0 "#PWR?" H 7650 5700 50  0001 C CNN
F 1 "GND" H 7650 5800 50  0000 C CNN
F 2 "" H 7650 5950 50  0001 C CNN
F 3 "" H 7650 5950 50  0001 C CNN
	1    7650 5950
	1    0    0    -1  
$EndComp
Wire Wire Line
	7650 5950 7650 5850
Wire Wire Line
	6100 5800 6100 5700
Wire Wire Line
	6000 5700 6000 5800
Wire Wire Line
	5900 5700 5900 5800
$Comp
L power:GND #PWR?
U 1 1 5F78B375
P 9800 2450
AR Path="/5E179620/5E179864/5F78B375" Ref="#PWR?"  Part="1" 
AR Path="/5E182A9D/5F777EC8/5F78B375" Ref="#PWR?"  Part="1" 
F 0 "#PWR?" H 9800 2200 50  0001 C CNN
F 1 "GND" H 9800 2300 50  0000 C CNN
F 2 "" H 9800 2450 50  0001 C CNN
F 3 "" H 9800 2450 50  0001 C CNN
	1    9800 2450
	1    0    0    -1  
$EndComp
Wire Wire Line
	9800 2450 9800 2350
Wire Wire Line
	9800 2350 10000 2350
Wire Wire Line
	10200 2350 10200 2250
Connection ~ 9800 2350
Wire Wire Line
	9800 2350 9800 2250
Wire Wire Line
	10000 2250 10000 2350
Connection ~ 10000 2350
Wire Wire Line
	10000 2350 10200 2350
Wire Wire Line
	9400 2350 9400 2250
Wire Wire Line
	9600 2250 9600 2350
Connection ~ 9600 2350
Wire Wire Line
	9600 2350 9400 2350
Wire Wire Line
	9600 2350 9800 2350
Wire Wire Line
	9400 1950 9400 1850
Connection ~ 9400 1850
Wire Wire Line
	9400 1850 9600 1850
Wire Wire Line
	9600 1850 9600 1950
Connection ~ 9600 1850
Wire Wire Line
	9600 1850 9800 1850
Wire Wire Line
	9800 1950 9800 1850
Connection ~ 9800 1850
Wire Wire Line
	9800 1850 10000 1850
Wire Wire Line
	10000 1850 10000 1950
Connection ~ 10000 1850
Wire Wire Line
	10000 1850 10200 1850
Wire Wire Line
	10200 1950 10200 1850
Connection ~ 10200 1850
Wire Wire Line
	2500 1500 2500 1400
Wire Wire Line
	2500 2050 2500 1800
Wire Wire Line
	10200 1850 10850 1850
$Comp
L power:GND #PWR?
U 1 1 5E59E198
P 6800 5600
AR Path="/5E179620/5E179864/5E59E198" Ref="#PWR?"  Part="1" 
AR Path="/5E182A9D/5F777EC8/5E59E198" Ref="#PWR?"  Part="1" 
F 0 "#PWR?" H 6800 5350 50  0001 C CNN
F 1 "GND" H 6800 5450 50  0000 C CNN
F 2 "" H 6800 5600 50  0001 C CNN
F 3 "" H 6800 5600 50  0001 C CNN
	1    6800 5600
	1    0    0    -1  
$EndComp
Wire Wire Line
	6800 5100 6700 5100
Wire Wire Line
	6800 5100 6800 5400
Wire Wire Line
	6700 5400 6800 5400
Connection ~ 6800 5400
Wire Wire Line
	6800 5400 6800 5600
Wire Wire Line
	10000 5150 10000 5200
$Comp
L power:GND #PWR?
U 1 1 5EBC9AF4
P 10000 5650
AR Path="/5E179620/5EBC9AF4" Ref="#PWR?"  Part="1" 
AR Path="/5E182A9D/5F8F0FFE/5EBC9AF4" Ref="#PWR?"  Part="1" 
AR Path="/5E182A9D/5F8A93F2/5EBC9AF4" Ref="#PWR?"  Part="1" 
AR Path="/5E182A9D/5F8F1079/5EBC9AF4" Ref="#PWR?"  Part="1" 
AR Path="/5E182A9D/5F8F10F2/5EBC9AF4" Ref="#PWR?"  Part="1" 
AR Path="/5E182A9D/5F777EC8/5EBC9AF4" Ref="#PWR?"  Part="1" 
F 0 "#PWR?" H 10000 5400 50  0001 C CNN
F 1 "GND" H 10000 5500 50  0000 C CNN
F 2 "" H 10000 5650 50  0001 C CNN
F 3 "" H 10000 5650 50  0001 C CNN
	1    10000 5650
	1    0    0    -1  
$EndComp
Wire Wire Line
	10000 5650 10000 5550
Wire Wire Line
	9650 5250 9650 5200
Wire Wire Line
	9650 5200 10000 5200
Connection ~ 10000 5200
Wire Wire Line
	10000 5200 10000 5250
$Comp
L power:GND #PWR?
U 1 1 5EBC9AFF
P 9650 5650
AR Path="/5E179620/5EBC9AFF" Ref="#PWR?"  Part="1" 
AR Path="/5E182A9D/5F8F0FFE/5EBC9AFF" Ref="#PWR?"  Part="1" 
AR Path="/5E182A9D/5F8A93F2/5EBC9AFF" Ref="#PWR?"  Part="1" 
AR Path="/5E182A9D/5F8F1079/5EBC9AFF" Ref="#PWR?"  Part="1" 
AR Path="/5E182A9D/5F8F10F2/5EBC9AFF" Ref="#PWR?"  Part="1" 
AR Path="/5E182A9D/5F777EC8/5EBC9AFF" Ref="#PWR?"  Part="1" 
F 0 "#PWR?" H 9650 5400 50  0001 C CNN
F 1 "GND" H 9650 5500 50  0000 C CNN
F 2 "" H 9650 5650 50  0001 C CNN
F 3 "" H 9650 5650 50  0001 C CNN
	1    9650 5650
	1    0    0    -1  
$EndComp
Wire Wire Line
	9650 5650 9650 5550
Text HLabel 10150 5200 2    50   Output ~ 0
v_sense
Wire Wire Line
	10150 5200 10000 5200
Wire Wire Line
	10000 4850 10000 4550
$Comp
L power:+3.3V #PWR?
U 1 1 5EBC9B19
P 9650 4800
AR Path="/5EBC9B19" Ref="#PWR?"  Part="1" 
AR Path="/5E182A9D/5F8A93F2/5EBC9B19" Ref="#PWR?"  Part="1" 
AR Path="/5E182A9D/5F777EC8/5EBC9B19" Ref="#PWR?"  Part="1" 
F 0 "#PWR?" H 9650 4650 50  0001 C CNN
F 1 "+3.3V" H 9650 4940 50  0000 C CNN
F 2 "" H 9650 4800 50  0001 C CNN
F 3 "" H 9650 4800 50  0001 C CNN
	1    9650 4800
	1    0    0    -1  
$EndComp
Wire Wire Line
	9650 4800 9650 4850
Wire Wire Line
	9650 5150 9650 5200
Connection ~ 9650 5200
Connection ~ 10000 4550
Wire Wire Line
	10000 4550 10850 4550
$Comp
L power:GND #PWR?
U 1 1 5EEE5BC1
P 1500 6900
AR Path="/5E179620/5E179864/5EEE5BC1" Ref="#PWR?"  Part="1" 
AR Path="/5E182A9D/5F8A93F2/5EEE5BC1" Ref="#PWR?"  Part="1" 
AR Path="/5E182A9D/5F8F0FFE/5EEE5BC1" Ref="#PWR?"  Part="1" 
AR Path="/5E182A9D/5F8F1079/5EEE5BC1" Ref="#PWR?"  Part="1" 
AR Path="/5E182A9D/5F8F10F2/5EEE5BC1" Ref="#PWR?"  Part="1" 
AR Path="/5E182A9D/5F777EC8/5EEE5BC1" Ref="#PWR?"  Part="1" 
F 0 "#PWR?" H 1500 6650 50  0001 C CNN
F 1 "GND" H 1500 6750 50  0000 C CNN
F 2 "" H 1500 6900 50  0001 C CNN
F 3 "" H 1500 6900 50  0001 C CNN
	1    1500 6900
	-1   0    0    -1  
$EndComp
Wire Wire Line
	1500 6900 1500 6800
Wire Wire Line
	1500 6500 1500 6400
Wire Wire Line
	1500 6400 6300 6400
Wire Wire Line
	6900 7100 6900 7000
Wire Wire Line
	6900 6900 6900 7000
Connection ~ 6900 7000
Wire Wire Line
	6900 6400 6900 6500
Connection ~ 6900 6900
Connection ~ 6900 6500
Wire Wire Line
	6900 6500 6900 6600
Connection ~ 6900 6600
Wire Wire Line
	6900 6600 6900 6700
Connection ~ 6900 6700
Wire Wire Line
	6900 6700 6900 6800
Connection ~ 6900 6800
Wire Wire Line
	6900 6800 6900 6900
Wire Wire Line
	6900 6400 6900 5400
Connection ~ 6900 6400
$Comp
L power:GND #PWR?
U 1 1 5EEE5BDF
P 1750 7000
AR Path="/5E179620/5E179864/5EEE5BDF" Ref="#PWR?"  Part="1" 
AR Path="/5E182A9D/5F8A93F2/5EEE5BDF" Ref="#PWR?"  Part="1" 
AR Path="/5E182A9D/5F8F0FFE/5EEE5BDF" Ref="#PWR?"  Part="1" 
AR Path="/5E182A9D/5F8F1079/5EEE5BDF" Ref="#PWR?"  Part="1" 
AR Path="/5E182A9D/5F8F10F2/5EEE5BDF" Ref="#PWR?"  Part="1" 
AR Path="/5E182A9D/5F777EC8/5EEE5BDF" Ref="#PWR?"  Part="1" 
F 0 "#PWR?" H 1750 6750 50  0001 C CNN
F 1 "GND" H 1750 6850 50  0000 C CNN
F 2 "" H 1750 7000 50  0001 C CNN
F 3 "" H 1750 7000 50  0001 C CNN
	1    1750 7000
	-1   0    0    -1  
$EndComp
Wire Wire Line
	1750 7000 1750 6900
Wire Wire Line
	1750 6600 1750 6500
$Comp
L power:GND #PWR?
U 1 1 5EEE5BED
P 2000 7000
AR Path="/5E179620/5E179864/5EEE5BED" Ref="#PWR?"  Part="1" 
AR Path="/5E182A9D/5F8A93F2/5EEE5BED" Ref="#PWR?"  Part="1" 
AR Path="/5E182A9D/5F8F0FFE/5EEE5BED" Ref="#PWR?"  Part="1" 
AR Path="/5E182A9D/5F8F1079/5EEE5BED" Ref="#PWR?"  Part="1" 
AR Path="/5E182A9D/5F8F10F2/5EEE5BED" Ref="#PWR?"  Part="1" 
AR Path="/5E182A9D/5F777EC8/5EEE5BED" Ref="#PWR?"  Part="1" 
F 0 "#PWR?" H 2000 6750 50  0001 C CNN
F 1 "GND" H 2000 6850 50  0000 C CNN
F 2 "" H 2000 7000 50  0001 C CNN
F 3 "" H 2000 7000 50  0001 C CNN
	1    2000 7000
	-1   0    0    -1  
$EndComp
Wire Wire Line
	2000 7000 2000 6900
Wire Wire Line
	2000 6600 2000 6500
Wire Wire Line
	1750 6500 2000 6500
Connection ~ 2000 6500
Wire Wire Line
	2000 6500 6300 6500
$Comp
L power:GND #PWR?
U 1 1 5EEE5BFE
P 2500 7100
AR Path="/5E179620/5E179864/5EEE5BFE" Ref="#PWR?"  Part="1" 
AR Path="/5E182A9D/5F8A93F2/5EEE5BFE" Ref="#PWR?"  Part="1" 
AR Path="/5E182A9D/5F8F0FFE/5EEE5BFE" Ref="#PWR?"  Part="1" 
AR Path="/5E182A9D/5F8F1079/5EEE5BFE" Ref="#PWR?"  Part="1" 
AR Path="/5E182A9D/5F8F10F2/5EEE5BFE" Ref="#PWR?"  Part="1" 
AR Path="/5E182A9D/5F777EC8/5EEE5BFE" Ref="#PWR?"  Part="1" 
F 0 "#PWR?" H 2500 6850 50  0001 C CNN
F 1 "GND" H 2500 6950 50  0000 C CNN
F 2 "" H 2500 7100 50  0001 C CNN
F 3 "" H 2500 7100 50  0001 C CNN
	1    2500 7100
	-1   0    0    -1  
$EndComp
Wire Wire Line
	2500 7100 2500 7000
Wire Wire Line
	2500 6700 2500 6600
Wire Wire Line
	2500 6600 6300 6600
$Comp
L power:GND #PWR?
U 1 1 5EEE5C0D
P 2750 7200
AR Path="/5E179620/5E179864/5EEE5C0D" Ref="#PWR?"  Part="1" 
AR Path="/5E182A9D/5F8A93F2/5EEE5C0D" Ref="#PWR?"  Part="1" 
AR Path="/5E182A9D/5F8F0FFE/5EEE5C0D" Ref="#PWR?"  Part="1" 
AR Path="/5E182A9D/5F8F1079/5EEE5C0D" Ref="#PWR?"  Part="1" 
AR Path="/5E182A9D/5F8F10F2/5EEE5C0D" Ref="#PWR?"  Part="1" 
AR Path="/5E182A9D/5F777EC8/5EEE5C0D" Ref="#PWR?"  Part="1" 
F 0 "#PWR?" H 2750 6950 50  0001 C CNN
F 1 "GND" H 2750 7050 50  0000 C CNN
F 2 "" H 2750 7200 50  0001 C CNN
F 3 "" H 2750 7200 50  0001 C CNN
	1    2750 7200
	-1   0    0    -1  
$EndComp
Wire Wire Line
	2750 7200 2750 7100
Wire Wire Line
	2750 6800 2750 6700
$Comp
L power:GND #PWR?
U 1 1 5EEE5C1B
P 3000 7200
AR Path="/5E179620/5E179864/5EEE5C1B" Ref="#PWR?"  Part="1" 
AR Path="/5E182A9D/5F8A93F2/5EEE5C1B" Ref="#PWR?"  Part="1" 
AR Path="/5E182A9D/5F8F0FFE/5EEE5C1B" Ref="#PWR?"  Part="1" 
AR Path="/5E182A9D/5F8F1079/5EEE5C1B" Ref="#PWR?"  Part="1" 
AR Path="/5E182A9D/5F8F10F2/5EEE5C1B" Ref="#PWR?"  Part="1" 
AR Path="/5E182A9D/5F777EC8/5EEE5C1B" Ref="#PWR?"  Part="1" 
F 0 "#PWR?" H 3000 6950 50  0001 C CNN
F 1 "GND" H 3000 7050 50  0000 C CNN
F 2 "" H 3000 7200 50  0001 C CNN
F 3 "" H 3000 7200 50  0001 C CNN
	1    3000 7200
	-1   0    0    -1  
$EndComp
Wire Wire Line
	3000 7200 3000 7100
Wire Wire Line
	3000 6800 3000 6700
Wire Wire Line
	2750 6700 3000 6700
Connection ~ 3000 6700
Wire Wire Line
	3000 6700 6300 6700
$Comp
L power:GND #PWR?
U 1 1 5EEE5C2C
P 3500 7300
AR Path="/5E179620/5E179864/5EEE5C2C" Ref="#PWR?"  Part="1" 
AR Path="/5E182A9D/5F8A93F2/5EEE5C2C" Ref="#PWR?"  Part="1" 
AR Path="/5E182A9D/5F8F0FFE/5EEE5C2C" Ref="#PWR?"  Part="1" 
AR Path="/5E182A9D/5F8F1079/5EEE5C2C" Ref="#PWR?"  Part="1" 
AR Path="/5E182A9D/5F8F10F2/5EEE5C2C" Ref="#PWR?"  Part="1" 
AR Path="/5E182A9D/5F777EC8/5EEE5C2C" Ref="#PWR?"  Part="1" 
F 0 "#PWR?" H 3500 7050 50  0001 C CNN
F 1 "GND" H 3500 7150 50  0000 C CNN
F 2 "" H 3500 7300 50  0001 C CNN
F 3 "" H 3500 7300 50  0001 C CNN
	1    3500 7300
	-1   0    0    -1  
$EndComp
Wire Wire Line
	3500 7300 3500 7200
Wire Wire Line
	3500 6900 3500 6800
Wire Wire Line
	3500 6800 6300 6800
$Comp
L power:GND #PWR?
U 1 1 5EEE5C3B
P 3750 7400
AR Path="/5E179620/5E179864/5EEE5C3B" Ref="#PWR?"  Part="1" 
AR Path="/5E182A9D/5F8A93F2/5EEE5C3B" Ref="#PWR?"  Part="1" 
AR Path="/5E182A9D/5F8F0FFE/5EEE5C3B" Ref="#PWR?"  Part="1" 
AR Path="/5E182A9D/5F8F1079/5EEE5C3B" Ref="#PWR?"  Part="1" 
AR Path="/5E182A9D/5F8F10F2/5EEE5C3B" Ref="#PWR?"  Part="1" 
AR Path="/5E182A9D/5F777EC8/5EEE5C3B" Ref="#PWR?"  Part="1" 
F 0 "#PWR?" H 3750 7150 50  0001 C CNN
F 1 "GND" H 3750 7250 50  0000 C CNN
F 2 "" H 3750 7400 50  0001 C CNN
F 3 "" H 3750 7400 50  0001 C CNN
	1    3750 7400
	-1   0    0    -1  
$EndComp
Wire Wire Line
	3750 7400 3750 7300
Wire Wire Line
	3750 7000 3750 6900
$Comp
L power:GND #PWR?
U 1 1 5EEE5C49
P 4000 7400
AR Path="/5E179620/5E179864/5EEE5C49" Ref="#PWR?"  Part="1" 
AR Path="/5E182A9D/5F8A93F2/5EEE5C49" Ref="#PWR?"  Part="1" 
AR Path="/5E182A9D/5F8F0FFE/5EEE5C49" Ref="#PWR?"  Part="1" 
AR Path="/5E182A9D/5F8F1079/5EEE5C49" Ref="#PWR?"  Part="1" 
AR Path="/5E182A9D/5F8F10F2/5EEE5C49" Ref="#PWR?"  Part="1" 
AR Path="/5E182A9D/5F777EC8/5EEE5C49" Ref="#PWR?"  Part="1" 
F 0 "#PWR?" H 4000 7150 50  0001 C CNN
F 1 "GND" H 4000 7250 50  0000 C CNN
F 2 "" H 4000 7400 50  0001 C CNN
F 3 "" H 4000 7400 50  0001 C CNN
	1    4000 7400
	-1   0    0    -1  
$EndComp
Wire Wire Line
	4000 7400 4000 7300
Wire Wire Line
	4000 7000 4000 6900
Wire Wire Line
	3750 6900 4000 6900
Connection ~ 4000 6900
Wire Wire Line
	4000 6900 6300 6900
$Comp
L power:GND #PWR?
U 1 1 5EEE5C5A
P 4500 7500
AR Path="/5E179620/5E179864/5EEE5C5A" Ref="#PWR?"  Part="1" 
AR Path="/5E182A9D/5F8A93F2/5EEE5C5A" Ref="#PWR?"  Part="1" 
AR Path="/5E182A9D/5F8F0FFE/5EEE5C5A" Ref="#PWR?"  Part="1" 
AR Path="/5E182A9D/5F8F1079/5EEE5C5A" Ref="#PWR?"  Part="1" 
AR Path="/5E182A9D/5F8F10F2/5EEE5C5A" Ref="#PWR?"  Part="1" 
AR Path="/5E182A9D/5F777EC8/5EEE5C5A" Ref="#PWR?"  Part="1" 
F 0 "#PWR?" H 4500 7250 50  0001 C CNN
F 1 "GND" H 4500 7350 50  0000 C CNN
F 2 "" H 4500 7500 50  0001 C CNN
F 3 "" H 4500 7500 50  0001 C CNN
	1    4500 7500
	-1   0    0    -1  
$EndComp
Wire Wire Line
	4500 7500 4500 7400
Wire Wire Line
	4500 7100 4500 7000
Wire Wire Line
	4500 7000 6300 7000
$Comp
L power:GND #PWR?
U 1 1 5EEE5C69
P 4750 7600
AR Path="/5E179620/5E179864/5EEE5C69" Ref="#PWR?"  Part="1" 
AR Path="/5E182A9D/5F8A93F2/5EEE5C69" Ref="#PWR?"  Part="1" 
AR Path="/5E182A9D/5F8F0FFE/5EEE5C69" Ref="#PWR?"  Part="1" 
AR Path="/5E182A9D/5F8F1079/5EEE5C69" Ref="#PWR?"  Part="1" 
AR Path="/5E182A9D/5F8F10F2/5EEE5C69" Ref="#PWR?"  Part="1" 
AR Path="/5E182A9D/5F777EC8/5EEE5C69" Ref="#PWR?"  Part="1" 
F 0 "#PWR?" H 4750 7350 50  0001 C CNN
F 1 "GND" H 4750 7450 50  0000 C CNN
F 2 "" H 4750 7600 50  0001 C CNN
F 3 "" H 4750 7600 50  0001 C CNN
	1    4750 7600
	-1   0    0    -1  
$EndComp
Wire Wire Line
	4750 7600 4750 7500
Wire Wire Line
	4750 7200 4750 7100
$Comp
L power:GND #PWR?
U 1 1 5EEE5C77
P 5000 7600
AR Path="/5E179620/5E179864/5EEE5C77" Ref="#PWR?"  Part="1" 
AR Path="/5E182A9D/5F8A93F2/5EEE5C77" Ref="#PWR?"  Part="1" 
AR Path="/5E182A9D/5F8F0FFE/5EEE5C77" Ref="#PWR?"  Part="1" 
AR Path="/5E182A9D/5F8F1079/5EEE5C77" Ref="#PWR?"  Part="1" 
AR Path="/5E182A9D/5F8F10F2/5EEE5C77" Ref="#PWR?"  Part="1" 
AR Path="/5E182A9D/5F777EC8/5EEE5C77" Ref="#PWR?"  Part="1" 
F 0 "#PWR?" H 5000 7350 50  0001 C CNN
F 1 "GND" H 5000 7450 50  0000 C CNN
F 2 "" H 5000 7600 50  0001 C CNN
F 3 "" H 5000 7600 50  0001 C CNN
	1    5000 7600
	-1   0    0    -1  
$EndComp
Wire Wire Line
	5000 7600 5000 7500
Wire Wire Line
	5000 7200 5000 7100
Wire Wire Line
	4750 7100 5000 7100
Connection ~ 5000 7100
Wire Wire Line
	5000 7100 6300 7100
Wire Wire Line
	6900 5400 7650 5400
Connection ~ 7650 5400
Wire Wire Line
	7650 5400 7650 4850
Wire Wire Line
	7650 5400 7650 5550
Wire Wire Line
	800  1000 1800 1000
Text HLabel 5400 5800 2    50   Output ~ 0
p_good
$Comp
L power:GND #PWR?
U 1 1 5F392D3E
P 4900 5850
AR Path="/5E179620/5E2CEBB7/5F392D3E" Ref="#PWR?"  Part="1" 
AR Path="/5E179620/5E2CF5EB/5F392D3E" Ref="#PWR?"  Part="1" 
AR Path="/5E179620/5F392D3E" Ref="#PWR?"  Part="1" 
AR Path="/5E182A9D/5F8A93F2/5F392D3E" Ref="#PWR?"  Part="1" 
AR Path="/5E182A9D/5F8F0FFE/5F392D3E" Ref="#PWR?"  Part="1" 
AR Path="/5E182A9D/5F8F1079/5F392D3E" Ref="#PWR?"  Part="1" 
AR Path="/5E182A9D/5F8F10F2/5F392D3E" Ref="#PWR?"  Part="1" 
AR Path="/5E182A9D/5F777EC8/5F392D3E" Ref="#PWR?"  Part="1" 
F 0 "#PWR?" H 4900 5600 50  0001 C CNN
F 1 "GND" H 4900 5700 50  0000 C CNN
F 2 "" H 4900 5850 50  0001 C CNN
F 3 "" H 4900 5850 50  0001 C CNN
	1    4900 5850
	1    0    0    -1  
$EndComp
Wire Wire Line
	4900 5850 4900 5750
$Comp
L power:+3.3V #PWR?
U 1 1 5F392D4B
P 5300 5600
AR Path="/5E179620/5E2CF5EB/5F392D4B" Ref="#PWR?"  Part="1" 
AR Path="/5E179620/5F392D4B" Ref="#PWR?"  Part="1" 
AR Path="/5E182A9D/5F8A93F2/5F392D4B" Ref="#PWR?"  Part="1" 
AR Path="/5E182A9D/5F8F0FFE/5F392D4B" Ref="#PWR?"  Part="1" 
AR Path="/5E182A9D/5F8F1079/5F392D4B" Ref="#PWR?"  Part="1" 
AR Path="/5E182A9D/5F8F10F2/5F392D4B" Ref="#PWR?"  Part="1" 
AR Path="/5E182A9D/5F777EC8/5F392D4B" Ref="#PWR?"  Part="1" 
F 0 "#PWR?" H 5300 5450 50  0001 C CNN
F 1 "+3.3V" H 5300 5740 50  0000 C CNN
F 2 "" H 5300 5600 50  0001 C CNN
F 3 "" H 5300 5600 50  0001 C CNN
	1    5300 5600
	1    0    0    -1  
$EndComp
$Comp
L power:GND #PWR?
U 1 1 5F392D51
P 5300 6250
AR Path="/5E179620/5E2CEBB7/5F392D51" Ref="#PWR?"  Part="1" 
AR Path="/5E179620/5E2CF5EB/5F392D51" Ref="#PWR?"  Part="1" 
AR Path="/5E179620/5F392D51" Ref="#PWR?"  Part="1" 
AR Path="/5E182A9D/5F8A93F2/5F392D51" Ref="#PWR?"  Part="1" 
AR Path="/5E182A9D/5F8F0FFE/5F392D51" Ref="#PWR?"  Part="1" 
AR Path="/5E182A9D/5F8F1079/5F392D51" Ref="#PWR?"  Part="1" 
AR Path="/5E182A9D/5F8F10F2/5F392D51" Ref="#PWR?"  Part="1" 
AR Path="/5E182A9D/5F777EC8/5F392D51" Ref="#PWR?"  Part="1" 
F 0 "#PWR?" H 5300 6000 50  0001 C CNN
F 1 "GND" H 5300 6100 50  0000 C CNN
F 2 "" H 5300 6250 50  0001 C CNN
F 3 "" H 5300 6250 50  0001 C CNN
	1    5300 6250
	1    0    0    -1  
$EndComp
Wire Wire Line
	5300 5850 5300 5800
Wire Wire Line
	5300 5600 5300 5650
Wire Wire Line
	4900 3250 4900 5650
Wire Wire Line
	5400 5800 5300 5800
Wire Wire Line
	5300 6250 5300 6150
Connection ~ 5300 5800
Wire Wire Line
	5300 5800 5300 5750
Wire Wire Line
	4900 3250 5200 3250
Text Label 6100 6400 0    50   ~ 0
SW0
Text Label 6100 6500 0    50   ~ 0
SW1
Text Label 6100 6600 0    50   ~ 0
SW2
Text Label 6100 6700 0    50   ~ 0
SW3
Text Label 6100 6800 0    50   ~ 0
SW4
Text Label 6100 6900 0    50   ~ 0
SW5
Text Label 6100 7000 0    50   ~ 0
SW6
Text Label 6100 7100 0    50   ~ 0
SW7
Text Label 7250 5400 0    50   ~ 0
FB
Text Label 7900 2400 0    50   ~ 0
L_IN
Text Label 8650 2450 0    50   ~ 0
L_OUT
Text Label 8500 3850 0    50   ~ 0
GATE_LOW_OUT
Text Label 8500 4350 0    50   ~ 0
GATE_HIGH_OUT
Text Label 7050 2550 0    50   ~ 0
GATE_LOW_IN
Text Label 6950 2050 0    50   ~ 0
GATE_HIGH_IN
Text Label 8300 3100 0    50   ~ 0
CS
$Comp
L power:GND #PWR?
U 1 1 5F77D77C
P 7500 1500
AR Path="/5E179620/5E179864/5F77D77C" Ref="#PWR?"  Part="1" 
AR Path="/5E182A9D/5F777EC8/5F77D77C" Ref="#PWR?"  Part="1" 
F 0 "#PWR?" H 7500 1250 50  0001 C CNN
F 1 "GND" H 7500 1350 50  0000 C CNN
F 2 "" H 7500 1500 50  0001 C CNN
F 3 "" H 7500 1500 50  0001 C CNN
	1    7500 1500
	1    0    0    -1  
$EndComp
Wire Wire Line
	7500 1500 7500 1400
Wire Wire Line
	7500 1100 7500 1000
$Comp
L power:GND #PWR?
U 1 1 5F78CCAF
P 7750 1500
AR Path="/5E179620/5E179864/5F78CCAF" Ref="#PWR?"  Part="1" 
AR Path="/5E182A9D/5F777EC8/5F78CCAF" Ref="#PWR?"  Part="1" 
F 0 "#PWR?" H 7750 1250 50  0001 C CNN
F 1 "GND" H 7750 1350 50  0000 C CNN
F 2 "" H 7750 1500 50  0001 C CNN
F 3 "" H 7750 1500 50  0001 C CNN
	1    7750 1500
	1    0    0    -1  
$EndComp
Wire Wire Line
	7750 1500 7750 1400
Wire Wire Line
	7750 1100 7750 1000
Connection ~ 7750 1000
Wire Wire Line
	7750 1000 8000 1000
Connection ~ 7500 1000
Wire Wire Line
	7500 1000 7750 1000
Text Label 4350 2550 0    50   ~ 0
sync_ic
Text Label 4350 2650 0    50   ~ 0
mode
Text Label 4850 2750 0    50   ~ 0
ss
Text Label 4850 2950 0    50   ~ 0
slope
Text Label 3700 2250 0    50   ~ 0
visns
Text Label 4350 3550 0    50   ~ 0
bias
Text Label 4600 3750 0    50   ~ 0
comp
Text Label 4500 4650 0    50   ~ 0
comp_mid
Text Label 4900 5200 0    50   ~ 0
pg
Text Label 2500 1450 0    50   ~ 0
vin_d
Text Label 2650 2050 0    50   ~ 0
vin_ic
Text Label 6700 4250 0    50   ~ 0
BOOT_OUT
Text Label 6750 2150 0    50   ~ 0
BOOT_IN
Text Label 6750 3550 0    50   ~ 0
CSG_IC
Text Label 6750 3150 0    50   ~ 0
CS_IC
Text Label 7700 3550 0    50   ~ 0
CSG
$Comp
L 000_PreferredDiodes:D_Schottky_60V_1A D504
U 1 1 5F96FB80
P 9650 5000
F 0 "D504" H 9650 5100 50  0000 C CNN
F 1 "D_Schottky_60V_1A" H 9650 4900 50  0001 C CNN
F 2 "Diode_SMD:D_SOD-123F" H 9650 5000 50  0001 C CNN
F 3 "~" H 9650 5000 50  0001 C CNN
F 4 "DSS16UTR" H 9650 5000 50  0001 C CNN "PartNumber"
F 5 "Schottky" H 9650 4900 50  0000 C CNN "DisplayValue"
F 6 "60V_1A" H 9650 4800 50  0000 C CNN "DisplayValue2"
F 7 "3000-0000000481" H 9650 5000 50  0001 C CNN "PartSpecification"
	1    9650 5000
	0    1    1    0   
$EndComp
$Comp
L Device:Net-Tie_2 NT501
U 1 1 5F89B9EE
P 8350 3600
F 0 "NT501" H 8350 3650 50  0000 C CNN
F 1 "Net-Tie_2" H 8350 3550 50  0000 C CNN
F 2 "NetTie:NetTie-2_SMD_Pad2.0mm" H 8350 3600 50  0001 C CNN
F 3 "~" H 8350 3600 50  0001 C CNN
	1    8350 3600
	1    0    0    -1  
$EndComp
$Comp
L Device:C C?
U 1 1 5F78CCB9
P 7750 1250
AR Path="/5E179620/5E179864/5F78CCB9" Ref="C?"  Part="1" 
AR Path="/5E182A9D/5F777EC8/5F78CCB9" Ref="C525"  Part="1" 
F 0 "C525" H 7775 1350 50  0000 L CNN
F 1 "10uF" H 7775 1150 50  0000 L CNN
F 2 "Capacitor_SMD:C_1210_3225Metric" H 7788 1100 50  0001 C CNN
F 3 "~" H 7750 1250 50  0001 C CNN
F 4 "3000-0000000472" H 7750 1250 50  0001 C CNN "PartSpecification"
F 5 "60V" H 7750 1250 50  0001 C CNN "Voltage"
	1    7750 1250
	1    0    0    -1  
$EndComp
$Comp
L Device:C C?
U 1 1 5F77D786
P 7500 1250
AR Path="/5E179620/5E179864/5F77D786" Ref="C?"  Part="1" 
AR Path="/5E182A9D/5F777EC8/5F77D786" Ref="C501"  Part="1" 
F 0 "C501" H 7525 1350 50  0000 L CNN
F 1 "10uF" H 7525 1150 50  0000 L CNN
F 2 "Capacitor_SMD:C_1210_3225Metric" H 7538 1100 50  0001 C CNN
F 3 "~" H 7500 1250 50  0001 C CNN
F 4 "3000-0000000472" H 7500 1250 50  0001 C CNN "PartSpecification"
F 5 "60V" H 7500 1250 50  0001 C CNN "Voltage"
	1    7500 1250
	1    0    0    -1  
$EndComp
$Comp
L Device:R R?
U 1 1 5F392D45
P 5300 6000
AR Path="/5E179620/5E2CEBB7/5F392D45" Ref="R?"  Part="1" 
AR Path="/5E179620/5E2CF5EB/5F392D45" Ref="R?"  Part="1" 
AR Path="/5E179620/5F392D45" Ref="R?"  Part="1" 
AR Path="/5E182A9D/5F8A93F2/5F392D45" Ref="R?"  Part="1" 
AR Path="/5E182A9D/5F8F0FFE/5F392D45" Ref="R?"  Part="1" 
AR Path="/5E182A9D/5F8F1079/5F392D45" Ref="R?"  Part="1" 
AR Path="/5E182A9D/5F8F10F2/5F392D45" Ref="R?"  Part="1" 
AR Path="/5E182A9D/5F777EC8/5F392D45" Ref="R526"  Part="1" 
F 0 "R526" V 5380 6000 50  0000 C CNN
F 1 "100k" V 5300 6000 50  0000 C CNN
F 2 "Resistor_SMD:R_0402_1005Metric" V 5230 6000 50  0001 C CNN
F 3 "~" H 5300 6000 50  0001 C CNN
F 4 "3000-0000000575" H 5300 6000 50  0001 C CNN "PartSpecification"
	1    5300 6000
	-1   0    0    1   
$EndComp
$Comp
L POWDER_Power:EL3H7-G U?
U 1 1 5F392D38
P 5100 5700
AR Path="/5E179620/5E2CF5EB/5F392D38" Ref="U?"  Part="1" 
AR Path="/5E179620/5F392D38" Ref="U?"  Part="1" 
AR Path="/5E182A9D/5F8A93F2/5F392D38" Ref="U?"  Part="1" 
AR Path="/5E182A9D/5F8F0FFE/5F392D38" Ref="U?"  Part="1" 
AR Path="/5E182A9D/5F8F1079/5F392D38" Ref="U?"  Part="1" 
AR Path="/5E182A9D/5F8F10F2/5F392D38" Ref="U?"  Part="1" 
AR Path="/5E182A9D/5F777EC8/5F392D38" Ref="U506"  Part="1" 
F 0 "U506" H 5050 5850 50  0000 C CNN
F 1 "EL3H7-G" H 5100 5550 50  0000 C CNN
F 2 "POWDER_Power:EL3H7-G" H 5100 5400 50  0001 C CNN
F 3 "" H 5100 5700 50  0001 C CNN
F 4 "3000-0000000432" H 5100 5700 50  0001 C CNN "PartSpecification"
	1    5100 5700
	1    0    0    -1  
$EndComp
$Comp
L Device:R R?
U 1 1 5EEE5C71
P 5000 7350
AR Path="/5E179620/5E179864/5EEE5C71" Ref="R?"  Part="1" 
AR Path="/5E182A9D/5F8A93F2/5EEE5C71" Ref="R?"  Part="1" 
AR Path="/5E182A9D/5F8F0FFE/5EEE5C71" Ref="R?"  Part="1" 
AR Path="/5E182A9D/5F8F1079/5EEE5C71" Ref="R?"  Part="1" 
AR Path="/5E182A9D/5F8F10F2/5EEE5C71" Ref="R?"  Part="1" 
AR Path="/5E182A9D/5F777EC8/5EEE5C71" Ref="R517"  Part="1" 
F 0 "R517" V 5080 7350 50  0000 C CNN
F 1 "1.54k" V 5000 7350 50  0000 C CNN
F 2 "Resistor_SMD:R_0402_1005Metric" V 4930 7350 50  0001 C CNN
F 3 "~" H 5000 7350 50  0001 C CNN
F 4 "3000-0000000574" H 5000 7350 50  0001 C CNN "PartSpecification"
	1    5000 7350
	1    0    0    1   
$EndComp
$Comp
L Device:R R?
U 1 1 5EEE5C63
P 4750 7350
AR Path="/5E179620/5E179864/5EEE5C63" Ref="R?"  Part="1" 
AR Path="/5E182A9D/5F8A93F2/5EEE5C63" Ref="R?"  Part="1" 
AR Path="/5E182A9D/5F8F0FFE/5EEE5C63" Ref="R?"  Part="1" 
AR Path="/5E182A9D/5F8F1079/5EEE5C63" Ref="R?"  Part="1" 
AR Path="/5E182A9D/5F8F10F2/5EEE5C63" Ref="R?"  Part="1" 
AR Path="/5E182A9D/5F777EC8/5EEE5C63" Ref="R516"  Part="1" 
F 0 "R516" V 4830 7350 50  0000 C CNN
F 1 "1.54k" V 4750 7350 50  0000 C CNN
F 2 "Resistor_SMD:R_0402_1005Metric" V 4680 7350 50  0001 C CNN
F 3 "~" H 4750 7350 50  0001 C CNN
F 4 "3000-0000000574" H 4750 7350 50  0001 C CNN "PartSpecification"
	1    4750 7350
	1    0    0    1   
$EndComp
$Comp
L Device:R R?
U 1 1 5EEE5C54
P 4500 7250
AR Path="/5E179620/5E179864/5EEE5C54" Ref="R?"  Part="1" 
AR Path="/5E182A9D/5F8A93F2/5EEE5C54" Ref="R?"  Part="1" 
AR Path="/5E182A9D/5F8F0FFE/5EEE5C54" Ref="R?"  Part="1" 
AR Path="/5E182A9D/5F8F1079/5EEE5C54" Ref="R?"  Part="1" 
AR Path="/5E182A9D/5F8F10F2/5EEE5C54" Ref="R?"  Part="1" 
AR Path="/5E182A9D/5F777EC8/5EEE5C54" Ref="R515"  Part="1" 
F 0 "R515" V 4580 7250 50  0000 C CNN
F 1 "1.54k" V 4500 7250 50  0000 C CNN
F 2 "Resistor_SMD:R_0402_1005Metric" V 4430 7250 50  0001 C CNN
F 3 "~" H 4500 7250 50  0001 C CNN
F 4 "3000-0000000574" H 4500 7250 50  0001 C CNN "PartSpecification"
	1    4500 7250
	1    0    0    1   
$EndComp
$Comp
L Device:R R?
U 1 1 5EEE5C43
P 4000 7150
AR Path="/5E179620/5E179864/5EEE5C43" Ref="R?"  Part="1" 
AR Path="/5E182A9D/5F8A93F2/5EEE5C43" Ref="R?"  Part="1" 
AR Path="/5E182A9D/5F8F0FFE/5EEE5C43" Ref="R?"  Part="1" 
AR Path="/5E182A9D/5F8F1079/5EEE5C43" Ref="R?"  Part="1" 
AR Path="/5E182A9D/5F8F10F2/5EEE5C43" Ref="R?"  Part="1" 
AR Path="/5E182A9D/5F777EC8/5EEE5C43" Ref="R513"  Part="1" 
F 0 "R513" V 4080 7150 50  0000 C CNN
F 1 "6.2k" V 4000 7150 50  0000 C CNN
F 2 "Resistor_SMD:R_0402_1005Metric" V 3930 7150 50  0001 C CNN
F 3 "~" H 4000 7150 50  0001 C CNN
F 4 "3000-0000000573" H 4000 7150 50  0001 C CNN "PartSpecification"
	1    4000 7150
	1    0    0    1   
$EndComp
$Comp
L Device:R R?
U 1 1 5EEE5C35
P 3750 7150
AR Path="/5E179620/5E179864/5EEE5C35" Ref="R?"  Part="1" 
AR Path="/5E182A9D/5F8A93F2/5EEE5C35" Ref="R?"  Part="1" 
AR Path="/5E182A9D/5F8F0FFE/5EEE5C35" Ref="R?"  Part="1" 
AR Path="/5E182A9D/5F8F1079/5EEE5C35" Ref="R?"  Part="1" 
AR Path="/5E182A9D/5F8F10F2/5EEE5C35" Ref="R?"  Part="1" 
AR Path="/5E182A9D/5F777EC8/5EEE5C35" Ref="R511"  Part="1" 
F 0 "R511" V 3830 7150 50  0000 C CNN
F 1 "6.2k" V 3750 7150 50  0000 C CNN
F 2 "Resistor_SMD:R_0402_1005Metric" V 3680 7150 50  0001 C CNN
F 3 "~" H 3750 7150 50  0001 C CNN
F 4 "3000-0000000573" H 3750 7150 50  0001 C CNN "PartSpecification"
	1    3750 7150
	1    0    0    1   
$EndComp
$Comp
L Device:R R?
U 1 1 5EEE5C26
P 3500 7050
AR Path="/5E179620/5E179864/5EEE5C26" Ref="R?"  Part="1" 
AR Path="/5E182A9D/5F8A93F2/5EEE5C26" Ref="R?"  Part="1" 
AR Path="/5E182A9D/5F8F0FFE/5EEE5C26" Ref="R?"  Part="1" 
AR Path="/5E182A9D/5F8F1079/5EEE5C26" Ref="R?"  Part="1" 
AR Path="/5E182A9D/5F8F10F2/5EEE5C26" Ref="R?"  Part="1" 
AR Path="/5E182A9D/5F777EC8/5EEE5C26" Ref="R509"  Part="1" 
F 0 "R509" V 3580 7050 50  0000 C CNN
F 1 "6.2k" V 3500 7050 50  0000 C CNN
F 2 "Resistor_SMD:R_0402_1005Metric" V 3430 7050 50  0001 C CNN
F 3 "~" H 3500 7050 50  0001 C CNN
F 4 "3000-0000000573" H 3500 7050 50  0001 C CNN "PartSpecification"
	1    3500 7050
	1    0    0    1   
$EndComp
$Comp
L Device:R R?
U 1 1 5EEE5C15
P 3000 6950
AR Path="/5E179620/5E179864/5EEE5C15" Ref="R?"  Part="1" 
AR Path="/5E182A9D/5F8A93F2/5EEE5C15" Ref="R?"  Part="1" 
AR Path="/5E182A9D/5F8F0FFE/5EEE5C15" Ref="R?"  Part="1" 
AR Path="/5E182A9D/5F8F1079/5EEE5C15" Ref="R?"  Part="1" 
AR Path="/5E182A9D/5F8F10F2/5EEE5C15" Ref="R?"  Part="1" 
AR Path="/5E182A9D/5F777EC8/5EEE5C15" Ref="R508"  Part="1" 
F 0 "R508" V 3080 6950 50  0000 C CNN
F 1 "24.9k" V 3000 6950 50  0000 C CNN
F 2 "Resistor_SMD:R_0402_1005Metric" V 2930 6950 50  0001 C CNN
F 3 "~" H 3000 6950 50  0001 C CNN
F 4 "3000-0000000570" H 3000 6950 50  0001 C CNN "PartSpecification"
	1    3000 6950
	1    0    0    1   
$EndComp
$Comp
L Device:R R?
U 1 1 5EEE5C07
P 2750 6950
AR Path="/5E179620/5E179864/5EEE5C07" Ref="R?"  Part="1" 
AR Path="/5E182A9D/5F8A93F2/5EEE5C07" Ref="R?"  Part="1" 
AR Path="/5E182A9D/5F8F0FFE/5EEE5C07" Ref="R?"  Part="1" 
AR Path="/5E182A9D/5F8F1079/5EEE5C07" Ref="R?"  Part="1" 
AR Path="/5E182A9D/5F8F10F2/5EEE5C07" Ref="R?"  Part="1" 
AR Path="/5E182A9D/5F777EC8/5EEE5C07" Ref="R506"  Part="1" 
F 0 "R506" V 2830 6950 50  0000 C CNN
F 1 "24.9k" V 2750 6950 50  0000 C CNN
F 2 "Resistor_SMD:R_0402_1005Metric" V 2680 6950 50  0001 C CNN
F 3 "~" H 2750 6950 50  0001 C CNN
F 4 "3000-0000000570" H 2750 6950 50  0001 C CNN "PartSpecification"
	1    2750 6950
	1    0    0    1   
$EndComp
$Comp
L Device:R R?
U 1 1 5EEE5BF8
P 2500 6850
AR Path="/5E179620/5E179864/5EEE5BF8" Ref="R?"  Part="1" 
AR Path="/5E182A9D/5F8A93F2/5EEE5BF8" Ref="R?"  Part="1" 
AR Path="/5E182A9D/5F8F0FFE/5EEE5BF8" Ref="R?"  Part="1" 
AR Path="/5E182A9D/5F8F1079/5EEE5BF8" Ref="R?"  Part="1" 
AR Path="/5E182A9D/5F8F10F2/5EEE5BF8" Ref="R?"  Part="1" 
AR Path="/5E182A9D/5F777EC8/5EEE5BF8" Ref="R505"  Part="1" 
F 0 "R505" V 2580 6850 50  0000 C CNN
F 1 "24.9k" V 2500 6850 50  0000 C CNN
F 2 "Resistor_SMD:R_0402_1005Metric" V 2430 6850 50  0001 C CNN
F 3 "~" H 2500 6850 50  0001 C CNN
F 4 "3000-0000000570" H 2500 6850 50  0001 C CNN "PartSpecification"
	1    2500 6850
	1    0    0    1   
$EndComp
$Comp
L Device:R R?
U 1 1 5EEE5BE7
P 2000 6750
AR Path="/5E179620/5E179864/5EEE5BE7" Ref="R?"  Part="1" 
AR Path="/5E182A9D/5F8A93F2/5EEE5BE7" Ref="R?"  Part="1" 
AR Path="/5E182A9D/5F8F0FFE/5EEE5BE7" Ref="R?"  Part="1" 
AR Path="/5E182A9D/5F8F1079/5EEE5BE7" Ref="R?"  Part="1" 
AR Path="/5E182A9D/5F8F10F2/5EEE5BE7" Ref="R?"  Part="1" 
AR Path="/5E182A9D/5F777EC8/5EEE5BE7" Ref="R503"  Part="1" 
F 0 "R503" V 2080 6750 50  0000 C CNN
F 1 "100k" V 2000 6750 50  0000 C CNN
F 2 "Resistor_SMD:R_0402_1005Metric" V 1930 6750 50  0001 C CNN
F 3 "~" H 2000 6750 50  0001 C CNN
F 4 "3000-0000000575" H 2000 6750 50  0001 C CNN "PartSpecification"
	1    2000 6750
	1    0    0    1   
$EndComp
$Comp
L Device:R R?
U 1 1 5EEE5BD9
P 1750 6750
AR Path="/5E179620/5E179864/5EEE5BD9" Ref="R?"  Part="1" 
AR Path="/5E182A9D/5F8A93F2/5EEE5BD9" Ref="R?"  Part="1" 
AR Path="/5E182A9D/5F8F0FFE/5EEE5BD9" Ref="R?"  Part="1" 
AR Path="/5E182A9D/5F8F1079/5EEE5BD9" Ref="R?"  Part="1" 
AR Path="/5E182A9D/5F8F10F2/5EEE5BD9" Ref="R?"  Part="1" 
AR Path="/5E182A9D/5F777EC8/5EEE5BD9" Ref="R502"  Part="1" 
F 0 "R502" V 1830 6750 50  0000 C CNN
F 1 "100k" V 1750 6750 50  0000 C CNN
F 2 "Resistor_SMD:R_0402_1005Metric" V 1680 6750 50  0001 C CNN
F 3 "~" H 1750 6750 50  0001 C CNN
F 4 "3000-0000000575" H 1750 6750 50  0001 C CNN "PartSpecification"
	1    1750 6750
	1    0    0    1   
$EndComp
$Comp
L Device:R R?
U 1 1 5EEE5BBB
P 1500 6650
AR Path="/5E179620/5E179864/5EEE5BBB" Ref="R?"  Part="1" 
AR Path="/5E182A9D/5F8A93F2/5EEE5BBB" Ref="R?"  Part="1" 
AR Path="/5E182A9D/5F8F0FFE/5EEE5BBB" Ref="R?"  Part="1" 
AR Path="/5E182A9D/5F8F1079/5EEE5BBB" Ref="R?"  Part="1" 
AR Path="/5E182A9D/5F8F10F2/5EEE5BBB" Ref="R?"  Part="1" 
AR Path="/5E182A9D/5F777EC8/5EEE5BBB" Ref="R501"  Part="1" 
F 0 "R501" V 1580 6650 50  0000 C CNN
F 1 "100k" V 1500 6650 50  0000 C CNN
F 2 "Resistor_SMD:R_0402_1005Metric" V 1430 6650 50  0001 C CNN
F 3 "~" H 1500 6650 50  0001 C CNN
F 4 "3000-0000000575" H 1500 6650 50  0001 C CNN "PartSpecification"
	1    1500 6650
	1    0    0    1   
$EndComp
$Comp
L Switch:SW_DIP_x08 SW?
U 1 1 5EEE5BB5
P 6600 6800
AR Path="/5EEE5BB5" Ref="SW?"  Part="1" 
AR Path="/5E182A9D/5EEE5BB5" Ref="SW?"  Part="1" 
AR Path="/5E182A9D/5F8A93F2/5EEE5BB5" Ref="SW?"  Part="1" 
AR Path="/5E182A9D/5F8F0FFE/5EEE5BB5" Ref="SW?"  Part="1" 
AR Path="/5E182A9D/5F8F1079/5EEE5BB5" Ref="SW?"  Part="1" 
AR Path="/5E182A9D/5F8F10F2/5EEE5BB5" Ref="SW?"  Part="1" 
AR Path="/5E182A9D/5F777EC8/5EEE5BB5" Ref="SW501"  Part="1" 
F 0 "SW501" H 6600 7350 50  0000 C CNN
F 1 "SW_DIP_x08" H 6600 6350 50  0000 C CNN
F 2 "Package_DIP:SMDIP-16_W7.62mm" H 6600 6800 50  0001 C CNN
F 3 "~" H 6600 6800 50  0001 C CNN
F 4 "CT2198LPST-ND" H 6600 6800 50  0001 C CNN "PartNumber"
F 5 "3000-0000000501" H 6600 6800 50  0001 C CNN "PartSpecification"
	1    6600 6800
	-1   0    0    -1  
$EndComp
$Comp
L 000_PreferredParts:C_0_1uF C?
U 1 1 5EBC9B09
P 9650 5400
AR Path="/5E179620/5EBC9B09" Ref="C?"  Part="1" 
AR Path="/5E182A9D/5F8F0FFE/5EBC9B09" Ref="C?"  Part="1" 
AR Path="/5E182A9D/5F8A93F2/5EBC9B09" Ref="C?"  Part="1" 
AR Path="/5E182A9D/5F8F1079/5EBC9B09" Ref="C?"  Part="1" 
AR Path="/5E182A9D/5F8F10F2/5EBC9B09" Ref="C?"  Part="1" 
AR Path="/5E182A9D/5F777EC8/5EBC9B09" Ref="C518"  Part="1" 
F 0 "C518" H 9675 5500 50  0000 L CNN
F 1 "C_0_1uF" H 9675 5300 50  0001 L CNN
F 2 "Capacitor_SMD:C_0402_1005Metric" H 9688 5250 50  0001 C CNN
F 3 "~" H 9650 5400 50  0001 C CNN
F 4 "0.1uF" H 9800 5300 50  0000 C CNN "DisplayValue"
F 5 "3000-0000000125" H 9650 5400 50  0001 C CNN "PartSpecification"
F 6 "100V" H 9650 5400 50  0001 C CNN "Voltage"
	1    9650 5400
	1    0    0    -1  
$EndComp
$Comp
L Device:R R?
U 1 1 5EBC9AED
P 10000 5000
AR Path="/5E179620/5EBC9AED" Ref="R?"  Part="1" 
AR Path="/5E182A9D/5F8F0FFE/5EBC9AED" Ref="R?"  Part="1" 
AR Path="/5E182A9D/5F8A93F2/5EBC9AED" Ref="R?"  Part="1" 
AR Path="/5E182A9D/5F8F1079/5EBC9AED" Ref="R?"  Part="1" 
AR Path="/5E182A9D/5F8F10F2/5EBC9AED" Ref="R?"  Part="1" 
AR Path="/5E182A9D/5F777EC8/5EBC9AED" Ref="R524"  Part="1" 
F 0 "R524" V 10080 5000 50  0000 C CNN
F 1 "R" V 10000 5000 50  0000 C CNN
F 2 "Resistor_SMD:R_0402_1005Metric" V 9930 5000 50  0001 C CNN
F 3 "~" H 10000 5000 50  0001 C CNN
	1    10000 5000
	1    0    0    -1  
$EndComp
$Comp
L Device:R R?
U 1 1 5EBC9AE7
P 10000 5400
AR Path="/5E179620/5EBC9AE7" Ref="R?"  Part="1" 
AR Path="/5E182A9D/5F8F0FFE/5EBC9AE7" Ref="R?"  Part="1" 
AR Path="/5E182A9D/5F8A93F2/5EBC9AE7" Ref="R?"  Part="1" 
AR Path="/5E182A9D/5F8F1079/5EBC9AE7" Ref="R?"  Part="1" 
AR Path="/5E182A9D/5F8F10F2/5EBC9AE7" Ref="R?"  Part="1" 
AR Path="/5E182A9D/5F777EC8/5EBC9AE7" Ref="R525"  Part="1" 
F 0 "R525" V 10080 5400 50  0000 C CNN
F 1 "R" V 10000 5400 50  0000 C CNN
F 2 "Resistor_SMD:R_0402_1005Metric" V 9930 5400 50  0001 C CNN
F 3 "~" H 10000 5400 50  0001 C CNN
	1    10000 5400
	1    0    0    -1  
$EndComp
$Comp
L Device:C C523
U 1 1 5F799F9C
P 10200 2100
F 0 "C523" H 10225 2200 50  0000 L CNN
F 1 "10uF" H 10225 2000 50  0000 L CNN
F 2 "Capacitor_SMD:C_1210_3225Metric" H 10238 1950 50  0001 C CNN
F 3 "~" H 10200 2100 50  0001 C CNN
F 4 "60V" H 10200 2100 50  0001 C CNN "Voltage"
F 5 "3000-0000000472" H 10200 2100 50  0001 C CNN "PartSpecification"
	1    10200 2100
	1    0    0    -1  
$EndComp
$Comp
L Device:C C521
U 1 1 5F799C53
P 10000 2100
F 0 "C521" H 10025 2200 50  0000 L CNN
F 1 "10uF" H 10025 2000 50  0000 L CNN
F 2 "Capacitor_SMD:C_1210_3225Metric" H 10038 1950 50  0001 C CNN
F 3 "~" H 10000 2100 50  0001 C CNN
F 4 "60V" H 10000 2100 50  0001 C CNN "Voltage"
F 5 "3000-0000000472" H 10000 2100 50  0001 C CNN "PartSpecification"
	1    10000 2100
	1    0    0    -1  
$EndComp
$Comp
L Device:C C519
U 1 1 5F799990
P 9800 2100
F 0 "C519" H 9825 2200 50  0000 L CNN
F 1 "10uF" H 9825 2000 50  0000 L CNN
F 2 "Capacitor_SMD:C_1210_3225Metric" H 9838 1950 50  0001 C CNN
F 3 "~" H 9800 2100 50  0001 C CNN
F 4 "60V" H 9800 2100 50  0001 C CNN "Voltage"
F 5 "3000-0000000472" H 9800 2100 50  0001 C CNN "PartSpecification"
	1    9800 2100
	1    0    0    -1  
$EndComp
$Comp
L Device:C C517
U 1 1 5F7996A5
P 9600 2100
F 0 "C517" H 9625 2200 50  0000 L CNN
F 1 "10uF" H 9625 2000 50  0000 L CNN
F 2 "Capacitor_SMD:C_1210_3225Metric" H 9638 1950 50  0001 C CNN
F 3 "~" H 9600 2100 50  0001 C CNN
F 4 "60V" H 9600 2100 50  0001 C CNN "Voltage"
F 5 "3000-0000000472" H 9600 2100 50  0001 C CNN "PartSpecification"
	1    9600 2100
	1    0    0    -1  
$EndComp
$Comp
L Device:C C515
U 1 1 5F798545
P 9400 2100
F 0 "C515" H 9425 2200 50  0000 L CNN
F 1 "10uF" H 9425 2000 50  0000 L CNN
F 2 "Capacitor_SMD:C_1210_3225Metric" H 9438 1950 50  0001 C CNN
F 3 "~" H 9400 2100 50  0001 C CNN
F 4 "60V" H 9400 2100 50  0001 C CNN "Voltage"
F 5 "3000-0000000472" H 9400 2100 50  0001 C CNN "PartSpecification"
	1    9400 2100
	1    0    0    -1  
$EndComp
$Comp
L Device:R R?
U 1 1 5F78B336
P 7650 5700
AR Path="/5E179620/5E179864/5F78B336" Ref="R?"  Part="1" 
AR Path="/5E182A9D/5F777EC8/5F78B336" Ref="R522"  Part="1" 
F 0 "R522" V 7730 5700 50  0000 C CNN
F 1 "100k" V 7650 5700 50  0000 C CNN
F 2 "Resistor_SMD:R_0402_1005Metric" V 7580 5700 50  0001 C CNN
F 3 "~" H 7650 5700 50  0001 C CNN
F 4 "3000-0000000575" H 7650 5700 50  0001 C CNN "PartSpecification"
	1    7650 5700
	-1   0    0    1   
$EndComp
$Comp
L Device:R R?
U 1 1 5F78B32D
P 7650 4700
AR Path="/5E179620/5E179864/5F78B32D" Ref="R?"  Part="1" 
AR Path="/5E182A9D/5F777EC8/5F78B32D" Ref="R521"  Part="1" 
F 0 "R521" V 7730 4700 50  0000 C CNN
F 1 "23.2k" V 7650 4700 50  0000 C CNN
F 2 "Resistor_SMD:R_0603_1608Metric" V 7580 4700 50  0001 C CNN
F 3 "~" H 7650 4700 50  0001 C CNN
F 4 "3000-0000000555" H 7650 4700 50  0001 C CNN "PartSpecification"
	1    7650 4700
	-1   0    0    1   
$EndComp
$Comp
L 000_PreferredParts:C_0_1uF C?
U 1 1 5F78B31B
P 3700 3800
AR Path="/5E179620/5E179864/5F78B31B" Ref="C?"  Part="1" 
AR Path="/5E182A9D/5F777EC8/5F78B31B" Ref="C506"  Part="1" 
F 0 "C506" H 3725 3900 50  0000 L CNN
F 1 "C_0_1uF" H 3725 3700 50  0001 L CNN
F 2 "Capacitor_SMD:C_0402_1005Metric" H 3738 3650 50  0001 C CNN
F 3 "~" H 3700 3800 50  0001 C CNN
F 4 "0.1uF" H 3850 3700 50  0000 C CNN "DisplayValue"
F 5 "3000-0000000125" H 3700 3800 50  0001 C CNN "PartSpecification"
F 6 "100V" H 3700 3800 50  0001 C CNN "Voltage"
	1    3700 3800
	1    0    0    -1  
$EndComp
$Comp
L Device:R R?
U 1 1 5F78B2CE
P 4500 4900
AR Path="/5E179620/5E179864/5F78B2CE" Ref="R?"  Part="1" 
AR Path="/5E182A9D/5F777EC8/5F78B2CE" Ref="R514"  Part="1" 
F 0 "R514" V 4580 4900 50  0000 C CNN
F 1 "R" V 4500 4900 50  0000 C CNN
F 2 "Resistor_SMD:R_0402_1005Metric" V 4430 4900 50  0001 C CNN
F 3 "~" H 4500 4900 50  0001 C CNN
	1    4500 4900
	1    0    0    -1  
$EndComp
$Comp
L Device:C C?
U 1 1 5F78B2C8
P 4500 4400
AR Path="/5E179620/5E179864/5F78B2C8" Ref="C?"  Part="1" 
AR Path="/5E182A9D/5F777EC8/5F78B2C8" Ref="C509"  Part="1" 
F 0 "C509" H 4525 4500 50  0000 L CNN
F 1 "C" H 4525 4300 50  0000 L CNN
F 2 "Capacitor_SMD:C_0402_1005Metric" H 4538 4250 50  0001 C CNN
F 3 "~" H 4500 4400 50  0001 C CNN
	1    4500 4400
	1    0    0    -1  
$EndComp
$Comp
L Device:C C?
U 1 1 5F78B2C2
P 4000 4400
AR Path="/5E179620/5E179864/5F78B2C2" Ref="C?"  Part="1" 
AR Path="/5E182A9D/5F777EC8/5F78B2C2" Ref="C507"  Part="1" 
F 0 "C507" H 4025 4500 50  0000 L CNN
F 1 "C" H 4025 4300 50  0000 L CNN
F 2 "Capacitor_SMD:C_0402_1005Metric" H 4038 4250 50  0001 C CNN
F 3 "~" H 4000 4400 50  0001 C CNN
	1    4000 4400
	1    0    0    -1  
$EndComp
$Comp
L Device:R R?
U 1 1 5F78B2B5
P 5200 1750
AR Path="/5E179620/5E179864/5F78B2B5" Ref="R?"  Part="1" 
AR Path="/5E182A9D/5F777EC8/5F78B2B5" Ref="R518"  Part="1" 
F 0 "R518" V 5280 1750 50  0000 C CNN
F 1 "10k" V 5200 1750 50  0000 C CNN
F 2 "Resistor_SMD:R_0402_1005Metric" V 5130 1750 50  0001 C CNN
F 3 "~" H 5200 1750 50  0001 C CNN
F 4 "3000-0000000131" H 5200 1750 50  0001 C CNN "PartSpecification"
	1    5200 1750
	1    0    0    -1  
$EndComp
$Comp
L Device:C C?
U 1 1 5F78B2A7
P 4700 3100
AR Path="/5E179620/5E179864/5F78B2A7" Ref="C?"  Part="1" 
AR Path="/5E182A9D/5F777EC8/5F78B2A7" Ref="C510"  Part="1" 
F 0 "C510" H 4725 3200 50  0000 L CNN
F 1 "C" H 4725 3000 50  0000 L CNN
F 2 "Capacitor_SMD:C_0402_1005Metric" H 4738 2950 50  0001 C CNN
F 3 "~" H 4700 3100 50  0001 C CNN
	1    4700 3100
	1    0    0    -1  
$EndComp
$Comp
L 000_PreferredDiodes:D_Schottky_60V_1A D?
U 1 1 5F78B27C
P 7150 4250
AR Path="/5E179620/5E179864/5F78B27C" Ref="D?"  Part="1" 
AR Path="/5E182A9D/5F777EC8/5F78B27C" Ref="D503"  Part="1" 
F 0 "D503" H 7150 4350 50  0000 C CNN
F 1 "D_Schottky_60V_1A" H 7150 4150 50  0001 C CNN
F 2 "Diode_SMD:D_SOD-123F" H 7150 4250 50  0001 C CNN
F 3 "~" H 7150 4250 50  0001 C CNN
F 4 "DSS16UTR" H 7150 4250 50  0001 C CNN "PartNumber"
F 5 "Schottky" H 7150 4150 50  0000 C CNN "DisplayValue"
F 6 "60V_1A" H 7150 4050 50  0000 C CNN "DisplayValue2"
F 7 "3000-0000000481" H 7150 4250 50  0001 C CNN "PartSpecification"
	1    7150 4250
	1    0    0    -1  
$EndComp
$Comp
L 000_PreferredParts:C_0_1uF C?
U 1 1 5F78B270
P 6850 4100
AR Path="/5E179620/5E179864/5F78B270" Ref="C?"  Part="1" 
AR Path="/5E182A9D/5F777EC8/5F78B270" Ref="C514"  Part="1" 
F 0 "C514" H 6875 4200 50  0000 L CNN
F 1 "C_0_1uF" H 6875 4000 50  0001 L CNN
F 2 "Capacitor_SMD:C_0402_1005Metric" H 6888 3950 50  0001 C CNN
F 3 "~" H 6850 4100 50  0001 C CNN
F 4 "0.1uF" H 7000 4000 50  0000 C CNN "DisplayValue"
F 5 "3000-0000000125" H 6850 4100 50  0001 C CNN "PartSpecification"
F 6 "100V" H 6850 4100 50  0001 C CNN "Voltage"
	1    6850 4100
	1    0    0    -1  
$EndComp
$Comp
L 000_PreferredDiodes:D_Schottky_60V_1A D?
U 1 1 5F78B262
P 6850 1800
AR Path="/5E179620/5E179864/5F78B262" Ref="D?"  Part="1" 
AR Path="/5E182A9D/5F777EC8/5F78B262" Ref="D502"  Part="1" 
F 0 "D502" H 6850 1900 50  0000 C CNN
F 1 "D_Schottky_60V_1A" H 6850 1700 50  0001 C CNN
F 2 "Diode_SMD:D_SOD-123F" H 6850 1800 50  0001 C CNN
F 3 "~" H 6850 1800 50  0001 C CNN
F 4 "DSS16UTR" H 6850 1800 50  0001 C CNN "PartNumber"
F 5 "Schottky" H 6850 1700 50  0000 C CNN "DisplayValue"
F 6 "60V_1A" H 6850 1600 50  0000 C CNN "DisplayValue2"
F 7 "3000-0000000481" H 6850 1800 50  0001 C CNN "PartSpecification"
	1    6850 1800
	0    -1   -1   0   
$EndComp
$Comp
L Device:R R?
U 1 1 5F78B239
P 7200 3150
AR Path="/5E179620/5E179864/5F78B239" Ref="R?"  Part="1" 
AR Path="/5E182A9D/5F777EC8/5F78B239" Ref="R519"  Part="1" 
F 0 "R519" V 7280 3150 50  0000 C CNN
F 1 "100" V 7200 3150 50  0000 C CNN
F 2 "Resistor_SMD:R_0402_1005Metric" V 7130 3150 50  0001 C CNN
F 3 "~" H 7200 3150 50  0001 C CNN
F 4 "3000-0000000149" H 7200 3150 50  0001 C CNN "PartSpecification"
	1    7200 3150
	0    1    1    0   
$EndComp
$Comp
L Device:R R?
U 1 1 5F78B233
P 7200 3550
AR Path="/5E179620/5E179864/5F78B233" Ref="R?"  Part="1" 
AR Path="/5E182A9D/5F777EC8/5F78B233" Ref="R520"  Part="1" 
F 0 "R520" V 7280 3550 50  0000 C CNN
F 1 "100" V 7200 3550 50  0000 C CNN
F 2 "Resistor_SMD:R_0402_1005Metric" V 7130 3550 50  0001 C CNN
F 3 "~" H 7200 3550 50  0001 C CNN
F 4 "3000-0000000149" H 7200 3550 50  0001 C CNN "PartSpecification"
	1    7200 3550
	0    1    1    0   
$EndComp
$Comp
L Device:C C?
U 1 1 5F78B22D
P 2100 1250
AR Path="/5E179620/5E179864/5F78B22D" Ref="C?"  Part="1" 
AR Path="/5E182A9D/5F777EC8/5F78B22D" Ref="C503"  Part="1" 
F 0 "C503" H 2125 1350 50  0000 L CNN
F 1 "10uF" H 2125 1150 50  0000 L CNN
F 2 "Capacitor_SMD:C_1210_3225Metric" H 2138 1100 50  0001 C CNN
F 3 "~" H 2100 1250 50  0001 C CNN
F 4 "3000-0000000472" H 2100 1250 50  0001 C CNN "PartSpecification"
F 5 "60V" H 2100 1250 50  0001 C CNN "Voltage"
	1    2100 1250
	1    0    0    -1  
$EndComp
$Comp
L Device:R R?
U 1 1 5F78B211
P 8250 3350
AR Path="/5E179620/5E179864/5F78B211" Ref="R?"  Part="1" 
AR Path="/5E182A9D/5F777EC8/5F78B211" Ref="R523"  Part="1" 
F 0 "R523" V 8330 3350 50  0000 C CNN
F 1 "R" V 8250 3350 50  0000 C CNN
F 2 "Resistor_SMD:R_2512_6332Metric" V 8180 3350 50  0001 C CNN
F 3 "~" H 8250 3350 50  0001 C CNN
	1    8250 3350
	1    0    0    -1  
$EndComp
$Comp
L Device:CP C?
U 1 1 5F78B1F4
P 9550 950
AR Path="/5E179620/5E179864/5F78B1F4" Ref="C?"  Part="1" 
AR Path="/5E182A9D/5F777EC8/5F78B1F4" Ref="C516"  Part="1" 
F 0 "C516" H 9575 1050 50  0000 L CNN
F 1 "82uF" H 9575 850 50  0000 L CNN
F 2 "Capacitor_SMD:CP_Elec_10x10" H 9588 800 50  0001 C CNN
F 3 "~" H 9550 950 50  0001 C CNN
F 4 "" H 9550 950 50  0001 C CNN "PartNumber"
F 5 "63V" H 9550 950 50  0001 C CNN "Voltage"
F 6 "1.4A" H 9550 950 50  0001 C CNN "Ripple current"
F 7 "3000-0000000470" H 9550 950 50  0001 C CNN "PartSpecification"
	1    9550 950 
	1    0    0    -1  
$EndComp
$Comp
L Device:CP C?
U 1 1 5F78B1EB
P 9850 950
AR Path="/5E179620/5E179864/5F78B1EB" Ref="C?"  Part="1" 
AR Path="/5E182A9D/5F777EC8/5F78B1EB" Ref="C520"  Part="1" 
F 0 "C520" H 9875 1050 50  0000 L CNN
F 1 "82uF" H 9875 850 50  0000 L CNN
F 2 "Capacitor_SMD:CP_Elec_10x10" H 9888 800 50  0001 C CNN
F 3 "~" H 9850 950 50  0001 C CNN
F 4 "" H 9850 950 50  0001 C CNN "PartNumber"
F 5 "63V" H 9850 950 50  0001 C CNN "Voltage"
F 6 "1.4A" H 9850 950 50  0001 C CNN "Ripple current"
F 7 "3000-0000000470" H 9850 950 50  0001 C CNN "PartSpecification"
	1    9850 950 
	1    0    0    -1  
$EndComp
$Comp
L Device:CP C?
U 1 1 5F78B1D2
P 10150 950
AR Path="/5E179620/5E179864/5F78B1D2" Ref="C?"  Part="1" 
AR Path="/5E182A9D/5F777EC8/5F78B1D2" Ref="C522"  Part="1" 
F 0 "C522" H 10175 1050 50  0000 L CNN
F 1 "82uF" H 10175 850 50  0000 L CNN
F 2 "Capacitor_SMD:CP_Elec_10x10" H 10188 800 50  0001 C CNN
F 3 "~" H 10150 950 50  0001 C CNN
F 4 "" H 10150 950 50  0001 C CNN "PartNumber"
F 5 "63V" H 10150 950 50  0001 C CNN "Voltage"
F 6 "1.4A" H 10150 950 50  0001 C CNN "Ripple current"
F 7 "3000-0000000470" H 10150 950 50  0001 C CNN "PartSpecification"
	1    10150 950 
	1    0    0    -1  
$EndComp
$Comp
L Device:CP C?
U 1 1 5F78B1C9
P 10450 950
AR Path="/5E179620/5E179864/5F78B1C9" Ref="C?"  Part="1" 
AR Path="/5E182A9D/5F777EC8/5F78B1C9" Ref="C524"  Part="1" 
F 0 "C524" H 10475 1050 50  0000 L CNN
F 1 "82uF" H 10475 850 50  0000 L CNN
F 2 "Capacitor_SMD:CP_Elec_10x10" H 10488 800 50  0001 C CNN
F 3 "~" H 10450 950 50  0001 C CNN
F 4 "" H 10450 950 50  0001 C CNN "PartNumber"
F 5 "63V" H 10450 950 50  0001 C CNN "Voltage"
F 6 "1.4A" H 10450 950 50  0001 C CNN "Ripple current"
F 7 "3000-0000000470" H 10450 950 50  0001 C CNN "PartSpecification"
	1    10450 950 
	1    0    0    -1  
$EndComp
$Comp
L POWDER_Power:CSD18531Q5A U?
U 1 1 5F78B1B2
P 8750 2850
AR Path="/5E179620/5E179864/5F78B1B2" Ref="U?"  Part="1" 
AR Path="/5E182A9D/5F777EC8/5F78B1B2" Ref="U505"  Part="1" 
F 0 "U505" H 8750 2550 50  0000 C CNN
F 1 "CSD18531Q5A" H 8750 3150 50  0000 C CNN
F 2 "POWDER_Power:CSD16321Q5" H 8650 2450 50  0001 C CNN
F 3 "" H 8750 2850 50  0001 C CNN
F 4 "3000-0000000512" H 8750 2850 50  0001 C CNN "PartSpecification"
	1    8750 2850
	-1   0    0    -1  
$EndComp
$Comp
L POWDER_Power:CSD18531Q5A U?
U 1 1 5F78B1AA
P 8750 2050
AR Path="/5E179620/5E179864/5F78B1AA" Ref="U?"  Part="1" 
AR Path="/5E182A9D/5F777EC8/5F78B1AA" Ref="U504"  Part="1" 
F 0 "U504" H 8750 1750 50  0000 C CNN
F 1 "CSD18531Q5A" H 8750 2350 50  0000 C CNN
F 2 "POWDER_Power:CSD16321Q5" H 8650 1650 50  0001 C CNN
F 3 "" H 8750 2050 50  0001 C CNN
F 4 "3000-0000000512" H 8750 2050 50  0001 C CNN "PartSpecification"
	1    8750 2050
	-1   0    0    -1  
$EndComp
$Comp
L POWDER_Power:CSD18531Q5A U?
U 1 1 5F78B194
P 7750 2850
AR Path="/5E179620/5E179864/5F78B194" Ref="U?"  Part="1" 
AR Path="/5E182A9D/5F777EC8/5F78B194" Ref="U503"  Part="1" 
F 0 "U503" H 7750 2550 50  0000 C CNN
F 1 "CSD18531Q5A" H 7750 3150 50  0000 C CNN
F 2 "POWDER_Power:CSD16321Q5" H 7650 2450 50  0001 C CNN
F 3 "" H 7750 2850 50  0001 C CNN
F 4 "3000-0000000512" H 7750 2850 50  0001 C CNN "PartSpecification"
	1    7750 2850
	1    0    0    -1  
$EndComp
$Comp
L POWDER_Power:CSD18531Q5A U?
U 1 1 5F78B189
P 7750 2050
AR Path="/5E179620/5E179864/5F78B189" Ref="U?"  Part="1" 
AR Path="/5E182A9D/5F777EC8/5F78B189" Ref="U502"  Part="1" 
F 0 "U502" H 7750 1750 50  0000 C CNN
F 1 "CSD18531Q5A" H 7750 2350 50  0000 C CNN
F 2 "POWDER_Power:CSD16321Q5" H 7650 1650 50  0001 C CNN
F 3 "" H 7750 2050 50  0001 C CNN
F 4 "3000-0000000512" H 7750 2050 50  0001 C CNN "PartSpecification"
	1    7750 2050
	1    0    0    -1  
$EndComp
$Comp
L Device:L L?
U 1 1 5F78B183
P 8250 2450
AR Path="/5E179620/5E179864/5F78B183" Ref="L?"  Part="1" 
AR Path="/5E182A9D/5F777EC8/5F78B183" Ref="L501"  Part="1" 
F 0 "L501" V 8200 2450 50  0000 C CNN
F 1 "10uH" V 8325 2450 50  0000 C CNN
F 2 "POWDER_Power:PQ2614BxA" H 8250 2450 50  0001 C CNN
F 3 "~" H 8250 2450 50  0001 C CNN
F 4 "CDEP15D90T150NP-100MC-125" V 8250 2450 50  0001 C CNN "PartNumber"
F 5 "3000-0000000493" H 8250 2450 50  0001 C CNN "PartSpecification"
	1    8250 2450
	0    -1   -1   0   
$EndComp
$Comp
L Device:R R?
U 1 1 5F78B16B
P 3900 2900
AR Path="/5E179620/5E179864/5F78B16B" Ref="R?"  Part="1" 
AR Path="/5E182A9D/5F777EC8/5F78B16B" Ref="R512"  Part="1" 
F 0 "R512" V 3980 2900 50  0000 C CNN
F 1 "93.1k" V 3900 2900 50  0000 C CNN
F 2 "Resistor_SMD:R_0402_1005Metric" V 3830 2900 50  0001 C CNN
F 3 "~" H 3900 2900 50  0001 C CNN
F 4 "3000-0000000572" H 3900 2900 50  0001 C CNN "PartSpecification"
	1    3900 2900
	1    0    0    -1  
$EndComp
$Comp
L 000_PreferredParts:C_0_1uF C?
U 1 1 5F78B15D
P 4200 2900
AR Path="/5E179620/5E179864/5F78B15D" Ref="C?"  Part="1" 
AR Path="/5E182A9D/5F777EC8/5F78B15D" Ref="C508"  Part="1" 
F 0 "C508" H 4225 3000 50  0000 L CNN
F 1 "C_0_1uF" H 4225 2800 50  0001 L CNN
F 2 "Capacitor_SMD:C_0402_1005Metric" H 4238 2750 50  0001 C CNN
F 3 "~" H 4200 2900 50  0001 C CNN
F 4 "0.1uF" H 4350 2800 50  0000 C CNN "DisplayValue"
F 5 "3000-0000000125" H 4200 2900 50  0001 C CNN "PartSpecification"
F 6 "100V" H 4200 2900 50  0001 C CNN "Voltage"
	1    4200 2900
	1    0    0    -1  
$EndComp
$Comp
L 000_PreferredParts:C_1nF C?
U 1 1 5F78B151
P 3350 2550
AR Path="/5E179620/5E179864/5F78B151" Ref="C?"  Part="1" 
AR Path="/5E182A9D/5F777EC8/5F78B151" Ref="C505"  Part="1" 
F 0 "C505" H 3375 2650 50  0000 L CNN
F 1 "C_1nF" H 3375 2450 50  0000 L CNN
F 2 "Capacitor_SMD:C_0402_1005Metric" H 3388 2400 50  0001 C CNN
F 3 "~" H 3350 2550 50  0001 C CNN
F 4 "3000-0000000128" H 3350 2550 50  0001 C CNN "PartSpecification"
	1    3350 2550
	0    1    1    0   
$EndComp
$Comp
L Device:R R?
U 1 1 5F78B141
P 3600 2800
AR Path="/5E179620/5E179864/5F78B141" Ref="R?"  Part="1" 
AR Path="/5E182A9D/5F777EC8/5F78B141" Ref="R510"  Part="1" 
F 0 "R510" V 3680 2800 50  0000 C CNN
F 1 "14.036k" V 3600 2800 50  0000 C CNN
F 2 "Resistor_SMD:R_0402_1005Metric" V 3530 2800 50  0001 C CNN
F 3 "~" H 3600 2800 50  0001 C CNN
F 4 "3000-0000000571" H 3600 2800 50  0001 C CNN "PartSpecification"
	1    3600 2800
	1    0    0    -1  
$EndComp
$Comp
L 000_PreferredParts:C_1uF C?
U 1 1 5F78B130
P 6400 1500
AR Path="/5E179620/5E179864/5F78B130" Ref="C?"  Part="1" 
AR Path="/5E182A9D/5F777EC8/5F78B130" Ref="C511"  Part="1" 
F 0 "C511" H 6425 1600 50  0000 L CNN
F 1 "C_1uF" H 6425 1400 50  0000 L CNN
F 2 "Capacitor_SMD:C_0603_1608Metric" H 6438 1350 50  0001 C CNN
F 3 "~" H 6400 1500 50  0001 C CNN
F 4 "3000-0000000136" H 6400 1500 50  0001 C CNN "PartSpecification"
	1    6400 1500
	1    0    0    -1  
$EndComp
$Comp
L 000_PreferredParts:C_0_1uF C?
U 1 1 5F78B11C
P 2550 2450
AR Path="/5E179620/5E179864/5F78B11C" Ref="C?"  Part="1" 
AR Path="/5E182A9D/5F777EC8/5F78B11C" Ref="C504"  Part="1" 
F 0 "C504" H 2575 2550 50  0000 L CNN
F 1 "C_0_1uF" H 2575 2350 50  0001 L CNN
F 2 "Capacitor_SMD:C_0402_1005Metric" H 2588 2300 50  0001 C CNN
F 3 "~" H 2550 2450 50  0001 C CNN
F 4 "0.1uF" H 2700 2350 50  0000 C CNN "DisplayValue"
F 5 "3000-0000000125" H 2550 2450 50  0001 C CNN "PartSpecification"
	1    2550 2450
	1    0    0    -1  
$EndComp
$Comp
L Device:R R?
U 1 1 5F78B114
P 2500 1650
AR Path="/5E179620/5E179864/5F78B114" Ref="R?"  Part="1" 
AR Path="/5E182A9D/5F777EC8/5F78B114" Ref="R504"  Part="1" 
F 0 "R504" V 2580 1650 50  0000 C CNN
F 1 "10" V 2500 1650 50  0000 C CNN
F 2 "Resistor_SMD:R_0603_1608Metric" V 2430 1650 50  0001 C CNN
F 3 "~" H 2500 1650 50  0001 C CNN
F 4 "3000-0000000551" H 2500 1650 50  0001 C CNN "PartSpecification"
	1    2500 1650
	-1   0    0    1   
$EndComp
$Comp
L Device:R R?
U 1 1 5F78B109
P 2950 2250
AR Path="/5E179620/5E179864/5F78B109" Ref="R?"  Part="1" 
AR Path="/5E182A9D/5F777EC8/5F78B109" Ref="R507"  Part="1" 
F 0 "R507" V 3030 2250 50  0000 C CNN
F 1 "2k" V 2950 2250 50  0000 C CNN
F 2 "Resistor_SMD:R_0603_1608Metric" V 2880 2250 50  0001 C CNN
F 3 "~" H 2950 2250 50  0001 C CNN
F 4 "3000-0000000553" H 2950 2250 50  0001 C CNN "PartSpecification"
	1    2950 2250
	0    1    1    0   
$EndComp
$Comp
L 000_PreferredDiodes:D_Schottky_60V_1A D?
U 1 1 5F78B103
P 2500 1250
AR Path="/5E179620/5E179864/5F78B103" Ref="D?"  Part="1" 
AR Path="/5E182A9D/5F777EC8/5F78B103" Ref="D501"  Part="1" 
F 0 "D501" H 2500 1350 50  0000 C CNN
F 1 "D_Schottky_60V_1A" H 2500 1150 50  0001 C CNN
F 2 "Diode_SMD:D_SOD-123F" H 2500 1250 50  0001 C CNN
F 3 "~" H 2500 1250 50  0001 C CNN
F 4 "DSS16UTR" H 2500 1250 50  0001 C CNN "PartNumber"
F 5 "Schottky" H 2500 1150 50  0000 C CNN "DisplayValue"
F 6 "60V_1A" H 2500 1050 50  0000 C CNN "DisplayValue2"
F 7 "3000-0000000481" H 2500 1250 50  0001 C CNN "PartSpecification"
	1    2500 1250
	0    -1   -1   0   
$EndComp
$Comp
L Device:CP C?
U 1 1 5F78B0D2
P 1800 1250
AR Path="/5E179620/5E179864/5F78B0D2" Ref="C?"  Part="1" 
AR Path="/5E182A9D/5F777EC8/5F78B0D2" Ref="C502"  Part="1" 
F 0 "C502" H 1825 1350 50  0000 L CNN
F 1 "82uF" H 1825 1150 50  0000 L CNN
F 2 "Capacitor_SMD:CP_Elec_10x10" H 1838 1100 50  0001 C CNN
F 3 "~" H 1800 1250 50  0001 C CNN
F 4 "" H 1800 1250 50  0001 C CNN "PartNumber"
F 5 "63V" H 1800 1250 50  0001 C CNN "Voltage"
F 6 "1.4A" H 1800 1250 50  0001 C CNN "Ripple current"
F 7 "3000-0000000470" H 1800 1250 50  0001 C CNN "PartSpecification"
	1    1800 1250
	1    0    0    -1  
$EndComp
$Comp
L POWDER_Power:LM5176_QFN U?
U 1 1 5F78B0C9
P 6000 2750
AR Path="/5E179620/5E179864/5F78B0C9" Ref="U?"  Part="1" 
AR Path="/5E182A9D/5F777EC8/5F78B0C9" Ref="U501"  Part="1" 
F 0 "U501" H 5500 3700 50  0000 L CNN
F 1 "LM5176_QFN" H 5500 3600 50  0000 L CNN
F 2 "POWDER_Power:LM5176_QFN" H 6700 3600 50  0001 L CNN
F 3 "" H 8000 2300 50  0001 C CNN
F 4 "3000-0000000511" H 6000 2750 50  0001 C CNN "PartSpecification"
	1    6000 2750
	1    0    0    -1  
$EndComp
$Comp
L 000_PreferredParts:C_0_1uF C?
U 1 1 5F78B256
P 6850 2300
AR Path="/5E179620/5E179864/5F78B256" Ref="C?"  Part="1" 
AR Path="/5E182A9D/5F777EC8/5F78B256" Ref="C512"  Part="1" 
F 0 "C512" H 6875 2400 50  0000 L CNN
F 1 "C_0_1uF" H 6875 2200 50  0001 L CNN
F 2 "Capacitor_SMD:C_0402_1005Metric" H 6888 2150 50  0001 C CNN
F 3 "~" H 6850 2300 50  0001 C CNN
F 4 "0.1uF" H 7000 2200 50  0000 C CNN "DisplayValue"
F 5 "3000-0000000125" H 6850 2300 50  0001 C CNN "PartSpecification"
F 6 "100V" H 6850 2300 50  0001 C CNN "Voltage"
	1    6850 2300
	1    0    0    -1  
$EndComp
$Comp
L 000_PreferredParts:C_100pF C513
U 1 1 5E4CA2DB
P 6850 3350
F 0 "C513" H 6875 3450 50  0000 L CNN
F 1 "C_100pF" H 6875 3250 50  0001 L CNN
F 2 "Capacitor_SMD:C_0402_1005Metric" H 6888 3200 50  0001 C CNN
F 3 "~" H 6850 3350 50  0001 C CNN
F 4 "100pF" H 7000 3250 50  0000 C CNN "DisplayValue"
F 5 "3000-0000000474" H 6850 3350 50  0001 C CNN "PartSpecification"
	1    6850 3350
	1    0    0    -1  
$EndComp
Wire Wire Line
	7350 3550 8250 3550
$EndSCHEMATC
