EESchema Schematic File Version 4
EELAYER 26 0
EELAYER END
$Descr A4 11693 8268
encoding utf-8
Sheet 1 1
Title ""
Date ""
Rev ""
Comp ""
Comment1 ""
Comment2 ""
Comment3 ""
Comment4 ""
$EndDescr
$Comp
L Connector:Conn_Coaxial J1
U 1 1 5B55632A
P 1850 2350
F 0 "J1" H 1780 2588 50  0000 C CNN
F 1 "Conn_Coaxial" H 1780 2497 50  0000 C CNN
F 2 "rf:SMA_endlaunch_SD-73251-115" H 1850 2350 50  0001 C CNN
F 3 " ~" H 1850 2350 50  0001 C CNN
	1    1850 2350
	-1   0    0    -1  
$EndComp
$Comp
L rf:MMZ25333BT1 U1
U 1 1 5B55726B
P 6050 2350
F 0 "U1" H 6400 2900 50  0000 R CNN
F 1 "MMZ25333BT1" H 6750 2000 50  0000 R CNN
F 2 "Package_DFN_QFN:QFN-24-1EP_4x4mm_P0.5mm_EP2.6x2.6mm_ThermalVias" H 6050 2350 50  0001 C CNN
F 3 "" H 6050 2350 50  0001 C CNN
	1    6050 2350
	1    0    0    -1  
$EndComp
$Comp
L Device:C C8
U 1 1 5B5573F6
P 2850 2600
F 0 "C8" H 2965 2646 50  0000 L CNN
F 1 "C" H 2965 2555 50  0000 L CNN
F 2 "Capacitor_SMD:C_0201_0603Metric" H 2888 2450 50  0001 C CNN
F 3 "~" H 2850 2600 50  0001 C CNN
	1    2850 2600
	1    0    0    -1  
$EndComp
$Comp
L Device:C C19
U 1 1 5B55743C
P 3250 2350
F 0 "C19" V 2998 2350 50  0000 C CNN
F 1 "C" V 3089 2350 50  0000 C CNN
F 2 "Capacitor_SMD:C_0201_0603Metric" H 3288 2200 50  0001 C CNN
F 3 "~" H 3250 2350 50  0001 C CNN
	1    3250 2350
	0    1    1    0   
$EndComp
$Comp
L Device:C C20
U 1 1 5B55747F
P 3600 2600
F 0 "C20" H 3485 2554 50  0000 R CNN
F 1 "C" H 3485 2645 50  0000 R CNN
F 2 "Capacitor_SMD:C_0201_0603Metric" H 3638 2450 50  0001 C CNN
F 3 "~" H 3600 2600 50  0001 C CNN
	1    3600 2600
	-1   0    0    1   
$EndComp
$Comp
L Device:C C21
U 1 1 5B5574CB
P 3950 2350
F 0 "C21" V 4202 2350 50  0000 C CNN
F 1 "C" V 4111 2350 50  0000 C CNN
F 2 "Capacitor_SMD:C_0201_0603Metric" H 3988 2200 50  0001 C CNN
F 3 "~" H 3950 2350 50  0001 C CNN
	1    3950 2350
	0    -1   -1   0   
$EndComp
$Comp
L Device:C C22
U 1 1 5B55750A
P 4300 2600
F 0 "C22" H 4415 2646 50  0000 L CNN
F 1 "C" H 4415 2555 50  0000 L CNN
F 2 "Capacitor_SMD:C_0201_0603Metric" H 4338 2450 50  0001 C CNN
F 3 "~" H 4300 2600 50  0001 C CNN
	1    4300 2600
	1    0    0    -1  
$EndComp
$Comp
L Device:C C23
U 1 1 5B557550
P 4600 2350
F 0 "C23" V 4348 2350 50  0000 C CNN
F 1 "C" V 4439 2350 50  0000 C CNN
F 2 "Capacitor_SMD:C_0201_0603Metric" H 4638 2200 50  0001 C CNN
F 3 "~" H 4600 2350 50  0001 C CNN
	1    4600 2350
	0    1    1    0   
$EndComp
$Comp
L Device:C C24
U 1 1 5B55758F
P 4900 2600
F 0 "C24" H 4785 2554 50  0000 R CNN
F 1 "C" H 4785 2645 50  0000 R CNN
F 2 "Capacitor_SMD:C_0201_0603Metric" H 4938 2450 50  0001 C CNN
F 3 "~" H 4900 2600 50  0001 C CNN
	1    4900 2600
	-1   0    0    1   
$EndComp
$Comp
L power:GND #PWR?
U 1 1 5B557629
P 1850 3000
F 0 "#PWR?" H 1850 2750 50  0001 C CNN
F 1 "GND" H 1855 2827 50  0000 C CNN
F 2 "" H 1850 3000 50  0001 C CNN
F 3 "" H 1850 3000 50  0001 C CNN
	1    1850 3000
	1    0    0    -1  
$EndComp
$Comp
L power:GND #PWR?
U 1 1 5B55764D
P 2850 3000
F 0 "#PWR?" H 2850 2750 50  0001 C CNN
F 1 "GND" H 2855 2827 50  0000 C CNN
F 2 "" H 2850 3000 50  0001 C CNN
F 3 "" H 2850 3000 50  0001 C CNN
	1    2850 3000
	1    0    0    -1  
$EndComp
$Comp
L power:GND #PWR?
U 1 1 5B55766A
P 3600 3000
F 0 "#PWR?" H 3600 2750 50  0001 C CNN
F 1 "GND" H 3605 2827 50  0000 C CNN
F 2 "" H 3600 3000 50  0001 C CNN
F 3 "" H 3600 3000 50  0001 C CNN
	1    3600 3000
	1    0    0    -1  
$EndComp
$Comp
L power:GND #PWR?
U 1 1 5B557687
P 4300 3000
F 0 "#PWR?" H 4300 2750 50  0001 C CNN
F 1 "GND" H 4305 2827 50  0000 C CNN
F 2 "" H 4300 3000 50  0001 C CNN
F 3 "" H 4300 3000 50  0001 C CNN
	1    4300 3000
	1    0    0    -1  
$EndComp
$Comp
L power:GND #PWR?
U 1 1 5B5576A4
P 4900 3000
F 0 "#PWR?" H 4900 2750 50  0001 C CNN
F 1 "GND" H 4905 2827 50  0000 C CNN
F 2 "" H 4900 3000 50  0001 C CNN
F 3 "" H 4900 3000 50  0001 C CNN
	1    4900 3000
	1    0    0    -1  
$EndComp
Wire Wire Line
	1850 3000 1850 2550
Wire Wire Line
	2850 2350 2850 2450
Wire Wire Line
	2850 2350 3100 2350
Wire Wire Line
	2850 2750 2850 3000
Wire Wire Line
	3400 2350 3600 2350
Wire Wire Line
	3600 2350 3600 2450
Wire Wire Line
	3600 2350 3800 2350
Connection ~ 3600 2350
Wire Wire Line
	3600 2750 3600 3000
Wire Wire Line
	4100 2350 4300 2350
Wire Wire Line
	4300 2350 4300 2450
Connection ~ 4300 2350
Wire Wire Line
	4300 2350 4450 2350
Wire Wire Line
	4300 2750 4300 3000
Wire Wire Line
	4900 2350 4900 2450
Wire Wire Line
	4750 2350 4900 2350
$Comp
L Device:C C1
U 1 1 5B5579D4
P 5200 2350
F 0 "C1" V 4948 2350 50  0000 C CNN
F 1 "22p" V 5039 2350 50  0000 C CNN
F 2 "Capacitor_SMD:C_0201_0603Metric" H 5238 2200 50  0001 C CNN
F 3 "~" H 5200 2350 50  0001 C CNN
	1    5200 2350
	0    1    1    0   
$EndComp
Connection ~ 4900 2350
Wire Wire Line
	4900 2350 5050 2350
Wire Wire Line
	4900 2750 4900 3000
$Comp
L Device:C C7
U 1 1 5B557D64
P 2500 2350
F 0 "C7" V 2248 2350 50  0000 C CNN
F 1 "C" V 2339 2350 50  0000 C CNN
F 2 "Capacitor_SMD:C_0201_0603Metric" H 2538 2200 50  0001 C CNN
F 3 "~" H 2500 2350 50  0001 C CNN
	1    2500 2350
	0    1    1    0   
$EndComp
Wire Wire Line
	2650 2350 2850 2350
Connection ~ 2850 2350
Wire Wire Line
	2350 2350 2050 2350
Wire Wire Line
	5600 2350 5350 2350
$Comp
L Device:R R1
U 1 1 5B5583B1
P 5950 3000
F 0 "R1" H 6020 3046 50  0000 L CNN
F 1 "1.8k" H 6020 2955 50  0000 L CNN
F 2 "Resistor_SMD:R_0402_1005Metric" V 5880 3000 50  0001 C CNN
F 3 "~" H 5950 3000 50  0001 C CNN
	1    5950 3000
	1    0    0    -1  
$EndComp
$Comp
L Device:R R2
U 1 1 5B55841F
P 6050 3300
F 0 "R2" H 6120 3346 50  0000 L CNN
F 1 "680" H 6120 3255 50  0000 L CNN
F 2 "Resistor_SMD:R_0402_1005Metric" V 5980 3300 50  0001 C CNN
F 3 "~" H 6050 3300 50  0001 C CNN
	1    6050 3300
	1    0    0    -1  
$EndComp
$Comp
L Device:C C14
U 1 1 5B558611
P 5950 3850
F 0 "C14" H 6065 3896 50  0000 L CNN
F 1 "1u" H 6065 3805 50  0000 L CNN
F 2 "Capacitor_SMD:C_0402_1005Metric" H 5988 3700 50  0001 C CNN
F 3 "~" H 5950 3850 50  0001 C CNN
	1    5950 3850
	1    0    0    -1  
$EndComp
$Comp
L Device:C C9
U 1 1 5B558683
P 6450 3850
F 0 "C9" H 6565 3896 50  0000 L CNN
F 1 "1000p" H 6565 3805 50  0000 L CNN
F 2 "Capacitor_SMD:C_0402_1005Metric" H 6488 3700 50  0001 C CNN
F 3 "~" H 6450 3850 50  0001 C CNN
	1    6450 3850
	1    0    0    -1  
$EndComp
Wire Wire Line
	5950 2850 5950 2750
Wire Wire Line
	6050 2750 6050 3150
Wire Wire Line
	5950 3150 5950 3550
Wire Wire Line
	5950 3550 6050 3550
Wire Wire Line
	6450 3550 6450 3700
Connection ~ 5950 3550
Wire Wire Line
	5950 3550 5950 3700
Wire Wire Line
	6050 3450 6050 3550
Connection ~ 6050 3550
Wire Wire Line
	6050 3550 6150 3550
$Comp
L power:GND #PWR?
U 1 1 5B558FF2
P 5950 4150
F 0 "#PWR?" H 5950 3900 50  0001 C CNN
F 1 "GND" H 5955 3977 50  0000 C CNN
F 2 "" H 5950 4150 50  0001 C CNN
F 3 "" H 5950 4150 50  0001 C CNN
	1    5950 4150
	1    0    0    -1  
$EndComp
$Comp
L power:GND #PWR?
U 1 1 5B55901B
P 6450 4150
F 0 "#PWR?" H 6450 3900 50  0001 C CNN
F 1 "GND" H 6455 3977 50  0000 C CNN
F 2 "" H 6450 4150 50  0001 C CNN
F 3 "" H 6450 4150 50  0001 C CNN
	1    6450 4150
	1    0    0    -1  
$EndComp
Wire Wire Line
	6450 4150 6450 4000
Wire Wire Line
	5950 4000 5950 4150
Wire Wire Line
	6150 2750 6150 3550
Connection ~ 6150 3550
Wire Wire Line
	6150 3550 6450 3550
$Comp
L Device:C C2
U 1 1 5B559976
P 7000 2800
F 0 "C2" H 7115 2846 50  0000 L CNN
F 1 "2p" H 7115 2755 50  0000 L CNN
F 2 "Capacitor_SMD:C_0201_0603Metric" H 7038 2650 50  0001 C CNN
F 3 "~" H 7000 2800 50  0001 C CNN
	1    7000 2800
	1    0    0    -1  
$EndComp
$Comp
L Device:C C3
U 1 1 5B5599E2
P 7500 2800
F 0 "C3" H 7615 2846 50  0000 L CNN
F 1 "1.5p" H 7615 2755 50  0000 L CNN
F 2 "Capacitor_SMD:C_0201_0603Metric" H 7538 2650 50  0001 C CNN
F 3 "~" H 7500 2800 50  0001 C CNN
	1    7500 2800
	1    0    0    -1  
$EndComp
$Comp
L Device:L L4
U 1 1 5B559A6E
P 7250 2450
F 0 "L4" V 7440 2450 50  0000 C CNN
F 1 "L" V 7349 2450 50  0000 C CNN
F 2 "Capacitor_SMD:C_0201_0603Metric" H 7250 2450 50  0001 C CNN
F 3 "~" H 7250 2450 50  0001 C CNN
	1    7250 2450
	0    -1   -1   0   
$EndComp
$Comp
L Device:L L3
U 1 1 5B559B37
P 7000 1850
F 0 "L3" H 7053 1896 50  0000 L CNN
F 1 "6.8n" H 7053 1805 50  0000 L CNN
F 2 "Inductor_SMD:L_0603_1608Metric" H 7000 1850 50  0001 C CNN
F 3 "~" H 7000 1850 50  0001 C CNN
	1    7000 1850
	1    0    0    -1  
$EndComp
$Comp
L Device:C C13
U 1 1 5B559BEF
P 7500 1850
F 0 "C13" H 7615 1896 50  0000 L CNN
F 1 "1000p" H 7615 1805 50  0000 L CNN
F 2 "Capacitor_SMD:C_0402_1005Metric" H 7538 1700 50  0001 C CNN
F 3 "~" H 7500 1850 50  0001 C CNN
	1    7500 1850
	1    0    0    -1  
$EndComp
$Comp
L Device:C C17
U 1 1 5B559C3D
P 7950 1850
F 0 "C17" H 8065 1896 50  0000 L CNN
F 1 "4.7u" H 8065 1805 50  0000 L CNN
F 2 "Capacitor_SMD:C_0402_1005Metric" H 7988 1700 50  0001 C CNN
F 3 "~" H 7950 1850 50  0001 C CNN
	1    7950 1850
	1    0    0    -1  
$EndComp
Wire Wire Line
	7500 1700 7500 1550
Wire Wire Line
	7500 1550 7000 1550
Wire Wire Line
	7000 1550 7000 1700
Wire Wire Line
	7950 1700 7950 1550
Wire Wire Line
	7950 1550 7700 1550
Connection ~ 7500 1550
$Comp
L power:VCC #PWR?
U 1 1 5B55A481
P 7950 1300
F 0 "#PWR?" H 7950 1150 50  0001 C CNN
F 1 "VCC" H 7967 1473 50  0000 C CNN
F 2 "" H 7950 1300 50  0001 C CNN
F 3 "" H 7950 1300 50  0001 C CNN
	1    7950 1300
	1    0    0    -1  
$EndComp
Wire Wire Line
	7950 1300 7950 1550
Connection ~ 7950 1550
$Comp
L power:GND #PWR?
U 1 1 5B55A8F4
P 7950 2100
F 0 "#PWR?" H 7950 1850 50  0001 C CNN
F 1 "GND" H 7955 1927 50  0000 C CNN
F 2 "" H 7950 2100 50  0001 C CNN
F 3 "" H 7950 2100 50  0001 C CNN
	1    7950 2100
	1    0    0    -1  
$EndComp
$Comp
L power:GND #PWR?
U 1 1 5B55A929
P 7500 2100
F 0 "#PWR?" H 7500 1850 50  0001 C CNN
F 1 "GND" H 7505 1927 50  0000 C CNN
F 2 "" H 7500 2100 50  0001 C CNN
F 3 "" H 7500 2100 50  0001 C CNN
	1    7500 2100
	1    0    0    -1  
$EndComp
Wire Wire Line
	7500 2100 7500 2000
Wire Wire Line
	7950 2100 7950 2000
Wire Wire Line
	7000 2650 7000 2450
Wire Wire Line
	6600 2450 6700 2450
Wire Wire Line
	6700 2450 6700 2350
Wire Wire Line
	6700 2250 6600 2250
Wire Wire Line
	6600 2350 6700 2350
Connection ~ 6700 2350
Wire Wire Line
	6700 2350 6700 2250
Wire Wire Line
	7000 2350 6700 2350
Connection ~ 7000 2350
Wire Wire Line
	7000 2350 7000 2000
$Comp
L Device:C C4
U 1 1 5B55CBF4
P 8750 2450
F 0 "C4" V 8498 2450 50  0000 C CNN
F 1 "22p" V 8589 2450 50  0000 C CNN
F 2 "Capacitor_SMD:C_0201_0603Metric" H 8788 2300 50  0001 C CNN
F 3 "~" H 8750 2450 50  0001 C CNN
	1    8750 2450
	0    1    1    0   
$EndComp
Wire Wire Line
	7100 2450 7000 2450
Connection ~ 7000 2450
Wire Wire Line
	7000 2450 7000 2350
Wire Wire Line
	7400 2450 7500 2450
Wire Wire Line
	7500 2450 7500 2650
$Comp
L Device:L L5
U 1 1 5B55DCF2
P 7750 2450
F 0 "L5" V 7940 2450 50  0000 C CNN
F 1 "L" V 7849 2450 50  0000 C CNN
F 2 "Capacitor_SMD:C_0201_0603Metric" H 7750 2450 50  0001 C CNN
F 3 "~" H 7750 2450 50  0001 C CNN
	1    7750 2450
	0    -1   -1   0   
$EndComp
$Comp
L Device:L L6
U 1 1 5B55DD44
P 8250 2450
F 0 "L6" V 8440 2450 50  0000 C CNN
F 1 "L" V 8349 2450 50  0000 C CNN
F 2 "Capacitor_SMD:C_0201_0603Metric" H 8250 2450 50  0001 C CNN
F 3 "~" H 8250 2450 50  0001 C CNN
	1    8250 2450
	0    -1   -1   0   
$EndComp
$Comp
L Device:C C25
U 1 1 5B55DD98
P 8000 2800
F 0 "C25" H 8115 2846 50  0000 L CNN
F 1 "C" H 8115 2755 50  0000 L CNN
F 2 "Capacitor_SMD:C_0201_0603Metric" H 8038 2650 50  0001 C CNN
F 3 "~" H 8000 2800 50  0001 C CNN
	1    8000 2800
	1    0    0    -1  
$EndComp
Wire Wire Line
	8000 2650 8000 2450
Wire Wire Line
	8000 2450 7900 2450
Wire Wire Line
	8000 2450 8100 2450
Connection ~ 8000 2450
Wire Wire Line
	7600 2450 7500 2450
Connection ~ 7500 2450
$Comp
L power:GND #PWR?
U 1 1 5B55F995
P 7000 3050
F 0 "#PWR?" H 7000 2800 50  0001 C CNN
F 1 "GND" H 7005 2877 50  0000 C CNN
F 2 "" H 7000 3050 50  0001 C CNN
F 3 "" H 7000 3050 50  0001 C CNN
	1    7000 3050
	1    0    0    -1  
$EndComp
$Comp
L power:GND #PWR?
U 1 1 5B55F9D2
P 7500 3050
F 0 "#PWR?" H 7500 2800 50  0001 C CNN
F 1 "GND" H 7505 2877 50  0000 C CNN
F 2 "" H 7500 3050 50  0001 C CNN
F 3 "" H 7500 3050 50  0001 C CNN
	1    7500 3050
	1    0    0    -1  
$EndComp
$Comp
L power:GND #PWR?
U 1 1 5B55FA0F
P 8000 3050
F 0 "#PWR?" H 8000 2800 50  0001 C CNN
F 1 "GND" H 8005 2877 50  0000 C CNN
F 2 "" H 8000 3050 50  0001 C CNN
F 3 "" H 8000 3050 50  0001 C CNN
	1    8000 3050
	1    0    0    -1  
$EndComp
Wire Wire Line
	8000 3050 8000 2950
Wire Wire Line
	7500 3050 7500 2950
Wire Wire Line
	7000 3050 7000 2950
$Comp
L Device:C C26
U 1 1 5B561936
P 8500 2800
F 0 "C26" H 8615 2846 50  0000 L CNN
F 1 "C" H 8615 2755 50  0000 L CNN
F 2 "Capacitor_SMD:C_0201_0603Metric" H 8538 2650 50  0001 C CNN
F 3 "~" H 8500 2800 50  0001 C CNN
	1    8500 2800
	1    0    0    -1  
$EndComp
Wire Wire Line
	8500 2650 8500 2450
Wire Wire Line
	8500 2450 8400 2450
Wire Wire Line
	8600 2450 8500 2450
Connection ~ 8500 2450
$Comp
L power:GND #PWR?
U 1 1 5B563149
P 8500 3050
F 0 "#PWR?" H 8500 2800 50  0001 C CNN
F 1 "GND" H 8505 2877 50  0000 C CNN
F 2 "" H 8500 3050 50  0001 C CNN
F 3 "" H 8500 3050 50  0001 C CNN
	1    8500 3050
	1    0    0    -1  
$EndComp
Wire Wire Line
	8500 3050 8500 2950
$Comp
L Connector:Conn_Coaxial J2
U 1 1 5B563DE3
P 9300 2450
F 0 "J2" H 9399 2426 50  0000 L CNN
F 1 "Conn_Coaxial" H 9399 2335 50  0000 L CNN
F 2 "rf:SMA_endlaunch_SD-73251-115" H 9300 2450 50  0001 C CNN
F 3 " ~" H 9300 2450 50  0001 C CNN
	1    9300 2450
	1    0    0    -1  
$EndComp
Wire Wire Line
	9100 2450 8900 2450
$Comp
L power:GND #PWR?
U 1 1 5B564BF7
P 9300 3050
F 0 "#PWR?" H 9300 2800 50  0001 C CNN
F 1 "GND" H 9305 2877 50  0000 C CNN
F 2 "" H 9300 3050 50  0001 C CNN
F 3 "" H 9300 3050 50  0001 C CNN
	1    9300 3050
	1    0    0    -1  
$EndComp
Wire Wire Line
	9300 3050 9300 2650
$Comp
L Device:C C10
U 1 1 5B565950
P 6600 1200
F 0 "C10" H 6715 1246 50  0000 L CNN
F 1 "470p" H 6715 1155 50  0000 L CNN
F 2 "Capacitor_SMD:C_0402_1005Metric" H 6638 1050 50  0001 C CNN
F 3 "~" H 6600 1200 50  0001 C CNN
	1    6600 1200
	1    0    0    -1  
$EndComp
$Comp
L power:GND #PWR?
U 1 1 5B5659DE
P 6600 1500
F 0 "#PWR?" H 6600 1250 50  0001 C CNN
F 1 "GND" H 6605 1327 50  0000 C CNN
F 2 "" H 6600 1500 50  0001 C CNN
F 3 "" H 6600 1500 50  0001 C CNN
	1    6600 1500
	1    0    0    -1  
$EndComp
Wire Wire Line
	6600 1500 6600 1350
Wire Wire Line
	6600 1050 6600 950 
Wire Wire Line
	6600 950  6250 950 
Wire Wire Line
	6250 950  6250 1750
$Comp
L Device:C C6
U 1 1 5B56771B
P 5850 1150
F 0 "C6" H 5965 1196 50  0000 L CNN
F 1 "7.5p" H 5965 1105 50  0000 L CNN
F 2 "Capacitor_SMD:C_0402_1005Metric" H 5888 1000 50  0001 C CNN
F 3 "~" H 5850 1150 50  0001 C CNN
	1    5850 1150
	1    0    0    -1  
$EndComp
Wire Wire Line
	6150 1750 6150 1000
$Comp
L Device:L L2
U 1 1 5B56887E
P 6400 750
F 0 "L2" V 6590 750 50  0000 C CNN
F 1 "10n" V 6499 750 50  0000 C CNN
F 2 "Inductor_SMD:L_0603_1608Metric" H 6400 750 50  0001 C CNN
F 3 "~" H 6400 750 50  0001 C CNN
	1    6400 750 
	0    -1   -1   0   
$EndComp
Wire Wire Line
	5850 750  5850 1000
Connection ~ 5850 1000
$Comp
L Device:C C16
U 1 1 5B569C26
P 6950 1000
F 0 "C16" H 7065 1046 50  0000 L CNN
F 1 "1u" H 7065 955 50  0000 L CNN
F 2 "Capacitor_SMD:C_0402_1005Metric" H 6988 850 50  0001 C CNN
F 3 "~" H 6950 1000 50  0001 C CNN
	1    6950 1000
	1    0    0    -1  
$EndComp
$Comp
L Device:C C12
U 1 1 5B569CB0
P 7350 1000
F 0 "C12" H 7465 1046 50  0000 L CNN
F 1 "1000p" H 7465 955 50  0000 L CNN
F 2 "Capacitor_SMD:C_0402_1005Metric" H 7388 850 50  0001 C CNN
F 3 "~" H 7350 1000 50  0001 C CNN
	1    7350 1000
	1    0    0    -1  
$EndComp
Wire Wire Line
	6950 850  6950 750 
Wire Wire Line
	6950 750  6550 750 
Wire Wire Line
	7350 850  7350 750 
Wire Wire Line
	7350 750  6950 750 
Connection ~ 6950 750 
$Comp
L power:GND #PWR?
U 1 1 5B56C51D
P 7350 1250
F 0 "#PWR?" H 7350 1000 50  0001 C CNN
F 1 "GND" H 7355 1077 50  0000 C CNN
F 2 "" H 7350 1250 50  0001 C CNN
F 3 "" H 7350 1250 50  0001 C CNN
	1    7350 1250
	1    0    0    -1  
$EndComp
$Comp
L power:GND #PWR?
U 1 1 5B56C568
P 6950 1250
F 0 "#PWR?" H 6950 1000 50  0001 C CNN
F 1 "GND" H 6955 1077 50  0000 C CNN
F 2 "" H 6950 1250 50  0001 C CNN
F 3 "" H 6950 1250 50  0001 C CNN
	1    6950 1250
	1    0    0    -1  
$EndComp
Wire Wire Line
	6950 1250 6950 1150
Wire Wire Line
	7350 1250 7350 1150
$Comp
L power:GND #PWR?
U 1 1 5B56F1AE
P 5850 1350
F 0 "#PWR?" H 5850 1100 50  0001 C CNN
F 1 "GND" H 5855 1177 50  0000 C CNN
F 2 "" H 5850 1350 50  0001 C CNN
F 3 "" H 5850 1350 50  0001 C CNN
	1    5850 1350
	1    0    0    -1  
$EndComp
Wire Wire Line
	5850 1350 5850 1300
Wire Wire Line
	7350 750  7700 750 
Wire Wire Line
	7700 750  7700 1550
Connection ~ 7350 750 
Connection ~ 7700 1550
Wire Wire Line
	7700 1550 7500 1550
$Comp
L Device:C C18
U 1 1 5B572213
P 5100 1450
F 0 "C18" H 5215 1496 50  0000 L CNN
F 1 "2.2p" H 5215 1405 50  0000 L CNN
F 2 "Capacitor_SMD:C_0402_1005Metric" H 5138 1300 50  0001 C CNN
F 3 "~" H 5100 1450 50  0001 C CNN
	1    5100 1450
	1    0    0    -1  
$EndComp
$Comp
L Device:C C5
U 1 1 5B57229D
P 5500 1450
F 0 "C5" H 5615 1496 50  0000 L CNN
F 1 "22p" H 5615 1405 50  0000 L CNN
F 2 "Capacitor_SMD:C_0402_1005Metric" H 5538 1300 50  0001 C CNN
F 3 "~" H 5500 1450 50  0001 C CNN
	1    5500 1450
	1    0    0    -1  
$EndComp
Wire Wire Line
	5500 1600 5950 1600
Wire Wire Line
	5950 1600 5950 1750
Wire Wire Line
	5850 1750 5850 1700
$Comp
L Device:L L1
U 1 1 5B5775EE
P 4800 1450
F 0 "L1" H 4853 1496 50  0000 L CNN
F 1 "56n" H 4853 1405 50  0000 L CNN
F 2 "Inductor_SMD:L_0603_1608Metric" H 4800 1450 50  0001 C CNN
F 3 "~" H 4800 1450 50  0001 C CNN
	1    4800 1450
	1    0    0    -1  
$EndComp
Wire Wire Line
	5100 1700 4800 1700
Wire Wire Line
	4800 1700 4800 1600
Connection ~ 5100 1700
$Comp
L Device:R R3
U 1 1 5B579625
P 4800 950
F 0 "R3" H 4870 996 50  0000 L CNN
F 1 "27" H 4870 905 50  0000 L CNN
F 2 "Resistor_SMD:R_0402_1005Metric" V 4730 950 50  0001 C CNN
F 3 "~" H 4800 950 50  0001 C CNN
	1    4800 950 
	1    0    0    -1  
$EndComp
Wire Wire Line
	4800 1100 4800 1200
$Comp
L power:VCC #PWR?
U 1 1 5B57B748
P 4800 700
F 0 "#PWR?" H 4800 550 50  0001 C CNN
F 1 "VCC" H 4817 873 50  0000 C CNN
F 2 "" H 4800 700 50  0001 C CNN
F 3 "" H 4800 700 50  0001 C CNN
	1    4800 700 
	1    0    0    -1  
$EndComp
Wire Wire Line
	4800 700  4800 800 
$Comp
L Device:C C15
U 1 1 5B57D996
P 4400 1450
F 0 "C15" H 4515 1496 50  0000 L CNN
F 1 "0.01u" H 4515 1405 50  0000 L CNN
F 2 "Capacitor_SMD:C_0402_1005Metric" H 4438 1300 50  0001 C CNN
F 3 "~" H 4400 1450 50  0001 C CNN
	1    4400 1450
	1    0    0    -1  
$EndComp
$Comp
L Device:C C11
U 1 1 5B57DA80
P 3950 1450
F 0 "C11" H 4065 1496 50  0000 L CNN
F 1 "1000p" H 4065 1405 50  0000 L CNN
F 2 "Capacitor_SMD:C_0402_1005Metric" H 3988 1300 50  0001 C CNN
F 3 "~" H 3950 1450 50  0001 C CNN
	1    3950 1450
	1    0    0    -1  
$EndComp
Wire Wire Line
	4400 1300 4400 1200
Wire Wire Line
	4400 1200 4800 1200
Connection ~ 4800 1200
Wire Wire Line
	4800 1200 4800 1300
Wire Wire Line
	3950 1300 3950 1200
Wire Wire Line
	3950 1200 4400 1200
Connection ~ 4400 1200
$Comp
L power:GND #PWR?
U 1 1 5B5825E5
P 4400 1700
F 0 "#PWR?" H 4400 1450 50  0001 C CNN
F 1 "GND" H 4405 1527 50  0000 C CNN
F 2 "" H 4400 1700 50  0001 C CNN
F 3 "" H 4400 1700 50  0001 C CNN
	1    4400 1700
	1    0    0    -1  
$EndComp
$Comp
L power:GND #PWR?
U 1 1 5B58263C
P 3950 1700
F 0 "#PWR?" H 3950 1450 50  0001 C CNN
F 1 "GND" H 3955 1527 50  0000 C CNN
F 2 "" H 3950 1700 50  0001 C CNN
F 3 "" H 3950 1700 50  0001 C CNN
	1    3950 1700
	1    0    0    -1  
$EndComp
Wire Wire Line
	3950 1700 3950 1600
Wire Wire Line
	4400 1600 4400 1700
Wire Wire Line
	5100 1600 5100 1700
Wire Wire Line
	5100 1300 5500 1300
Wire Wire Line
	5100 1700 5850 1700
Wire Wire Line
	5850 1000 6150 1000
Wire Wire Line
	5850 750  6250 750 
Text Label 2200 2350 0    50   ~ 0
RFin
Text Label 8950 2450 0    50   ~ 0
RFout
$Comp
L power:VCC #PWR?
U 1 1 5B59C5DC
P 6450 3400
F 0 "#PWR?" H 6450 3250 50  0001 C CNN
F 1 "VCC" H 6467 3573 50  0000 C CNN
F 2 "" H 6450 3400 50  0001 C CNN
F 3 "" H 6450 3400 50  0001 C CNN
	1    6450 3400
	1    0    0    -1  
$EndComp
Wire Wire Line
	6450 3400 6450 3550
Connection ~ 6450 3550
$Comp
L Connector:Conn_01x03_Male J3
U 1 1 5B59F648
P 2600 1100
F 0 "J3" H 2706 1378 50  0000 C CNN
F 1 "Conn_01x02_Male" H 2706 1287 50  0000 C CNN
F 2 "Connector_PinHeader_2.54mm:PinHeader_1x03_P2.54mm_Vertical" H 2600 1100 50  0001 C CNN
F 3 "~" H 2600 1100 50  0001 C CNN
	1    2600 1100
	1    0    0    -1  
$EndComp
$Comp
L power:VCC #PWR?
U 1 1 5B59F943
P 3050 850
F 0 "#PWR?" H 3050 700 50  0001 C CNN
F 1 "VCC" H 3067 1023 50  0000 C CNN
F 2 "" H 3050 850 50  0001 C CNN
F 3 "" H 3050 850 50  0001 C CNN
	1    3050 850 
	1    0    0    -1  
$EndComp
Wire Wire Line
	3050 1000 2800 1000
Wire Wire Line
	3050 850  3050 1000
$Comp
L power:GND #PWR?
U 1 1 5B5A27D2
P 3050 1300
F 0 "#PWR?" H 3050 1050 50  0001 C CNN
F 1 "GND" H 3055 1127 50  0000 C CNN
F 2 "" H 3050 1300 50  0001 C CNN
F 3 "" H 3050 1300 50  0001 C CNN
	1    3050 1300
	1    0    0    -1  
$EndComp
Wire Wire Line
	3050 1300 3050 1200
Wire Wire Line
	3050 1200 2800 1200
Text Label 6400 950  0    50   ~ 0
Pdet
Text Label 2900 1100 0    50   ~ 0
Pdet
Wire Wire Line
	2900 1100 2800 1100
$Comp
L power:GND #PWR?
U 1 1 5B5AF172
P 5750 3000
F 0 "#PWR?" H 5750 2750 50  0001 C CNN
F 1 "GND" H 5755 2827 50  0000 C CNN
F 2 "" H 5750 3000 50  0001 C CNN
F 3 "" H 5750 3000 50  0001 C CNN
	1    5750 3000
	1    0    0    -1  
$EndComp
Wire Wire Line
	5750 3000 5750 2750
$EndSCHEMATC
