EESchema Schematic File Version 4
EELAYER 30 0
EELAYER END
$Descr A4 11693 8268
encoding utf-8
Sheet 21 39
Title ""
Date ""
Rev ""
Comp ""
Comment1 ""
Comment2 ""
Comment3 ""
Comment4 ""
$EndDescr
Text Notes 1550 3050 0    50   ~ 0
Using comp setting 1 (minimum capacitance 32 uF for 1 - 3.3 V out).\nComp/fset = 18 MHz kOhm / fs.
Wire Wire Line
	3000 1900 3400 1900
Wire Wire Line
	3000 2000 3000 1900
Wire Wire Line
	3000 2600 3000 2300
$Comp
L power:GND #PWR?
U 1 1 5F87ACB0
P 3000 2600
F 0 "#PWR?" H 3000 2350 50  0001 C CNN
F 1 "GND" H 3000 2450 50  0000 C CNN
F 2 "" H 3000 2600 50  0001 C CNN
F 3 "" H 3000 2600 50  0001 C CNN
	1    3000 2600
	1    0    0    -1  
$EndComp
Wire Wire Line
	3300 2600 3300 2500
$Comp
L power:GND #PWR?
U 1 1 5F87ACB7
P 3300 2600
F 0 "#PWR?" H 3300 2350 50  0001 C CNN
F 1 "GND" H 3300 2450 50  0000 C CNN
F 2 "" H 3300 2600 50  0001 C CNN
F 3 "" H 3300 2600 50  0001 C CNN
	1    3300 2600
	1    0    0    -1  
$EndComp
Wire Wire Line
	3300 2100 3400 2100
Wire Wire Line
	3300 2200 3300 2100
$Comp
L Device:R R2108
U 1 1 5F87ACC5
P 3000 2150
F 0 "R2108" V 3080 2150 50  0000 C CNN
F 1 "7.5k" V 3000 2150 50  0000 C CNN
F 2 "Resistor_SMD:R_0402_1005Metric" V 2930 2150 50  0001 C CNN
F 3 "~" H 3000 2150 50  0001 C CNN
F 4 "3000-0000001291" H 3000 2150 50  0001 C CNN "PartSpecification"
	1    3000 2150
	1    0    0    -1  
$EndComp
Connection ~ 1750 1500
Wire Wire Line
	1750 1550 1750 1500
Wire Wire Line
	1750 1500 1500 1500
Wire Wire Line
	1500 1500 1300 1500
Connection ~ 1500 1500
Wire Wire Line
	1500 1550 1500 1500
Wire Wire Line
	1750 2050 1750 1850
$Comp
L power:GND #PWR?
U 1 1 5F87ACD7
P 1750 2050
F 0 "#PWR?" H 1750 1800 50  0001 C CNN
F 1 "GND" H 1750 1900 50  0000 C CNN
F 2 "" H 1750 2050 50  0001 C CNN
F 3 "" H 1750 2050 50  0001 C CNN
	1    1750 2050
	1    0    0    -1  
$EndComp
Wire Wire Line
	1500 2050 1500 1850
$Comp
L power:GND #PWR?
U 1 1 5F87ACDE
P 1500 2050
F 0 "#PWR?" H 1500 1800 50  0001 C CNN
F 1 "GND" H 1500 1900 50  0000 C CNN
F 2 "" H 1500 2050 50  0001 C CNN
F 3 "" H 1500 2050 50  0001 C CNN
	1    1500 2050
	1    0    0    -1  
$EndComp
$Comp
L 000_PreferredParts:C_10uF_0805 C2102
U 1 1 5F87ACE7
P 1750 1700
F 0 "C2102" H 1775 1800 50  0000 L CNN
F 1 "C_10uF_0805" H 1775 1600 50  0001 L CNN
F 2 "Capacitor_SMD:C_0805_2012Metric" H 1788 1550 50  0001 C CNN
F 3 "~" H 1750 1700 50  0001 C CNN
F 4 "10uF" H 1900 1600 50  0000 C CNN "DisplayValue"
F 5 "0805" H 1900 1500 50  0000 C CNN "DisplayFootprint"
F 6 "3000-0000000134" H 1750 1700 50  0001 C CNN "PartSpecification"
	1    1750 1700
	1    0    0    -1  
$EndComp
$Comp
L 000_PreferredParts:C_10uF_0805 C2101
U 1 1 5F87ACF0
P 1500 1700
F 0 "C2101" H 1525 1800 50  0000 L CNN
F 1 "C_10uF_0805" H 1525 1600 50  0001 L CNN
F 2 "Capacitor_SMD:C_0805_2012Metric" H 1538 1550 50  0001 C CNN
F 3 "~" H 1500 1700 50  0001 C CNN
F 4 "10uF" H 1650 1600 50  0000 C CNN "DisplayValue"
F 5 "0805" H 1650 1500 50  0000 C CNN "DisplayFootprint"
F 6 "3000-0000000134" H 1500 1700 50  0001 C CNN "PartSpecification"
	1    1500 1700
	1    0    0    -1  
$EndComp
Wire Wire Line
	4050 2400 4050 2300
$Comp
L power:GND #PWR?
U 1 1 5F87ACF7
P 4050 2400
F 0 "#PWR?" H 4050 2150 50  0001 C CNN
F 1 "GND" H 4050 2250 50  0000 C CNN
F 2 "" H 4050 2400 50  0001 C CNN
F 3 "" H 4050 2400 50  0001 C CNN
	1    4050 2400
	1    0    0    -1  
$EndComp
Connection ~ 7000 1500
Wire Wire Line
	7000 1550 7000 1500
Wire Wire Line
	7000 1500 6750 1500
Connection ~ 6750 1500
Wire Wire Line
	6750 1550 6750 1500
Wire Wire Line
	6750 1500 6500 1500
Connection ~ 6500 1500
Wire Wire Line
	6500 1550 6500 1500
Wire Wire Line
	6500 1500 6250 1500
Connection ~ 6250 1500
Wire Wire Line
	6250 1550 6250 1500
Wire Wire Line
	7250 1500 7000 1500
Wire Wire Line
	7250 1550 7250 1500
Wire Wire Line
	7250 2050 7250 1850
$Comp
L power:GND #PWR?
U 1 1 5F87AD0D
P 7250 2050
F 0 "#PWR?" H 7250 1800 50  0001 C CNN
F 1 "GND" H 7250 1900 50  0000 C CNN
F 2 "" H 7250 2050 50  0001 C CNN
F 3 "" H 7250 2050 50  0001 C CNN
	1    7250 2050
	1    0    0    -1  
$EndComp
Wire Wire Line
	7000 2050 7000 1850
$Comp
L power:GND #PWR?
U 1 1 5F87AD14
P 7000 2050
F 0 "#PWR?" H 7000 1800 50  0001 C CNN
F 1 "GND" H 7000 1900 50  0000 C CNN
F 2 "" H 7000 2050 50  0001 C CNN
F 3 "" H 7000 2050 50  0001 C CNN
	1    7000 2050
	1    0    0    -1  
$EndComp
Wire Wire Line
	6750 2050 6750 1850
$Comp
L power:GND #PWR?
U 1 1 5F87AD1B
P 6750 2050
F 0 "#PWR?" H 6750 1800 50  0001 C CNN
F 1 "GND" H 6750 1900 50  0000 C CNN
F 2 "" H 6750 2050 50  0001 C CNN
F 3 "" H 6750 2050 50  0001 C CNN
	1    6750 2050
	1    0    0    -1  
$EndComp
Wire Wire Line
	6500 2050 6500 1850
$Comp
L power:GND #PWR?
U 1 1 5F87AD22
P 6500 2050
F 0 "#PWR?" H 6500 1800 50  0001 C CNN
F 1 "GND" H 6500 1900 50  0000 C CNN
F 2 "" H 6500 2050 50  0001 C CNN
F 3 "" H 6500 2050 50  0001 C CNN
	1    6500 2050
	1    0    0    -1  
$EndComp
Wire Wire Line
	6250 2050 6250 1850
$Comp
L power:GND #PWR?
U 1 1 5F87AD29
P 6250 2050
F 0 "#PWR?" H 6250 1800 50  0001 C CNN
F 1 "GND" H 6250 1900 50  0000 C CNN
F 2 "" H 6250 2050 50  0001 C CNN
F 3 "" H 6250 2050 50  0001 C CNN
	1    6250 2050
	1    0    0    -1  
$EndComp
$Comp
L 000_PreferredParts:C_10uF_0805 C2108
U 1 1 5F87AD32
P 7250 1700
F 0 "C2108" H 7275 1800 50  0000 L CNN
F 1 "C_10uF_0805" H 7275 1600 50  0001 L CNN
F 2 "Capacitor_SMD:C_0805_2012Metric" H 7288 1550 50  0001 C CNN
F 3 "~" H 7250 1700 50  0001 C CNN
F 4 "10uF" H 7400 1600 50  0000 C CNN "DisplayValue"
F 5 "0805" H 7400 1500 50  0000 C CNN "DisplayFootprint"
F 6 "3000-0000000134" H 7250 1700 50  0001 C CNN "PartSpecification"
	1    7250 1700
	1    0    0    -1  
$EndComp
$Comp
L 000_PreferredParts:C_10uF_0805 C2107
U 1 1 5F87AD3B
P 7000 1700
F 0 "C2107" H 7025 1800 50  0000 L CNN
F 1 "C_10uF_0805" H 7025 1600 50  0001 L CNN
F 2 "Capacitor_SMD:C_0805_2012Metric" H 7038 1550 50  0001 C CNN
F 3 "~" H 7000 1700 50  0001 C CNN
F 4 "10uF" H 7150 1600 50  0000 C CNN "DisplayValue"
F 5 "0805" H 7150 1500 50  0000 C CNN "DisplayFootprint"
F 6 "3000-0000000134" H 7000 1700 50  0001 C CNN "PartSpecification"
	1    7000 1700
	1    0    0    -1  
$EndComp
$Comp
L 000_PreferredParts:C_10uF_0805 C2106
U 1 1 5F87AD44
P 6750 1700
F 0 "C2106" H 6775 1800 50  0000 L CNN
F 1 "C_10uF_0805" H 6775 1600 50  0001 L CNN
F 2 "Capacitor_SMD:C_0805_2012Metric" H 6788 1550 50  0001 C CNN
F 3 "~" H 6750 1700 50  0001 C CNN
F 4 "10uF" H 6900 1600 50  0000 C CNN "DisplayValue"
F 5 "0805" H 6900 1500 50  0000 C CNN "DisplayFootprint"
F 6 "3000-0000000134" H 6750 1700 50  0001 C CNN "PartSpecification"
	1    6750 1700
	1    0    0    -1  
$EndComp
$Comp
L 000_PreferredParts:C_10uF_0805 C2105
U 1 1 5F87AD4D
P 6500 1700
F 0 "C2105" H 6525 1800 50  0000 L CNN
F 1 "C_10uF_0805" H 6525 1600 50  0001 L CNN
F 2 "Capacitor_SMD:C_0805_2012Metric" H 6538 1550 50  0001 C CNN
F 3 "~" H 6500 1700 50  0001 C CNN
F 4 "10uF" H 6650 1600 50  0000 C CNN "DisplayValue"
F 5 "0805" H 6650 1500 50  0000 C CNN "DisplayFootprint"
F 6 "3000-0000000134" H 6500 1700 50  0001 C CNN "PartSpecification"
	1    6500 1700
	1    0    0    -1  
$EndComp
$Comp
L 000_PreferredParts:C_10uF_0805 C2104
U 1 1 5F87AD56
P 6250 1700
F 0 "C2104" H 6275 1800 50  0000 L CNN
F 1 "C_10uF_0805" H 6275 1600 50  0001 L CNN
F 2 "Capacitor_SMD:C_0805_2012Metric" H 6288 1550 50  0001 C CNN
F 3 "~" H 6250 1700 50  0001 C CNN
F 4 "10uF" H 6400 1600 50  0000 C CNN "DisplayValue"
F 5 "0805" H 6400 1500 50  0000 C CNN "DisplayFootprint"
F 6 "3000-0000000134" H 6250 1700 50  0001 C CNN "PartSpecification"
	1    6250 1700
	1    0    0    -1  
$EndComp
Connection ~ 5500 1500
Wire Wire Line
	5500 1550 5500 1500
Wire Wire Line
	5500 1950 5150 1950
Wire Wire Line
	5500 1850 5500 1950
$Comp
L Device:C C2103
U 1 1 5F87AD64
P 5500 1700
F 0 "C2103" H 5525 1800 50  0000 L CNN
F 1 "10p" H 5525 1600 50  0000 L CNN
F 2 "Capacitor_SMD:C_0402_1005Metric" H 5538 1550 50  0001 C CNN
F 3 "~" H 5500 1700 50  0001 C CNN
F 4 "3000-0000000126" H 5500 1700 50  0001 C CNN "PartSpecification"
	1    5500 1700
	1    0    0    -1  
$EndComp
Wire Wire Line
	4700 2050 5750 2050
Wire Wire Line
	5150 1950 5150 2150
Wire Wire Line
	5750 2050 5750 1850
Wire Wire Line
	5150 2500 5150 2450
$Comp
L power:GND #PWR?
U 1 1 5F87AD6E
P 5150 2500
F 0 "#PWR?" H 5150 2250 50  0001 C CNN
F 1 "GND" H 5150 2350 50  0000 C CNN
F 2 "" H 5150 2500 50  0001 C CNN
F 3 "" H 5150 2500 50  0001 C CNN
	1    5150 2500
	1    0    0    -1  
$EndComp
Connection ~ 5150 1950
Wire Wire Line
	4700 1950 5150 1950
Wire Wire Line
	5150 1850 5150 1950
Wire Wire Line
	4800 1500 4700 1500
Wire Wire Line
	5500 1500 5150 1500
Wire Wire Line
	5150 1500 5100 1500
Connection ~ 5150 1500
Wire Wire Line
	5150 1550 5150 1500
$Comp
L Device:L L2101
U 1 1 5F87AD7C
P 4950 1500
F 0 "L2101" V 4900 1500 50  0000 C CNN
F 1 "0.47uH" V 5025 1500 50  0000 C CNN
F 2 "Inductor_SMD:L_1008_2520Metric" H 4950 1500 50  0001 C CNN
F 3 "~" H 4950 1500 50  0001 C CNN
F 4 "DFE252012PD-R47M=P2 " V 4950 1500 50  0001 C CNN "PartNumber"
F 5 "Murata Electronics" V 4950 1500 50  0001 C CNN "Manufacturer"
F 6 "3000-0000001283" H 4950 1500 50  0001 C CNN "PartSpecification"
	1    4950 1500
	0    -1   -1   0   
$EndComp
$Comp
L POWDER_Power:TPS62810-Q1 U2101
U 1 1 5F87AD82
P 4050 1750
F 0 "U2101" H 4500 2150 50  0000 C CNN
F 1 "TPS62810-Q1" H 4050 2150 50  0000 C CNN
F 2 "POWDER_Power:RWY0009A" H 4050 1750 50  0001 C CNN
F 3 "" H 4050 1750 50  0001 C CNN
F 4 "3000-0000001298" H 4050 1750 50  0001 C CNN "PartSpecification"
	1    4050 1750
	1    0    0    -1  
$EndComp
$Comp
L Device:R R2109
U 1 1 5F87AD88
P 5150 2300
F 0 "R2109" V 5230 2300 50  0000 C CNN
F 1 "68k" V 5150 2300 50  0000 C CNN
F 2 "Resistor_SMD:R_0402_1005Metric" V 5080 2300 50  0001 C CNN
F 3 "~" H 5150 2300 50  0001 C CNN
F 4 "3000-0000001293" H 5150 2300 50  0001 C CNN "PartSpecification"
	1    5150 2300
	1    0    0    -1  
$EndComp
$Comp
L Device:R R2102
U 1 1 5F87AD8E
P 5150 1700
F 0 "R2102" V 5230 1700 50  0000 C CNN
F 1 "68k" V 5150 1700 50  0000 C CNN
F 2 "Resistor_SMD:R_0402_1005Metric" V 5080 1700 50  0001 C CNN
F 3 "~" H 5150 1700 50  0001 C CNN
F 4 "3000-0000001293" H 5150 1700 50  0001 C CNN "PartSpecification"
	1    5150 1700
	1    0    0    -1  
$EndComp
Wire Wire Line
	3400 1800 2600 1800
Text HLabel 2500 1800 0    50   Input ~ 0
SYNC_1
Text HLabel 1250 1500 0    50   Input ~ 0
VIN
$Comp
L power:+1V2 #PWR?
U 1 1 5F87DBE2
P 8500 1250
F 0 "#PWR?" H 8500 1100 50  0001 C CNN
F 1 "+1V2" H 8500 1390 50  0000 C CNN
F 2 "" H 8500 1250 50  0001 C CNN
F 3 "" H 8500 1250 50  0001 C CNN
	1    8500 1250
	1    0    0    -1  
$EndComp
Wire Wire Line
	8500 1250 8500 1500
Wire Wire Line
	3000 4400 3400 4400
Wire Wire Line
	3000 4500 3000 4400
Wire Wire Line
	3000 5100 3000 4800
$Comp
L power:GND #PWR?
U 1 1 5F890BDF
P 3000 5100
F 0 "#PWR?" H 3000 4850 50  0001 C CNN
F 1 "GND" H 3000 4950 50  0000 C CNN
F 2 "" H 3000 5100 50  0001 C CNN
F 3 "" H 3000 5100 50  0001 C CNN
	1    3000 5100
	1    0    0    -1  
$EndComp
Wire Wire Line
	3300 5100 3300 5000
$Comp
L power:GND #PWR?
U 1 1 5F890BE6
P 3300 5100
F 0 "#PWR?" H 3300 4850 50  0001 C CNN
F 1 "GND" H 3300 4950 50  0000 C CNN
F 2 "" H 3300 5100 50  0001 C CNN
F 3 "" H 3300 5100 50  0001 C CNN
	1    3300 5100
	1    0    0    -1  
$EndComp
Wire Wire Line
	3300 4600 3400 4600
Wire Wire Line
	3300 4700 3300 4600
$Comp
L Device:R R2117
U 1 1 5F890BF4
P 3000 4650
F 0 "R2117" V 3080 4650 50  0000 C CNN
F 1 "7.5k" V 3000 4650 50  0000 C CNN
F 2 "Resistor_SMD:R_0402_1005Metric" V 2930 4650 50  0001 C CNN
F 3 "~" H 3000 4650 50  0001 C CNN
F 4 "3000-0000001291" H 3000 4650 50  0001 C CNN "PartSpecification"
	1    3000 4650
	1    0    0    -1  
$EndComp
Wire Wire Line
	1750 4050 1750 4000
Wire Wire Line
	1750 4000 1500 4000
Wire Wire Line
	1500 4000 1300 4000
Connection ~ 1500 4000
Wire Wire Line
	1500 4050 1500 4000
Wire Wire Line
	1750 4550 1750 4350
$Comp
L power:GND #PWR?
U 1 1 5F890C06
P 1750 4550
F 0 "#PWR?" H 1750 4300 50  0001 C CNN
F 1 "GND" H 1750 4400 50  0000 C CNN
F 2 "" H 1750 4550 50  0001 C CNN
F 3 "" H 1750 4550 50  0001 C CNN
	1    1750 4550
	1    0    0    -1  
$EndComp
Wire Wire Line
	1500 4550 1500 4350
$Comp
L power:GND #PWR?
U 1 1 5F890C0D
P 1500 4550
F 0 "#PWR?" H 1500 4300 50  0001 C CNN
F 1 "GND" H 1500 4400 50  0000 C CNN
F 2 "" H 1500 4550 50  0001 C CNN
F 3 "" H 1500 4550 50  0001 C CNN
	1    1500 4550
	1    0    0    -1  
$EndComp
$Comp
L 000_PreferredParts:C_10uF_0805 C2112
U 1 1 5F890C16
P 1750 4200
F 0 "C2112" H 1775 4300 50  0000 L CNN
F 1 "C_10uF_0805" H 1775 4100 50  0001 L CNN
F 2 "Capacitor_SMD:C_0805_2012Metric" H 1788 4050 50  0001 C CNN
F 3 "~" H 1750 4200 50  0001 C CNN
F 4 "10uF" H 1900 4100 50  0000 C CNN "DisplayValue"
F 5 "0805" H 1900 4000 50  0000 C CNN "DisplayFootprint"
F 6 "3000-0000000134" H 1750 4200 50  0001 C CNN "PartSpecification"
	1    1750 4200
	1    0    0    -1  
$EndComp
$Comp
L 000_PreferredParts:C_10uF_0805 C2111
U 1 1 5F890C1F
P 1500 4200
F 0 "C2111" H 1525 4300 50  0000 L CNN
F 1 "C_10uF_0805" H 1525 4100 50  0001 L CNN
F 2 "Capacitor_SMD:C_0805_2012Metric" H 1538 4050 50  0001 C CNN
F 3 "~" H 1500 4200 50  0001 C CNN
F 4 "10uF" H 1650 4100 50  0000 C CNN "DisplayValue"
F 5 "0805" H 1650 4000 50  0000 C CNN "DisplayFootprint"
F 6 "3000-0000000134" H 1500 4200 50  0001 C CNN "PartSpecification"
	1    1500 4200
	1    0    0    -1  
$EndComp
Wire Wire Line
	4050 4900 4050 4800
$Comp
L power:GND #PWR?
U 1 1 5F890C26
P 4050 4900
F 0 "#PWR?" H 4050 4650 50  0001 C CNN
F 1 "GND" H 4050 4750 50  0000 C CNN
F 2 "" H 4050 4900 50  0001 C CNN
F 3 "" H 4050 4900 50  0001 C CNN
	1    4050 4900
	1    0    0    -1  
$EndComp
Connection ~ 7000 4000
Wire Wire Line
	7000 4050 7000 4000
Wire Wire Line
	7000 4000 6750 4000
Connection ~ 6750 4000
Wire Wire Line
	6750 4050 6750 4000
Wire Wire Line
	6750 4000 6500 4000
Connection ~ 6500 4000
Wire Wire Line
	6500 4050 6500 4000
Wire Wire Line
	6500 4000 6250 4000
Connection ~ 6250 4000
Wire Wire Line
	6250 4050 6250 4000
Wire Wire Line
	7250 4000 7000 4000
Wire Wire Line
	7250 4050 7250 4000
Wire Wire Line
	7250 4550 7250 4350
$Comp
L power:GND #PWR?
U 1 1 5F890C3C
P 7250 4550
F 0 "#PWR?" H 7250 4300 50  0001 C CNN
F 1 "GND" H 7250 4400 50  0000 C CNN
F 2 "" H 7250 4550 50  0001 C CNN
F 3 "" H 7250 4550 50  0001 C CNN
	1    7250 4550
	1    0    0    -1  
$EndComp
Wire Wire Line
	7000 4550 7000 4350
$Comp
L power:GND #PWR?
U 1 1 5F890C43
P 7000 4550
F 0 "#PWR?" H 7000 4300 50  0001 C CNN
F 1 "GND" H 7000 4400 50  0000 C CNN
F 2 "" H 7000 4550 50  0001 C CNN
F 3 "" H 7000 4550 50  0001 C CNN
	1    7000 4550
	1    0    0    -1  
$EndComp
Wire Wire Line
	6750 4550 6750 4350
$Comp
L power:GND #PWR?
U 1 1 5F890C4A
P 6750 4550
F 0 "#PWR?" H 6750 4300 50  0001 C CNN
F 1 "GND" H 6750 4400 50  0000 C CNN
F 2 "" H 6750 4550 50  0001 C CNN
F 3 "" H 6750 4550 50  0001 C CNN
	1    6750 4550
	1    0    0    -1  
$EndComp
Wire Wire Line
	6500 4550 6500 4350
$Comp
L power:GND #PWR?
U 1 1 5F890C51
P 6500 4550
F 0 "#PWR?" H 6500 4300 50  0001 C CNN
F 1 "GND" H 6500 4400 50  0000 C CNN
F 2 "" H 6500 4550 50  0001 C CNN
F 3 "" H 6500 4550 50  0001 C CNN
	1    6500 4550
	1    0    0    -1  
$EndComp
Wire Wire Line
	6250 4550 6250 4350
$Comp
L power:GND #PWR?
U 1 1 5F890C58
P 6250 4550
F 0 "#PWR?" H 6250 4300 50  0001 C CNN
F 1 "GND" H 6250 4400 50  0000 C CNN
F 2 "" H 6250 4550 50  0001 C CNN
F 3 "" H 6250 4550 50  0001 C CNN
	1    6250 4550
	1    0    0    -1  
$EndComp
$Comp
L 000_PreferredParts:C_10uF_0805 C2118
U 1 1 5F890C61
P 7250 4200
F 0 "C2118" H 7275 4300 50  0000 L CNN
F 1 "C_10uF_0805" H 7275 4100 50  0001 L CNN
F 2 "Capacitor_SMD:C_0805_2012Metric" H 7288 4050 50  0001 C CNN
F 3 "~" H 7250 4200 50  0001 C CNN
F 4 "10uF" H 7400 4100 50  0000 C CNN "DisplayValue"
F 5 "0805" H 7400 4000 50  0000 C CNN "DisplayFootprint"
F 6 "3000-0000000134" H 7250 4200 50  0001 C CNN "PartSpecification"
	1    7250 4200
	1    0    0    -1  
$EndComp
$Comp
L 000_PreferredParts:C_10uF_0805 C2117
U 1 1 5F890C6A
P 7000 4200
F 0 "C2117" H 7025 4300 50  0000 L CNN
F 1 "C_10uF_0805" H 7025 4100 50  0001 L CNN
F 2 "Capacitor_SMD:C_0805_2012Metric" H 7038 4050 50  0001 C CNN
F 3 "~" H 7000 4200 50  0001 C CNN
F 4 "10uF" H 7150 4100 50  0000 C CNN "DisplayValue"
F 5 "0805" H 7150 4000 50  0000 C CNN "DisplayFootprint"
F 6 "3000-0000000134" H 7000 4200 50  0001 C CNN "PartSpecification"
	1    7000 4200
	1    0    0    -1  
$EndComp
$Comp
L 000_PreferredParts:C_10uF_0805 C2116
U 1 1 5F890C73
P 6750 4200
F 0 "C2116" H 6775 4300 50  0000 L CNN
F 1 "C_10uF_0805" H 6775 4100 50  0001 L CNN
F 2 "Capacitor_SMD:C_0805_2012Metric" H 6788 4050 50  0001 C CNN
F 3 "~" H 6750 4200 50  0001 C CNN
F 4 "10uF" H 6900 4100 50  0000 C CNN "DisplayValue"
F 5 "0805" H 6900 4000 50  0000 C CNN "DisplayFootprint"
F 6 "3000-0000000134" H 6750 4200 50  0001 C CNN "PartSpecification"
	1    6750 4200
	1    0    0    -1  
$EndComp
$Comp
L 000_PreferredParts:C_10uF_0805 C2115
U 1 1 5F890C7C
P 6500 4200
F 0 "C2115" H 6525 4300 50  0000 L CNN
F 1 "C_10uF_0805" H 6525 4100 50  0001 L CNN
F 2 "Capacitor_SMD:C_0805_2012Metric" H 6538 4050 50  0001 C CNN
F 3 "~" H 6500 4200 50  0001 C CNN
F 4 "10uF" H 6650 4100 50  0000 C CNN "DisplayValue"
F 5 "0805" H 6650 4000 50  0000 C CNN "DisplayFootprint"
F 6 "3000-0000000134" H 6500 4200 50  0001 C CNN "PartSpecification"
	1    6500 4200
	1    0    0    -1  
$EndComp
$Comp
L 000_PreferredParts:C_10uF_0805 C2114
U 1 1 5F890C85
P 6250 4200
F 0 "C2114" H 6275 4300 50  0000 L CNN
F 1 "C_10uF_0805" H 6275 4100 50  0001 L CNN
F 2 "Capacitor_SMD:C_0805_2012Metric" H 6288 4050 50  0001 C CNN
F 3 "~" H 6250 4200 50  0001 C CNN
F 4 "10uF" H 6400 4100 50  0000 C CNN "DisplayValue"
F 5 "0805" H 6400 4000 50  0000 C CNN "DisplayFootprint"
F 6 "3000-0000000134" H 6250 4200 50  0001 C CNN "PartSpecification"
	1    6250 4200
	1    0    0    -1  
$EndComp
Connection ~ 5500 4000
Wire Wire Line
	5500 4050 5500 4000
Wire Wire Line
	5500 4450 5150 4450
Wire Wire Line
	5500 4350 5500 4450
$Comp
L Device:C C2113
U 1 1 5F890C93
P 5500 4200
F 0 "C2113" H 5525 4300 50  0000 L CNN
F 1 "10p" H 5525 4100 50  0000 L CNN
F 2 "Capacitor_SMD:C_0402_1005Metric" H 5538 4050 50  0001 C CNN
F 3 "~" H 5500 4200 50  0001 C CNN
F 4 "3000-0000000126" H 5500 4200 50  0001 C CNN "PartSpecification"
	1    5500 4200
	1    0    0    -1  
$EndComp
Wire Wire Line
	4700 4550 5750 4550
Wire Wire Line
	5150 4450 5150 4650
Wire Wire Line
	5750 4550 5750 4350
Wire Wire Line
	5150 5000 5150 4950
$Comp
L power:GND #PWR?
U 1 1 5F890C9D
P 5150 5000
F 0 "#PWR?" H 5150 4750 50  0001 C CNN
F 1 "GND" H 5150 4850 50  0000 C CNN
F 2 "" H 5150 5000 50  0001 C CNN
F 3 "" H 5150 5000 50  0001 C CNN
	1    5150 5000
	1    0    0    -1  
$EndComp
Connection ~ 5150 4450
Wire Wire Line
	4700 4450 5150 4450
Wire Wire Line
	5150 4350 5150 4450
Wire Wire Line
	4800 4000 4700 4000
Wire Wire Line
	5500 4000 5150 4000
Wire Wire Line
	5150 4000 5100 4000
Connection ~ 5150 4000
Wire Wire Line
	5150 4050 5150 4000
$Comp
L POWDER_Power:TPS62810-Q1 U2103
U 1 1 5F890CB1
P 4050 4250
F 0 "U2103" H 4500 4650 50  0000 C CNN
F 1 "TPS62810-Q1" H 4050 4650 50  0000 C CNN
F 2 "POWDER_Power:RWY0009A" H 4050 4250 50  0001 C CNN
F 3 "" H 4050 4250 50  0001 C CNN
F 4 "3000-0000001298" H 4050 4250 50  0001 C CNN "PartSpecification"
	1    4050 4250
	1    0    0    -1  
$EndComp
$Comp
L Device:R R2118
U 1 1 5F890CB7
P 5150 4800
F 0 "R2118" V 5230 4800 50  0000 C CNN
F 1 "15k" V 5150 4800 50  0000 C CNN
F 2 "Resistor_SMD:R_0402_1005Metric" V 5080 4800 50  0001 C CNN
F 3 "~" H 5150 4800 50  0001 C CNN
F 4 "3000-0000001297" H 5150 4800 50  0001 C CNN "PartSpecification"
	1    5150 4800
	1    0    0    -1  
$EndComp
$Comp
L Device:R R2111
U 1 1 5F890CBD
P 5150 4200
F 0 "R2111" V 5230 4200 50  0000 C CNN
F 1 "47.5k" V 5150 4200 50  0000 C CNN
F 2 "Resistor_SMD:R_0402_1005Metric" V 5080 4200 50  0001 C CNN
F 3 "~" H 5150 4200 50  0001 C CNN
F 4 "3000-0000001295" H 5150 4200 50  0001 C CNN "PartSpecification"
	1    5150 4200
	1    0    0    -1  
$EndComp
Wire Wire Line
	3400 4300 2600 4300
Text HLabel 2550 4300 0    50   Input ~ 0
SYNC_2
Wire Wire Line
	8450 3850 8450 4000
Wire Wire Line
	3000 5900 3400 5900
Wire Wire Line
	3000 6000 3000 5900
Wire Wire Line
	3000 6600 3000 6300
$Comp
L power:GND #PWR?
U 1 1 5F89A76D
P 3000 6600
F 0 "#PWR?" H 3000 6350 50  0001 C CNN
F 1 "GND" H 3000 6450 50  0000 C CNN
F 2 "" H 3000 6600 50  0001 C CNN
F 3 "" H 3000 6600 50  0001 C CNN
	1    3000 6600
	1    0    0    -1  
$EndComp
Wire Wire Line
	3300 6600 3300 6500
$Comp
L power:GND #PWR?
U 1 1 5F89A774
P 3300 6600
F 0 "#PWR?" H 3300 6350 50  0001 C CNN
F 1 "GND" H 3300 6450 50  0000 C CNN
F 2 "" H 3300 6600 50  0001 C CNN
F 3 "" H 3300 6600 50  0001 C CNN
	1    3300 6600
	1    0    0    -1  
$EndComp
Wire Wire Line
	3300 6100 3400 6100
Wire Wire Line
	3300 6200 3300 6100
$Comp
L Device:C C2128
U 1 1 5F89A77C
P 3300 6350
F 0 "C2128" H 3325 6450 50  0000 L CNN
F 1 "4.3n" H 3325 6250 50  0000 L CNN
F 2 "Capacitor_SMD:C_0402_1005Metric" H 3338 6200 50  0001 C CNN
F 3 "~" H 3300 6350 50  0001 C CNN
F 4 "3000-0000001259" H 3300 6350 50  0001 C CNN "PartSpecification"
	1    3300 6350
	1    0    0    -1  
$EndComp
$Comp
L Device:R R2126
U 1 1 5F89A782
P 3000 6150
F 0 "R2126" V 3080 6150 50  0000 C CNN
F 1 "7.5k" V 3000 6150 50  0000 C CNN
F 2 "Resistor_SMD:R_0402_1005Metric" V 2930 6150 50  0001 C CNN
F 3 "~" H 3000 6150 50  0001 C CNN
F 4 "3000-0000001291" H 3000 6150 50  0001 C CNN "PartSpecification"
	1    3000 6150
	1    0    0    -1  
$EndComp
Connection ~ 1750 5500
Wire Wire Line
	1750 5550 1750 5500
Wire Wire Line
	1750 5500 1500 5500
Wire Wire Line
	1500 5500 1300 5500
Connection ~ 1500 5500
Wire Wire Line
	1500 5550 1500 5500
Wire Wire Line
	1750 6050 1750 5850
$Comp
L power:GND #PWR?
U 1 1 5F89A794
P 1750 6050
F 0 "#PWR?" H 1750 5800 50  0001 C CNN
F 1 "GND" H 1750 5900 50  0000 C CNN
F 2 "" H 1750 6050 50  0001 C CNN
F 3 "" H 1750 6050 50  0001 C CNN
	1    1750 6050
	1    0    0    -1  
$EndComp
Wire Wire Line
	1500 6050 1500 5850
$Comp
L power:GND #PWR?
U 1 1 5F89A79B
P 1500 6050
F 0 "#PWR?" H 1500 5800 50  0001 C CNN
F 1 "GND" H 1500 5900 50  0000 C CNN
F 2 "" H 1500 6050 50  0001 C CNN
F 3 "" H 1500 6050 50  0001 C CNN
	1    1500 6050
	1    0    0    -1  
$EndComp
$Comp
L 000_PreferredParts:C_10uF_0805 C2121
U 1 1 5F89A7A4
P 1750 5700
F 0 "C2121" H 1775 5800 50  0000 L CNN
F 1 "C_10uF_0805" H 1775 5600 50  0001 L CNN
F 2 "Capacitor_SMD:C_0805_2012Metric" H 1788 5550 50  0001 C CNN
F 3 "~" H 1750 5700 50  0001 C CNN
F 4 "10uF" H 1900 5600 50  0000 C CNN "DisplayValue"
F 5 "0805" H 1900 5500 50  0000 C CNN "DisplayFootprint"
F 6 "3000-0000000134" H 1750 5700 50  0001 C CNN "PartSpecification"
	1    1750 5700
	1    0    0    -1  
$EndComp
$Comp
L 000_PreferredParts:C_10uF_0805 C2120
U 1 1 5F89A7AD
P 1500 5700
F 0 "C2120" H 1525 5800 50  0000 L CNN
F 1 "C_10uF_0805" H 1525 5600 50  0001 L CNN
F 2 "Capacitor_SMD:C_0805_2012Metric" H 1538 5550 50  0001 C CNN
F 3 "~" H 1500 5700 50  0001 C CNN
F 4 "10uF" H 1650 5600 50  0000 C CNN "DisplayValue"
F 5 "0805" H 1650 5500 50  0000 C CNN "DisplayFootprint"
F 6 "3000-0000000134" H 1500 5700 50  0001 C CNN "PartSpecification"
	1    1500 5700
	1    0    0    -1  
$EndComp
Wire Wire Line
	4050 6400 4050 6300
$Comp
L power:GND #PWR?
U 1 1 5F89A7B4
P 4050 6400
F 0 "#PWR?" H 4050 6150 50  0001 C CNN
F 1 "GND" H 4050 6250 50  0000 C CNN
F 2 "" H 4050 6400 50  0001 C CNN
F 3 "" H 4050 6400 50  0001 C CNN
	1    4050 6400
	1    0    0    -1  
$EndComp
Connection ~ 7000 5500
Wire Wire Line
	7000 5550 7000 5500
Wire Wire Line
	7000 5500 6750 5500
Connection ~ 6750 5500
Wire Wire Line
	6750 5550 6750 5500
Wire Wire Line
	6750 5500 6500 5500
Connection ~ 6500 5500
Wire Wire Line
	6500 5550 6500 5500
Wire Wire Line
	6500 5500 6250 5500
Connection ~ 6250 5500
Wire Wire Line
	6250 5550 6250 5500
Wire Wire Line
	7250 5500 7000 5500
Wire Wire Line
	7250 5550 7250 5500
Wire Wire Line
	7250 6050 7250 5850
$Comp
L power:GND #PWR?
U 1 1 5F89A7CA
P 7250 6050
F 0 "#PWR?" H 7250 5800 50  0001 C CNN
F 1 "GND" H 7250 5900 50  0000 C CNN
F 2 "" H 7250 6050 50  0001 C CNN
F 3 "" H 7250 6050 50  0001 C CNN
	1    7250 6050
	1    0    0    -1  
$EndComp
Wire Wire Line
	7000 6050 7000 5850
$Comp
L power:GND #PWR?
U 1 1 5F89A7D1
P 7000 6050
F 0 "#PWR?" H 7000 5800 50  0001 C CNN
F 1 "GND" H 7000 5900 50  0000 C CNN
F 2 "" H 7000 6050 50  0001 C CNN
F 3 "" H 7000 6050 50  0001 C CNN
	1    7000 6050
	1    0    0    -1  
$EndComp
Wire Wire Line
	6750 6050 6750 5850
$Comp
L power:GND #PWR?
U 1 1 5F89A7D8
P 6750 6050
F 0 "#PWR?" H 6750 5800 50  0001 C CNN
F 1 "GND" H 6750 5900 50  0000 C CNN
F 2 "" H 6750 6050 50  0001 C CNN
F 3 "" H 6750 6050 50  0001 C CNN
	1    6750 6050
	1    0    0    -1  
$EndComp
Wire Wire Line
	6500 6050 6500 5850
$Comp
L power:GND #PWR?
U 1 1 5F89A7DF
P 6500 6050
F 0 "#PWR?" H 6500 5800 50  0001 C CNN
F 1 "GND" H 6500 5900 50  0000 C CNN
F 2 "" H 6500 6050 50  0001 C CNN
F 3 "" H 6500 6050 50  0001 C CNN
	1    6500 6050
	1    0    0    -1  
$EndComp
Wire Wire Line
	6250 6050 6250 5850
$Comp
L power:GND #PWR?
U 1 1 5F89A7E6
P 6250 6050
F 0 "#PWR?" H 6250 5800 50  0001 C CNN
F 1 "GND" H 6250 5900 50  0000 C CNN
F 2 "" H 6250 6050 50  0001 C CNN
F 3 "" H 6250 6050 50  0001 C CNN
	1    6250 6050
	1    0    0    -1  
$EndComp
$Comp
L 000_PreferredParts:C_10uF_0805 C2127
U 1 1 5F89A7EF
P 7250 5700
F 0 "C2127" H 7275 5800 50  0000 L CNN
F 1 "C_10uF_0805" H 7275 5600 50  0001 L CNN
F 2 "Capacitor_SMD:C_0805_2012Metric" H 7288 5550 50  0001 C CNN
F 3 "~" H 7250 5700 50  0001 C CNN
F 4 "10uF" H 7400 5600 50  0000 C CNN "DisplayValue"
F 5 "0805" H 7400 5500 50  0000 C CNN "DisplayFootprint"
F 6 "3000-0000000134" H 7250 5700 50  0001 C CNN "PartSpecification"
	1    7250 5700
	1    0    0    -1  
$EndComp
$Comp
L 000_PreferredParts:C_10uF_0805 C2126
U 1 1 5F89A7F8
P 7000 5700
F 0 "C2126" H 7025 5800 50  0000 L CNN
F 1 "C_10uF_0805" H 7025 5600 50  0001 L CNN
F 2 "Capacitor_SMD:C_0805_2012Metric" H 7038 5550 50  0001 C CNN
F 3 "~" H 7000 5700 50  0001 C CNN
F 4 "10uF" H 7150 5600 50  0000 C CNN "DisplayValue"
F 5 "0805" H 7150 5500 50  0000 C CNN "DisplayFootprint"
F 6 "3000-0000000134" H 7000 5700 50  0001 C CNN "PartSpecification"
	1    7000 5700
	1    0    0    -1  
$EndComp
$Comp
L 000_PreferredParts:C_10uF_0805 C2125
U 1 1 5F89A801
P 6750 5700
F 0 "C2125" H 6775 5800 50  0000 L CNN
F 1 "C_10uF_0805" H 6775 5600 50  0001 L CNN
F 2 "Capacitor_SMD:C_0805_2012Metric" H 6788 5550 50  0001 C CNN
F 3 "~" H 6750 5700 50  0001 C CNN
F 4 "10uF" H 6900 5600 50  0000 C CNN "DisplayValue"
F 5 "0805" H 6900 5500 50  0000 C CNN "DisplayFootprint"
F 6 "3000-0000000134" H 6750 5700 50  0001 C CNN "PartSpecification"
	1    6750 5700
	1    0    0    -1  
$EndComp
$Comp
L 000_PreferredParts:C_10uF_0805 C2124
U 1 1 5F89A80A
P 6500 5700
F 0 "C2124" H 6525 5800 50  0000 L CNN
F 1 "C_10uF_0805" H 6525 5600 50  0001 L CNN
F 2 "Capacitor_SMD:C_0805_2012Metric" H 6538 5550 50  0001 C CNN
F 3 "~" H 6500 5700 50  0001 C CNN
F 4 "10uF" H 6650 5600 50  0000 C CNN "DisplayValue"
F 5 "0805" H 6650 5500 50  0000 C CNN "DisplayFootprint"
F 6 "3000-0000000134" H 6500 5700 50  0001 C CNN "PartSpecification"
	1    6500 5700
	1    0    0    -1  
$EndComp
$Comp
L 000_PreferredParts:C_10uF_0805 C2123
U 1 1 5F89A813
P 6250 5700
F 0 "C2123" H 6275 5800 50  0000 L CNN
F 1 "C_10uF_0805" H 6275 5600 50  0001 L CNN
F 2 "Capacitor_SMD:C_0805_2012Metric" H 6288 5550 50  0001 C CNN
F 3 "~" H 6250 5700 50  0001 C CNN
F 4 "10uF" H 6400 5600 50  0000 C CNN "DisplayValue"
F 5 "0805" H 6400 5500 50  0000 C CNN "DisplayFootprint"
F 6 "3000-0000000134" H 6250 5700 50  0001 C CNN "PartSpecification"
	1    6250 5700
	1    0    0    -1  
$EndComp
Connection ~ 5500 5500
Wire Wire Line
	5500 5550 5500 5500
Wire Wire Line
	5500 5950 5150 5950
Wire Wire Line
	5500 5850 5500 5950
$Comp
L Device:C C2122
U 1 1 5F89A821
P 5500 5700
F 0 "C2122" H 5525 5800 50  0000 L CNN
F 1 "10p" H 5525 5600 50  0000 L CNN
F 2 "Capacitor_SMD:C_0402_1005Metric" H 5538 5550 50  0001 C CNN
F 3 "~" H 5500 5700 50  0001 C CNN
F 4 "3000-0000000126" H 5500 5700 50  0001 C CNN "PartSpecification"
	1    5500 5700
	1    0    0    -1  
$EndComp
Wire Wire Line
	4700 6050 5750 6050
Wire Wire Line
	5150 5950 5150 6150
Wire Wire Line
	5750 6050 5750 5850
Wire Wire Line
	5150 6500 5150 6450
$Comp
L power:GND #PWR?
U 1 1 5F89A82B
P 5150 6500
F 0 "#PWR?" H 5150 6250 50  0001 C CNN
F 1 "GND" H 5150 6350 50  0000 C CNN
F 2 "" H 5150 6500 50  0001 C CNN
F 3 "" H 5150 6500 50  0001 C CNN
	1    5150 6500
	1    0    0    -1  
$EndComp
Connection ~ 5150 5950
Wire Wire Line
	4700 5950 5150 5950
Wire Wire Line
	5150 5850 5150 5950
Wire Wire Line
	4800 5500 4700 5500
Wire Wire Line
	5500 5500 5150 5500
Wire Wire Line
	5150 5500 5100 5500
Connection ~ 5150 5500
Wire Wire Line
	5150 5550 5150 5500
$Comp
L POWDER_Power:TPS62810-Q1 U2104
U 1 1 5F89A83F
P 4050 5750
F 0 "U2104" H 4500 6150 50  0000 C CNN
F 1 "TPS62810-Q1" H 4050 6150 50  0000 C CNN
F 2 "POWDER_Power:RWY0009A" H 4050 5750 50  0001 C CNN
F 3 "" H 4050 5750 50  0001 C CNN
F 4 "3000-0000001298" H 4050 5750 50  0001 C CNN "PartSpecification"
	1    4050 5750
	1    0    0    -1  
$EndComp
$Comp
L Device:R R2127
U 1 1 5F89A845
P 5150 6300
F 0 "R2127" V 5230 6300 50  0000 C CNN
F 1 "15k" V 5150 6300 50  0000 C CNN
F 2 "Resistor_SMD:R_0402_1005Metric" V 5080 6300 50  0001 C CNN
F 3 "~" H 5150 6300 50  0001 C CNN
F 4 "3000-0000001297" H 5150 6300 50  0001 C CNN "PartSpecification"
	1    5150 6300
	1    0    0    -1  
$EndComp
$Comp
L Device:R R2120
U 1 1 5F89A84B
P 5150 5700
F 0 "R2120" V 5230 5700 50  0000 C CNN
F 1 "47.5k" V 5150 5700 50  0000 C CNN
F 2 "Resistor_SMD:R_0402_1005Metric" V 5080 5700 50  0001 C CNN
F 3 "~" H 5150 5700 50  0001 C CNN
F 4 "3000-0000001295" H 5150 5700 50  0001 C CNN "PartSpecification"
	1    5150 5700
	1    0    0    -1  
$EndComp
Wire Wire Line
	3400 5800 2600 5800
Text HLabel 2500 5800 0    50   Input ~ 0
SYNC_3
Wire Wire Line
	8500 5250 8500 5500
$Comp
L power:+2V5 #PWR?
U 1 1 5F8A0FBF
P 8450 3850
F 0 "#PWR?" H 8450 3700 50  0001 C CNN
F 1 "+2V5" H 8450 3990 50  0000 C CNN
F 2 "" H 8450 3850 50  0001 C CNN
F 3 "" H 8450 3850 50  0001 C CNN
	1    8450 3850
	1    0    0    -1  
$EndComp
$Comp
L POWDER_PowerGlobals:+2V5_A #PWR?
U 1 1 5F8AB0E2
P 8500 5250
AR Path="/5F8AB0E2" Ref="#PWR?"  Part="1" 
AR Path="/5F853053/5F8AB0E2" Ref="#PWR?"  Part="1" 
AR Path="/605746B5/5F853053/5F8AB0E2" Ref="#PWR?"  Part="1" 
F 0 "#PWR?" H 8500 5100 50  0001 C CNN
F 1 "+2V5_A" H 8500 5390 50  0000 C CNN
F 2 "" H 8500 5250 50  0001 C CNN
F 3 "" H 8500 5250 50  0001 C CNN
	1    8500 5250
	1    0    0    -1  
$EndComp
$Comp
L Device:C C2119
U 1 1 5F8AD39D
P 3300 4850
F 0 "C2119" H 3325 4950 50  0000 L CNN
F 1 "4.3n" H 3325 4750 50  0000 L CNN
F 2 "Capacitor_SMD:C_0402_1005Metric" H 3338 4700 50  0001 C CNN
F 3 "~" H 3300 4850 50  0001 C CNN
F 4 "3000-0000001259" H 3300 4850 50  0001 C CNN "PartSpecification"
	1    3300 4850
	1    0    0    -1  
$EndComp
$Comp
L Device:C C2110
U 1 1 5F8AD8A6
P 3300 2350
F 0 "C2110" H 3325 2450 50  0000 L CNN
F 1 "4.3n" H 3325 2250 50  0000 L CNN
F 2 "Capacitor_SMD:C_0402_1005Metric" H 3338 2200 50  0001 C CNN
F 3 "~" H 3300 2350 50  0001 C CNN
F 4 "3000-0000001259" H 3300 2350 50  0001 C CNN "PartSpecification"
	1    3300 2350
	1    0    0    -1  
$EndComp
$Comp
L Device:L L2102
U 1 1 5F8AF852
P 4950 4000
F 0 "L2102" V 4900 4000 50  0000 C CNN
F 1 "0.47uH" V 5025 4000 50  0000 C CNN
F 2 "Inductor_SMD:L_1008_2520Metric" H 4950 4000 50  0001 C CNN
F 3 "~" H 4950 4000 50  0001 C CNN
F 4 "DFE252012PD-R47M=P2 " V 4950 4000 50  0001 C CNN "PartNumber"
F 5 "Murata Electronics" V 4950 4000 50  0001 C CNN "Manufacturer"
F 6 "3000-0000001283" H 4950 4000 50  0001 C CNN "PartSpecification"
	1    4950 4000
	0    -1   -1   0   
$EndComp
$Comp
L Device:L L2103
U 1 1 5F8AFDB5
P 4950 5500
F 0 "L2103" V 4900 5500 50  0000 C CNN
F 1 "0.47uH" V 5025 5500 50  0000 C CNN
F 2 "Inductor_SMD:L_1008_2520Metric" H 4950 5500 50  0001 C CNN
F 3 "~" H 4950 5500 50  0001 C CNN
F 4 "DFE252012PD-R47M=P2 " V 4950 5500 50  0001 C CNN "PartNumber"
F 5 "Murata Electronics" V 4950 5500 50  0001 C CNN "Manufacturer"
F 6 "3000-0000001283" H 4950 5500 50  0001 C CNN "PartSpecification"
	1    4950 5500
	0    -1   -1   0   
$EndComp
Text HLabel 5850 2050 2    50   Output ~ 0
PG_1
Wire Wire Line
	5850 2050 5750 2050
Connection ~ 5750 2050
Text HLabel 5850 4550 2    50   Output ~ 0
PG_2
Text HLabel 5850 6050 2    50   Output ~ 0
PG_3
Wire Wire Line
	5850 4550 5750 4550
Connection ~ 5750 4550
Wire Wire Line
	5850 6050 5750 6050
Connection ~ 5750 6050
Wire Wire Line
	1750 1500 3400 1500
Wire Wire Line
	1750 5500 3400 5500
Text HLabel 2500 1700 0    50   Input ~ 0
EN_1
Wire Wire Line
	2500 1700 2800 1700
Text HLabel 2550 4200 0    50   Input ~ 0
EN_2
Text HLabel 2500 5700 0    50   Input ~ 0
EN_3
Wire Wire Line
	2550 4200 2800 4200
Wire Wire Line
	2500 5700 2800 5700
$Comp
L Device:R R2107
U 1 1 5FB8B018
P 2800 2150
F 0 "R2107" V 2880 2150 50  0000 C CNN
F 1 "10k" V 2800 2150 50  0000 C CNN
F 2 "Resistor_SMD:R_0402_1005Metric" V 2730 2150 50  0001 C CNN
F 3 "~" H 2800 2150 50  0001 C CNN
F 4 "3000-0000000131" H 2800 2150 50  0001 C CNN "PartSpecification"
	1    2800 2150
	1    0    0    -1  
$EndComp
$Comp
L power:GND #PWR?
U 1 1 5FB8B60B
P 2800 2600
F 0 "#PWR?" H 2800 2350 50  0001 C CNN
F 1 "GND" H 2800 2450 50  0000 C CNN
F 2 "" H 2800 2600 50  0001 C CNN
F 3 "" H 2800 2600 50  0001 C CNN
	1    2800 2600
	1    0    0    -1  
$EndComp
Wire Wire Line
	2800 2600 2800 2300
Wire Wire Line
	2800 2000 2800 1700
Connection ~ 2800 1700
Wire Wire Line
	2800 1700 3400 1700
$Comp
L Device:R R2116
U 1 1 5FB9CD96
P 2800 4650
F 0 "R2116" V 2880 4650 50  0000 C CNN
F 1 "10k" V 2800 4650 50  0000 C CNN
F 2 "Resistor_SMD:R_0402_1005Metric" V 2730 4650 50  0001 C CNN
F 3 "~" H 2800 4650 50  0001 C CNN
F 4 "3000-0000000131" H 2800 4650 50  0001 C CNN "PartSpecification"
	1    2800 4650
	1    0    0    -1  
$EndComp
$Comp
L power:GND #PWR?
U 1 1 5FB9CD9C
P 2800 5100
F 0 "#PWR?" H 2800 4850 50  0001 C CNN
F 1 "GND" H 2800 4950 50  0000 C CNN
F 2 "" H 2800 5100 50  0001 C CNN
F 3 "" H 2800 5100 50  0001 C CNN
	1    2800 5100
	1    0    0    -1  
$EndComp
Wire Wire Line
	2800 5100 2800 4800
Wire Wire Line
	2800 4500 2800 4200
$Comp
L Device:R R2125
U 1 1 5FBA439B
P 2800 6150
F 0 "R2125" V 2880 6150 50  0000 C CNN
F 1 "10k" V 2800 6150 50  0000 C CNN
F 2 "Resistor_SMD:R_0402_1005Metric" V 2730 6150 50  0001 C CNN
F 3 "~" H 2800 6150 50  0001 C CNN
F 4 "3000-0000000131" H 2800 6150 50  0001 C CNN "PartSpecification"
	1    2800 6150
	1    0    0    -1  
$EndComp
$Comp
L power:GND #PWR?
U 1 1 5FBA43A1
P 2800 6600
F 0 "#PWR?" H 2800 6350 50  0001 C CNN
F 1 "GND" H 2800 6450 50  0000 C CNN
F 2 "" H 2800 6600 50  0001 C CNN
F 3 "" H 2800 6600 50  0001 C CNN
	1    2800 6600
	1    0    0    -1  
$EndComp
Wire Wire Line
	2800 6600 2800 6300
Wire Wire Line
	2800 6000 2800 5700
Connection ~ 2800 4200
Wire Wire Line
	2800 4200 3400 4200
Connection ~ 2800 5700
Wire Wire Line
	2800 5700 3400 5700
Text Label 4750 1500 0    50   ~ 0
SW1
Text Label 4750 4000 0    50   ~ 0
SW2
Text Label 4750 5500 0    50   ~ 0
SW3
Text Label 4750 1950 0    50   ~ 0
FB1
Text Label 4750 4450 0    50   ~ 0
FB2
Text Label 4750 5950 0    50   ~ 0
FB3
Text Label 3100 1900 0    50   ~ 0
FSET1
Text Label 3100 4400 0    50   ~ 0
FSET2
Text Label 3100 5900 0    50   ~ 0
FSET3
Text Label 3300 2100 0    50   ~ 0
SS1
Text Label 3300 4600 0    50   ~ 0
SS2
Text Label 3300 6100 0    50   ~ 0
SS3
Text Label 6000 1500 0    50   ~ 0
OUT1
Text Label 6000 4000 0    50   ~ 0
OUT2
Text Label 6000 5500 0    50   ~ 0
OUT3
Wire Wire Line
	5500 1500 6250 1500
Wire Wire Line
	5500 4000 6250 4000
Wire Wire Line
	5500 5500 6250 5500
$Comp
L Device:R R2103
U 1 1 60787D9A
P 5750 1700
F 0 "R2103" V 5830 1700 50  0000 C CNN
F 1 "10k" V 5750 1700 50  0000 C CNN
F 2 "Resistor_SMD:R_0402_1005Metric" V 5680 1700 50  0001 C CNN
F 3 "~" H 5750 1700 50  0001 C CNN
F 4 "3000-0000000131" H 5750 1700 50  0001 C CNN "PartSpecification"
	1    5750 1700
	1    0    0    -1  
$EndComp
$Comp
L power:+2V5 #PWR?
U 1 1 607885DB
P 5750 1450
F 0 "#PWR?" H 5750 1300 50  0001 C CNN
F 1 "+2V5" H 5750 1590 50  0000 C CNN
F 2 "" H 5750 1450 50  0001 C CNN
F 3 "" H 5750 1450 50  0001 C CNN
	1    5750 1450
	1    0    0    -1  
$EndComp
Wire Wire Line
	5750 1450 5750 1550
$Comp
L Device:R R2112
U 1 1 6078F7B2
P 5750 4200
F 0 "R2112" V 5830 4200 50  0000 C CNN
F 1 "10k" V 5750 4200 50  0000 C CNN
F 2 "Resistor_SMD:R_0402_1005Metric" V 5680 4200 50  0001 C CNN
F 3 "~" H 5750 4200 50  0001 C CNN
F 4 "3000-0000000131" H 5750 4200 50  0001 C CNN "PartSpecification"
	1    5750 4200
	1    0    0    -1  
$EndComp
$Comp
L Device:R R2121
U 1 1 6078FD02
P 5750 5700
F 0 "R2121" V 5830 5700 50  0000 C CNN
F 1 "10k" V 5750 5700 50  0000 C CNN
F 2 "Resistor_SMD:R_0402_1005Metric" V 5680 5700 50  0001 C CNN
F 3 "~" H 5750 5700 50  0001 C CNN
F 4 "3000-0000000131" H 5750 5700 50  0001 C CNN "PartSpecification"
	1    5750 5700
	1    0    0    -1  
$EndComp
$Comp
L power:+2V5 #PWR?
U 1 1 607903F6
P 5750 3950
F 0 "#PWR?" H 5750 3800 50  0001 C CNN
F 1 "+2V5" H 5750 4090 50  0000 C CNN
F 2 "" H 5750 3950 50  0001 C CNN
F 3 "" H 5750 3950 50  0001 C CNN
	1    5750 3950
	1    0    0    -1  
$EndComp
$Comp
L power:+2V5 #PWR?
U 1 1 60790958
P 5750 5450
F 0 "#PWR?" H 5750 5300 50  0001 C CNN
F 1 "+2V5" H 5750 5590 50  0000 C CNN
F 2 "" H 5750 5450 50  0001 C CNN
F 3 "" H 5750 5450 50  0001 C CNN
	1    5750 5450
	1    0    0    -1  
$EndComp
Wire Wire Line
	5750 5450 5750 5550
Wire Wire Line
	5750 4050 5750 3950
$Comp
L Device:R R2106
U 1 1 60FBC3CC
P 2600 2150
F 0 "R2106" V 2680 2150 50  0000 C CNN
F 1 "10k" V 2600 2150 50  0000 C CNN
F 2 "Resistor_SMD:R_0402_1005Metric" V 2530 2150 50  0001 C CNN
F 3 "~" H 2600 2150 50  0001 C CNN
F 4 "3000-0000000131" H 2600 2150 50  0001 C CNN "PartSpecification"
	1    2600 2150
	1    0    0    -1  
$EndComp
$Comp
L power:GND #PWR?
U 1 1 60FBC3D2
P 2600 2600
F 0 "#PWR?" H 2600 2350 50  0001 C CNN
F 1 "GND" H 2600 2450 50  0000 C CNN
F 2 "" H 2600 2600 50  0001 C CNN
F 3 "" H 2600 2600 50  0001 C CNN
	1    2600 2600
	1    0    0    -1  
$EndComp
Wire Wire Line
	2600 2600 2600 2300
$Comp
L Device:R R2115
U 1 1 60FC3148
P 2600 4650
F 0 "R2115" V 2680 4650 50  0000 C CNN
F 1 "10k" V 2600 4650 50  0000 C CNN
F 2 "Resistor_SMD:R_0402_1005Metric" V 2530 4650 50  0001 C CNN
F 3 "~" H 2600 4650 50  0001 C CNN
F 4 "3000-0000000131" H 2600 4650 50  0001 C CNN "PartSpecification"
	1    2600 4650
	1    0    0    -1  
$EndComp
$Comp
L power:GND #PWR?
U 1 1 60FC314E
P 2600 5100
F 0 "#PWR?" H 2600 4850 50  0001 C CNN
F 1 "GND" H 2600 4950 50  0000 C CNN
F 2 "" H 2600 5100 50  0001 C CNN
F 3 "" H 2600 5100 50  0001 C CNN
	1    2600 5100
	1    0    0    -1  
$EndComp
Wire Wire Line
	2600 5100 2600 4800
$Comp
L Device:R R2124
U 1 1 60FCA21F
P 2600 6150
F 0 "R2124" V 2680 6150 50  0000 C CNN
F 1 "10k" V 2600 6150 50  0000 C CNN
F 2 "Resistor_SMD:R_0402_1005Metric" V 2530 6150 50  0001 C CNN
F 3 "~" H 2600 6150 50  0001 C CNN
F 4 "3000-0000000131" H 2600 6150 50  0001 C CNN "PartSpecification"
	1    2600 6150
	1    0    0    -1  
$EndComp
$Comp
L power:GND #PWR?
U 1 1 60FCA225
P 2600 6600
F 0 "#PWR?" H 2600 6350 50  0001 C CNN
F 1 "GND" H 2600 6450 50  0000 C CNN
F 2 "" H 2600 6600 50  0001 C CNN
F 3 "" H 2600 6600 50  0001 C CNN
	1    2600 6600
	1    0    0    -1  
$EndComp
Wire Wire Line
	2600 6600 2600 6300
Wire Wire Line
	2600 2000 2600 1800
Connection ~ 2600 1800
Wire Wire Line
	2600 1800 2500 1800
Wire Wire Line
	2600 4500 2600 4300
Connection ~ 2600 4300
Wire Wire Line
	2600 4300 2550 4300
Wire Wire Line
	2600 6000 2600 5800
Connection ~ 2600 5800
Wire Wire Line
	2600 5800 2500 5800
$Comp
L POWDER_Power:INA4180-Q1 U?
U 1 1 61012C8D
P 9850 2900
AR Path="/61012C8D" Ref="U?"  Part="1" 
AR Path="/5D949534/61012C8D" Ref="U?"  Part="1" 
AR Path="/605746B5/5F853053/61012C8D" Ref="U2102"  Part="1" 
F 0 "U2102" H 10100 3600 50  0000 L CNN
F 1 "INA4180-Q1" H 10000 2200 50  0000 L CNN
F 2 "Package_SO:TSSOP-14_4.4x5mm_P0.65mm" H 11750 3750 100 0001 C CNN
F 3 "" H 10100 3600 100 0001 C CNN
F 4 "3000-0000000185" H 9850 2900 50  0001 C CNN "PartSpecification"
	1    9850 2900
	1    0    0    -1  
$EndComp
Wire Wire Line
	9850 1600 9850 1700
$Comp
L 000_PreferredParts:C_0_1uF C?
U 1 1 61012C97
P 10500 1900
AR Path="/5D949534/61012C97" Ref="C?"  Part="1" 
AR Path="/605746B5/5F853053/61012C97" Ref="C2109"  Part="1" 
F 0 "C2109" H 10525 2000 50  0000 L CNN
F 1 "C_0_1uF" H 10525 1800 50  0001 L CNN
F 2 "Capacitor_SMD:C_0402_1005Metric" H 10538 1750 50  0001 C CNN
F 3 "~" H 10500 1900 50  0001 C CNN
F 4 "0.1uF" H 10650 1800 50  0000 C CNN "DisplayValue"
F 5 "3000-0000000125" H 6300 -300 50  0001 C CNN "PartSpecification"
	1    10500 1900
	1    0    0    -1  
$EndComp
$Comp
L power:GND #PWR?
U 1 1 61012C9D
P 10500 2150
AR Path="/61012C9D" Ref="#PWR?"  Part="1" 
AR Path="/5D949534/61012C9D" Ref="#PWR?"  Part="1" 
AR Path="/605746B5/5F853053/61012C9D" Ref="#PWR?"  Part="1" 
F 0 "#PWR?" H 10500 1900 50  0001 C CNN
F 1 "GND" H 10505 1977 50  0000 C CNN
F 2 "" H 10500 2150 50  0001 C CNN
F 3 "" H 10500 2150 50  0001 C CNN
	1    10500 2150
	1    0    0    -1  
$EndComp
Wire Wire Line
	10500 2150 10500 2050
Wire Wire Line
	10500 1750 10500 1700
$Comp
L Device:Ferrite_Bead_Small FB?
U 1 1 61012CAB
P 9850 1500
AR Path="/5D949534/61012CAB" Ref="FB?"  Part="1" 
AR Path="/605746B5/5F853053/61012CAB" Ref="FB2101"  Part="1" 
F 0 "FB2101" H 9925 1550 50  0000 L CNN
F 1 "Ferrite_Bead_Small" H 9925 1450 50  0000 L CNN
F 2 "Inductor_SMD:L_0603_1608Metric" V 9780 1500 50  0001 C CNN
F 3 "~" H 9850 1500 50  0001 C CNN
F 4 "BLM18SP601SH1D" H 9850 1500 50  0001 C CNN "PartNumber"
F 5 "3000-0000001272" H 9850 1500 50  0001 C CNN "PartSpecification"
	1    9850 1500
	1    0    0    -1  
$EndComp
$Comp
L POWDER_PowerGlobals:+2V5_A #PWR?
U 1 1 61012CB4
P 9850 1300
AR Path="/5D949534/61012CB4" Ref="#PWR?"  Part="1" 
AR Path="/605746B5/5F853053/61012CB4" Ref="#PWR?"  Part="1" 
F 0 "#PWR?" H 9850 1150 50  0001 C CNN
F 1 "+2V5_A" H 9865 1473 50  0000 C CNN
F 2 "" H 9850 1300 50  0001 C CNN
F 3 "" H 9850 1300 50  0001 C CNN
	1    9850 1300
	1    0    0    -1  
$EndComp
$Comp
L power:GND #PWR?
U 1 1 610230F2
P 9850 3700
F 0 "#PWR?" H 9850 3450 50  0001 C CNN
F 1 "GND" H 9850 3550 50  0000 C CNN
F 2 "" H 9850 3700 50  0001 C CNN
F 3 "" H 9850 3700 50  0001 C CNN
	1    9850 3700
	1    0    0    -1  
$EndComp
Wire Wire Line
	9850 3700 9850 3600
Wire Wire Line
	9850 1300 9850 1400
Wire Wire Line
	10500 1700 9850 1700
Connection ~ 9850 1700
Wire Wire Line
	9850 1700 9850 2200
$Comp
L Device:R R?
U 1 1 610708DD
P 8000 1500
AR Path="/610708DD" Ref="R?"  Part="1" 
AR Path="/5D949534/610708DD" Ref="R?"  Part="1" 
AR Path="/605746B5/5F853053/610708DD" Ref="R2101"  Part="1" 
F 0 "R2101" V 7793 1500 50  0000 C CNN
F 1 "5m" V 7884 1500 50  0000 C CNN
F 2 "POWDER_Power:R_0508_1220Metric" V 7930 1500 50  0001 C CNN
F 3 "~" H 8000 1500 50  0001 C CNN
F 4 "Bourns Inc." H 8000 1500 50  0001 C CNN "Manufacturer"
F 5 "" H 8000 1500 50  0001 C CNN "PartNumber"
F 6 "3000-0000000584" V 8000 1500 50  0001 C CNN "PartSpecification"
	1    8000 1500
	0    -1   1    0   
$EndComp
Wire Wire Line
	8150 1500 8200 1500
Wire Wire Line
	7850 1500 7800 1500
Connection ~ 7250 1500
$Comp
L Device:R R?
U 1 1 610892F5
P 7750 4000
AR Path="/610892F5" Ref="R?"  Part="1" 
AR Path="/5D949534/610892F5" Ref="R?"  Part="1" 
AR Path="/605746B5/5F853053/610892F5" Ref="R2110"  Part="1" 
F 0 "R2110" V 7543 4000 50  0000 C CNN
F 1 "5m" V 7634 4000 50  0000 C CNN
F 2 "POWDER_Power:R_0508_1220Metric" V 7680 4000 50  0001 C CNN
F 3 "~" H 7750 4000 50  0001 C CNN
F 4 "Bourns Inc." H 7750 4000 50  0001 C CNN "Manufacturer"
F 5 "" H 7750 4000 50  0001 C CNN "PartNumber"
F 6 "3000-0000000584" V 7750 4000 50  0001 C CNN "PartSpecification"
	1    7750 4000
	0    -1   1    0   
$EndComp
Wire Wire Line
	7900 4000 7950 4000
Wire Wire Line
	7600 4000 7550 4000
$Comp
L Device:R R?
U 1 1 610918C6
P 7750 5500
AR Path="/610918C6" Ref="R?"  Part="1" 
AR Path="/5D949534/610918C6" Ref="R?"  Part="1" 
AR Path="/605746B5/5F853053/610918C6" Ref="R2119"  Part="1" 
F 0 "R2119" V 7543 5500 50  0000 C CNN
F 1 "5m" V 7634 5500 50  0000 C CNN
F 2 "POWDER_Power:R_0508_1220Metric" V 7680 5500 50  0001 C CNN
F 3 "~" H 7750 5500 50  0001 C CNN
F 4 "Bourns Inc." H 7750 5500 50  0001 C CNN "Manufacturer"
F 5 "" H 7750 5500 50  0001 C CNN "PartNumber"
F 6 "3000-0000000584" V 7750 5500 50  0001 C CNN "PartSpecification"
	1    7750 5500
	0    -1   1    0   
$EndComp
Wire Wire Line
	7900 5500 7950 5500
Wire Wire Line
	7600 5500 7550 5500
Text HLabel 9300 3000 0    50   Input ~ 0
IS_6
Text HLabel 9300 3100 0    50   Input ~ 0
VIN
Wire Wire Line
	9300 3100 9400 3100
Wire Wire Line
	9400 3000 9300 3000
Wire Wire Line
	9400 3300 7800 3300
Connection ~ 7800 1500
Wire Wire Line
	7800 1500 7250 1500
Wire Wire Line
	8200 3400 9400 3400
Connection ~ 8200 1500
Wire Wire Line
	8200 1500 8250 1500
Wire Wire Line
	9400 2400 7550 2400
Connection ~ 7550 4000
Wire Wire Line
	7550 4000 7250 4000
Wire Wire Line
	9400 2500 7950 2500
Connection ~ 7950 4000
Wire Wire Line
	7950 4000 8150 4000
Wire Wire Line
	7550 5500 7550 4100
Wire Wire Line
	7550 4100 8550 4100
Wire Wire Line
	8550 2700 9400 2700
Connection ~ 7550 5500
Wire Wire Line
	7550 5500 7250 5500
Wire Wire Line
	7950 5500 7950 4200
Wire Wire Line
	7950 4200 8650 4200
Wire Wire Line
	8650 2800 9400 2800
Connection ~ 7950 5500
Wire Wire Line
	7950 5500 8250 5500
Wire Wire Line
	10300 3050 10500 3050
Wire Wire Line
	10500 3350 10300 3350
Wire Wire Line
	10500 2450 10300 2450
Wire Wire Line
	10500 2750 10300 2750
Text HLabel 10500 3050 2    50   Output ~ 0
ISENSE_MAX10_6
Text HLabel 10500 3350 2    50   Output ~ 0
ISENSE_1_2
Text HLabel 10500 2450 2    50   Output ~ 0
ISENSE_2_5
Text HLabel 10500 2750 2    50   Output ~ 0
ISENSE_2_5A
$Comp
L Device:R R?
U 1 1 61144C1E
P 8700 1500
AR Path="/60664CFF/61144C1E" Ref="R?"  Part="1" 
AR Path="/61144C1E" Ref="R?"  Part="1" 
AR Path="/605746B5/5F853053/61144C1E" Ref="R2104"  Part="1" 
F 0 "R2104" V 8780 1500 50  0000 C CNN
F 1 "10k" V 8700 1500 50  0000 C CNN
F 2 "Resistor_SMD:R_0402_1005Metric" V 8630 1500 50  0001 C CNN
F 3 "~" H 8700 1500 50  0001 C CNN
F 4 "3000-0000000131" V 8700 1500 50  0001 C CNN "PartSpecification"
	1    8700 1500
	0    1    1    0   
$EndComp
$Comp
L Device:R R?
U 1 1 61144C25
P 8900 1700
AR Path="/60664CFF/61144C25" Ref="R?"  Part="1" 
AR Path="/61144C25" Ref="R?"  Part="1" 
AR Path="/605746B5/5F853053/61144C25" Ref="R2105"  Part="1" 
F 0 "R2105" V 8980 1700 50  0000 C CNN
F 1 "4.87k" V 8900 1700 50  0000 C CNN
F 2 "Resistor_SMD:R_0402_1005Metric" V 8830 1700 50  0001 C CNN
F 3 "~" H 8900 1700 50  0001 C CNN
F 4 "3000-0000000133" V 8900 1700 50  0001 C CNN "PartSpecification"
	1    8900 1700
	1    0    0    -1  
$EndComp
$Comp
L power:GND #PWR?
U 1 1 61144C2B
P 8900 1950
AR Path="/60664CFF/61144C2B" Ref="#PWR?"  Part="1" 
AR Path="/61144C2B" Ref="#PWR?"  Part="1" 
AR Path="/605746B5/5F853053/61144C2B" Ref="#PWR?"  Part="1" 
F 0 "#PWR?" H 8900 1700 50  0001 C CNN
F 1 "GND" H 8905 1777 50  0000 C CNN
F 2 "" H 8900 1950 50  0001 C CNN
F 3 "" H 8900 1950 50  0001 C CNN
	1    8900 1950
	1    0    0    -1  
$EndComp
Wire Wire Line
	8900 1850 8900 1950
Wire Wire Line
	8900 1550 8900 1500
Wire Wire Line
	8900 1500 9150 1500
Connection ~ 8900 1500
$Comp
L Device:R R?
U 1 1 611510C2
P 8750 4200
AR Path="/60664CFF/611510C2" Ref="R?"  Part="1" 
AR Path="/611510C2" Ref="R?"  Part="1" 
AR Path="/605746B5/5F853053/611510C2" Ref="R2113"  Part="1" 
F 0 "R2113" V 8830 4200 50  0000 C CNN
F 1 "10k" V 8750 4200 50  0000 C CNN
F 2 "Resistor_SMD:R_0402_1005Metric" V 8680 4200 50  0001 C CNN
F 3 "~" H 8750 4200 50  0001 C CNN
F 4 "3000-0000000131" V 8750 4200 50  0001 C CNN "PartSpecification"
	1    8750 4200
	1    0    0    -1  
$EndComp
$Comp
L Device:R R?
U 1 1 611510C9
P 8750 4600
AR Path="/60664CFF/611510C9" Ref="R?"  Part="1" 
AR Path="/611510C9" Ref="R?"  Part="1" 
AR Path="/605746B5/5F853053/611510C9" Ref="R2114"  Part="1" 
F 0 "R2114" V 8830 4600 50  0000 C CNN
F 1 "4.87k" V 8750 4600 50  0000 C CNN
F 2 "Resistor_SMD:R_0402_1005Metric" V 8680 4600 50  0001 C CNN
F 3 "~" H 8750 4600 50  0001 C CNN
F 4 "3000-0000000133" V 8750 4600 50  0001 C CNN "PartSpecification"
	1    8750 4600
	1    0    0    -1  
$EndComp
$Comp
L power:GND #PWR?
U 1 1 611510CF
P 8750 4900
AR Path="/60664CFF/611510CF" Ref="#PWR?"  Part="1" 
AR Path="/611510CF" Ref="#PWR?"  Part="1" 
AR Path="/605746B5/5F853053/611510CF" Ref="#PWR?"  Part="1" 
F 0 "#PWR?" H 8750 4650 50  0001 C CNN
F 1 "GND" H 8755 4727 50  0000 C CNN
F 2 "" H 8750 4900 50  0001 C CNN
F 3 "" H 8750 4900 50  0001 C CNN
	1    8750 4900
	1    0    0    -1  
$EndComp
Wire Wire Line
	8750 4750 8750 4900
Wire Wire Line
	8750 4450 8750 4400
Wire Wire Line
	8750 4400 9000 4400
Connection ~ 8750 4400
Wire Wire Line
	8750 4400 8750 4350
Wire Wire Line
	8750 4000 8750 4050
$Comp
L Device:R R?
U 1 1 6115CCA8
P 8500 5700
AR Path="/60664CFF/6115CCA8" Ref="R?"  Part="1" 
AR Path="/6115CCA8" Ref="R?"  Part="1" 
AR Path="/605746B5/5F853053/6115CCA8" Ref="R2122"  Part="1" 
F 0 "R2122" V 8580 5700 50  0000 C CNN
F 1 "10k" V 8500 5700 50  0000 C CNN
F 2 "Resistor_SMD:R_0402_1005Metric" V 8430 5700 50  0001 C CNN
F 3 "~" H 8500 5700 50  0001 C CNN
F 4 "3000-0000000131" V 8500 5700 50  0001 C CNN "PartSpecification"
	1    8500 5700
	1    0    0    -1  
$EndComp
$Comp
L Device:R R?
U 1 1 6115CCAF
P 8500 6100
AR Path="/60664CFF/6115CCAF" Ref="R?"  Part="1" 
AR Path="/6115CCAF" Ref="R?"  Part="1" 
AR Path="/605746B5/5F853053/6115CCAF" Ref="R2123"  Part="1" 
F 0 "R2123" V 8580 6100 50  0000 C CNN
F 1 "4.87k" V 8500 6100 50  0000 C CNN
F 2 "Resistor_SMD:R_0402_1005Metric" V 8430 6100 50  0001 C CNN
F 3 "~" H 8500 6100 50  0001 C CNN
F 4 "3000-0000000133" V 8500 6100 50  0001 C CNN "PartSpecification"
	1    8500 6100
	1    0    0    -1  
$EndComp
$Comp
L power:GND #PWR?
U 1 1 6115CCB5
P 8500 6350
AR Path="/60664CFF/6115CCB5" Ref="#PWR?"  Part="1" 
AR Path="/6115CCB5" Ref="#PWR?"  Part="1" 
AR Path="/605746B5/5F853053/6115CCB5" Ref="#PWR?"  Part="1" 
F 0 "#PWR?" H 8500 6100 50  0001 C CNN
F 1 "GND" H 8505 6177 50  0000 C CNN
F 2 "" H 8500 6350 50  0001 C CNN
F 3 "" H 8500 6350 50  0001 C CNN
	1    8500 6350
	1    0    0    -1  
$EndComp
Wire Wire Line
	8500 6250 8500 6350
Wire Wire Line
	8500 5950 8500 5900
Wire Wire Line
	8500 5900 8750 5900
Connection ~ 8500 5900
Wire Wire Line
	8500 5900 8500 5850
Wire Wire Line
	8500 5500 8500 5550
Connection ~ 8500 5500
Connection ~ 8500 1500
Wire Wire Line
	8750 4000 8450 4000
Connection ~ 8450 4000
Text HLabel 9150 1500 2    50   Output ~ 0
VSENSE_1_2
Text HLabel 9000 4400 2    50   Output ~ 0
VSENSE_2_5
Text HLabel 8750 5900 2    50   Output ~ 0
VSENSE_2_5A
$Comp
L power:PWR_FLAG #FLG?
U 1 1 6102F0B3
P 8250 5400
F 0 "#FLG?" H 8250 5475 50  0001 C CNN
F 1 "PWR_FLAG" H 8250 5573 50  0000 C CNN
F 2 "" H 8250 5400 50  0001 C CNN
F 3 "~" H 8250 5400 50  0001 C CNN
	1    8250 5400
	1    0    0    -1  
$EndComp
Wire Wire Line
	8250 5400 8250 5500
Connection ~ 8250 5500
Wire Wire Line
	8250 5500 8500 5500
$Comp
L power:PWR_FLAG #FLG?
U 1 1 6103B743
P 8150 3900
F 0 "#FLG?" H 8150 3975 50  0001 C CNN
F 1 "PWR_FLAG" H 8150 4073 50  0000 C CNN
F 2 "" H 8150 3900 50  0001 C CNN
F 3 "~" H 8150 3900 50  0001 C CNN
	1    8150 3900
	1    0    0    -1  
$EndComp
Wire Wire Line
	8150 3900 8150 4000
Connection ~ 8150 4000
Wire Wire Line
	8150 4000 8450 4000
Wire Wire Line
	1300 1500 1300 4000
Connection ~ 1300 1500
Wire Wire Line
	1300 1500 1250 1500
Connection ~ 1300 4000
Wire Wire Line
	1300 4000 1300 5500
Wire Wire Line
	3400 4000 1750 4000
Connection ~ 1750 4000
$Comp
L power:PWR_FLAG #FLG?
U 1 1 617050FE
P 8250 1400
F 0 "#FLG?" H 8250 1475 50  0001 C CNN
F 1 "PWR_FLAG" H 8250 1573 50  0000 C CNN
F 2 "" H 8250 1400 50  0001 C CNN
F 3 "~" H 8250 1400 50  0001 C CNN
	1    8250 1400
	1    0    0    -1  
$EndComp
Wire Wire Line
	8250 1400 8250 1500
Connection ~ 8250 1500
Wire Wire Line
	8250 1500 8500 1500
Text Label 9850 1900 2    50   ~ 0
VS_F
Wire Wire Line
	8650 2800 8650 4200
Wire Wire Line
	8550 2700 8550 4100
Wire Wire Line
	8900 1500 8850 1500
Wire Wire Line
	8550 1500 8500 1500
Wire Wire Line
	7950 2500 7950 4000
Wire Wire Line
	7550 2400 7550 4000
Connection ~ 7250 4000
Connection ~ 7250 5500
Wire Wire Line
	7800 1500 7800 3300
Wire Wire Line
	8200 1500 8200 3400
$EndSCHEMATC
