EESchema Schematic File Version 4
EELAYER 30 0
EELAYER END
$Descr A4 11693 8268
encoding utf-8
Sheet 33 39
Title ""
Date ""
Rev ""
Comp ""
Comment1 ""
Comment2 ""
Comment3 ""
Comment4 ""
$EndDescr
$Comp
L POWDER_Digital:10M50DAF256 U2201
U 7 1 5F9D0B7B
P 4500 3150
F 0 "U2201" H 4500 3300 50  0000 C CNN
F 1 "‎10M08DAF256C8G" H 4500 3150 50  0000 C CNN
F 2 "Package_BGA:BGA-256_17.0x17.0mm_Layout16x16_P1.0mm_Ball0.5mm_Pad0.4mm_NSMD" H 4500 3150 50  0001 C CNN
F 3 "" H 4500 3150 50  0001 C CNN
F 4 "3000-0000001300" H 4500 3150 50  0001 C CNN "PartSpecification"
	7    4500 3150
	1    0    0    -1  
$EndComp
$Comp
L 000_PreferredParts:C_1nF C?
U 1 1 5FBBEFB8
P 4750 2000
AR Path="/5F8E5420/5F971A6D/5FBBEFB8" Ref="C?"  Part="1" 
AR Path="/5F8E5420/5F9C1206/5FBBEFB8" Ref="C1002"  Part="1" 
AR Path="/605746B5/5F8E5420/5F9C1206/5FBBEFB8" Ref="C3402"  Part="1" 
F 0 "C3402" H 4775 2100 50  0000 L CNN
F 1 "C_1nF" H 4775 1900 50  0000 L CNN
F 2 "Capacitor_SMD:C_0402_1005Metric" H 4788 1850 50  0001 C CNN
F 3 "~" H 4750 2000 50  0001 C CNN
F 4 "3000-0000000128" H 4750 2000 50  0001 C CNN "PartSpecification"
	1    4750 2000
	1    0    0    -1  
$EndComp
$Comp
L 000_PreferredParts:C_1nF C?
U 1 1 5FBBEFBF
P 4150 2000
AR Path="/5F8E5420/5F971A6D/5FBBEFBF" Ref="C?"  Part="1" 
AR Path="/5F8E5420/5F9C1206/5FBBEFBF" Ref="C1001"  Part="1" 
AR Path="/605746B5/5F8E5420/5F9C1206/5FBBEFBF" Ref="C3401"  Part="1" 
F 0 "C3401" H 4175 2100 50  0000 L CNN
F 1 "C_1nF" H 4175 1900 50  0000 L CNN
F 2 "Capacitor_SMD:C_0402_1005Metric" H 4188 1850 50  0001 C CNN
F 3 "~" H 4150 2000 50  0001 C CNN
F 4 "3000-0000000128" H 4150 2000 50  0001 C CNN "PartSpecification"
	1    4150 2000
	1    0    0    -1  
$EndComp
$Comp
L 000_PreferredParts:C_0_1uF C?
U 1 1 5FBBEFC8
P 5100 2000
AR Path="/5F8E5420/5F971A6D/5FBBEFC8" Ref="C?"  Part="1" 
AR Path="/5F8E5420/5F9C1206/5FBBEFC8" Ref="C1003"  Part="1" 
AR Path="/605746B5/5F8E5420/5F9C1206/5FBBEFC8" Ref="C3403"  Part="1" 
F 0 "C3403" H 5125 2100 50  0000 L CNN
F 1 "C_0_1uF" H 5125 1900 50  0001 L CNN
F 2 "Capacitor_SMD:C_0402_1005Metric" H 5138 1850 50  0001 C CNN
F 3 "~" H 5100 2000 50  0001 C CNN
F 4 "0.1uF" H 5250 1900 50  0000 C CNN "DisplayValue"
F 5 "3000-0000000125" H 5100 2000 50  0001 C CNN "PartSpecification"
F 6 "100V" H 5100 2000 50  0001 C CNN "Voltage"
	1    5100 2000
	1    0    0    -1  
$EndComp
$Comp
L power:GND #PWR?
U 1 1 5FBBEFD4
P 5450 2200
AR Path="/5F8E5420/5F971A6D/5FBBEFD4" Ref="#PWR?"  Part="1" 
AR Path="/5F8E5420/5F9C1206/5FBBEFD4" Ref="#PWR?"  Part="1" 
AR Path="/605746B5/5F8E5420/5F9C1206/5FBBEFD4" Ref="#PWR?"  Part="1" 
F 0 "#PWR?" H 5450 1950 50  0001 C CNN
F 1 "GND" H 5450 2050 50  0000 C CNN
F 2 "" H 5450 2200 50  0001 C CNN
F 3 "" H 5450 2200 50  0001 C CNN
	1    5450 2200
	1    0    0    -1  
$EndComp
Wire Wire Line
	4750 2150 4750 2200
Wire Wire Line
	4750 2200 5100 2200
Wire Wire Line
	5100 2200 5100 2150
Connection ~ 5100 2200
Wire Wire Line
	5100 2200 5450 2200
Wire Wire Line
	4550 2350 4550 1750
Wire Wire Line
	4550 1750 4750 1750
Wire Wire Line
	5100 1850 5100 1750
Wire Wire Line
	4750 1850 4750 1750
Connection ~ 4750 1750
Wire Wire Line
	4750 1750 5100 1750
$Comp
L power:GND #PWR?
U 1 1 5FBBEFEA
P 4150 2200
AR Path="/5F8E5420/5F971A6D/5FBBEFEA" Ref="#PWR?"  Part="1" 
AR Path="/5F8E5420/5F9C1206/5FBBEFEA" Ref="#PWR?"  Part="1" 
AR Path="/605746B5/5F8E5420/5F9C1206/5FBBEFEA" Ref="#PWR?"  Part="1" 
F 0 "#PWR?" H 4150 1950 50  0001 C CNN
F 1 "GND" H 4150 2050 50  0000 C CNN
F 2 "" H 4150 2200 50  0001 C CNN
F 3 "" H 4150 2200 50  0001 C CNN
	1    4150 2200
	1    0    0    -1  
$EndComp
Wire Wire Line
	4150 2200 4150 2150
Wire Wire Line
	4150 1850 4150 1750
Wire Wire Line
	4150 1750 4450 1750
Wire Wire Line
	4450 1750 4450 2350
Wire Wire Line
	4450 1750 4450 1650
Wire Wire Line
	4450 1650 4500 1650
Wire Wire Line
	4550 1650 4550 1750
Connection ~ 4450 1750
Connection ~ 4550 1750
Text HLabel 6000 3200 2    50   Output ~ 0
PA_REG_EN
Text HLabel 3000 3100 0    50   Output ~ 0
PA_REG_VSEL_1
Text HLabel 6000 3300 2    50   Output ~ 0
PA_REG_VSEL_2
Text HLabel 3000 3500 0    50   Output ~ 0
PA_REG_PS_SYNC
Text HLabel 3000 3200 0    50   Input ~ 0
PA_REG_DCDC_PG
Text HLabel 6000 3400 2    50   Input ~ 0
PA_REG_LDO_PG
Text HLabel 3000 2900 0    50   Output ~ 0
PA_EN
Text HLabel 3000 3300 0    50   Output ~ 0
BT_TX_CTRL_1
Text HLabel 3000 3000 0    50   Output ~ 0
BP_TX_CTRL_2
Text HLabel 3000 3400 0    50   Output ~ 0
BP_TX_ENABLE
$Comp
L power:+2V5 #PWR?
U 1 1 60D96A67
P 4500 1500
F 0 "#PWR?" H 4500 1350 50  0001 C CNN
F 1 "+2V5" H 4515 1673 50  0000 C CNN
F 2 "" H 4500 1500 50  0001 C CNN
F 3 "" H 4500 1500 50  0001 C CNN
	1    4500 1500
	1    0    0    -1  
$EndComp
Wire Wire Line
	4500 1500 4500 1650
Wire Wire Line
	3000 2900 3400 2900
Wire Wire Line
	6000 3200 5600 3200
Wire Wire Line
	3000 3100 3400 3100
Wire Wire Line
	6000 3300 5600 3300
Wire Wire Line
	3000 3500 3400 3500
Wire Wire Line
	3000 3200 3400 3200
Wire Wire Line
	6000 3400 5600 3400
Wire Wire Line
	3400 3400 3000 3400
Wire Wire Line
	3400 3000 3000 3000
Wire Wire Line
	3400 3300 3000 3300
Connection ~ 4500 1650
Wire Wire Line
	4500 1650 4550 1650
$Comp
L POWDER_Misc:DSC1004 U3301
U 1 1 62B0D2EB
P 6500 2250
F 0 "U3301" H 6650 2550 50  0000 L CNN
F 1 "DSC1004" H 6650 1950 50  0000 L CNN
F 2 "Crystal:Crystal_SMD_2520-4Pin_2.5x2.0mm" H 6550 2250 50  0001 C CNN
F 3 "" H 6550 2250 50  0001 C CNN
F 4 "DSC1004DI2-010.0000" H 6500 2250 50  0001 C CNN "PartNumber"
F 5 "3000-0000001317" H 6500 2250 50  0001 C CNN "PartSpecification"
	1    6500 2250
	1    0    0    -1  
$EndComp
$Comp
L power:GND #PWR?
U 1 1 62B0EB0C
P 6500 2700
AR Path="/5F8E5420/5F971A6D/62B0EB0C" Ref="#PWR?"  Part="1" 
AR Path="/5F8E5420/5F9C1206/62B0EB0C" Ref="#PWR?"  Part="1" 
AR Path="/605746B5/5F8E5420/5F9C1206/62B0EB0C" Ref="#PWR?"  Part="1" 
F 0 "#PWR?" H 6500 2450 50  0001 C CNN
F 1 "GND" H 6500 2550 50  0000 C CNN
F 2 "" H 6500 2700 50  0001 C CNN
F 3 "" H 6500 2700 50  0001 C CNN
	1    6500 2700
	1    0    0    -1  
$EndComp
Wire Wire Line
	6500 2700 6500 2600
$Comp
L power:+2V5 #PWR?
U 1 1 62B0F457
P 6500 1800
F 0 "#PWR?" H 6500 1650 50  0001 C CNN
F 1 "+2V5" H 6515 1973 50  0000 C CNN
F 2 "" H 6500 1800 50  0001 C CNN
F 3 "" H 6500 1800 50  0001 C CNN
	1    6500 1800
	1    0    0    -1  
$EndComp
Wire Wire Line
	7050 2250 7250 2250
Wire Wire Line
	7250 2250 7250 3000
Wire Wire Line
	5600 3000 7250 3000
Text Label 6000 3000 0    50   ~ 0
CLK_10MHZ
$Comp
L 000_PreferredParts:C_0_1uF C?
U 1 1 62B6A508
P 7250 1750
AR Path="/5F8E5420/5F971A6D/62B6A508" Ref="C?"  Part="1" 
AR Path="/5F8E5420/5F9C1206/62B6A508" Ref="C?"  Part="1" 
AR Path="/605746B5/5F8E5420/5F9C1206/62B6A508" Ref="C3305"  Part="1" 
F 0 "C3305" H 7275 1850 50  0000 L CNN
F 1 "C_0_1uF" H 7275 1650 50  0001 L CNN
F 2 "Capacitor_SMD:C_0402_1005Metric" H 7288 1600 50  0001 C CNN
F 3 "~" H 7250 1750 50  0001 C CNN
F 4 "0.1uF" H 7400 1650 50  0000 C CNN "DisplayValue"
F 5 "3000-0000000125" H 7250 1750 50  0001 C CNN "PartSpecification"
F 6 "100V" H 7250 1750 50  0001 C CNN "Voltage"
	1    7250 1750
	1    0    0    -1  
$EndComp
$Comp
L power:GND #PWR?
U 1 1 62B6ABFC
P 7250 2000
AR Path="/5F8E5420/5F971A6D/62B6ABFC" Ref="#PWR?"  Part="1" 
AR Path="/5F8E5420/5F9C1206/62B6ABFC" Ref="#PWR?"  Part="1" 
AR Path="/605746B5/5F8E5420/5F9C1206/62B6ABFC" Ref="#PWR?"  Part="1" 
F 0 "#PWR?" H 7250 1750 50  0001 C CNN
F 1 "GND" H 7250 1850 50  0000 C CNN
F 2 "" H 7250 2000 50  0001 C CNN
F 3 "" H 7250 2000 50  0001 C CNN
	1    7250 2000
	1    0    0    -1  
$EndComp
$Comp
L power:+2V5 #PWR?
U 1 1 62B6AE9D
P 7250 1500
F 0 "#PWR?" H 7250 1350 50  0001 C CNN
F 1 "+2V5" H 7265 1673 50  0000 C CNN
F 2 "" H 7250 1500 50  0001 C CNN
F 3 "" H 7250 1500 50  0001 C CNN
	1    7250 1500
	1    0    0    -1  
$EndComp
Wire Wire Line
	7250 1500 7250 1600
Wire Wire Line
	7250 1900 7250 2000
$Comp
L 000_PreferredParts:C_1nF C?
U 1 1 62B6F47D
P 7750 1750
AR Path="/5F8E5420/5F971A6D/62B6F47D" Ref="C?"  Part="1" 
AR Path="/5F8E5420/5F9C1206/62B6F47D" Ref="C?"  Part="1" 
AR Path="/605746B5/5F8E5420/5F9C1206/62B6F47D" Ref="C3306"  Part="1" 
F 0 "C3306" H 7775 1850 50  0000 L CNN
F 1 "C_1nF" H 7775 1650 50  0000 L CNN
F 2 "Capacitor_SMD:C_0402_1005Metric" H 7788 1600 50  0001 C CNN
F 3 "~" H 7750 1750 50  0001 C CNN
F 4 "3000-0000000128" H 7750 1750 50  0001 C CNN "PartSpecification"
	1    7750 1750
	1    0    0    -1  
$EndComp
$Comp
L power:+2V5 #PWR?
U 1 1 62B6F8F9
P 7750 1500
F 0 "#PWR?" H 7750 1350 50  0001 C CNN
F 1 "+2V5" H 7765 1673 50  0000 C CNN
F 2 "" H 7750 1500 50  0001 C CNN
F 3 "" H 7750 1500 50  0001 C CNN
	1    7750 1500
	1    0    0    -1  
$EndComp
Wire Wire Line
	7750 1500 7750 1600
Wire Wire Line
	7750 1900 7750 2000
$Comp
L power:GND #PWR?
U 1 1 62B70CC6
P 7750 2000
AR Path="/5F8E5420/5F971A6D/62B70CC6" Ref="#PWR?"  Part="1" 
AR Path="/5F8E5420/5F9C1206/62B70CC6" Ref="#PWR?"  Part="1" 
AR Path="/605746B5/5F8E5420/5F9C1206/62B70CC6" Ref="#PWR?"  Part="1" 
F 0 "#PWR?" H 7750 1750 50  0001 C CNN
F 1 "GND" H 7750 1850 50  0000 C CNN
F 2 "" H 7750 2000 50  0001 C CNN
F 3 "" H 7750 2000 50  0001 C CNN
	1    7750 2000
	1    0    0    -1  
$EndComp
Wire Wire Line
	6500 1800 6500 1900
Wire Wire Line
	5600 3100 5700 3100
Wire Wire Line
	5700 3100 5700 2250
Wire Wire Line
	5700 2250 5850 2250
$Comp
L Device:R R?
U 1 1 60A29014
P 5850 2500
AR Path="/605746B5/5F853053/60A29014" Ref="R?"  Part="1" 
AR Path="/605746B5/61256AAD/60A29014" Ref="R?"  Part="1" 
AR Path="/605746B5/5F8E5420/5F9C1206/60A29014" Ref="R3303"  Part="1" 
F 0 "R3303" V 5930 2500 50  0000 C CNN
F 1 "10k" V 5850 2500 50  0000 C CNN
F 2 "Resistor_SMD:R_0402_1005Metric" V 5780 2500 50  0001 C CNN
F 3 "~" H 5850 2500 50  0001 C CNN
F 4 "3000-0000000131" H 5850 2500 50  0001 C CNN "PartSpecification"
	1    5850 2500
	1    0    0    -1  
$EndComp
$Comp
L power:GND #PWR?
U 1 1 60A2901A
P 5850 2750
AR Path="/605746B5/5F853053/60A2901A" Ref="#PWR?"  Part="1" 
AR Path="/605746B5/5F8E5420/5F9C1206/60A2901A" Ref="#PWR?"  Part="1" 
F 0 "#PWR?" H 5850 2500 50  0001 C CNN
F 1 "GND" H 5850 2600 50  0000 C CNN
F 2 "" H 5850 2750 50  0001 C CNN
F 3 "" H 5850 2750 50  0001 C CNN
	1    5850 2750
	1    0    0    -1  
$EndComp
Wire Wire Line
	5850 2750 5850 2650
Wire Wire Line
	5850 2350 5850 2250
Connection ~ 5850 2250
Wire Wire Line
	5850 2250 5950 2250
$EndSCHEMATC
