EESchema Schematic File Version 4
EELAYER 30 0
EELAYER END
$Descr A4 11693 8268
encoding utf-8
Sheet 4 13
Title ""
Date ""
Rev ""
Comp ""
Comment1 ""
Comment2 ""
Comment3 ""
Comment4 ""
$EndDescr
Text HLabel 750  3300 0    50   Input ~ 0
EN
$Comp
L POWDER_Power:TPS7A92 U?
U 1 1 6053CDFE
P 3650 3200
AR Path="/5D562501/6053CDFE" Ref="U?"  Part="1" 
AR Path="/5D587C46/6053CDFE" Ref="U?"  Part="1" 
AR Path="/60664CFF/6053CDFE" Ref="U?"  Part="1" 
AR Path="/612ADC7E/6053CDFE" Ref="U1"  Part="1" 
F 0 "U1" H 4050 3650 50  0000 C CNN
F 1 "TPS7A92" H 3650 3450 50  0000 C CNN
F 2 "POWDER_Power:R-PWSON-N10" H 4400 2150 50  0001 C CNN
F 3 "" H 3650 3200 50  0001 C CNN
F 4 "3000-0000000193" H 3650 3200 50  0001 C CNN "PartSpecification"
	1    3650 3200
	1    0    0    -1  
$EndComp
Wire Wire Line
	3050 3100 2750 3100
Wire Wire Line
	2750 3100 2750 3000
Wire Wire Line
	2750 3000 3050 3000
Connection ~ 2750 3000
$Comp
L power:GND #PWR?
U 1 1 6053CDFF
P 3700 3800
AR Path="/5D562501/6053CDFF" Ref="#PWR?"  Part="1" 
AR Path="/5D587C46/6053CDFF" Ref="#PWR?"  Part="1" 
AR Path="/5D591ABD/6053CDFF" Ref="#PWR?"  Part="1" 
AR Path="/60664CFF/6053CDFF" Ref="#PWR?"  Part="1" 
AR Path="/612ADC7E/6053CDFF" Ref="#PWR?"  Part="1" 
F 0 "#PWR?" H 3700 3550 50  0001 C CNN
F 1 "GND" H 3705 3627 50  0000 C CNN
F 2 "" H 3700 3800 50  0001 C CNN
F 3 "" H 3700 3800 50  0001 C CNN
	1    3700 3800
	1    0    0    -1  
$EndComp
$Comp
L power:GND #PWR?
U 1 1 60577FEF
P 3600 3800
AR Path="/5D562501/60577FEF" Ref="#PWR?"  Part="1" 
AR Path="/5D587C46/60577FEF" Ref="#PWR?"  Part="1" 
AR Path="/5D591ABD/60577FEF" Ref="#PWR?"  Part="1" 
AR Path="/60664CFF/60577FEF" Ref="#PWR?"  Part="1" 
AR Path="/612ADC7E/60577FEF" Ref="#PWR?"  Part="1" 
F 0 "#PWR?" H 3600 3550 50  0001 C CNN
F 1 "GND" H 3605 3627 50  0000 C CNN
F 2 "" H 3600 3800 50  0001 C CNN
F 3 "" H 3600 3800 50  0001 C CNN
	1    3600 3800
	1    0    0    -1  
$EndComp
Text HLabel 4550 3400 2    50   Output ~ 0
LDO_PG
$Comp
L 000_PreferredParts:C_1uF C?
U 1 1 60577FF2
P 2250 3550
AR Path="/5D562501/60577FF2" Ref="C?"  Part="1" 
AR Path="/5D587C46/60577FF2" Ref="C?"  Part="1" 
AR Path="/60664CFF/60577FF2" Ref="C?"  Part="1" 
AR Path="/612ADC7E/60577FF2" Ref="C2"  Part="1" 
F 0 "C2" H 2275 3650 50  0000 L CNN
F 1 "C_1uF" H 2275 3450 50  0000 L CNN
F 2 "Capacitor_SMD:C_0603_1608Metric" H 2288 3400 50  0001 C CNN
F 3 "~" H 2250 3550 50  0001 C CNN
F 4 "3000-0000000136" H 2250 3550 50  0001 C CNN "PartSpecification"
	1    2250 3550
	1    0    0    -1  
$EndComp
Wire Wire Line
	2250 3200 3050 3200
$Comp
L power:GND #PWR?
U 1 1 6053CE02
P 2250 3800
AR Path="/5D562501/6053CE02" Ref="#PWR?"  Part="1" 
AR Path="/5D587C46/6053CE02" Ref="#PWR?"  Part="1" 
AR Path="/5D591ABD/6053CE02" Ref="#PWR?"  Part="1" 
AR Path="/60664CFF/6053CE02" Ref="#PWR?"  Part="1" 
AR Path="/612ADC7E/6053CE02" Ref="#PWR?"  Part="1" 
F 0 "#PWR?" H 2250 3550 50  0001 C CNN
F 1 "GND" H 2255 3627 50  0000 C CNN
F 2 "" H 2250 3800 50  0001 C CNN
F 3 "" H 2250 3800 50  0001 C CNN
	1    2250 3800
	1    0    0    -1  
$EndComp
$Comp
L power:GND #PWR?
U 1 1 6053CE03
P 2950 3800
AR Path="/5D562501/6053CE03" Ref="#PWR?"  Part="1" 
AR Path="/5D587C46/6053CE03" Ref="#PWR?"  Part="1" 
AR Path="/5D591ABD/6053CE03" Ref="#PWR?"  Part="1" 
AR Path="/60664CFF/6053CE03" Ref="#PWR?"  Part="1" 
AR Path="/612ADC7E/6053CE03" Ref="#PWR?"  Part="1" 
F 0 "#PWR?" H 2950 3550 50  0001 C CNN
F 1 "GND" H 2955 3627 50  0000 C CNN
F 2 "" H 2950 3800 50  0001 C CNN
F 3 "" H 2950 3800 50  0001 C CNN
	1    2950 3800
	1    0    0    -1  
$EndComp
$Comp
L 000_PreferredParts:C_10uF_0805 C?
U 1 1 60577FF9
P 1450 3550
AR Path="/5D562501/60577FF9" Ref="C?"  Part="1" 
AR Path="/5D587C46/60577FF9" Ref="C?"  Part="1" 
AR Path="/60664CFF/60577FF9" Ref="C?"  Part="1" 
AR Path="/612ADC7E/60577FF9" Ref="C1"  Part="1" 
F 0 "C1" H 1565 3596 50  0000 L CNN
F 1 "C_10uF_0805" H 1565 3505 50  0000 L CNN
F 2 "Capacitor_SMD:C_0805_2012Metric" H 1488 3400 50  0001 C CNN
F 3 "~" H 1450 3550 50  0001 C CNN
F 4 "Murata Electronics" H 1450 3550 50  0001 C CNN "Manufacturer"
F 5 "GRM21BC8YA106ME11L" H 1450 3550 50  0001 C CNN "PartNumber"
F 6 "3000-0000000134" H 1450 3550 50  0001 C CNN "PartSpecification"
	1    1450 3550
	1    0    0    -1  
$EndComp
Wire Wire Line
	1450 3400 1450 3000
Wire Wire Line
	1450 3000 2750 3000
$Comp
L power:GND #PWR?
U 1 1 60577FFC
P 1450 3800
AR Path="/5D562501/60577FFC" Ref="#PWR?"  Part="1" 
AR Path="/5D587C46/60577FFC" Ref="#PWR?"  Part="1" 
AR Path="/5D591ABD/60577FFC" Ref="#PWR?"  Part="1" 
AR Path="/60664CFF/60577FFC" Ref="#PWR?"  Part="1" 
AR Path="/612ADC7E/60577FFC" Ref="#PWR?"  Part="1" 
F 0 "#PWR?" H 1450 3550 50  0001 C CNN
F 1 "GND" H 1455 3627 50  0000 C CNN
F 2 "" H 1450 3800 50  0001 C CNN
F 3 "" H 1450 3800 50  0001 C CNN
	1    1450 3800
	1    0    0    -1  
$EndComp
$Comp
L power:GND #PWR?
U 1 1 5EA2F6C9
P 6150 4050
AR Path="/5D562501/5EA2F6C9" Ref="#PWR?"  Part="1" 
AR Path="/5D587C46/5EA2F6C9" Ref="#PWR?"  Part="1" 
AR Path="/5D591ABD/5EA2F6C9" Ref="#PWR?"  Part="1" 
AR Path="/60664CFF/5EA2F6C9" Ref="#PWR?"  Part="1" 
AR Path="/612ADC7E/5EA2F6C9" Ref="#PWR?"  Part="1" 
F 0 "#PWR?" H 6150 3800 50  0001 C CNN
F 1 "GND" H 6155 3877 50  0000 C CNN
F 2 "" H 6150 4050 50  0001 C CNN
F 3 "" H 6150 4050 50  0001 C CNN
	1    6150 4050
	1    0    0    -1  
$EndComp
Wire Wire Line
	6150 4050 6150 3950
$Comp
L Device:R R?
U 1 1 5EA43B22
P 6150 3800
AR Path="/5D562501/5EA43B22" Ref="R?"  Part="1" 
AR Path="/5D587C46/5EA43B22" Ref="R?"  Part="1" 
AR Path="/60664CFF/5EA43B22" Ref="R?"  Part="1" 
AR Path="/612ADC7E/5EA43B22" Ref="R11"  Part="1" 
F 0 "R11" V 6230 3800 50  0000 C CNN
F 1 "1k" V 6150 3800 50  0000 C CNN
F 2 "Resistor_SMD:R_0402_1005Metric" V 6080 3800 50  0001 C CNN
F 3 "~" H 6150 3800 50  0001 C CNN
F 4 "3000-0000000224" V 6150 3800 50  0001 C CNN "PartSpecification"
	1    6150 3800
	1    0    0    -1  
$EndComp
$Comp
L Device:R R?
U 1 1 60578003
P 6150 3300
AR Path="/5D562501/60578003" Ref="R?"  Part="1" 
AR Path="/5D587C46/60578003" Ref="R?"  Part="1" 
AR Path="/60664CFF/60578003" Ref="R?"  Part="1" 
AR Path="/612ADC7E/60578003" Ref="R10"  Part="1" 
F 0 "R10" V 6230 3300 50  0000 C CNN
F 1 "4.64k" V 6150 3300 50  0000 C CNN
F 2 "Resistor_SMD:R_0402_1005Metric" V 6080 3300 50  0001 C CNN
F 3 "~" H 6150 3300 50  0001 C CNN
F 4 "3000-0000000133" V 6150 3300 50  0001 C CNN "PartSpecification"
	1    6150 3300
	1    0    0    -1  
$EndComp
Wire Wire Line
	4250 3100 4750 3100
Wire Wire Line
	4250 3000 4750 3000
Wire Wire Line
	4750 3000 4750 3100
Wire Wire Line
	4750 3000 6150 3000
Connection ~ 4750 3000
Wire Wire Line
	6150 3000 6150 3150
Wire Wire Line
	6150 3650 6150 3550
Wire Wire Line
	6150 3550 5450 3550
Connection ~ 6150 3550
Wire Wire Line
	6150 3550 6150 3450
Wire Wire Line
	6150 3550 6850 3550
Wire Wire Line
	4250 3250 5450 3250
Wire Wire Line
	5450 3250 5450 3550
$Comp
L Device:C C?
U 1 1 6057800A
P 6850 3250
AR Path="/5D587C46/6057800A" Ref="C?"  Part="1" 
AR Path="/5D562501/6057800A" Ref="C?"  Part="1" 
AR Path="/60664CFF/6057800A" Ref="C?"  Part="1" 
AR Path="/612ADC7E/6057800A" Ref="C3"  Part="1" 
F 0 "C3" H 6875 3350 50  0000 L CNN
F 1 "10nF" H 6875 3150 50  0000 L CNN
F 2 "Capacitor_SMD:C_0402_1005Metric" H 6888 3100 50  0001 C CNN
F 3 "~" H 6850 3250 50  0001 C CNN
F 4 "3000-0000000203" H 6850 3250 50  0001 C CNN "PartSpecification"
	1    6850 3250
	1    0    0    -1  
$EndComp
Wire Wire Line
	6850 3100 6850 3000
Connection ~ 6150 3000
Wire Wire Line
	6850 3400 6850 3550
$Comp
L 000_PreferredParts:C_10uF_0603 C?
U 1 1 6057800D
P 8050 3250
AR Path="/5D587C46/6057800D" Ref="C?"  Part="1" 
AR Path="/5D562501/6057800D" Ref="C?"  Part="1" 
AR Path="/60664CFF/6057800D" Ref="C?"  Part="1" 
AR Path="/612ADC7E/6057800D" Ref="C5"  Part="1" 
F 0 "C5" H 8075 3350 50  0000 L CNN
F 1 "C_10uF_0603" H 8075 3150 50  0001 L CNN
F 2 "Capacitor_SMD:C_0603_1608Metric" H 8088 3100 50  0001 C CNN
F 3 "~" H 8050 3250 50  0001 C CNN
F 4 "10uF" H 8200 3150 50  0000 C CNN "DisplayValue"
F 5 "0603" H 8200 3050 50  0000 C CNN "DisplayFootprint"
F 6 "3000-0000000135" H -1450 -1450 50  0001 C CNN "PartSpecification"
	1    8050 3250
	1    0    0    -1  
$EndComp
Wire Wire Line
	8050 3100 8050 3000
Connection ~ 6850 3000
$Comp
L power:GND #PWR?
U 1 1 6053CE0D
P 8050 3550
AR Path="/5D562501/6053CE0D" Ref="#PWR?"  Part="1" 
AR Path="/5D587C46/6053CE0D" Ref="#PWR?"  Part="1" 
AR Path="/5D591ABD/6053CE0D" Ref="#PWR?"  Part="1" 
AR Path="/60664CFF/6053CE0D" Ref="#PWR?"  Part="1" 
AR Path="/612ADC7E/6053CE0D" Ref="#PWR?"  Part="1" 
F 0 "#PWR?" H 8050 3300 50  0001 C CNN
F 1 "GND" H 8055 3377 50  0000 C CNN
F 2 "" H 8050 3550 50  0001 C CNN
F 3 "" H 8050 3550 50  0001 C CNN
	1    8050 3550
	-1   0    0    -1  
$EndComp
Wire Wire Line
	8050 3550 8050 3400
$Comp
L 000_PreferredParts:C_10uF_0603 C?
U 1 1 6053CE10
P 8400 3250
AR Path="/5D587C46/6053CE10" Ref="C?"  Part="1" 
AR Path="/5D562501/6053CE10" Ref="C?"  Part="1" 
AR Path="/60664CFF/6053CE10" Ref="C?"  Part="1" 
AR Path="/612ADC7E/6053CE10" Ref="C6"  Part="1" 
F 0 "C6" H 8425 3350 50  0000 L CNN
F 1 "C_10uF_0603" H 8425 3150 50  0001 L CNN
F 2 "Capacitor_SMD:C_0603_1608Metric" H 8438 3100 50  0001 C CNN
F 3 "~" H 8400 3250 50  0001 C CNN
F 4 "10uF" H 8550 3150 50  0000 C CNN "DisplayValue"
F 5 "0603" H 8550 3050 50  0000 C CNN "DisplayFootprint"
F 6 "3000-0000000135" H -2100 -1450 50  0001 C CNN "PartSpecification"
	1    8400 3250
	1    0    0    -1  
$EndComp
Wire Wire Line
	8400 3100 8400 3000
$Comp
L power:GND #PWR?
U 1 1 6053CE11
P 8400 3550
AR Path="/5D562501/6053CE11" Ref="#PWR?"  Part="1" 
AR Path="/5D587C46/6053CE11" Ref="#PWR?"  Part="1" 
AR Path="/5D591ABD/6053CE11" Ref="#PWR?"  Part="1" 
AR Path="/60664CFF/6053CE11" Ref="#PWR?"  Part="1" 
AR Path="/612ADC7E/6053CE11" Ref="#PWR?"  Part="1" 
F 0 "#PWR?" H 8400 3300 50  0001 C CNN
F 1 "GND" H 8405 3377 50  0000 C CNN
F 2 "" H 8400 3550 50  0001 C CNN
F 3 "" H 8400 3550 50  0001 C CNN
	1    8400 3550
	-1   0    0    -1  
$EndComp
Wire Wire Line
	8400 3550 8400 3400
$Comp
L 000_PreferredParts:C_10uF_0603 C?
U 1 1 6053CE14
P 7700 3250
AR Path="/5D587C46/6053CE14" Ref="C?"  Part="1" 
AR Path="/5D562501/6053CE14" Ref="C?"  Part="1" 
AR Path="/60664CFF/6053CE14" Ref="C?"  Part="1" 
AR Path="/612ADC7E/6053CE14" Ref="C4"  Part="1" 
F 0 "C4" H 7725 3350 50  0000 L CNN
F 1 "C_10uF_0603" H 7725 3150 50  0001 L CNN
F 2 "Capacitor_SMD:C_0603_1608Metric" H 7738 3100 50  0001 C CNN
F 3 "~" H 7700 3250 50  0001 C CNN
F 4 "10uF" H 7850 3150 50  0000 C CNN "DisplayValue"
F 5 "0603" H 7850 3050 50  0000 C CNN "DisplayFootprint"
F 6 "3000-0000000135" H -2300 -450 50  0001 C CNN "PartSpecification"
	1    7700 3250
	1    0    0    -1  
$EndComp
Wire Wire Line
	7700 3100 7700 3000
$Comp
L power:GND #PWR?
U 1 1 6053CE15
P 7700 3550
AR Path="/5D562501/6053CE15" Ref="#PWR?"  Part="1" 
AR Path="/5D587C46/6053CE15" Ref="#PWR?"  Part="1" 
AR Path="/5D591ABD/6053CE15" Ref="#PWR?"  Part="1" 
AR Path="/60664CFF/6053CE15" Ref="#PWR?"  Part="1" 
AR Path="/612ADC7E/6053CE15" Ref="#PWR?"  Part="1" 
F 0 "#PWR?" H 7700 3300 50  0001 C CNN
F 1 "GND" H 7705 3377 50  0000 C CNN
F 2 "" H 7700 3550 50  0001 C CNN
F 3 "" H 7700 3550 50  0001 C CNN
	1    7700 3550
	-1   0    0    -1  
$EndComp
Wire Wire Line
	7700 3550 7700 3400
Text Label 6550 3550 0    50   ~ 0
LDO_FB
Text Label 2600 3200 0    50   ~ 0
NR_SS
Wire Wire Line
	6150 3000 6850 3000
Connection ~ 7700 3000
Text HLabel 8850 3000 2    50   Output ~ 0
V_OUT
Text Label 6250 3000 0    50   ~ 0
VDD_LNA_REG
Wire Wire Line
	4250 3400 4550 3400
$Comp
L Device:R R?
U 1 1 60A0D69C
P 950 3550
AR Path="/605746B5/5F853053/60A0D69C" Ref="R?"  Part="1" 
AR Path="/605746B5/61256AAD/60A0D69C" Ref="R?"  Part="1" 
AR Path="/60664CFF/60A0D69C" Ref="R?"  Part="1" 
AR Path="/612ADC7E/60A0D69C" Ref="R9"  Part="1" 
F 0 "R9" V 1030 3550 50  0000 C CNN
F 1 "10k" V 950 3550 50  0000 C CNN
F 2 "Resistor_SMD:R_0402_1005Metric" V 880 3550 50  0001 C CNN
F 3 "~" H 950 3550 50  0001 C CNN
F 4 "3000-0000000131" H 950 3550 50  0001 C CNN "PartSpecification"
	1    950  3550
	1    0    0    -1  
$EndComp
$Comp
L power:GND #PWR?
U 1 1 60A0D6A2
P 950 3800
AR Path="/605746B5/5F853053/60A0D6A2" Ref="#PWR?"  Part="1" 
AR Path="/60664CFF/60A0D6A2" Ref="#PWR?"  Part="1" 
AR Path="/612ADC7E/60A0D6A2" Ref="#PWR?"  Part="1" 
F 0 "#PWR?" H 950 3550 50  0001 C CNN
F 1 "GND" H 950 3650 50  0000 C CNN
F 2 "" H 950 3800 50  0001 C CNN
F 3 "" H 950 3800 50  0001 C CNN
	1    950  3800
	1    0    0    -1  
$EndComp
Wire Wire Line
	750  3300 950  3300
Wire Wire Line
	950  3400 950  3300
Connection ~ 950  3300
Wire Wire Line
	950  3300 3050 3300
Wire Wire Line
	2250 3200 2250 3400
Wire Wire Line
	3050 3400 2950 3400
Wire Wire Line
	3700 3700 3700 3800
Wire Wire Line
	3600 3700 3600 3800
Wire Wire Line
	2950 3400 2950 3800
Wire Wire Line
	2250 3700 2250 3800
Wire Wire Line
	1450 3700 1450 3800
Wire Wire Line
	950  3700 950  3800
Wire Wire Line
	1450 3000 1450 2700
Connection ~ 1450 3000
$Comp
L power:+5V #PWR?
U 1 1 612901BB
P 1450 2700
F 0 "#PWR?" H 1450 2550 50  0001 C CNN
F 1 "+5V" H 1465 2873 50  0000 C CNN
F 2 "" H 1450 2700 50  0001 C CNN
F 3 "" H 1450 2700 50  0001 C CNN
	1    1450 2700
	1    0    0    -1  
$EndComp
Wire Wire Line
	7700 3000 8050 3000
Wire Wire Line
	6850 3000 7700 3000
Connection ~ 8050 3000
Wire Wire Line
	8050 3000 8400 3000
Wire Wire Line
	8400 3000 8750 3000
Connection ~ 8400 3000
Wire Wire Line
	8750 3000 8750 3850
Connection ~ 8750 3000
Wire Wire Line
	8750 3000 8850 3000
$Comp
L Device:R R19
U 1 1 61678234
P 8750 4000
F 0 "R19" H 8820 4046 50  0000 L CNN
F 1 "0" H 8820 3955 50  0000 L CNN
F 2 "Resistor_SMD:R_0402_1005Metric" V 8680 4000 50  0001 C CNN
F 3 "~" H 8750 4000 50  0001 C CNN
	1    8750 4000
	1    0    0    -1  
$EndComp
$Comp
L Device:R R20
U 1 1 61678D59
P 8750 4500
F 0 "R20" H 8820 4546 50  0000 L CNN
F 1 "DNP" H 8820 4455 50  0000 L CNN
F 2 "Resistor_SMD:R_0402_1005Metric" V 8680 4500 50  0001 C CNN
F 3 "~" H 8750 4500 50  0001 C CNN
	1    8750 4500
	1    0    0    -1  
$EndComp
Wire Wire Line
	8750 4150 8750 4250
Wire Wire Line
	8750 4650 8750 4750
$Comp
L power:GND #PWR?
U 1 1 6167D55B
P 8750 4750
F 0 "#PWR?" H 8750 4500 50  0001 C CNN
F 1 "GND" H 8755 4577 50  0000 C CNN
F 2 "" H 8750 4750 50  0001 C CNN
F 3 "" H 8750 4750 50  0001 C CNN
	1    8750 4750
	1    0    0    -1  
$EndComp
Wire Wire Line
	8750 4250 8950 4250
Connection ~ 8750 4250
Wire Wire Line
	8750 4250 8750 4350
Text GLabel 8950 4250 2    50   Output ~ 0
LNA_VREG_SENSE
$EndSCHEMATC
