(kicad_sch (version 20211123) (generator eeschema)

  (uuid 87802c09-8e3f-4496-9fa3-d64a3450019e)

  (paper "A4")

  (lib_symbols
    (symbol "000_PreferredParts:C_10pF" (pin_numbers hide) (pin_names (offset 0.254)) (in_bom yes) (on_board yes)
      (property "Reference" "C" (id 0) (at 0.635 2.54 0)
        (effects (font (size 1.27 1.27)) (justify left))
      )
      (property "Value" "C_10pF" (id 1) (at 0.635 -2.54 0)
        (effects (font (size 1.27 1.27)) (justify left))
      )
      (property "Footprint" "Capacitor_SMD:C_0402_1005Metric" (id 2) (at 0.9652 -3.81 0)
        (effects (font (size 1.27 1.27)) hide)
      )
      (property "Datasheet" "~" (id 3) (at 0 0 0)
        (effects (font (size 1.27 1.27)) hide)
      )
      (property "PartSpecification" "3000-0000000582" (id 4) (at 0 0 0)
        (effects (font (size 1.27 1.27)) hide)
      )
      (property "ki_keywords" "cap capacitor" (id 5) (at 0 0 0)
        (effects (font (size 1.27 1.27)) hide)
      )
      (property "ki_description" "Unpolarized capacitor" (id 6) (at 0 0 0)
        (effects (font (size 1.27 1.27)) hide)
      )
      (property "ki_fp_filters" "C_*" (id 7) (at 0 0 0)
        (effects (font (size 1.27 1.27)) hide)
      )
      (symbol "C_10pF_0_1"
        (polyline
          (pts
            (xy -2.032 -0.762)
            (xy 2.032 -0.762)
          )
          (stroke (width 0.508) (type default) (color 0 0 0 0))
          (fill (type none))
        )
        (polyline
          (pts
            (xy -2.032 0.762)
            (xy 2.032 0.762)
          )
          (stroke (width 0.508) (type default) (color 0 0 0 0))
          (fill (type none))
        )
      )
      (symbol "C_10pF_1_1"
        (pin passive line (at 0 3.81 270) (length 2.794)
          (name "~" (effects (font (size 1.27 1.27))))
          (number "1" (effects (font (size 1.27 1.27))))
        )
        (pin passive line (at 0 -3.81 90) (length 2.794)
          (name "~" (effects (font (size 1.27 1.27))))
          (number "2" (effects (font (size 1.27 1.27))))
        )
      )
    )
    (symbol "000_PreferredParts:C_10uF_0603" (pin_numbers hide) (pin_names (offset 0.254)) (in_bom yes) (on_board yes)
      (property "Reference" "C" (id 0) (at 0.635 2.54 0)
        (effects (font (size 1.27 1.27)) (justify left))
      )
      (property "Value" "C_10uF_0603" (id 1) (at 0.635 -2.54 0)
        (effects (font (size 1.27 1.27)) (justify left) hide)
      )
      (property "Footprint" "Capacitor_SMD:C_0603_1608Metric" (id 2) (at 0.9652 -3.81 0)
        (effects (font (size 1.27 1.27)) hide)
      )
      (property "Datasheet" "~" (id 3) (at 0 0 0)
        (effects (font (size 1.27 1.27)) hide)
      )
      (property "DisplayValue" "10uF" (id 4) (at 3.81 -2.54 0)
        (effects (font (size 1.27 1.27)))
      )
      (property "DisplayFootprint" "0603" (id 5) (at 3.81 -5.08 0)
        (effects (font (size 1.27 1.27)))
      )
      (property "PartSpecification" "3000-0000000135" (id 6) (at 0 0 0)
        (effects (font (size 1.27 1.27)) hide)
      )
      (property "ki_keywords" "cap capacitor" (id 7) (at 0 0 0)
        (effects (font (size 1.27 1.27)) hide)
      )
      (property "ki_description" "Unpolarized capacitor" (id 8) (at 0 0 0)
        (effects (font (size 1.27 1.27)) hide)
      )
      (property "ki_fp_filters" "C_*" (id 9) (at 0 0 0)
        (effects (font (size 1.27 1.27)) hide)
      )
      (symbol "C_10uF_0603_0_1"
        (polyline
          (pts
            (xy -2.032 -0.762)
            (xy 2.032 -0.762)
          )
          (stroke (width 0.508) (type default) (color 0 0 0 0))
          (fill (type none))
        )
        (polyline
          (pts
            (xy -2.032 0.762)
            (xy 2.032 0.762)
          )
          (stroke (width 0.508) (type default) (color 0 0 0 0))
          (fill (type none))
        )
      )
      (symbol "C_10uF_0603_1_1"
        (pin passive line (at 0 3.81 270) (length 2.794)
          (name "~" (effects (font (size 1.27 1.27))))
          (number "1" (effects (font (size 1.27 1.27))))
        )
        (pin passive line (at 0 -3.81 90) (length 2.794)
          (name "~" (effects (font (size 1.27 1.27))))
          (number "2" (effects (font (size 1.27 1.27))))
        )
      )
    )
    (symbol "000_PreferredParts:C_1nF" (pin_numbers hide) (pin_names (offset 0.254)) (in_bom yes) (on_board yes)
      (property "Reference" "C" (id 0) (at 0.635 2.54 0)
        (effects (font (size 1.27 1.27)) (justify left))
      )
      (property "Value" "C_1nF" (id 1) (at 0.635 -2.54 0)
        (effects (font (size 1.27 1.27)) (justify left))
      )
      (property "Footprint" "Capacitor_SMD:C_0402_1005Metric" (id 2) (at 0.9652 -3.81 0)
        (effects (font (size 1.27 1.27)) hide)
      )
      (property "Datasheet" "~" (id 3) (at 0 0 0)
        (effects (font (size 1.27 1.27)) hide)
      )
      (property "PartSpecification" "3000-0000000128" (id 4) (at 0 0 0)
        (effects (font (size 1.27 1.27)) hide)
      )
      (property "ki_keywords" "cap capacitor" (id 5) (at 0 0 0)
        (effects (font (size 1.27 1.27)) hide)
      )
      (property "ki_description" "Unpolarized capacitor" (id 6) (at 0 0 0)
        (effects (font (size 1.27 1.27)) hide)
      )
      (property "ki_fp_filters" "C_*" (id 7) (at 0 0 0)
        (effects (font (size 1.27 1.27)) hide)
      )
      (symbol "C_1nF_0_1"
        (polyline
          (pts
            (xy -2.032 -0.762)
            (xy 2.032 -0.762)
          )
          (stroke (width 0.508) (type default) (color 0 0 0 0))
          (fill (type none))
        )
        (polyline
          (pts
            (xy -2.032 0.762)
            (xy 2.032 0.762)
          )
          (stroke (width 0.508) (type default) (color 0 0 0 0))
          (fill (type none))
        )
      )
      (symbol "C_1nF_1_1"
        (pin passive line (at 0 3.81 270) (length 2.794)
          (name "~" (effects (font (size 1.27 1.27))))
          (number "1" (effects (font (size 1.27 1.27))))
        )
        (pin passive line (at 0 -3.81 90) (length 2.794)
          (name "~" (effects (font (size 1.27 1.27))))
          (number "2" (effects (font (size 1.27 1.27))))
        )
      )
    )
    (symbol "000_PreferredParts:C_1uF" (pin_numbers hide) (pin_names (offset 0.254)) (in_bom yes) (on_board yes)
      (property "Reference" "C" (id 0) (at 0.635 2.54 0)
        (effects (font (size 1.27 1.27)) (justify left))
      )
      (property "Value" "C_1uF" (id 1) (at 0.635 -2.54 0)
        (effects (font (size 1.27 1.27)) (justify left))
      )
      (property "Footprint" "Capacitor_SMD:C_0603_1608Metric" (id 2) (at 0.9652 -3.81 0)
        (effects (font (size 1.27 1.27)) hide)
      )
      (property "Datasheet" "~" (id 3) (at 0 0 0)
        (effects (font (size 1.27 1.27)) hide)
      )
      (property "PartSpecification" "3000-0000000136" (id 4) (at 0 0 0)
        (effects (font (size 1.27 1.27)) hide)
      )
      (property "ki_keywords" "cap capacitor" (id 5) (at 0 0 0)
        (effects (font (size 1.27 1.27)) hide)
      )
      (property "ki_description" "Unpolarized capacitor" (id 6) (at 0 0 0)
        (effects (font (size 1.27 1.27)) hide)
      )
      (property "ki_fp_filters" "C_*" (id 7) (at 0 0 0)
        (effects (font (size 1.27 1.27)) hide)
      )
      (symbol "C_1uF_0_1"
        (polyline
          (pts
            (xy -2.032 -0.762)
            (xy 2.032 -0.762)
          )
          (stroke (width 0.508) (type default) (color 0 0 0 0))
          (fill (type none))
        )
        (polyline
          (pts
            (xy -2.032 0.762)
            (xy 2.032 0.762)
          )
          (stroke (width 0.508) (type default) (color 0 0 0 0))
          (fill (type none))
        )
      )
      (symbol "C_1uF_1_1"
        (pin passive line (at 0 3.81 270) (length 2.794)
          (name "~" (effects (font (size 1.27 1.27))))
          (number "1" (effects (font (size 1.27 1.27))))
        )
        (pin passive line (at 0 -3.81 90) (length 2.794)
          (name "~" (effects (font (size 1.27 1.27))))
          (number "2" (effects (font (size 1.27 1.27))))
        )
      )
    )
    (symbol "Device:FerriteBead" (pin_numbers hide) (pin_names (offset 0)) (in_bom yes) (on_board yes)
      (property "Reference" "FB" (id 0) (at -3.81 0.635 90)
        (effects (font (size 1.27 1.27)))
      )
      (property "Value" "FerriteBead" (id 1) (at 3.81 0 90)
        (effects (font (size 1.27 1.27)))
      )
      (property "Footprint" "" (id 2) (at -1.778 0 90)
        (effects (font (size 1.27 1.27)) hide)
      )
      (property "Datasheet" "~" (id 3) (at 0 0 0)
        (effects (font (size 1.27 1.27)) hide)
      )
      (property "ki_keywords" "L ferrite bead inductor filter" (id 4) (at 0 0 0)
        (effects (font (size 1.27 1.27)) hide)
      )
      (property "ki_description" "Ferrite bead" (id 5) (at 0 0 0)
        (effects (font (size 1.27 1.27)) hide)
      )
      (property "ki_fp_filters" "Inductor_* L_* *Ferrite*" (id 6) (at 0 0 0)
        (effects (font (size 1.27 1.27)) hide)
      )
      (symbol "FerriteBead_0_1"
        (polyline
          (pts
            (xy 0 -1.27)
            (xy 0 -1.2192)
          )
          (stroke (width 0) (type default) (color 0 0 0 0))
          (fill (type none))
        )
        (polyline
          (pts
            (xy 0 1.27)
            (xy 0 1.2954)
          )
          (stroke (width 0) (type default) (color 0 0 0 0))
          (fill (type none))
        )
        (polyline
          (pts
            (xy -2.7686 0.4064)
            (xy -1.7018 2.2606)
            (xy 2.7686 -0.3048)
            (xy 1.6764 -2.159)
            (xy -2.7686 0.4064)
          )
          (stroke (width 0) (type default) (color 0 0 0 0))
          (fill (type none))
        )
      )
      (symbol "FerriteBead_1_1"
        (pin passive line (at 0 3.81 270) (length 2.54)
          (name "~" (effects (font (size 1.27 1.27))))
          (number "1" (effects (font (size 1.27 1.27))))
        )
        (pin passive line (at 0 -3.81 90) (length 2.54)
          (name "~" (effects (font (size 1.27 1.27))))
          (number "2" (effects (font (size 1.27 1.27))))
        )
      )
    )
    (symbol "Device:R" (pin_numbers hide) (pin_names (offset 0)) (in_bom yes) (on_board yes)
      (property "Reference" "R" (id 0) (at 2.032 0 90)
        (effects (font (size 1.27 1.27)))
      )
      (property "Value" "R" (id 1) (at 0 0 90)
        (effects (font (size 1.27 1.27)))
      )
      (property "Footprint" "" (id 2) (at -1.778 0 90)
        (effects (font (size 1.27 1.27)) hide)
      )
      (property "Datasheet" "~" (id 3) (at 0 0 0)
        (effects (font (size 1.27 1.27)) hide)
      )
      (property "ki_keywords" "R res resistor" (id 4) (at 0 0 0)
        (effects (font (size 1.27 1.27)) hide)
      )
      (property "ki_description" "Resistor" (id 5) (at 0 0 0)
        (effects (font (size 1.27 1.27)) hide)
      )
      (property "ki_fp_filters" "R_*" (id 6) (at 0 0 0)
        (effects (font (size 1.27 1.27)) hide)
      )
      (symbol "R_0_1"
        (rectangle (start -1.016 -2.54) (end 1.016 2.54)
          (stroke (width 0.254) (type default) (color 0 0 0 0))
          (fill (type none))
        )
      )
      (symbol "R_1_1"
        (pin passive line (at 0 3.81 270) (length 1.27)
          (name "~" (effects (font (size 1.27 1.27))))
          (number "1" (effects (font (size 1.27 1.27))))
        )
        (pin passive line (at 0 -3.81 90) (length 1.27)
          (name "~" (effects (font (size 1.27 1.27))))
          (number "2" (effects (font (size 1.27 1.27))))
        )
      )
    )
    (symbol "POWDER_Power:LP5907MFX-x.x{slash}NOPB" (in_bom yes) (on_board yes)
      (property "Reference" "U" (id 0) (at 3.81 -6.35 0)
        (effects (font (size 1.27 1.27)))
      )
      (property "Value" "LP5907MFX-x.x{slash}NOPB" (id 1) (at 0 5.08 0)
        (effects (font (size 1.27 1.27)))
      )
      (property "Footprint" "Package_TO_SOT_SMD:SOT-23-5" (id 2) (at 0 7.62 0)
        (effects (font (size 1.27 1.27)) hide)
      )
      (property "Datasheet" "" (id 3) (at 0 0 0)
        (effects (font (size 1.27 1.27)) hide)
      )
      (symbol "LP5907MFX-x.x{slash}NOPB_0_1"
        (rectangle (start -5.08 3.81) (end 5.08 -5.08)
          (stroke (width 0) (type default) (color 0 0 0 0))
          (fill (type background))
        )
      )
      (symbol "LP5907MFX-x.x{slash}NOPB_1_1"
        (pin power_in line (at -7.62 1.27 0) (length 2.54)
          (name "IN" (effects (font (size 1.27 1.27))))
          (number "1" (effects (font (size 1.27 1.27))))
        )
        (pin input line (at 0 -7.62 90) (length 2.54)
          (name "GND" (effects (font (size 1.27 1.27))))
          (number "2" (effects (font (size 1.27 1.27))))
        )
        (pin input line (at -7.62 -1.27 0) (length 2.54)
          (name "EN" (effects (font (size 1.27 1.27))))
          (number "3" (effects (font (size 1.27 1.27))))
        )
        (pin no_connect line (at -7.62 -3.81 0) (length 2.54) hide
          (name "" (effects (font (size 1.27 1.27))))
          (number "4" (effects (font (size 1.27 1.27))))
        )
        (pin power_out line (at 7.62 1.27 180) (length 2.54)
          (name "OUT" (effects (font (size 1.27 1.27))))
          (number "5" (effects (font (size 1.27 1.27))))
        )
      )
    )
    (symbol "power:GND" (power) (pin_names (offset 0)) (in_bom yes) (on_board yes)
      (property "Reference" "#PWR" (id 0) (at 0 -6.35 0)
        (effects (font (size 1.27 1.27)) hide)
      )
      (property "Value" "GND" (id 1) (at 0 -3.81 0)
        (effects (font (size 1.27 1.27)))
      )
      (property "Footprint" "" (id 2) (at 0 0 0)
        (effects (font (size 1.27 1.27)) hide)
      )
      (property "Datasheet" "" (id 3) (at 0 0 0)
        (effects (font (size 1.27 1.27)) hide)
      )
      (property "ki_keywords" "power-flag" (id 4) (at 0 0 0)
        (effects (font (size 1.27 1.27)) hide)
      )
      (property "ki_description" "Power symbol creates a global label with name \"GND\" , ground" (id 5) (at 0 0 0)
        (effects (font (size 1.27 1.27)) hide)
      )
      (symbol "GND_0_1"
        (polyline
          (pts
            (xy 0 0)
            (xy 0 -1.27)
            (xy 1.27 -1.27)
            (xy 0 -2.54)
            (xy -1.27 -1.27)
            (xy 0 -1.27)
          )
          (stroke (width 0) (type default) (color 0 0 0 0))
          (fill (type none))
        )
      )
      (symbol "GND_1_1"
        (pin power_in line (at 0 0 270) (length 0) hide
          (name "GND" (effects (font (size 1.27 1.27))))
          (number "1" (effects (font (size 1.27 1.27))))
        )
      )
    )
  )

  (junction (at 76.2 76.2) (diameter 0) (color 0 0 0 0)
    (uuid 034168b9-9d66-4b17-85f3-5bef75f668e3)
  )
  (junction (at 88.9 76.2) (diameter 0) (color 0 0 0 0)
    (uuid 2998584a-e0f9-4154-9354-2f4941356068)
  )
  (junction (at 215.9 76.2) (diameter 0) (color 0 0 0 0)
    (uuid 452ad12c-7446-41ee-a4ef-7149795f6608)
  )
  (junction (at 127 76.2) (diameter 0) (color 0 0 0 0)
    (uuid 6496fc72-441e-4e00-89da-167b20af4c95)
  )
  (junction (at 139.7 76.2) (diameter 0) (color 0 0 0 0)
    (uuid 881472a6-226f-4c40-aaa0-51fad49b14be)
  )
  (junction (at 203.2 76.2) (diameter 0) (color 0 0 0 0)
    (uuid a5450ab2-a277-4845-a8e5-c3a1f88c8a8e)
  )
  (junction (at 165.1 76.2) (diameter 0) (color 0 0 0 0)
    (uuid a597ab91-f055-4b32-8bae-414db6e34efa)
  )
  (junction (at 63.5 76.2) (diameter 0) (color 0 0 0 0)
    (uuid a96d962c-06f3-4a01-85aa-b0318ca4742a)
  )
  (junction (at 228.6 76.2) (diameter 0) (color 0 0 0 0)
    (uuid ae053985-e2b9-496f-a788-a9b10e938a90)
  )
  (junction (at 114.3 90.17) (diameter 0) (color 0 0 0 0)
    (uuid cb1c99fb-cdb9-41a3-b5c5-16dd246bf9ff)
  )
  (junction (at 104.14 78.74) (diameter 0) (color 0 0 0 0)
    (uuid e246fcb3-8130-4b65-bfd1-4091be54fe74)
  )
  (junction (at 152.4 76.2) (diameter 0) (color 0 0 0 0)
    (uuid e9ff7064-57f3-4b92-9ed5-5fdad43a7e78)
  )
  (junction (at 177.8 76.2) (diameter 0) (color 0 0 0 0)
    (uuid ebceb53c-da4f-4156-a0b8-df03d006929a)
  )
  (junction (at 241.3 76.2) (diameter 0) (color 0 0 0 0)
    (uuid f6efb45f-2d35-40b5-aea9-de8c4ceb859b)
  )

  (wire (pts (xy 88.9 76.2) (xy 88.9 78.74))
    (stroke (width 0) (type default) (color 0 0 0 0))
    (uuid 029093ea-58cb-43fd-8bb4-19dd7df0df89)
  )
  (wire (pts (xy 88.9 76.2) (xy 76.2 76.2))
    (stroke (width 0) (type default) (color 0 0 0 0))
    (uuid 113b9353-1cf7-40d1-8751-0bc73a4c12e3)
  )
  (wire (pts (xy 241.3 86.36) (xy 241.3 88.9))
    (stroke (width 0) (type default) (color 0 0 0 0))
    (uuid 1908600a-2dd2-4f84-8c6c-74fff5612033)
  )
  (wire (pts (xy 88.9 86.36) (xy 88.9 88.9))
    (stroke (width 0) (type default) (color 0 0 0 0))
    (uuid 197c0077-48eb-4793-ada1-707c13cc0fab)
  )
  (wire (pts (xy 76.2 86.36) (xy 76.2 88.9))
    (stroke (width 0) (type default) (color 0 0 0 0))
    (uuid 1deec2dc-bc23-42bb-b453-80cb9c83cb64)
  )
  (wire (pts (xy 114.3 90.17) (xy 114.3 91.44))
    (stroke (width 0) (type default) (color 0 0 0 0))
    (uuid 27ace062-2af5-46d1-8c4c-bd3cbb3d036c)
  )
  (wire (pts (xy 165.1 76.2) (xy 177.8 76.2))
    (stroke (width 0) (type default) (color 0 0 0 0))
    (uuid 2a9f96d2-39f9-4913-b96d-368df3f8cf5d)
  )
  (wire (pts (xy 241.3 76.2) (xy 254 76.2))
    (stroke (width 0) (type default) (color 0 0 0 0))
    (uuid 309bcc5e-f4b4-4850-b96e-e7d275be64d3)
  )
  (wire (pts (xy 127 76.2) (xy 127 78.74))
    (stroke (width 0) (type default) (color 0 0 0 0))
    (uuid 3a8eca7d-bcf2-4dfd-a708-d2a9f62013f6)
  )
  (wire (pts (xy 139.7 76.2) (xy 127 76.2))
    (stroke (width 0) (type default) (color 0 0 0 0))
    (uuid 3aab6ee6-8f39-40c2-8f9a-ca89a67f4c4b)
  )
  (wire (pts (xy 194.31 76.2) (xy 203.2 76.2))
    (stroke (width 0) (type default) (color 0 0 0 0))
    (uuid 3acf397f-621e-4ca6-9ec8-f71bd7d70c3c)
  )
  (wire (pts (xy 104.14 81.28) (xy 104.14 78.74))
    (stroke (width 0) (type default) (color 0 0 0 0))
    (uuid 4052ce0c-2575-45f5-8d15-9968bdf84d63)
  )
  (wire (pts (xy 114.3 85.09) (xy 114.3 90.17))
    (stroke (width 0) (type default) (color 0 0 0 0))
    (uuid 415e1a7c-5664-48bc-9e21-ab462f88b274)
  )
  (wire (pts (xy 165.1 76.2) (xy 165.1 78.74))
    (stroke (width 0) (type default) (color 0 0 0 0))
    (uuid 41a8b3ec-2b58-491c-aac8-ec2c69a64bd7)
  )
  (wire (pts (xy 228.6 86.36) (xy 228.6 88.9))
    (stroke (width 0) (type default) (color 0 0 0 0))
    (uuid 47dba8e0-ac54-4e24-8218-e2e17da9b4e2)
  )
  (wire (pts (xy 228.6 76.2) (xy 241.3 76.2))
    (stroke (width 0) (type default) (color 0 0 0 0))
    (uuid 4dd969e6-4b54-4a08-b5ca-ad3bd92eddef)
  )
  (wire (pts (xy 203.2 76.2) (xy 215.9 76.2))
    (stroke (width 0) (type default) (color 0 0 0 0))
    (uuid 4f8d93c4-7ddd-4185-a44b-f6eab01bd238)
  )
  (wire (pts (xy 106.68 76.2) (xy 88.9 76.2))
    (stroke (width 0) (type default) (color 0 0 0 0))
    (uuid 4fec98c0-6fc2-407b-b177-ff7b5e254150)
  )
  (wire (pts (xy 76.2 76.2) (xy 63.5 76.2))
    (stroke (width 0) (type default) (color 0 0 0 0))
    (uuid 527b35e5-2151-4990-afda-12e5a53c67ca)
  )
  (wire (pts (xy 76.2 76.2) (xy 76.2 78.74))
    (stroke (width 0) (type default) (color 0 0 0 0))
    (uuid 53eab837-3086-4be7-97c3-0df013bf4c43)
  )
  (wire (pts (xy 203.2 78.74) (xy 203.2 76.2))
    (stroke (width 0) (type default) (color 0 0 0 0))
    (uuid 55b7ed77-1491-47c1-be61-5d3673e5809f)
  )
  (wire (pts (xy 177.8 76.2) (xy 186.69 76.2))
    (stroke (width 0) (type default) (color 0 0 0 0))
    (uuid 5ce00338-684f-481e-8d9a-2f9d7b08e85c)
  )
  (wire (pts (xy 63.5 86.36) (xy 63.5 88.9))
    (stroke (width 0) (type default) (color 0 0 0 0))
    (uuid 5e0e9e12-ab32-42b7-bd97-bc4ad598be0d)
  )
  (wire (pts (xy 152.4 86.36) (xy 152.4 88.9))
    (stroke (width 0) (type default) (color 0 0 0 0))
    (uuid 5f5a34ee-70e1-429c-bc44-8e8911a405a7)
  )
  (wire (pts (xy 127 76.2) (xy 121.92 76.2))
    (stroke (width 0) (type default) (color 0 0 0 0))
    (uuid 6201f1af-a2ee-41b2-a771-880e0163ad11)
  )
  (wire (pts (xy 101.6 78.74) (xy 104.14 78.74))
    (stroke (width 0) (type default) (color 0 0 0 0))
    (uuid 62b16e05-69e9-47b7-be13-ff0df4057374)
  )
  (wire (pts (xy 104.14 90.17) (xy 114.3 90.17))
    (stroke (width 0) (type default) (color 0 0 0 0))
    (uuid 6ce1566b-1a3b-44da-97d0-e61a47eb1db8)
  )
  (wire (pts (xy 228.6 76.2) (xy 228.6 78.74))
    (stroke (width 0) (type default) (color 0 0 0 0))
    (uuid 76f42cae-3a73-47eb-8de7-9439c4b3a147)
  )
  (wire (pts (xy 165.1 86.36) (xy 165.1 88.9))
    (stroke (width 0) (type default) (color 0 0 0 0))
    (uuid 7944f2e3-80b9-4a16-9eda-73da2644f6e4)
  )
  (wire (pts (xy 152.4 76.2) (xy 165.1 76.2))
    (stroke (width 0) (type default) (color 0 0 0 0))
    (uuid 87987ea3-38a7-4775-a870-16e483bfd89b)
  )
  (wire (pts (xy 215.9 78.74) (xy 215.9 76.2))
    (stroke (width 0) (type default) (color 0 0 0 0))
    (uuid 9241db5a-60f8-4100-9e19-d6a8c169725e)
  )
  (wire (pts (xy 215.9 76.2) (xy 228.6 76.2))
    (stroke (width 0) (type default) (color 0 0 0 0))
    (uuid 9d72b5b8-28b8-4878-905d-491f1384e26b)
  )
  (wire (pts (xy 63.5 76.2) (xy 63.5 78.74))
    (stroke (width 0) (type default) (color 0 0 0 0))
    (uuid 9fc9dc08-dfac-4e71-9600-addb1c357810)
  )
  (wire (pts (xy 127 86.36) (xy 127 88.9))
    (stroke (width 0) (type default) (color 0 0 0 0))
    (uuid a04a74ed-18cc-4323-b125-6ec9ea371c8a)
  )
  (wire (pts (xy 139.7 78.74) (xy 139.7 76.2))
    (stroke (width 0) (type default) (color 0 0 0 0))
    (uuid a1d61310-4fd9-4524-854a-3221deb37b59)
  )
  (wire (pts (xy 177.8 86.36) (xy 177.8 88.9))
    (stroke (width 0) (type default) (color 0 0 0 0))
    (uuid a4abf38a-e5fe-45ab-9cce-7c5c467e377a)
  )
  (wire (pts (xy 177.8 76.2) (xy 177.8 78.74))
    (stroke (width 0) (type default) (color 0 0 0 0))
    (uuid b4c22aa7-3db0-4725-b0ad-dc8389575778)
  )
  (wire (pts (xy 57.15 76.2) (xy 63.5 76.2))
    (stroke (width 0) (type default) (color 0 0 0 0))
    (uuid bb9af15f-760a-469e-bfc5-3e573d4c818d)
  )
  (wire (pts (xy 139.7 76.2) (xy 152.4 76.2))
    (stroke (width 0) (type default) (color 0 0 0 0))
    (uuid c4c00d15-c45a-4441-8b6f-16a2c2b4b43c)
  )
  (wire (pts (xy 241.3 76.2) (xy 241.3 78.74))
    (stroke (width 0) (type default) (color 0 0 0 0))
    (uuid c65aab28-c244-4006-874e-d49bf1bd8f46)
  )
  (wire (pts (xy 139.7 86.36) (xy 139.7 88.9))
    (stroke (width 0) (type default) (color 0 0 0 0))
    (uuid cca744ee-1767-4210-92fd-0e5f80cead23)
  )
  (wire (pts (xy 152.4 78.74) (xy 152.4 76.2))
    (stroke (width 0) (type default) (color 0 0 0 0))
    (uuid ccd00318-2271-406a-8bbe-f50e4687220f)
  )
  (wire (pts (xy 104.14 78.74) (xy 106.68 78.74))
    (stroke (width 0) (type default) (color 0 0 0 0))
    (uuid dc4b02bf-de02-4a33-9a6e-d2b47b9e6325)
  )
  (wire (pts (xy 203.2 86.36) (xy 203.2 88.9))
    (stroke (width 0) (type default) (color 0 0 0 0))
    (uuid e6890f9e-fbbd-4b60-8cce-5e48b613cad0)
  )
  (wire (pts (xy 215.9 86.36) (xy 215.9 88.9))
    (stroke (width 0) (type default) (color 0 0 0 0))
    (uuid f1860ac7-6c92-49fa-b76e-33adc58154c5)
  )
  (wire (pts (xy 104.14 88.9) (xy 104.14 90.17))
    (stroke (width 0) (type default) (color 0 0 0 0))
    (uuid f9a3d796-7906-4fa6-90d1-1f2e19c052b1)
  )

  (text "Load resistor\nin case we\nneed something\nfor minimum load."
    (at 127 72.39 0)
    (effects (font (size 1.27 1.27)) (justify left bottom))
    (uuid 44bb5f91-0a5d-4f36-aba4-11820d0c28d9)
  )

  (label "V3_3_PREFILT" (at 152.4 76.2 0)
    (effects (font (size 1.27 1.27)) (justify left bottom))
    (uuid bce014b3-71a2-4439-8444-494658e675e5)
  )

  (hierarchical_label "IN" (shape input) (at 57.15 76.2 180)
    (effects (font (size 1.27 1.27)) (justify right))
    (uuid 03e592b1-99d2-4020-b347-a1476a0d3259)
  )
  (hierarchical_label "EN" (shape input) (at 101.6 78.74 180)
    (effects (font (size 1.27 1.27)) (justify right))
    (uuid 1d07d674-d45f-4550-b057-ccbebc0a7c28)
  )
  (hierarchical_label "OUT" (shape output) (at 254 76.2 0)
    (effects (font (size 1.27 1.27)) (justify left))
    (uuid b691fcf8-57b5-4b8d-8677-c85c90dcaf63)
  )

  (symbol (lib_id "power:GND") (at 177.8 88.9 0) (unit 1)
    (in_bom yes) (on_board yes) (fields_autoplaced)
    (uuid 0d4f1959-9ed7-401f-8921-2f63484872b2)
    (property "Reference" "#PWR0178" (id 0) (at 177.8 95.25 0)
      (effects (font (size 1.27 1.27)) hide)
    )
    (property "Value" "GND" (id 1) (at 177.8 93.98 0))
    (property "Footprint" "" (id 2) (at 177.8 88.9 0)
      (effects (font (size 1.27 1.27)) hide)
    )
    (property "Datasheet" "" (id 3) (at 177.8 88.9 0)
      (effects (font (size 1.27 1.27)) hide)
    )
    (pin "1" (uuid 49a3efaa-793c-42c3-acd4-b22366148699))
  )

  (symbol (lib_id "power:GND") (at 203.2 88.9 0) (unit 1)
    (in_bom yes) (on_board yes) (fields_autoplaced)
    (uuid 14a0ee36-b2f6-4af5-b971-f45117a12a17)
    (property "Reference" "#PWR0182" (id 0) (at 203.2 95.25 0)
      (effects (font (size 1.27 1.27)) hide)
    )
    (property "Value" "GND" (id 1) (at 203.2 93.98 0))
    (property "Footprint" "" (id 2) (at 203.2 88.9 0)
      (effects (font (size 1.27 1.27)) hide)
    )
    (property "Datasheet" "" (id 3) (at 203.2 88.9 0)
      (effects (font (size 1.27 1.27)) hide)
    )
    (pin "1" (uuid f763d612-474a-480d-be57-197183b403d9))
  )

  (symbol (lib_id "power:GND") (at 127 88.9 0) (unit 1)
    (in_bom yes) (on_board yes) (fields_autoplaced)
    (uuid 16ed7aaf-86b8-4f34-b091-dd4e5f0846e5)
    (property "Reference" "#PWR0190" (id 0) (at 127 95.25 0)
      (effects (font (size 1.27 1.27)) hide)
    )
    (property "Value" "GND" (id 1) (at 127 93.98 0))
    (property "Footprint" "" (id 2) (at 127 88.9 0)
      (effects (font (size 1.27 1.27)) hide)
    )
    (property "Datasheet" "" (id 3) (at 127 88.9 0)
      (effects (font (size 1.27 1.27)) hide)
    )
    (pin "1" (uuid 5753be2d-3ecc-4a8a-b9de-54babd8ac94d))
  )

  (symbol (lib_id "power:GND") (at 165.1 88.9 0) (unit 1)
    (in_bom yes) (on_board yes) (fields_autoplaced)
    (uuid 23d29bc7-7d8b-4e44-bd1f-092e3772768c)
    (property "Reference" "#PWR0189" (id 0) (at 165.1 95.25 0)
      (effects (font (size 1.27 1.27)) hide)
    )
    (property "Value" "GND" (id 1) (at 165.1 93.98 0))
    (property "Footprint" "" (id 2) (at 165.1 88.9 0)
      (effects (font (size 1.27 1.27)) hide)
    )
    (property "Datasheet" "" (id 3) (at 165.1 88.9 0)
      (effects (font (size 1.27 1.27)) hide)
    )
    (pin "1" (uuid 338df5ae-a29f-4912-9d27-2ca0cd7e435d))
  )

  (symbol (lib_id "000_PreferredParts:C_1uF") (at 63.5 82.55 0) (unit 1)
    (in_bom yes) (on_board yes) (fields_autoplaced)
    (uuid 265f3379-e55a-46f9-87df-6d19f3a23c8e)
    (property "Reference" "C401" (id 0) (at 67.31 81.2799 0)
      (effects (font (size 1.27 1.27)) (justify left))
    )
    (property "Value" "C_1uF" (id 1) (at 67.31 83.8199 0)
      (effects (font (size 1.27 1.27)) (justify left))
    )
    (property "Footprint" "Capacitor_SMD:C_0603_1608Metric" (id 2) (at 64.4652 86.36 0)
      (effects (font (size 1.27 1.27)) hide)
    )
    (property "Datasheet" "~" (id 3) (at 63.5 82.55 0)
      (effects (font (size 1.27 1.27)) hide)
    )
    (property "PartSpecification" "3000-0000000136" (id 4) (at 63.5 82.55 0)
      (effects (font (size 1.27 1.27)) hide)
    )
    (pin "1" (uuid 00d1e46c-922a-4242-83da-d0e6cd302522))
    (pin "2" (uuid 3bd3680e-baa1-4963-bd45-026e0e908542))
  )

  (symbol (lib_id "Device:R") (at 127 82.55 0) (unit 1)
    (in_bom yes) (on_board yes) (fields_autoplaced)
    (uuid 284c38c7-1ff5-45a7-844e-319520f6d6e8)
    (property "Reference" "R402" (id 0) (at 129.54 81.2799 0)
      (effects (font (size 1.27 1.27)) (justify left))
    )
    (property "Value" "10k" (id 1) (at 129.54 83.8199 0)
      (effects (font (size 1.27 1.27)) (justify left))
    )
    (property "Footprint" "Resistor_SMD:R_0402_1005Metric" (id 2) (at 125.222 82.55 90)
      (effects (font (size 1.27 1.27)) hide)
    )
    (property "Datasheet" "~" (id 3) (at 127 82.55 0)
      (effects (font (size 1.27 1.27)) hide)
    )
    (pin "1" (uuid a41e7cf8-2a1d-4d71-bccd-788713bd9a1b))
    (pin "2" (uuid 11ba1943-640b-429c-aeb4-1222dca13c5c))
  )

  (symbol (lib_id "000_PreferredParts:C_10uF_0603") (at 177.8 82.55 0) (unit 1)
    (in_bom yes) (on_board yes) (fields_autoplaced)
    (uuid 2dcc21c4-124b-4be2-8c44-121fdab9cdbe)
    (property "Reference" "C407" (id 0) (at 181.61 80.0099 0)
      (effects (font (size 1.27 1.27)) (justify left))
    )
    (property "Value" "C_10uF_0603" (id 1) (at 178.435 85.09 0)
      (effects (font (size 1.27 1.27)) (justify left) hide)
    )
    (property "Footprint" "Capacitor_SMD:C_0603_1608Metric" (id 2) (at 178.7652 86.36 0)
      (effects (font (size 1.27 1.27)) hide)
    )
    (property "Datasheet" "~" (id 3) (at 177.8 82.55 0)
      (effects (font (size 1.27 1.27)) hide)
    )
    (property "DisplayValue" "10uF" (id 4) (at 181.61 82.5499 0)
      (effects (font (size 1.27 1.27)) (justify left))
    )
    (property "DisplayFootprint" "0603" (id 5) (at 181.61 85.0899 0)
      (effects (font (size 1.27 1.27)) (justify left))
    )
    (property "PartSpecification" "3000-0000000135" (id 6) (at 177.8 82.55 0)
      (effects (font (size 1.27 1.27)) hide)
    )
    (pin "1" (uuid 1086fdc8-7928-463e-aea7-c780e24724ad))
    (pin "2" (uuid 2cf0a7dc-7d32-4c78-aa54-782314c37c8c))
  )

  (symbol (lib_id "000_PreferredParts:C_1nF") (at 215.9 82.55 0) (unit 1)
    (in_bom yes) (on_board yes) (fields_autoplaced)
    (uuid 3004cd68-032d-451d-ab76-5a49e30adedd)
    (property "Reference" "C409" (id 0) (at 219.71 81.2799 0)
      (effects (font (size 1.27 1.27)) (justify left))
    )
    (property "Value" "C_1nF" (id 1) (at 219.71 83.8199 0)
      (effects (font (size 1.27 1.27)) (justify left))
    )
    (property "Footprint" "Capacitor_SMD:C_0402_1005Metric" (id 2) (at 216.8652 86.36 0)
      (effects (font (size 1.27 1.27)) hide)
    )
    (property "Datasheet" "~" (id 3) (at 215.9 82.55 0)
      (effects (font (size 1.27 1.27)) hide)
    )
    (property "PartSpecification" "3000-0000000128" (id 4) (at 215.9 82.55 0)
      (effects (font (size 1.27 1.27)) hide)
    )
    (pin "1" (uuid e6a420f7-f3d8-4e2b-bed4-c35918cad1bc))
    (pin "2" (uuid be3878f1-ae37-4947-bd02-ddf2134d912e))
  )

  (symbol (lib_id "power:GND") (at 139.7 88.9 0) (unit 1)
    (in_bom yes) (on_board yes) (fields_autoplaced)
    (uuid 34405afd-fbe6-4aea-ada8-04bf30149ae5)
    (property "Reference" "#PWR0187" (id 0) (at 139.7 95.25 0)
      (effects (font (size 1.27 1.27)) hide)
    )
    (property "Value" "GND" (id 1) (at 139.7 93.98 0))
    (property "Footprint" "" (id 2) (at 139.7 88.9 0)
      (effects (font (size 1.27 1.27)) hide)
    )
    (property "Datasheet" "" (id 3) (at 139.7 88.9 0)
      (effects (font (size 1.27 1.27)) hide)
    )
    (pin "1" (uuid 80497686-053b-4b4c-89ad-d03eb39bcbf9))
  )

  (symbol (lib_id "000_PreferredParts:C_1uF") (at 165.1 82.55 0) (unit 1)
    (in_bom yes) (on_board yes) (fields_autoplaced)
    (uuid 37ad6b20-1be3-43e9-88b1-898c3035f534)
    (property "Reference" "C406" (id 0) (at 168.91 81.2799 0)
      (effects (font (size 1.27 1.27)) (justify left))
    )
    (property "Value" "C_1uF" (id 1) (at 168.91 83.8199 0)
      (effects (font (size 1.27 1.27)) (justify left))
    )
    (property "Footprint" "Capacitor_SMD:C_0603_1608Metric" (id 2) (at 166.0652 86.36 0)
      (effects (font (size 1.27 1.27)) hide)
    )
    (property "Datasheet" "~" (id 3) (at 165.1 82.55 0)
      (effects (font (size 1.27 1.27)) hide)
    )
    (property "PartSpecification" "3000-0000000136" (id 4) (at 165.1 82.55 0)
      (effects (font (size 1.27 1.27)) hide)
    )
    (pin "1" (uuid c3841a75-469c-4730-a8ac-3ff33e3d72d7))
    (pin "2" (uuid 615c87c8-dfa4-486b-8bde-aeea69aff5ae))
  )

  (symbol (lib_id "power:GND") (at 241.3 88.9 0) (unit 1)
    (in_bom yes) (on_board yes) (fields_autoplaced)
    (uuid 44bffef3-b4ac-4440-a054-289ad991d745)
    (property "Reference" "#PWR0180" (id 0) (at 241.3 95.25 0)
      (effects (font (size 1.27 1.27)) hide)
    )
    (property "Value" "GND" (id 1) (at 241.3 93.98 0))
    (property "Footprint" "" (id 2) (at 241.3 88.9 0)
      (effects (font (size 1.27 1.27)) hide)
    )
    (property "Datasheet" "" (id 3) (at 241.3 88.9 0)
      (effects (font (size 1.27 1.27)) hide)
    )
    (pin "1" (uuid 2f363c8c-71d4-4d51-aba7-6c25085de8dc))
  )

  (symbol (lib_id "000_PreferredParts:C_10pF") (at 203.2 82.55 0) (unit 1)
    (in_bom yes) (on_board yes)
    (uuid 58c602f0-a873-4361-9730-5b90a817aa3f)
    (property "Reference" "C408" (id 0) (at 207.01 81.28 0)
      (effects (font (size 1.27 1.27)) (justify left))
    )
    (property "Value" "C_10pF" (id 1) (at 205.74 83.8201 0)
      (effects (font (size 1.27 1.27)) (justify left))
    )
    (property "Footprint" "Capacitor_SMD:C_0402_1005Metric" (id 2) (at 204.1652 86.36 0)
      (effects (font (size 1.27 1.27)) hide)
    )
    (property "Datasheet" "~" (id 3) (at 203.2 82.55 0)
      (effects (font (size 1.27 1.27)) hide)
    )
    (property "PartSpecification" "3000-0000000582" (id 4) (at 203.2 82.55 0)
      (effects (font (size 1.27 1.27)) hide)
    )
    (pin "1" (uuid 8ddb5f15-666c-470c-9b0e-403ff9c67bff))
    (pin "2" (uuid f19758d4-88aa-4811-a1ac-77f4c0eae607))
  )

  (symbol (lib_id "power:GND") (at 76.2 88.9 0) (unit 1)
    (in_bom yes) (on_board yes) (fields_autoplaced)
    (uuid 62b01365-bfa3-4170-872e-4b02d7dab34a)
    (property "Reference" "#PWR0185" (id 0) (at 76.2 95.25 0)
      (effects (font (size 1.27 1.27)) hide)
    )
    (property "Value" "GND" (id 1) (at 76.2 93.98 0))
    (property "Footprint" "" (id 2) (at 76.2 88.9 0)
      (effects (font (size 1.27 1.27)) hide)
    )
    (property "Datasheet" "" (id 3) (at 76.2 88.9 0)
      (effects (font (size 1.27 1.27)) hide)
    )
    (pin "1" (uuid 82a18e69-2b0d-4452-99f1-6e1baf02d1dd))
  )

  (symbol (lib_id "Device:R") (at 104.14 85.09 0) (unit 1)
    (in_bom yes) (on_board yes) (fields_autoplaced)
    (uuid 7c3c81ac-35c3-4e10-8f5f-b650946f39e2)
    (property "Reference" "R401" (id 0) (at 106.68 83.8199 0)
      (effects (font (size 1.27 1.27)) (justify left))
    )
    (property "Value" "10k" (id 1) (at 106.68 86.3599 0)
      (effects (font (size 1.27 1.27)) (justify left))
    )
    (property "Footprint" "Resistor_SMD:R_0402_1005Metric" (id 2) (at 102.362 85.09 90)
      (effects (font (size 1.27 1.27)) hide)
    )
    (property "Datasheet" "~" (id 3) (at 104.14 85.09 0)
      (effects (font (size 1.27 1.27)) hide)
    )
    (pin "1" (uuid 8cbeba5f-06ab-4166-bb99-e6c5518025e4))
    (pin "2" (uuid f9a3c354-0807-47ff-bf7d-34fac9842d49))
  )

  (symbol (lib_id "000_PreferredParts:C_10pF") (at 88.9 82.55 0) (unit 1)
    (in_bom yes) (on_board yes) (fields_autoplaced)
    (uuid 7d6c488a-10b0-447e-acf4-a8ac0d51ec07)
    (property "Reference" "C403" (id 0) (at 92.71 81.2799 0)
      (effects (font (size 1.27 1.27)) (justify left))
    )
    (property "Value" "C_10pF" (id 1) (at 92.71 83.8199 0)
      (effects (font (size 1.27 1.27)) (justify left))
    )
    (property "Footprint" "Capacitor_SMD:C_0402_1005Metric" (id 2) (at 89.8652 86.36 0)
      (effects (font (size 1.27 1.27)) hide)
    )
    (property "Datasheet" "~" (id 3) (at 88.9 82.55 0)
      (effects (font (size 1.27 1.27)) hide)
    )
    (property "PartSpecification" "3000-0000000582" (id 4) (at 88.9 82.55 0)
      (effects (font (size 1.27 1.27)) hide)
    )
    (pin "1" (uuid 12104cdf-25b2-4796-8e67-0b091d6b0965))
    (pin "2" (uuid ae656ef5-ed79-41c5-aefb-294753801926))
  )

  (symbol (lib_id "power:GND") (at 152.4 88.9 0) (unit 1)
    (in_bom yes) (on_board yes) (fields_autoplaced)
    (uuid 92700fc3-fc2f-43ba-8b9a-c75944196d08)
    (property "Reference" "#PWR0188" (id 0) (at 152.4 95.25 0)
      (effects (font (size 1.27 1.27)) hide)
    )
    (property "Value" "GND" (id 1) (at 152.4 93.98 0))
    (property "Footprint" "" (id 2) (at 152.4 88.9 0)
      (effects (font (size 1.27 1.27)) hide)
    )
    (property "Datasheet" "" (id 3) (at 152.4 88.9 0)
      (effects (font (size 1.27 1.27)) hide)
    )
    (pin "1" (uuid b4d754c4-593b-402e-9235-ab7bcdb15a2c))
  )

  (symbol (lib_id "power:GND") (at 63.5 88.9 0) (unit 1)
    (in_bom yes) (on_board yes) (fields_autoplaced)
    (uuid 92f54abd-32c8-47e1-85fe-9de41eeccde4)
    (property "Reference" "#PWR0186" (id 0) (at 63.5 95.25 0)
      (effects (font (size 1.27 1.27)) hide)
    )
    (property "Value" "GND" (id 1) (at 63.5 93.98 0))
    (property "Footprint" "" (id 2) (at 63.5 88.9 0)
      (effects (font (size 1.27 1.27)) hide)
    )
    (property "Datasheet" "" (id 3) (at 63.5 88.9 0)
      (effects (font (size 1.27 1.27)) hide)
    )
    (pin "1" (uuid 4729916d-2a35-469d-84fb-54bfc546ae1d))
  )

  (symbol (lib_id "Device:FerriteBead") (at 190.5 76.2 270) (unit 1)
    (in_bom yes) (on_board yes) (fields_autoplaced)
    (uuid 956dc64b-cb7a-4080-b29f-846ea73b6614)
    (property "Reference" "FB401" (id 0) (at 190.5508 68.58 90))
    (property "Value" "FerriteBead" (id 1) (at 190.5508 71.12 90))
    (property "Footprint" "Inductor_SMD:L_0402_1005Metric" (id 2) (at 190.5 74.422 90)
      (effects (font (size 1.27 1.27)) hide)
    )
    (property "Datasheet" "~" (id 3) (at 190.5 76.2 0)
      (effects (font (size 1.27 1.27)) hide)
    )
    (pin "1" (uuid 42c147cd-590c-4c61-bd86-420daa21c2c9))
    (pin "2" (uuid 1d2117ff-1a0b-48dd-824c-bbe43301b41e))
  )

  (symbol (lib_id "000_PreferredParts:C_1nF") (at 76.2 82.55 0) (unit 1)
    (in_bom yes) (on_board yes) (fields_autoplaced)
    (uuid ab475e45-c2e5-4a82-9187-5473f66a690f)
    (property "Reference" "C402" (id 0) (at 80.01 81.2799 0)
      (effects (font (size 1.27 1.27)) (justify left))
    )
    (property "Value" "C_1nF" (id 1) (at 80.01 83.8199 0)
      (effects (font (size 1.27 1.27)) (justify left))
    )
    (property "Footprint" "Capacitor_SMD:C_0402_1005Metric" (id 2) (at 77.1652 86.36 0)
      (effects (font (size 1.27 1.27)) hide)
    )
    (property "Datasheet" "~" (id 3) (at 76.2 82.55 0)
      (effects (font (size 1.27 1.27)) hide)
    )
    (property "PartSpecification" "3000-0000000128" (id 4) (at 76.2 82.55 0)
      (effects (font (size 1.27 1.27)) hide)
    )
    (pin "1" (uuid d4e40aaf-7bed-41ae-b822-828fe0c78e56))
    (pin "2" (uuid 6b0f6bb0-c90e-4ec7-8e81-2663dc72b461))
  )

  (symbol (lib_id "000_PreferredParts:C_1nF") (at 152.4 82.55 0) (unit 1)
    (in_bom yes) (on_board yes) (fields_autoplaced)
    (uuid ac8cdeeb-aba7-4fb4-a2c6-b593b4857fda)
    (property "Reference" "C405" (id 0) (at 156.21 81.2799 0)
      (effects (font (size 1.27 1.27)) (justify left))
    )
    (property "Value" "C_1nF" (id 1) (at 156.21 83.8199 0)
      (effects (font (size 1.27 1.27)) (justify left))
    )
    (property "Footprint" "Capacitor_SMD:C_0402_1005Metric" (id 2) (at 153.3652 86.36 0)
      (effects (font (size 1.27 1.27)) hide)
    )
    (property "Datasheet" "~" (id 3) (at 152.4 82.55 0)
      (effects (font (size 1.27 1.27)) hide)
    )
    (property "PartSpecification" "3000-0000000128" (id 4) (at 152.4 82.55 0)
      (effects (font (size 1.27 1.27)) hide)
    )
    (pin "1" (uuid 0dd160d4-c3d1-422a-9dc8-8b8c80e006a2))
    (pin "2" (uuid 448c3527-85e8-4719-889e-9a42f2ca34ef))
  )

  (symbol (lib_id "000_PreferredParts:C_10uF_0603") (at 241.3 82.55 0) (unit 1)
    (in_bom yes) (on_board yes) (fields_autoplaced)
    (uuid b11e37d2-4ba0-4789-9ade-2b0469f68687)
    (property "Reference" "C411" (id 0) (at 245.11 80.0099 0)
      (effects (font (size 1.27 1.27)) (justify left))
    )
    (property "Value" "C_10uF_0603" (id 1) (at 241.935 85.09 0)
      (effects (font (size 1.27 1.27)) (justify left) hide)
    )
    (property "Footprint" "Capacitor_SMD:C_0603_1608Metric" (id 2) (at 242.2652 86.36 0)
      (effects (font (size 1.27 1.27)) hide)
    )
    (property "Datasheet" "~" (id 3) (at 241.3 82.55 0)
      (effects (font (size 1.27 1.27)) hide)
    )
    (property "DisplayValue" "10uF" (id 4) (at 245.11 82.5499 0)
      (effects (font (size 1.27 1.27)) (justify left))
    )
    (property "DisplayFootprint" "0603" (id 5) (at 245.11 85.0899 0)
      (effects (font (size 1.27 1.27)) (justify left))
    )
    (property "PartSpecification" "3000-0000000135" (id 6) (at 241.3 82.55 0)
      (effects (font (size 1.27 1.27)) hide)
    )
    (pin "1" (uuid 16cf24f5-1809-43c8-ad04-92e4364f4ce6))
    (pin "2" (uuid 5fd1fdd3-fae1-4820-a918-89bf4b238671))
  )

  (symbol (lib_id "000_PreferredParts:C_10pF") (at 139.7 82.55 0) (unit 1)
    (in_bom yes) (on_board yes)
    (uuid b3b0361a-fab8-4c96-992b-bdb2d0b33d7e)
    (property "Reference" "C404" (id 0) (at 143.51 81.2799 0)
      (effects (font (size 1.27 1.27)) (justify left))
    )
    (property "Value" "C_10pF" (id 1) (at 142.24 83.82 0)
      (effects (font (size 1.27 1.27)) (justify left))
    )
    (property "Footprint" "Capacitor_SMD:C_0402_1005Metric" (id 2) (at 140.6652 86.36 0)
      (effects (font (size 1.27 1.27)) hide)
    )
    (property "Datasheet" "~" (id 3) (at 139.7 82.55 0)
      (effects (font (size 1.27 1.27)) hide)
    )
    (property "PartSpecification" "3000-0000000582" (id 4) (at 139.7 82.55 0)
      (effects (font (size 1.27 1.27)) hide)
    )
    (pin "1" (uuid e4f0fdde-fbf8-4319-a6cd-920f8ebefee2))
    (pin "2" (uuid fd1d5279-0268-4be4-83cb-d0aaf136c135))
  )

  (symbol (lib_id "power:GND") (at 215.9 88.9 0) (unit 1)
    (in_bom yes) (on_board yes) (fields_autoplaced)
    (uuid b3f4fd54-57b8-4e0c-ab55-02818a538af2)
    (property "Reference" "#PWR0181" (id 0) (at 215.9 95.25 0)
      (effects (font (size 1.27 1.27)) hide)
    )
    (property "Value" "GND" (id 1) (at 215.9 93.98 0))
    (property "Footprint" "" (id 2) (at 215.9 88.9 0)
      (effects (font (size 1.27 1.27)) hide)
    )
    (property "Datasheet" "" (id 3) (at 215.9 88.9 0)
      (effects (font (size 1.27 1.27)) hide)
    )
    (pin "1" (uuid dd23bd14-be79-4b40-9ea4-3a669e92c783))
  )

  (symbol (lib_id "power:GND") (at 88.9 88.9 0) (unit 1)
    (in_bom yes) (on_board yes) (fields_autoplaced)
    (uuid bdd1bed3-84b1-4d6e-bed1-9344f64848cc)
    (property "Reference" "#PWR0184" (id 0) (at 88.9 95.25 0)
      (effects (font (size 1.27 1.27)) hide)
    )
    (property "Value" "GND" (id 1) (at 88.9 93.98 0))
    (property "Footprint" "" (id 2) (at 88.9 88.9 0)
      (effects (font (size 1.27 1.27)) hide)
    )
    (property "Datasheet" "" (id 3) (at 88.9 88.9 0)
      (effects (font (size 1.27 1.27)) hide)
    )
    (pin "1" (uuid ee699b9c-5a20-49b8-b3be-64940cdbe19e))
  )

  (symbol (lib_id "power:GND") (at 114.3 91.44 0) (unit 1)
    (in_bom yes) (on_board yes) (fields_autoplaced)
    (uuid ca231c54-c670-490e-856b-9465d890c270)
    (property "Reference" "#PWR0183" (id 0) (at 114.3 97.79 0)
      (effects (font (size 1.27 1.27)) hide)
    )
    (property "Value" "GND" (id 1) (at 114.3 96.52 0))
    (property "Footprint" "" (id 2) (at 114.3 91.44 0)
      (effects (font (size 1.27 1.27)) hide)
    )
    (property "Datasheet" "" (id 3) (at 114.3 91.44 0)
      (effects (font (size 1.27 1.27)) hide)
    )
    (pin "1" (uuid a6504d34-2a01-4db0-bc4b-576bcc407e86))
  )

  (symbol (lib_id "000_PreferredParts:C_1uF") (at 228.6 82.55 0) (unit 1)
    (in_bom yes) (on_board yes) (fields_autoplaced)
    (uuid d985d597-314e-4faa-a15b-c048c27a6187)
    (property "Reference" "C410" (id 0) (at 232.41 81.2799 0)
      (effects (font (size 1.27 1.27)) (justify left))
    )
    (property "Value" "C_1uF" (id 1) (at 232.41 83.8199 0)
      (effects (font (size 1.27 1.27)) (justify left))
    )
    (property "Footprint" "Capacitor_SMD:C_0603_1608Metric" (id 2) (at 229.5652 86.36 0)
      (effects (font (size 1.27 1.27)) hide)
    )
    (property "Datasheet" "~" (id 3) (at 228.6 82.55 0)
      (effects (font (size 1.27 1.27)) hide)
    )
    (property "PartSpecification" "3000-0000000136" (id 4) (at 228.6 82.55 0)
      (effects (font (size 1.27 1.27)) hide)
    )
    (pin "1" (uuid b0a1fb2f-2a8c-4ece-bb43-b8ce5c8ba1ae))
    (pin "2" (uuid 26ad3bf1-a8ad-4c58-a6ae-c712f17b284d))
  )

  (symbol (lib_id "POWDER_Power:LP5907MFX-x.x{slash}NOPB") (at 114.3 77.47 0) (unit 1)
    (in_bom yes) (on_board yes) (fields_autoplaced)
    (uuid f709f9c8-db32-4315-94e4-5af4b6e7044b)
    (property "Reference" "U401" (id 0) (at 114.3 68.58 0))
    (property "Value" "LP5907MFX-x.x/NOPB" (id 1) (at 114.3 71.12 0))
    (property "Footprint" "Package_TO_SOT_SMD:SOT-23-5" (id 2) (at 114.3 69.85 0)
      (effects (font (size 1.27 1.27)) hide)
    )
    (property "Datasheet" "" (id 3) (at 114.3 77.47 0)
      (effects (font (size 1.27 1.27)) hide)
    )
    (pin "1" (uuid 8b3e6828-0f43-4b19-9cb2-ac5889d263ef))
    (pin "2" (uuid a41b6f32-8b4c-4901-9566-f0fa57a9152f))
    (pin "3" (uuid 79fb4bb9-b6a3-47e7-b5ee-894e940d9099))
    (pin "4" (uuid b5d80ac5-e4f1-4afa-b11a-16a3db21327c))
    (pin "5" (uuid c82023c4-eb4a-487d-9003-76f7cac25638))
  )

  (symbol (lib_id "power:GND") (at 228.6 88.9 0) (unit 1)
    (in_bom yes) (on_board yes) (fields_autoplaced)
    (uuid fe139c88-be39-4b18-8d41-d7d88abd54c1)
    (property "Reference" "#PWR0179" (id 0) (at 228.6 95.25 0)
      (effects (font (size 1.27 1.27)) hide)
    )
    (property "Value" "GND" (id 1) (at 228.6 93.98 0))
    (property "Footprint" "" (id 2) (at 228.6 88.9 0)
      (effects (font (size 1.27 1.27)) hide)
    )
    (property "Datasheet" "" (id 3) (at 228.6 88.9 0)
      (effects (font (size 1.27 1.27)) hide)
    )
    (pin "1" (uuid 8bbbf126-6ee4-4826-8411-51bf44686414))
  )
)
