EESchema Schematic File Version 4
EELAYER 30 0
EELAYER END
$Descr A4 11693 8268
encoding utf-8
Sheet 28 39
Title ""
Date ""
Rev ""
Comp ""
Comment1 ""
Comment2 ""
Comment3 ""
Comment4 ""
$EndDescr
$Comp
L POWDER_Digital:10M50DAF256 U2201
U 6 1 5F9BF77D
P 4750 3600
F 0 "U2201" H 4750 3750 50  0000 C CNN
F 1 "‎10M08DAF256C8G" H 4750 3600 50  0000 C CNN
F 2 "Package_BGA:BGA-256_17.0x17.0mm_Layout16x16_P1.0mm_Ball0.5mm_Pad0.4mm_NSMD" H 4750 3600 50  0001 C CNN
F 3 "" H 4750 3600 50  0001 C CNN
F 4 "3000-0000001300" H 4750 3600 50  0001 C CNN "PartSpecification"
	6    4750 3600
	1    0    0    -1  
$EndComp
$Comp
L 000_PreferredParts:C_1nF C?
U 1 1 5FBB0E82
P 5500 2000
AR Path="/5F8E5420/5F971A6D/5FBB0E82" Ref="C?"  Part="1" 
AR Path="/5F8E5420/5F9B591E/5FBB0E82" Ref="C904"  Part="1" 
AR Path="/605746B5/5F8E5420/5F9B591E/5FBB0E82" Ref="C2804"  Part="1" 
F 0 "C2804" H 5525 2100 50  0000 L CNN
F 1 "C_1nF" H 5525 1900 50  0000 L CNN
F 2 "Capacitor_SMD:C_0402_1005Metric" H 5538 1850 50  0001 C CNN
F 3 "~" H 5500 2000 50  0001 C CNN
F 4 "3000-0000000128" H 5500 2000 50  0001 C CNN "PartSpecification"
	1    5500 2000
	1    0    0    -1  
$EndComp
$Comp
L 000_PreferredParts:C_1nF C?
U 1 1 5FBB0E89
P 3950 2000
AR Path="/5F8E5420/5F971A6D/5FBB0E89" Ref="C?"  Part="1" 
AR Path="/5F8E5420/5F9B591E/5FBB0E89" Ref="C901"  Part="1" 
AR Path="/605746B5/5F8E5420/5F9B591E/5FBB0E89" Ref="C2801"  Part="1" 
F 0 "C2801" H 3975 2100 50  0000 L CNN
F 1 "C_1nF" H 3975 1900 50  0000 L CNN
F 2 "Capacitor_SMD:C_0402_1005Metric" H 3988 1850 50  0001 C CNN
F 3 "~" H 3950 2000 50  0001 C CNN
F 4 "3000-0000000128" H 3950 2000 50  0001 C CNN "PartSpecification"
	1    3950 2000
	1    0    0    -1  
$EndComp
$Comp
L 000_PreferredParts:C_0_1uF C?
U 1 1 5FBB0E92
P 5850 2000
AR Path="/5F8E5420/5F971A6D/5FBB0E92" Ref="C?"  Part="1" 
AR Path="/5F8E5420/5F9B591E/5FBB0E92" Ref="C905"  Part="1" 
AR Path="/605746B5/5F8E5420/5F9B591E/5FBB0E92" Ref="C2805"  Part="1" 
F 0 "C2805" H 5875 2100 50  0000 L CNN
F 1 "C_0_1uF" H 5875 1900 50  0001 L CNN
F 2 "Capacitor_SMD:C_0402_1005Metric" H 5888 1850 50  0001 C CNN
F 3 "~" H 5850 2000 50  0001 C CNN
F 4 "0.1uF" H 6000 1900 50  0000 C CNN "DisplayValue"
F 5 "3000-0000000125" H 5850 2000 50  0001 C CNN "PartSpecification"
F 6 "100V" H 5850 2000 50  0001 C CNN "Voltage"
	1    5850 2000
	1    0    0    -1  
$EndComp
$Comp
L Device:R R?
U 1 1 5FBB0E98
P 6200 2000
AR Path="/5F8E5420/5F971A6D/5FBB0E98" Ref="R?"  Part="1" 
AR Path="/5F8E5420/5F9B591E/5FBB0E98" Ref="R909"  Part="1" 
AR Path="/605746B5/5F8E5420/5F9B591E/5FBB0E98" Ref="R2801"  Part="1" 
F 0 "R2801" V 6280 2000 50  0000 C CNN
F 1 "10k" V 6200 2000 50  0000 C CNN
F 2 "Resistor_SMD:R_0402_1005Metric" V 6130 2000 50  0001 C CNN
F 3 "~" H 6200 2000 50  0001 C CNN
F 4 "3000-0000000131" H 6200 2000 50  0001 C CNN "PartSpecification"
	1    6200 2000
	1    0    0    -1  
$EndComp
$Comp
L power:GND #PWR?
U 1 1 5FBB0E9E
P 6200 2200
AR Path="/5F8E5420/5F971A6D/5FBB0E9E" Ref="#PWR?"  Part="1" 
AR Path="/5F8E5420/5F9B591E/5FBB0E9E" Ref="#PWR?"  Part="1" 
AR Path="/605746B5/5F8E5420/5F9B591E/5FBB0E9E" Ref="#PWR?"  Part="1" 
F 0 "#PWR?" H 6200 1950 50  0001 C CNN
F 1 "GND" H 6200 2050 50  0000 C CNN
F 2 "" H 6200 2200 50  0001 C CNN
F 3 "" H 6200 2200 50  0001 C CNN
	1    6200 2200
	1    0    0    -1  
$EndComp
Wire Wire Line
	6200 2200 6200 2150
Wire Wire Line
	5500 2150 5500 2200
Wire Wire Line
	5500 2200 5850 2200
Connection ~ 6200 2200
Wire Wire Line
	5850 2200 5850 2150
Connection ~ 5850 2200
Wire Wire Line
	5850 2200 6200 2200
Wire Wire Line
	4800 2350 4800 1750
Wire Wire Line
	4800 1750 5500 1750
Wire Wire Line
	6200 1750 6200 1850
Wire Wire Line
	5850 1850 5850 1750
Connection ~ 5850 1750
Wire Wire Line
	5850 1750 6200 1750
Wire Wire Line
	5500 1850 5500 1750
Connection ~ 5500 1750
Wire Wire Line
	5500 1750 5850 1750
$Comp
L power:GND #PWR?
U 1 1 5FBB0EB4
P 3950 2200
AR Path="/5F8E5420/5F971A6D/5FBB0EB4" Ref="#PWR?"  Part="1" 
AR Path="/5F8E5420/5F9B591E/5FBB0EB4" Ref="#PWR?"  Part="1" 
AR Path="/605746B5/5F8E5420/5F9B591E/5FBB0EB4" Ref="#PWR?"  Part="1" 
F 0 "#PWR?" H 3950 1950 50  0001 C CNN
F 1 "GND" H 3950 2050 50  0000 C CNN
F 2 "" H 3950 2200 50  0001 C CNN
F 3 "" H 3950 2200 50  0001 C CNN
	1    3950 2200
	1    0    0    -1  
$EndComp
Wire Wire Line
	3950 2200 3950 2150
Wire Wire Line
	3950 1850 3950 1750
Wire Wire Line
	3950 1750 4700 1750
Wire Wire Line
	4700 1750 4700 2350
Wire Wire Line
	4700 1750 4700 1650
Wire Wire Line
	4700 1650 4750 1650
Wire Wire Line
	4800 1650 4800 1750
Connection ~ 4700 1750
Connection ~ 4800 1750
$Comp
L 000_PreferredParts:C_1nF C?
U 1 1 5FBB0EC4
P 4300 2000
AR Path="/5F8E5420/5F971A6D/5FBB0EC4" Ref="C?"  Part="1" 
AR Path="/5F8E5420/5F9B591E/5FBB0EC4" Ref="C902"  Part="1" 
AR Path="/605746B5/5F8E5420/5F9B591E/5FBB0EC4" Ref="C2802"  Part="1" 
F 0 "C2802" H 4325 2100 50  0000 L CNN
F 1 "C_1nF" H 4325 1900 50  0000 L CNN
F 2 "Capacitor_SMD:C_0402_1005Metric" H 4338 1850 50  0001 C CNN
F 3 "~" H 4300 2000 50  0001 C CNN
F 4 "3000-0000000128" H 4300 2000 50  0001 C CNN "PartSpecification"
	1    4300 2000
	1    0    0    -1  
$EndComp
$Comp
L power:GND #PWR?
U 1 1 5FBB0ECA
P 4300 2200
AR Path="/5F8E5420/5F971A6D/5FBB0ECA" Ref="#PWR?"  Part="1" 
AR Path="/5F8E5420/5F9B591E/5FBB0ECA" Ref="#PWR?"  Part="1" 
AR Path="/605746B5/5F8E5420/5F9B591E/5FBB0ECA" Ref="#PWR?"  Part="1" 
F 0 "#PWR?" H 4300 1950 50  0001 C CNN
F 1 "GND" H 4300 2050 50  0000 C CNN
F 2 "" H 4300 2200 50  0001 C CNN
F 3 "" H 4300 2200 50  0001 C CNN
	1    4300 2200
	1    0    0    -1  
$EndComp
Wire Wire Line
	4300 2200 4300 2150
Wire Wire Line
	4300 1850 4600 1850
Wire Wire Line
	4600 1850 4600 2350
Wire Wire Line
	4600 1850 4600 1650
Wire Wire Line
	4600 1650 4700 1650
Connection ~ 4600 1850
Connection ~ 4700 1650
$Comp
L 000_PreferredParts:C_1nF C?
U 1 1 5FBB6716
P 5100 2000
AR Path="/5F8E5420/5F971A6D/5FBB6716" Ref="C?"  Part="1" 
AR Path="/5F8E5420/5F9B591E/5FBB6716" Ref="C903"  Part="1" 
AR Path="/605746B5/5F8E5420/5F9B591E/5FBB6716" Ref="C2803"  Part="1" 
F 0 "C2803" H 5125 2100 50  0000 L CNN
F 1 "C_1nF" H 5125 1900 50  0000 L CNN
F 2 "Capacitor_SMD:C_0402_1005Metric" H 5138 1850 50  0001 C CNN
F 3 "~" H 5100 2000 50  0001 C CNN
F 4 "3000-0000000128" H 5100 2000 50  0001 C CNN "PartSpecification"
	1    5100 2000
	1    0    0    -1  
$EndComp
$Comp
L power:GND #PWR?
U 1 1 5FBB671C
P 5100 2200
AR Path="/5F8E5420/5F971A6D/5FBB671C" Ref="#PWR?"  Part="1" 
AR Path="/5F8E5420/5F9B591E/5FBB671C" Ref="#PWR?"  Part="1" 
AR Path="/605746B5/5F8E5420/5F9B591E/5FBB671C" Ref="#PWR?"  Part="1" 
F 0 "#PWR?" H 5100 1950 50  0001 C CNN
F 1 "GND" H 5100 2050 50  0000 C CNN
F 2 "" H 5100 2200 50  0001 C CNN
F 3 "" H 5100 2200 50  0001 C CNN
	1    5100 2200
	1    0    0    -1  
$EndComp
Wire Wire Line
	5100 2200 5100 2150
Wire Wire Line
	4900 2350 4900 1850
Wire Wire Line
	4900 1650 4800 1650
Connection ~ 4800 1650
Wire Wire Line
	5100 1850 4900 1850
Connection ~ 4900 1850
Wire Wire Line
	4900 1850 4900 1650
Text Label 6000 1750 0    50   ~ 0
VDDIO_6
Text HLabel 1750 2500 0    50   BiDi ~ 0
FRONTEND_GPIO[0..15]
Text HLabel 6500 1750 2    50   Input ~ 0
FRONTEND_VIO
Wire Wire Line
	6500 1750 6200 1750
Connection ~ 6200 1750
Wire Bus Line
	1750 2500 2250 2500
Entry Wire Line
	2250 4350 2350 4450
Entry Wire Line
	2250 4250 2350 4350
Entry Wire Line
	2250 4150 2350 4250
Entry Wire Line
	2250 3750 2350 3850
Entry Wire Line
	2250 3650 2350 3750
Entry Wire Line
	2250 3550 2350 3650
Entry Wire Line
	2250 3350 2350 3450
Entry Wire Line
	2250 3150 2350 3250
Entry Wire Line
	2250 3450 2350 3550
Entry Wire Line
	2250 3050 2350 3150
Entry Wire Line
	2250 2950 2350 3050
Text Label 2400 3250 0    50   ~ 0
FRONTEND_GPIO15
Wire Wire Line
	2350 3150 3350 3150
Wire Wire Line
	2350 3550 3350 3550
Wire Wire Line
	2350 3250 3350 3250
Wire Wire Line
	6150 3550 7150 3550
Wire Wire Line
	2350 3450 3350 3450
Wire Wire Line
	2350 3650 3350 3650
Wire Wire Line
	2350 3750 3350 3750
Wire Wire Line
	2350 3850 3350 3850
Wire Wire Line
	2350 4250 3350 4250
Wire Wire Line
	2350 4350 3350 4350
Wire Wire Line
	2350 4450 3350 4450
Text Label 2400 3150 0    50   ~ 0
FRONTEND_GPIO14
Text Label 2400 3550 0    50   ~ 0
FRONTEND_GPIO13
Text Label 2400 3650 0    50   ~ 0
FRONTEND_GPIO11
Text Label 2400 3450 0    50   ~ 0
FRONTEND_GPIO10
Text Label 2400 4250 0    50   ~ 0
FRONTEND_GPIO9
Text Label 2400 4350 0    50   ~ 0
FRONTEND_GPIO8
Text Label 2400 4450 0    50   ~ 0
FRONTEND_GPIO7
Text Label 6250 3550 0    50   ~ 0
FRONTEND_GPIO6
Text Label 6250 3850 0    50   ~ 0
FRONTEND_GPIO5
Text Label 6250 3650 0    50   ~ 0
FRONTEND_GPIO4
Text Label 2400 3750 0    50   ~ 0
FRONTEND_GPIO3
Text Label 6250 4050 0    50   ~ 0
FRONTEND_GPIO2
Text Label 6250 4250 0    50   ~ 0
FRONTEND_GPIO1
Text Label 2400 3850 0    50   ~ 0
FRONTEND_GPIO0
NoConn ~ 6150 3150
NoConn ~ 6150 3250
NoConn ~ 6150 3350
NoConn ~ 6150 3450
NoConn ~ 6150 3750
NoConn ~ 6150 3950
NoConn ~ 6150 4150
$Comp
L power:PWR_FLAG #FLG?
U 1 1 616FE283
P 4750 1500
F 0 "#FLG?" H 4750 1575 50  0001 C CNN
F 1 "PWR_FLAG" H 4750 1673 50  0000 C CNN
F 2 "" H 4750 1500 50  0001 C CNN
F 3 "~" H 4750 1500 50  0001 C CNN
	1    4750 1500
	1    0    0    -1  
$EndComp
Wire Wire Line
	4750 1500 4750 1650
Connection ~ 4750 1650
Wire Wire Line
	4750 1650 4800 1650
Wire Wire Line
	6150 3650 7150 3650
Wire Wire Line
	6150 3850 7150 3850
Wire Wire Line
	6150 4050 7150 4050
Wire Wire Line
	6150 4250 7150 4250
NoConn ~ 3350 3350
NoConn ~ 3350 3950
NoConn ~ 3350 4050
NoConn ~ 3350 4150
Entry Wire Line
	7250 3450 7150 3550
Entry Wire Line
	7250 3550 7150 3650
Entry Wire Line
	7250 3750 7150 3850
Entry Wire Line
	7250 3950 7150 4050
Entry Wire Line
	7250 4150 7150 4250
Wire Bus Line
	7250 5000 2250 5000
NoConn ~ 3350 2950
Text Label 2400 3050 0    50   ~ 0
FRONTEND_GPIO12
Wire Wire Line
	2350 3050 3350 3050
Wire Bus Line
	7250 3450 7250 5000
Wire Bus Line
	2250 2500 2250 5000
$EndSCHEMATC
