EESchema Schematic File Version 4
LIBS:endpoint_shield-cache
EELAYER 29 0
EELAYER END
$Descr A4 11693 8268
encoding utf-8
Sheet 2 3
Title ""
Date ""
Rev ""
Comp ""
Comment1 ""
Comment2 ""
Comment3 ""
Comment4 ""
$EndDescr
$Comp
L POWDER_Power:EL3H7-G U202
U 1 1 5C77E310
P 6100 3600
F 0 "U202" H 6100 3875 50  0000 C CNN
F 1 "EL3H7-G" H 6100 3784 50  0000 C CNN
F 2 "POWDER_Power:EL3H7-G" H 6100 3300 50  0001 C CNN
F 3 "" H 6100 3600 50  0001 C CNN
	1    6100 3600
	1    0    0    -1  
$EndComp
Wire Wire Line
	5900 3550 5700 3550
Wire Wire Line
	5900 3650 5800 3650
$Comp
L Device:R_Small R203
U 1 1 5C77E326
P 5600 3550
F 0 "R203" V 5404 3550 50  0000 C CNN
F 1 "1k" V 5495 3550 50  0000 C CNN
F 2 "Resistor_SMD:R_0603_1608Metric_Pad1.05x0.95mm_HandSolder" H 5600 3550 50  0001 C CNN
F 3 "~" H 5600 3550 50  0001 C CNN
	1    5600 3550
	0    1    1    0   
$EndComp
Text Notes 7400 2900 2    50   ~ 0
2mm Pitch
NoConn ~ 6950 3250
NoConn ~ 6950 3350
NoConn ~ 6950 3650
NoConn ~ 6950 3750
NoConn ~ 7450 3750
NoConn ~ 7450 3650
NoConn ~ 7450 3550
NoConn ~ 7450 3450
NoConn ~ 7450 3350
NoConn ~ 7450 3250
Wire Wire Line
	6950 3450 6850 3450
Wire Wire Line
	6850 3450 6850 3650
Wire Wire Line
	6300 3550 6950 3550
Wire Wire Line
	5800 3650 5800 3950
Text Notes 7550 3650 0    50   ~ 0
Pin 10 Key
$Comp
L Connector_Generic:Conn_02x06_Odd_Even J201
U 1 1 5C77E346
P 7150 3450
F 0 "J201" H 7200 3867 50  0000 C CNN
F 1 "Conn_02x06_Odd_Even" H 7200 3776 50  0000 C CNN
F 2 "Connector_PinHeader_2.00mm:PinHeader_2x06_P2.00mm_Vertical" H 7150 3450 50  0001 C CNN
F 3 "~" H 7150 3450 50  0001 C CNN
	1    7150 3450
	1    0    0    -1  
$EndComp
$Comp
L Device:C_Small C203
U 1 1 5C77EAC7
P 3750 4250
F 0 "C203" H 3842 4296 50  0000 L CNN
F 1 "10nF" H 3842 4205 50  0000 L CNN
F 2 "Capacitor_SMD:C_0603_1608Metric_Pad1.05x0.95mm_HandSolder" H 3750 4250 50  0001 C CNN
F 3 "~" H 3750 4250 50  0001 C CNN
	1    3750 4250
	1    0    0    -1  
$EndComp
Wire Wire Line
	3950 3550 3350 3550
$Comp
L Device:R_Small R202
U 1 1 5C7801D9
P 5050 3350
F 0 "R202" H 5109 3396 50  0000 L CNN
F 1 "10k" H 5109 3305 50  0000 L CNN
F 2 "Resistor_SMD:R_0603_1608Metric_Pad1.05x0.95mm_HandSolder" H 5050 3350 50  0001 C CNN
F 3 "~" H 5050 3350 50  0001 C CNN
	1    5050 3350
	1    0    0    -1  
$EndComp
Wire Wire Line
	5050 3750 4950 3750
Wire Wire Line
	5050 3750 5050 3950
Connection ~ 5050 3750
$Comp
L Device:C_Small C204
U 1 1 5C780B81
P 5050 4250
F 0 "C204" H 5142 4296 50  0000 L CNN
F 1 "1uF" H 5142 4205 50  0000 L CNN
F 2 "Capacitor_SMD:C_0603_1608Metric_Pad1.05x0.95mm_HandSolder" H 5050 4250 50  0001 C CNN
F 3 "~" H 5050 4250 50  0001 C CNN
	1    5050 4250
	1    0    0    -1  
$EndComp
$Comp
L power:GND #PWR?
U 1 1 5C780BED
P 5050 4550
F 0 "#PWR?" H 5050 4300 50  0001 C CNN
F 1 "GND" H 5055 4377 50  0000 C CNN
F 2 "" H 5050 4550 50  0001 C CNN
F 3 "" H 5050 4550 50  0001 C CNN
	1    5050 4550
	1    0    0    -1  
$EndComp
Wire Wire Line
	5050 4350 5050 4450
Wire Wire Line
	4450 4150 4450 4450
Wire Wire Line
	3750 4350 3750 4450
Wire Wire Line
	5050 3250 5050 3150
Wire Wire Line
	3850 3050 3850 3150
Wire Wire Line
	5050 3150 4450 3150
Wire Wire Line
	4450 3150 4450 3350
Wire Wire Line
	4450 3150 3850 3150
Wire Wire Line
	5050 4450 5050 4550
Connection ~ 5050 4450
Connection ~ 4450 4450
Wire Wire Line
	4450 4450 5050 4450
Text HLabel 3050 3550 0    50   Input ~ 0
NUC_Reset
$Comp
L Device:C_Small C202
U 1 1 5CA42E64
P 3150 4250
F 0 "C202" H 3242 4296 50  0000 L CNN
F 1 "10nF" H 3242 4205 50  0000 L CNN
F 2 "Capacitor_SMD:C_0603_1608Metric_Pad1.05x0.95mm_HandSolder" H 3150 4250 50  0001 C CNN
F 3 "~" H 3150 4250 50  0001 C CNN
	1    3150 4250
	1    0    0    -1  
$EndComp
$Comp
L Timer:LM555 U201
U 1 1 5CA4309E
P 4450 3750
F 0 "U201" H 4150 4100 50  0000 C CNN
F 1 "LM555" H 4700 4100 50  0000 C CNN
F 2 "Package_SO:SOIC-8_3.9x4.9mm_P1.27mm" H 4450 3750 50  0001 C CNN
F 3 "http://www.ti.com/lit/ds/symlink/lm555.pdf" H 4450 3750 50  0001 C CNN
	1    4450 3750
	1    0    0    -1  
$EndComp
Wire Wire Line
	5050 3450 5050 3750
Wire Wire Line
	4950 3950 5050 3950
Connection ~ 5050 3950
Wire Wire Line
	5050 3950 5050 4150
Wire Wire Line
	3950 3950 3850 3950
Wire Wire Line
	3850 3950 3850 3150
Wire Wire Line
	3950 3750 3750 3750
Wire Wire Line
	3750 3750 3750 4150
Wire Wire Line
	3750 4450 4450 4450
Wire Wire Line
	4950 3550 5500 3550
Connection ~ 4450 3150
Connection ~ 3850 3150
$Comp
L Device:C_Small C201
U 1 1 5CA6FA52
P 2800 4250
F 0 "C201" H 2892 4296 50  0000 L CNN
F 1 "1uF" H 2892 4205 50  0000 L CNN
F 2 "Capacitor_SMD:C_0603_1608Metric_Pad1.05x0.95mm_HandSolder" H 2800 4250 50  0001 C CNN
F 3 "~" H 2800 4250 50  0001 C CNN
	1    2800 4250
	1    0    0    -1  
$EndComp
Wire Wire Line
	3150 4150 3150 4050
Wire Wire Line
	3150 4050 2800 4050
Wire Wire Line
	2800 4050 2800 3950
Wire Wire Line
	2800 4050 2800 4150
Connection ~ 2800 4050
Wire Wire Line
	2800 4350 2800 4450
Wire Wire Line
	2800 4450 3150 4450
Wire Wire Line
	3150 4450 3150 4350
Wire Wire Line
	2800 4450 2800 4550
Connection ~ 2800 4450
$Comp
L power:GND #PWR?
U 1 1 5CA71EBE
P 2800 4550
F 0 "#PWR?" H 2800 4300 50  0001 C CNN
F 1 "GND" H 2805 4377 50  0000 C CNN
F 2 "" H 2800 4550 50  0001 C CNN
F 3 "" H 2800 4550 50  0001 C CNN
	1    2800 4550
	1    0    0    -1  
$EndComp
$Comp
L Device:R_Small R201
U 1 1 5CB02364
P 3350 3300
F 0 "R201" H 3409 3346 50  0000 L CNN
F 1 "10k" H 3409 3255 50  0000 L CNN
F 2 "Resistor_SMD:R_0603_1608Metric_Pad1.05x0.95mm_HandSolder" H 3350 3300 50  0001 C CNN
F 3 "~" H 3350 3300 50  0001 C CNN
	1    3350 3300
	1    0    0    -1  
$EndComp
Wire Wire Line
	3350 3400 3350 3550
Connection ~ 3350 3550
Wire Wire Line
	3350 3550 3050 3550
Wire Wire Line
	3350 3200 3350 3050
$Comp
L power:GND #PWR?
U 1 1 5CC88CD1
P 5800 3950
F 0 "#PWR?" H 5800 3700 50  0001 C CNN
F 1 "GND" H 5805 3777 50  0000 C CNN
F 2 "" H 5800 3950 50  0001 C CNN
F 3 "" H 5800 3950 50  0001 C CNN
	1    5800 3950
	1    0    0    -1  
$EndComp
Text Notes 4650 2950 0    50   ~ 0
10k and 1uF give 11ms pulse
$Comp
L power:+5V #PWR?
U 1 1 5CFC9B9F
P 3350 3050
F 0 "#PWR?" H 3350 2900 50  0001 C CNN
F 1 "+5V" H 3365 3223 50  0000 C CNN
F 2 "" H 3350 3050 50  0001 C CNN
F 3 "" H 3350 3050 50  0001 C CNN
	1    3350 3050
	1    0    0    -1  
$EndComp
$Comp
L power:+5V #PWR?
U 1 1 5CFCA1A0
P 3850 3050
F 0 "#PWR?" H 3850 2900 50  0001 C CNN
F 1 "+5V" H 3865 3223 50  0000 C CNN
F 2 "" H 3850 3050 50  0001 C CNN
F 3 "" H 3850 3050 50  0001 C CNN
	1    3850 3050
	1    0    0    -1  
$EndComp
$Comp
L power:+5V #PWR?
U 1 1 5CFCAABD
P 2800 3950
F 0 "#PWR?" H 2800 3800 50  0001 C CNN
F 1 "+5V" H 2815 4123 50  0000 C CNN
F 2 "" H 2800 3950 50  0001 C CNN
F 3 "" H 2800 3950 50  0001 C CNN
	1    2800 3950
	1    0    0    -1  
$EndComp
Wire Wire Line
	6300 3650 6850 3650
$EndSCHEMATC
