EESchema Schematic File Version 4
LIBS:power_supply-cache
EELAYER 29 0
EELAYER END
$Descr A4 11693 8268
encoding utf-8
Sheet 1 5
Title ""
Date ""
Rev ""
Comp ""
Comment1 ""
Comment2 ""
Comment3 ""
Comment4 ""
$EndDescr
$Sheet
S 2150 1000 1000 700 
U 5C66EB2D
F0 "Control_NUC_PS" 50
F1 "Control_NUC_PS.sch" 50
F2 "PWRGD" O R 3150 1100 100
F3 "RSM" O R 3150 1450 100
F4 "RSP" O R 3150 1600 100
$EndSheet
Text GLabel 850  4900 0    50   Input ~ 0
VDD
$Comp
L power:GND #PWR?
U 1 1 5C673716
P 1400 5300
F 0 "#PWR?" H 1400 5050 50  0001 C CNN
F 1 "GND" H 1405 5127 50  0000 C CNN
F 2 "" H 1400 5300 50  0001 C CNN
F 3 "" H 1400 5300 50  0001 C CNN
	1    1400 5300
	1    0    0    -1  
$EndComp
$Comp
L Connector:Screw_Terminal_01x02 J101
U 1 1 5C6737B2
P 1900 4900
F 0 "J101" H 1980 4892 50  0000 L CNN
F 1 "Screw_Terminal_01x02" H 1980 4801 50  0000 L CNN
F 2 "TerminalBlock:TerminalBlock_bornier-2_P5.08mm" H 1900 4900 50  0001 C CNN
F 3 "~" H 1900 4900 50  0001 C CNN
F 4 "0398800302" H 1900 4900 50  0001 C CNN "PartNumber"
F 5 "Molex" H 1900 4900 50  0001 C CNN "Manufacturer"
	1    1900 4900
	1    0    0    -1  
$EndComp
Wire Wire Line
	1400 4900 1700 4900
Wire Wire Line
	1700 5000 1400 5000
Wire Wire Line
	1400 5000 1400 5300
Wire Notes Line
	2500 1200 2650 1200
Wire Notes Line
	2650 1200 2650 1450
Wire Notes Line
	2650 1450 2500 1450
Wire Notes Line
	2500 1450 2500 1200
Wire Notes Line
	2500 1300 2400 1300
Wire Notes Line
	2400 1350 2500 1350
$Sheet
S 3800 1000 1500 700 
U 5C67E09D
F0 "Exp1_NUC_PS" 50
F1 "Exp1_NUC_PS.sch" 50
F2 "START" I L 3800 1100 100
F3 "PWRGD" O R 5300 1100 100
F4 "DISABLE" I L 3800 1600 100
F5 "RSM" O R 5300 1450 100
F6 "RSP" O R 5300 1600 100
$EndSheet
Wire Wire Line
	3150 1100 3400 1100
$Sheet
S 5900 1000 1500 700 
U 5C6D4194
F0 "Exp2_NUC_PS" 100
F1 "Exp2_NUC_PS.sch" 100
F2 "PWRGD" O R 7400 1100 100
F3 "START" I L 5900 1100 100
F4 "DISABLE" I L 5900 1600 100
F5 "RSM" O R 7400 1450 100
F6 "RSP" O R 7400 1600 100
$EndSheet
Wire Wire Line
	5300 1100 5400 1100
$Sheet
S 8200 1000 1500 700 
U 5C6D92EC
F0 "IRIS_PS" 100
F1 "IRIS_PS.sch" 100
F2 "PWRGD" O R 9700 1100 100
F3 "START" I L 8200 1100 100
F4 "DISABLE" I L 8200 1600 100
F5 "RSM" O R 9700 1450 100
F6 "RSP" O R 9700 1600 100
$EndSheet
$Comp
L POWDER_Power:LM2936Q-Q1 U101
U 1 1 5C6DF44C
P 1450 3050
F 0 "U101" H 1450 3477 100 0000 C CNN
F 1 "LM2936Q-Q1" H 1450 3311 100 0000 C CNN
F 2 "Package_SO:SOIC-8_3.9x4.9mm_P1.27mm" H 1700 2550 100 0001 C CNN
F 3 "" H 1450 3050 100 0001 C CNN
F 4 "LM2936QHBMA-5.0/NOPB" H 1450 3050 50  0001 C CNN "PartNumber"
F 5 "Texas Instruments" H 1450 3050 50  0001 C CNN "Manufacturer"
	1    1450 3050
	1    0    0    -1  
$EndComp
$Comp
L power:GND #PWR?
U 1 1 5C6DF639
P 1300 3650
F 0 "#PWR?" H 1300 3400 50  0001 C CNN
F 1 "GND" H 1305 3477 50  0000 C CNN
F 2 "" H 1300 3650 50  0001 C CNN
F 3 "" H 1300 3650 50  0001 C CNN
	1    1300 3650
	1    0    0    -1  
$EndComp
$Comp
L power:GND #PWR?
U 1 1 5C6DF651
P 1400 3650
F 0 "#PWR?" H 1400 3400 50  0001 C CNN
F 1 "GND" H 1405 3477 50  0000 C CNN
F 2 "" H 1400 3650 50  0001 C CNN
F 3 "" H 1400 3650 50  0001 C CNN
	1    1400 3650
	1    0    0    -1  
$EndComp
$Comp
L power:GND #PWR?
U 1 1 5C6DF660
P 1500 3650
F 0 "#PWR?" H 1500 3400 50  0001 C CNN
F 1 "GND" H 1505 3477 50  0000 C CNN
F 2 "" H 1500 3650 50  0001 C CNN
F 3 "" H 1500 3650 50  0001 C CNN
	1    1500 3650
	1    0    0    -1  
$EndComp
$Comp
L power:GND #PWR?
U 1 1 5C6DF66F
P 1600 3650
F 0 "#PWR?" H 1600 3400 50  0001 C CNN
F 1 "GND" H 1605 3477 50  0000 C CNN
F 2 "" H 1600 3650 50  0001 C CNN
F 3 "" H 1600 3650 50  0001 C CNN
	1    1600 3650
	1    0    0    -1  
$EndComp
Wire Wire Line
	1600 3650 1600 3450
Wire Wire Line
	1500 3450 1500 3650
Wire Wire Line
	1400 3650 1400 3450
Wire Wire Line
	1300 3450 1300 3650
Wire Wire Line
	1050 3100 950  3100
$Comp
L power:GND #PWR?
U 1 1 5C6DF879
P 950 3650
F 0 "#PWR?" H 950 3400 50  0001 C CNN
F 1 "GND" H 955 3477 50  0000 C CNN
F 2 "" H 950 3650 50  0001 C CNN
F 3 "" H 950 3650 50  0001 C CNN
	1    950  3650
	1    0    0    -1  
$EndComp
Wire Wire Line
	950  3100 950  3650
Text GLabel 800  3000 0    50   Input ~ 0
VDD
Wire Wire Line
	800  3000 850  3000
Wire Wire Line
	1850 3050 2100 3050
Wire Wire Line
	700  3200 700  3100
Wire Wire Line
	700  3100 850  3100
Wire Wire Line
	850  3100 850  3000
Connection ~ 850  3000
Wire Wire Line
	850  3000 1050 3000
$Comp
L power:GND #PWR?
U 1 1 5C6DFD0A
P 700 3650
F 0 "#PWR?" H 700 3400 50  0001 C CNN
F 1 "GND" H 705 3477 50  0000 C CNN
F 2 "" H 700 3650 50  0001 C CNN
F 3 "" H 700 3650 50  0001 C CNN
	1    700  3650
	1    0    0    -1  
$EndComp
Wire Wire Line
	700  3650 700  3500
$Comp
L Device:C C101
U 1 1 5C6E05F3
P 700 3350
AR Path="/5C6E05F3" Ref="C101"  Part="1" 
AR Path="/5C66EB2D/5C6E05F3" Ref="C?"  Part="1" 
F 0 "C101" H 815 3396 50  0000 L CNN
F 1 "2.2uF" H 815 3305 50  0000 L CNN
F 2 "Capacitor_SMD:C_1206_3216Metric" H 738 3200 50  0001 C CNN
F 3 "~" H 700 3350 50  0001 C CNN
F 4 "TDK" H 700 3350 50  0001 C CNN "Manufacturer"
F 5 "CGA5L3X7S2A225M160AB" H 700 3350 50  0001 C CNN "PartNumber"
	1    700  3350
	1    0    0    -1  
$EndComp
$Comp
L Device:C C102
U 1 1 5C6E0663
P 2100 3350
AR Path="/5C6E0663" Ref="C102"  Part="1" 
AR Path="/5C66EB2D/5C6E0663" Ref="C?"  Part="1" 
F 0 "C102" H 2215 3396 50  0000 L CNN
F 1 "10uF" H 2215 3305 50  0000 L CNN
F 2 "Capacitor_SMD:C_0805_2012Metric" H 2138 3200 50  0001 C CNN
F 3 "~" H 2100 3350 50  0001 C CNN
F 4 "Samsung Electro-Mechanics" H 2100 3350 50  0001 C CNN "Manufacturer"
F 5 "CL21A106KQCLRNC" H 2100 3350 50  0001 C CNN "PartNumber"
	1    2100 3350
	1    0    0    -1  
$EndComp
Wire Wire Line
	2100 3200 2100 3050
Connection ~ 2100 3050
Wire Wire Line
	2100 3050 2300 3050
Wire Wire Line
	2100 3500 2100 3650
$Comp
L power:GND #PWR?
U 1 1 5C6E0BA9
P 2100 3650
F 0 "#PWR?" H 2100 3400 50  0001 C CNN
F 1 "GND" H 2105 3477 50  0000 C CNN
F 2 "" H 2100 3650 50  0001 C CNN
F 3 "" H 2100 3650 50  0001 C CNN
	1    2100 3650
	1    0    0    -1  
$EndComp
$Comp
L power:+5V #PWR?
U 1 1 5C6E1300
P 2300 2900
F 0 "#PWR?" H 2300 2750 50  0001 C CNN
F 1 "+5V" H 2315 3073 50  0000 C CNN
F 2 "" H 2300 2900 50  0001 C CNN
F 3 "" H 2300 2900 50  0001 C CNN
	1    2300 2900
	1    0    0    -1  
$EndComp
Wire Wire Line
	2300 2900 2300 3050
Wire Wire Line
	7400 1100 7500 1100
$Comp
L POWDER_Power:INA2180-Q1 U102
U 1 1 5C6E239F
P 4350 2800
F 0 "U102" H 4700 3200 100 0000 C CNN
F 1 "INA2180-Q1" H 4900 2400 100 0000 C CNN
F 2 "Package_SO:VSSOP-8_3.0x3.0mm_P0.65mm" H 6250 3350 100 0001 C CNN
F 3 "" H 4600 3200 100 0001 C CNN
F 4 "INA2180A3QDGKRQ1" H 4350 2800 50  0001 C CNN "PartNumber"
F 5 "Texas Instruments" H 4350 2800 50  0001 C CNN "Manufacturer"
	1    4350 2800
	1    0    0    -1  
$EndComp
$Comp
L power:GND #PWR?
U 1 1 5C6E25C5
P 4350 3400
F 0 "#PWR?" H 4350 3150 50  0001 C CNN
F 1 "GND" H 4355 3227 50  0000 C CNN
F 2 "" H 4350 3400 50  0001 C CNN
F 3 "" H 4350 3400 50  0001 C CNN
	1    4350 3400
	1    0    0    -1  
$EndComp
Wire Wire Line
	4350 3400 4350 3200
Wire Wire Line
	3150 1600 3200 1600
Wire Wire Line
	3200 2700 3350 2700
Wire Wire Line
	3250 1450 3150 1450
Wire Wire Line
	5300 1600 5350 1600
Wire Wire Line
	5350 1600 5350 1900
Wire Wire Line
	5350 1900 3050 1900
Wire Wire Line
	3050 1900 3050 2900
Wire Wire Line
	3350 3000 3000 3000
Wire Wire Line
	3000 3000 3000 1950
Wire Wire Line
	3000 1950 5400 1950
Wire Wire Line
	5400 1950 5400 1450
Wire Wire Line
	5400 1450 5300 1450
Wire Wire Line
	7600 1600 7400 1600
Wire Wire Line
	7400 1450 7650 1450
Wire Wire Line
	9750 1600 9700 1600
Wire Wire Line
	9700 1450 9800 1450
Wire Wire Line
	3200 1600 3200 2700
Wire Wire Line
	3250 1450 3250 2600
$Comp
L power:GND #PWR?
U 1 1 5C6ED68F
P 9150 3400
F 0 "#PWR?" H 9150 3150 50  0001 C CNN
F 1 "GND" H 9155 3227 50  0000 C CNN
F 2 "" H 9150 3400 50  0001 C CNN
F 3 "" H 9150 3400 50  0001 C CNN
	1    9150 3400
	1    0    0    -1  
$EndComp
Wire Wire Line
	9150 3400 9150 3200
Wire Wire Line
	9750 1600 9750 1900
Wire Wire Line
	9750 1900 7450 1900
Wire Wire Line
	7450 1900 7450 2900
Wire Wire Line
	7400 3000 7400 1950
Wire Wire Line
	7400 1950 9800 1950
Wire Wire Line
	9800 1950 9800 1450
Wire Wire Line
	7600 1600 7600 2700
Wire Wire Line
	7650 1450 7650 2600
$Comp
L power:+5V #PWR?
U 1 1 5C6EE807
P 4350 2250
F 0 "#PWR?" H 4350 2100 50  0001 C CNN
F 1 "+5V" H 4365 2423 50  0000 C CNN
F 2 "" H 4350 2250 50  0001 C CNN
F 3 "" H 4350 2250 50  0001 C CNN
	1    4350 2250
	1    0    0    -1  
$EndComp
Wire Wire Line
	4350 2250 4350 2400
$Comp
L power:+5V #PWR?
U 1 1 5C6EF6D7
P 9150 2250
F 0 "#PWR?" H 9150 2100 50  0001 C CNN
F 1 "+5V" H 9165 2423 50  0000 C CNN
F 2 "" H 9150 2250 50  0001 C CNN
F 3 "" H 9150 2250 50  0001 C CNN
	1    9150 2250
	1    0    0    -1  
$EndComp
Wire Wire Line
	9150 2250 9150 2400
$Comp
L POWDER_Digital:CD4050B U103
U 1 1 5C6F1018
P 5400 4900
F 0 "U103" H 5550 5500 100 0000 C CNN
F 1 "CD4050B" H 5850 4250 100 0000 C CNN
F 2 "Package_SO:SOIC-16_3.9x9.9mm_P1.27mm" H 5400 4900 100 0001 C CNN
F 3 "" H 5400 4900 100 0001 C CNN
F 4 "CD4050BDR" H 5400 4900 50  0001 C CNN "PartNumber"
F 5 "Texas Instruments" H 5400 4900 50  0001 C CNN "Manufacturer"
	1    5400 4900
	1    0    0    -1  
$EndComp
$Comp
L power:GND #PWR?
U 1 1 5C6F1138
P 5400 5600
F 0 "#PWR?" H 5400 5350 50  0001 C CNN
F 1 "GND" H 5405 5427 50  0000 C CNN
F 2 "" H 5400 5600 50  0001 C CNN
F 3 "" H 5400 5600 50  0001 C CNN
	1    5400 5600
	1    0    0    -1  
$EndComp
Wire Wire Line
	5400 5600 5400 5500
$Comp
L power:+5V #PWR?
U 1 1 5C6F1F7E
P 5400 4200
F 0 "#PWR?" H 5400 4050 50  0001 C CNN
F 1 "+5V" H 5415 4373 50  0000 C CNN
F 2 "" H 5400 4200 50  0001 C CNN
F 3 "" H 5400 4200 50  0001 C CNN
	1    5400 4200
	1    0    0    -1  
$EndComp
Wire Wire Line
	5400 4300 5400 4250
$Comp
L power:GND #PWR?
U 1 1 5C6F2DFC
P 5000 5600
F 0 "#PWR?" H 5000 5350 50  0001 C CNN
F 1 "GND" H 5005 5427 50  0000 C CNN
F 2 "" H 5000 5600 50  0001 C CNN
F 3 "" H 5000 5600 50  0001 C CNN
	1    5000 5600
	1    0    0    -1  
$EndComp
Wire Wire Line
	5000 5600 5000 5150
Wire Wire Line
	5000 5050 5100 5050
Wire Wire Line
	5100 5150 5000 5150
Connection ~ 5000 5150
Wire Wire Line
	5000 5150 5000 5050
Wire Wire Line
	3400 1100 3400 850 
Connection ~ 3400 1100
Wire Wire Line
	3400 1100 3800 1100
Text Label 3500 850  0    50   ~ 0
Control_PWRGD
Wire Wire Line
	5400 1100 5400 800 
Wire Wire Line
	5400 800  5900 800 
Wire Wire Line
	7500 1100 7500 800 
Wire Wire Line
	7500 800  8100 800 
Text Label 5500 800  0    50   ~ 0
Exp1_PWRGD
Text Label 7600 800  0    50   ~ 0
Exp2_PWRGD
Text Label 9800 1100 0    50   ~ 0
IRIS_PWRGD
Wire Wire Line
	9700 1100 10150 1100
Text Label 4950 4650 2    50   ~ 0
Control_PWRGD
Text Label 4950 4750 2    50   ~ 0
Exp1_PWRGD
Text Label 4950 4850 2    50   ~ 0
Exp2_PWRGD
Text Label 4950 4950 2    50   ~ 0
IRIS_PWRGD
Wire Wire Line
	4950 4950 5100 4950
Wire Wire Line
	4950 4850 5100 4850
Wire Wire Line
	4950 4750 5100 4750
Wire Wire Line
	4950 4650 5100 4650
Text Label 5800 4650 0    50   ~ 0
Control_PWRGD_Buf
Text Label 5800 4750 0    50   ~ 0
Exp1_PWRGD_Buf
Text Label 5800 4850 0    50   ~ 0
Exp2_PWRGD_Buf
Text Label 5800 4950 0    50   ~ 0
IRIS_PWRGD_Buf
Wire Wire Line
	5800 4950 5700 4950
Wire Wire Line
	5700 4850 5800 4850
Wire Wire Line
	5700 4750 5800 4750
Wire Wire Line
	5800 4650 5700 4650
Text Label 3300 1600 0    50   ~ 0
Exp1_Disable
Wire Wire Line
	3300 1600 3800 1600
Text Label 5550 2100 0    50   ~ 0
Exp2_Disable
Wire Wire Line
	5550 2100 5550 1600
Wire Wire Line
	5550 1600 5900 1600
Text Label 7900 1700 1    50   ~ 0
IRIS_Disable
Wire Wire Line
	7900 1700 7900 1600
Wire Wire Line
	7900 1600 8200 1600
$Comp
L Connector_Generic:Conn_02x07_Odd_Even J102
U 1 1 5C70EA59
P 8850 5150
F 0 "J102" H 8900 5667 50  0000 C CNN
F 1 "Conn_02x07_Odd_Even" H 8900 5576 50  0000 C CNN
F 2 "Connector_PinHeader_2.54mm:PinHeader_2x07_P2.54mm_Vertical_SMD" H 8850 5150 50  0001 C CNN
F 3 "~" H 8850 5150 50  0001 C CNN
F 4 "CNC Tech" H 8850 5150 50  0001 C CNN "Manufacturer"
F 5 "3020-14-0300-00" H 8850 5150 50  0001 C CNN "PartNumber"
	1    8850 5150
	1    0    0    -1  
$EndComp
$Comp
L power:GND #PWR?
U 1 1 5C70EBA3
P 7400 5100
F 0 "#PWR?" H 7400 4850 50  0001 C CNN
F 1 "GND" H 7405 4927 50  0000 C CNN
F 2 "" H 7400 5100 50  0001 C CNN
F 3 "" H 7400 5100 50  0001 C CNN
	1    7400 5100
	1    0    0    -1  
$EndComp
Wire Wire Line
	7400 5100 7400 4850
Wire Wire Line
	7400 4850 8650 4850
Text Label 8500 5050 2    50   ~ 0
Control_PWRGD_Buf
Text Label 9300 5050 0    50   ~ 0
Exp1_PWRGD_Buf
Text Label 8500 5150 2    50   ~ 0
Exp2_PWRGD_Buf
Text Label 9300 5150 0    50   ~ 0
IRIS_PWRGD_Buf
Wire Wire Line
	9300 5050 9150 5050
Wire Wire Line
	8650 5050 8500 5050
Wire Wire Line
	8500 5150 8650 5150
Wire Wire Line
	8650 5250 8500 5250
Wire Wire Line
	8500 5350 8650 5350
Wire Wire Line
	9150 5150 9300 5150
Wire Wire Line
	9300 5250 9150 5250
Wire Wire Line
	9300 5350 9150 5350
Text Label 9300 4850 0    50   ~ 0
Exp1_Disable
Text Label 8500 4950 2    50   ~ 0
Exp2_Disable
Text Label 9300 4950 0    50   ~ 0
IRIS_Disable
Wire Wire Line
	9300 4950 9150 4950
Wire Wire Line
	9300 4850 9150 4850
Wire Wire Line
	8650 4950 8500 4950
Text Label 5050 2650 0    50   ~ 0
Control_Current
Text Label 5050 2950 0    50   ~ 0
Exp1_Current
Wire Wire Line
	4800 2950 5050 2950
Wire Wire Line
	4800 2650 5050 2650
Text Label 9950 2650 0    50   ~ 0
Exp2_Current
Text Label 9950 2950 0    50   ~ 0
IRIS_Current
Wire Wire Line
	9950 2650 9600 2650
Wire Wire Line
	9600 2950 9950 2950
Text Label 8500 5250 2    50   ~ 0
Control_Current
Text Label 9300 5250 0    50   ~ 0
Exp1_Current
Text Label 8500 5350 2    50   ~ 0
Exp2_Current
Text Label 9300 5350 0    50   ~ 0
IRIS_Current
$Comp
L Device:Net-Tie_2 NT103
U 1 1 5C735811
P 3800 2600
F 0 "NT103" H 3800 2778 50  0000 C CNN
F 1 "Net-Tie_2" H 3800 2687 50  0000 C CNN
F 2 "NetTie:NetTie-2_SMD_Pad0.5mm" H 3800 2600 50  0001 C CNN
F 3 "~" H 3800 2600 50  0001 C CNN
	1    3800 2600
	1    0    0    -1  
$EndComp
$Comp
L Device:Net-Tie_2 NT101
U 1 1 5C7388CD
P 3450 2700
F 0 "NT101" H 3450 2878 50  0000 C CNN
F 1 "Net-Tie_2" H 3450 2787 50  0000 C CNN
F 2 "NetTie:NetTie-2_SMD_Pad0.5mm" H 3450 2700 50  0001 C CNN
F 3 "~" H 3450 2700 50  0001 C CNN
	1    3450 2700
	1    0    0    -1  
$EndComp
$Comp
L Device:Net-Tie_2 NT104
U 1 1 5C7388FF
P 3800 2900
F 0 "NT104" H 3800 3078 50  0000 C CNN
F 1 "Net-Tie_2" H 3800 2987 50  0000 C CNN
F 2 "NetTie:NetTie-2_SMD_Pad0.5mm" H 3800 2900 50  0001 C CNN
F 3 "~" H 3800 2900 50  0001 C CNN
	1    3800 2900
	1    0    0    -1  
$EndComp
$Comp
L Device:Net-Tie_2 NT102
U 1 1 5C738937
P 3450 3000
F 0 "NT102" H 3450 3178 50  0000 C CNN
F 1 "Net-Tie_2" H 3450 3087 50  0000 C CNN
F 2 "NetTie:NetTie-2_SMD_Pad0.5mm" H 3450 3000 50  0001 C CNN
F 3 "~" H 3450 3000 50  0001 C CNN
	1    3450 3000
	1    0    0    -1  
$EndComp
Wire Wire Line
	3050 2900 3700 2900
Wire Wire Line
	3250 2600 3700 2600
Wire Wire Line
	3550 2700 3900 2700
Wire Wire Line
	3550 3000 3900 3000
$Comp
L Device:Net-Tie_2 NT107
U 1 1 5C74818B
P 8500 2600
F 0 "NT107" H 8500 2778 50  0000 C CNN
F 1 "Net-Tie_2" H 8500 2687 50  0000 C CNN
F 2 "NetTie:NetTie-2_SMD_Pad0.5mm" H 8500 2600 50  0001 C CNN
F 3 "~" H 8500 2600 50  0001 C CNN
	1    8500 2600
	1    0    0    -1  
$EndComp
$Comp
L Device:Net-Tie_2 NT105
U 1 1 5C748191
P 8150 2700
F 0 "NT105" H 8150 2878 50  0000 C CNN
F 1 "Net-Tie_2" H 8150 2787 50  0000 C CNN
F 2 "NetTie:NetTie-2_SMD_Pad0.5mm" H 8150 2700 50  0001 C CNN
F 3 "~" H 8150 2700 50  0001 C CNN
	1    8150 2700
	1    0    0    -1  
$EndComp
$Comp
L Device:Net-Tie_2 NT108
U 1 1 5C748197
P 8500 2900
F 0 "NT108" H 8500 3078 50  0000 C CNN
F 1 "Net-Tie_2" H 8500 2987 50  0000 C CNN
F 2 "NetTie:NetTie-2_SMD_Pad0.5mm" H 8500 2900 50  0001 C CNN
F 3 "~" H 8500 2900 50  0001 C CNN
	1    8500 2900
	1    0    0    -1  
$EndComp
$Comp
L Device:Net-Tie_2 NT106
U 1 1 5C74819D
P 8150 3000
F 0 "NT106" H 8150 3178 50  0000 C CNN
F 1 "Net-Tie_2" H 8150 3087 50  0000 C CNN
F 2 "NetTie:NetTie-2_SMD_Pad0.5mm" H 8150 3000 50  0001 C CNN
F 3 "~" H 8150 3000 50  0001 C CNN
	1    8150 3000
	1    0    0    -1  
$EndComp
Wire Wire Line
	7450 2900 8400 2900
Wire Wire Line
	7650 2600 8400 2600
Wire Wire Line
	7600 2700 8050 2700
Wire Wire Line
	7400 3000 8050 3000
Wire Wire Line
	8600 2600 8700 2600
Wire Wire Line
	8250 2700 8700 2700
Wire Wire Line
	8600 2900 8700 2900
Wire Wire Line
	8250 3000 8700 3000
$Comp
L Device:C C103
U 1 1 5C765679
P 6000 4050
AR Path="/5C765679" Ref="C103"  Part="1" 
AR Path="/5C66EB2D/5C765679" Ref="C?"  Part="1" 
F 0 "C103" H 6115 4096 50  0000 L CNN
F 1 "2.2uF" H 6115 4005 50  0000 L CNN
F 2 "Capacitor_SMD:C_1206_3216Metric" H 6038 3900 50  0001 C CNN
F 3 "~" H 6000 4050 50  0001 C CNN
F 4 "TDK" H 6000 4050 50  0001 C CNN "Manufacturer"
F 5 "CGA5L3X7S2A225M160AB" H 6000 4050 50  0001 C CNN "PartNumber"
	1    6000 4050
	1    0    0    -1  
$EndComp
$Comp
L power:GND #PWR?
U 1 1 5C76582C
P 6000 4300
F 0 "#PWR?" H 6000 4050 50  0001 C CNN
F 1 "GND" H 6005 4127 50  0000 C CNN
F 2 "" H 6000 4300 50  0001 C CNN
F 3 "" H 6000 4300 50  0001 C CNN
	1    6000 4300
	1    0    0    -1  
$EndComp
Wire Wire Line
	6000 4300 6000 4200
Wire Wire Line
	5400 4250 5650 4250
Wire Wire Line
	5650 4250 5650 3850
Wire Wire Line
	5650 3850 6000 3850
Wire Wire Line
	6000 3850 6000 3900
Connection ~ 5400 4250
Wire Wire Line
	5400 4250 5400 4200
Text Notes 8850 800  0    50   ~ 0
Fix IRIS Voltage
$Comp
L POWDER_Power:INA2180-Q1 U104
U 1 1 5C6EF61B
P 9150 2800
F 0 "U104" H 9500 3200 100 0000 C CNN
F 1 "INA2180-Q1" H 9700 2400 100 0000 C CNN
F 2 "Package_SO:VSSOP-8_3.0x3.0mm_P0.65mm" H 11050 3350 100 0001 C CNN
F 3 "" H 9400 3200 100 0001 C CNN
F 4 "Texas Instruments" H 9150 2800 50  0001 C CNN "Manufacturer"
F 5 "INA2180A3QDGKRQ1" H 9150 2800 50  0001 C CNN "PartNumber"
	1    9150 2800
	1    0    0    -1  
$EndComp
Wire Wire Line
	5600 850  5600 1100
Wire Wire Line
	5600 1100 5900 1100
Wire Wire Line
	5600 850  7950 850 
Wire Wire Line
	7950 850  7950 1100
Wire Wire Line
	7950 1100 8200 1100
Connection ~ 5600 850 
Wire Wire Line
	3400 850  5600 850 
$Comp
L power:+5V #PWR?
U 1 1 5C91CCD7
P 9500 5650
F 0 "#PWR?" H 9500 5500 50  0001 C CNN
F 1 "+5V" H 9515 5823 50  0000 C CNN
F 2 "" H 9500 5650 50  0001 C CNN
F 3 "" H 9500 5650 50  0001 C CNN
	1    9500 5650
	1    0    0    -1  
$EndComp
Wire Wire Line
	9500 5650 9500 5750
$Comp
L Device:Fuse F101
U 1 1 5C921654
P 1250 4900
F 0 "F101" V 1053 4900 50  0000 C CNN
F 1 "Fuse" V 1144 4900 50  0000 C CNN
F 2 "Fuse:Fuseholder_Cylinder-5x20mm_Stelvio-Kontek_PTF78_Horizontal_Open" V 1180 4900 50  0001 C CNN
F 3 "~" H 1250 4900 50  0001 C CNN
	1    1250 4900
	0    1    1    0   
$EndComp
Wire Wire Line
	1100 4900 850  4900
Text Label 1450 4900 0    50   ~ 0
VDD_FUSED
$Comp
L Mechanical:MountingHole_Pad H?
U 1 1 5C98A2DE
P 2200 6100
AR Path="/5C66EB2D/5C98A2DE" Ref="H?"  Part="1" 
AR Path="/5C98A2DE" Ref="H101"  Part="1" 
F 0 "H101" H 2300 6151 50  0000 L CNN
F 1 "MountingHole_Pad" H 2300 6060 50  0000 L CNN
F 2 "MountingHole:MountingHole_3.2mm_M3_Pad" H 2200 6100 50  0001 C CNN
F 3 "~" H 2200 6100 50  0001 C CNN
	1    2200 6100
	1    0    0    -1  
$EndComp
$Comp
L power:GND #PWR?
U 1 1 5C98A2E5
P 2200 6300
AR Path="/5C98A2E5" Ref="#PWR?"  Part="1" 
AR Path="/5C66EB2D/5C98A2E5" Ref="#PWR?"  Part="1" 
F 0 "#PWR?" H 2200 6050 50  0001 C CNN
F 1 "GND" H 2205 6127 50  0000 C CNN
F 2 "" H 2200 6300 50  0001 C CNN
F 3 "" H 2200 6300 50  0001 C CNN
	1    2200 6300
	1    0    0    -1  
$EndComp
Wire Wire Line
	2200 6300 2200 6200
$Comp
L Mechanical:MountingHole_Pad H?
U 1 1 5C98A2EC
P 3150 6100
AR Path="/5C66EB2D/5C98A2EC" Ref="H?"  Part="1" 
AR Path="/5C98A2EC" Ref="H103"  Part="1" 
F 0 "H103" H 3250 6151 50  0000 L CNN
F 1 "MountingHole_Pad" H 3250 6060 50  0000 L CNN
F 2 "MountingHole:MountingHole_3.2mm_M3_Pad" H 3150 6100 50  0001 C CNN
F 3 "~" H 3150 6100 50  0001 C CNN
	1    3150 6100
	1    0    0    -1  
$EndComp
$Comp
L power:GND #PWR?
U 1 1 5C98A2F3
P 3150 6300
AR Path="/5C98A2F3" Ref="#PWR?"  Part="1" 
AR Path="/5C66EB2D/5C98A2F3" Ref="#PWR?"  Part="1" 
F 0 "#PWR?" H 3150 6050 50  0001 C CNN
F 1 "GND" H 3155 6127 50  0000 C CNN
F 2 "" H 3150 6300 50  0001 C CNN
F 3 "" H 3150 6300 50  0001 C CNN
	1    3150 6300
	1    0    0    -1  
$EndComp
Wire Wire Line
	3150 6300 3150 6200
$Comp
L Mechanical:MountingHole_Pad H?
U 1 1 5C98A2FA
P 2200 6950
AR Path="/5C66EB2D/5C98A2FA" Ref="H?"  Part="1" 
AR Path="/5C98A2FA" Ref="H102"  Part="1" 
F 0 "H102" H 2300 7001 50  0000 L CNN
F 1 "MountingHole_Pad" H 2300 6910 50  0000 L CNN
F 2 "MountingHole:MountingHole_3.2mm_M3_Pad" H 2200 6950 50  0001 C CNN
F 3 "~" H 2200 6950 50  0001 C CNN
	1    2200 6950
	1    0    0    -1  
$EndComp
$Comp
L power:GND #PWR?
U 1 1 5C98A301
P 2200 7150
AR Path="/5C98A301" Ref="#PWR?"  Part="1" 
AR Path="/5C66EB2D/5C98A301" Ref="#PWR?"  Part="1" 
F 0 "#PWR?" H 2200 6900 50  0001 C CNN
F 1 "GND" H 2205 6977 50  0000 C CNN
F 2 "" H 2200 7150 50  0001 C CNN
F 3 "" H 2200 7150 50  0001 C CNN
	1    2200 7150
	1    0    0    -1  
$EndComp
Wire Wire Line
	2200 7150 2200 7050
$Comp
L Mechanical:MountingHole_Pad H?
U 1 1 5C98A308
P 3150 6950
AR Path="/5C66EB2D/5C98A308" Ref="H?"  Part="1" 
AR Path="/5C98A308" Ref="H104"  Part="1" 
F 0 "H104" H 3250 7001 50  0000 L CNN
F 1 "MountingHole_Pad" H 3250 6910 50  0000 L CNN
F 2 "MountingHole:MountingHole_3.2mm_M3_Pad" H 3150 6950 50  0001 C CNN
F 3 "~" H 3150 6950 50  0001 C CNN
	1    3150 6950
	1    0    0    -1  
$EndComp
$Comp
L power:GND #PWR?
U 1 1 5C98A30F
P 3150 7150
AR Path="/5C98A30F" Ref="#PWR?"  Part="1" 
AR Path="/5C66EB2D/5C98A30F" Ref="#PWR?"  Part="1" 
F 0 "#PWR?" H 3150 6900 50  0001 C CNN
F 1 "GND" H 3155 6977 50  0000 C CNN
F 2 "" H 3150 7150 50  0001 C CNN
F 3 "" H 3150 7150 50  0001 C CNN
	1    3150 7150
	1    0    0    -1  
$EndComp
Wire Wire Line
	3150 7150 3150 7050
Wire Wire Line
	9500 5750 9300 5750
Wire Wire Line
	9300 5750 9300 5450
Wire Wire Line
	9300 5450 9150 5450
$EndSCHEMATC
