EESchema Schematic File Version 4
EELAYER 30 0
EELAYER END
$Descr A4 11693 8268
encoding utf-8
Sheet 35 39
Title ""
Date ""
Rev ""
Comp ""
Comment1 ""
Comment2 ""
Comment3 ""
Comment4 ""
$EndDescr
Text HLabel 3050 2250 0    50   Input ~ 0
EN
Text HLabel 3050 2350 0    50   Input ~ 0
PS_SYNC
Text HLabel 5050 2100 2    50   Output ~ 0
DCDC_PG
Wire Wire Line
	5050 2100 4900 2100
$Comp
L power:GND #PWR?
U 1 1 606722B7
P 4200 2650
AR Path="/5D562501/606722B7" Ref="#PWR?"  Part="1" 
AR Path="/5D587C46/606722B7" Ref="#PWR?"  Part="1" 
AR Path="/5D591ABD/606722B7" Ref="#PWR?"  Part="1" 
AR Path="/60664CFF/606722B7" Ref="#PWR?"  Part="1" 
AR Path="/605A4C0E/606722B7" Ref="#PWR?"  Part="1" 
AR Path="/605746B5/6065B34E/606722B7" Ref="#PWR?"  Part="1" 
F 0 "#PWR?" H 4200 2400 50  0001 C CNN
F 1 "GND" H 4205 2477 50  0000 C CNN
F 2 "" H 4200 2650 50  0001 C CNN
F 3 "" H 4200 2650 50  0001 C CNN
	1    4200 2650
	1    0    0    -1  
$EndComp
$Comp
L power:GND #PWR?
U 1 1 606722BD
P 4400 2650
AR Path="/5D562501/606722BD" Ref="#PWR?"  Part="1" 
AR Path="/5D587C46/606722BD" Ref="#PWR?"  Part="1" 
AR Path="/5D591ABD/606722BD" Ref="#PWR?"  Part="1" 
AR Path="/60664CFF/606722BD" Ref="#PWR?"  Part="1" 
AR Path="/605A4C0E/606722BD" Ref="#PWR?"  Part="1" 
AR Path="/605746B5/6065B34E/606722BD" Ref="#PWR?"  Part="1" 
F 0 "#PWR?" H 4400 2400 50  0001 C CNN
F 1 "GND" H 4405 2477 50  0000 C CNN
F 2 "" H 4400 2650 50  0001 C CNN
F 3 "" H 4400 2650 50  0001 C CNN
	1    4400 2650
	1    0    0    -1  
$EndComp
Wire Wire Line
	4400 2650 4400 2500
Wire Wire Line
	4200 2500 4200 2650
$Comp
L 000_PreferredParts:C_100nF C?
U 1 1 606722C9
P 2550 2050
AR Path="/5D562501/606722C9" Ref="C?"  Part="1" 
AR Path="/5D587C46/606722C9" Ref="C?"  Part="1" 
AR Path="/5D591ABD/606722C9" Ref="C?"  Part="1" 
AR Path="/60664CFF/606722C9" Ref="C?"  Part="1" 
AR Path="/605A4C0E/606722C9" Ref="C?"  Part="1" 
AR Path="/605746B5/6065B34E/606722C9" Ref="C3509"  Part="1" 
F 0 "C3509" H 2665 2096 50  0000 L CNN
F 1 "C_100nF" H 2575 1950 50  0001 L CNN
F 2 "Capacitor_SMD:C_0402_1005Metric" H 2588 1900 50  0001 C CNN
F 3 "~" H 2550 2050 50  0001 C CNN
F 4 "Murata Electronics" H 2550 2050 50  0001 C CNN "Manufacturer"
F 5 "GRM155R62A104KE14D" H 2550 2050 50  0001 C CNN "PartNumber"
F 6 "100nF" H 2700 1950 50  0000 C CNN "DisplayValue"
F 7 "3000-0000000125" H 2550 2050 50  0001 C CNN "PartSpecification"
	1    2550 2050
	1    0    0    -1  
$EndComp
Wire Wire Line
	2550 1900 2550 1750
$Comp
L power:GND #PWR?
U 1 1 606722D0
P 2550 2350
AR Path="/5D562501/606722D0" Ref="#PWR?"  Part="1" 
AR Path="/5D587C46/606722D0" Ref="#PWR?"  Part="1" 
AR Path="/5D591ABD/606722D0" Ref="#PWR?"  Part="1" 
AR Path="/60664CFF/606722D0" Ref="#PWR?"  Part="1" 
AR Path="/605A4C0E/606722D0" Ref="#PWR?"  Part="1" 
AR Path="/605746B5/6065B34E/606722D0" Ref="#PWR?"  Part="1" 
F 0 "#PWR?" H 2550 2100 50  0001 C CNN
F 1 "GND" H 2555 2177 50  0000 C CNN
F 2 "" H 2550 2350 50  0001 C CNN
F 3 "" H 2550 2350 50  0001 C CNN
	1    2550 2350
	1    0    0    -1  
$EndComp
Wire Wire Line
	2550 2350 2550 2200
$Comp
L Device:C C?
U 1 1 606722DA
P 2150 1850
AR Path="/5D562501/606722DA" Ref="C?"  Part="1" 
AR Path="/5D587C46/606722DA" Ref="C?"  Part="1" 
AR Path="/5D591ABD/606722DA" Ref="C?"  Part="1" 
AR Path="/60664CFF/606722DA" Ref="C?"  Part="1" 
AR Path="/605A4C0E/606722DA" Ref="C?"  Part="1" 
AR Path="/605746B5/6065B34E/606722DA" Ref="C3508"  Part="1" 
F 0 "C3508" H 2265 1896 50  0000 L CNN
F 1 "10uF" H 2265 1805 50  0000 L CNN
F 2 "Capacitor_SMD:C_0603_1608Metric" H 2188 1700 50  0001 C CNN
F 3 "~" H 2150 1850 50  0001 C CNN
F 4 "Murata Electronics" H 2150 1850 50  0001 C CNN "Manufacturer"
F 5 "GRM188R6YA106MA73D" H 2150 1850 50  0001 C CNN "PartNumber"
F 6 "3000-0000000135" H 2150 1850 50  0001 C CNN "PartSpecification"
	1    2150 1850
	1    0    0    -1  
$EndComp
$Comp
L Device:C C?
U 1 1 606722E3
P 1700 1850
AR Path="/5D562501/606722E3" Ref="C?"  Part="1" 
AR Path="/5D587C46/606722E3" Ref="C?"  Part="1" 
AR Path="/5D591ABD/606722E3" Ref="C?"  Part="1" 
AR Path="/60664CFF/606722E3" Ref="C?"  Part="1" 
AR Path="/605A4C0E/606722E3" Ref="C?"  Part="1" 
AR Path="/605746B5/6065B34E/606722E3" Ref="C3507"  Part="1" 
F 0 "C3507" H 1815 1896 50  0000 L CNN
F 1 "10uF" H 1815 1805 50  0000 L CNN
F 2 "Capacitor_SMD:C_0805_2012Metric" H 1738 1700 50  0001 C CNN
F 3 "~" H 1700 1850 50  0001 C CNN
F 4 "Murata Electronics" H 1700 1850 50  0001 C CNN "Manufacturer"
F 5 "GRM21BC8YA106ME11L" H 1700 1850 50  0001 C CNN "PartNumber"
F 6 "3000-0000000134" H 1700 1850 50  0001 C CNN "PartSpecification"
	1    1700 1850
	1    0    0    -1  
$EndComp
$Comp
L Device:C C?
U 1 1 606722EC
P 1250 1850
AR Path="/5D562501/606722EC" Ref="C?"  Part="1" 
AR Path="/5D587C46/606722EC" Ref="C?"  Part="1" 
AR Path="/5D591ABD/606722EC" Ref="C?"  Part="1" 
AR Path="/60664CFF/606722EC" Ref="C?"  Part="1" 
AR Path="/605A4C0E/606722EC" Ref="C?"  Part="1" 
AR Path="/605746B5/6065B34E/606722EC" Ref="C3506"  Part="1" 
F 0 "C3506" H 1365 1896 50  0000 L CNN
F 1 "10uF" H 1365 1805 50  0000 L CNN
F 2 "Capacitor_SMD:C_0805_2012Metric" H 1288 1700 50  0001 C CNN
F 3 "~" H 1250 1850 50  0001 C CNN
F 4 "Murata Electronics" H 1250 1850 50  0001 C CNN "Manufacturer"
F 5 "GRM21BC8YA106ME11L" H 1250 1850 50  0001 C CNN "PartNumber"
F 6 "3000-0000000134" H 1250 1850 50  0001 C CNN "PartSpecification"
	1    1250 1850
	1    0    0    -1  
$EndComp
$Comp
L power:GND #PWR?
U 1 1 606722F2
P 2150 2100
AR Path="/5D562501/606722F2" Ref="#PWR?"  Part="1" 
AR Path="/5D587C46/606722F2" Ref="#PWR?"  Part="1" 
AR Path="/5D591ABD/606722F2" Ref="#PWR?"  Part="1" 
AR Path="/60664CFF/606722F2" Ref="#PWR?"  Part="1" 
AR Path="/605A4C0E/606722F2" Ref="#PWR?"  Part="1" 
AR Path="/605746B5/6065B34E/606722F2" Ref="#PWR?"  Part="1" 
F 0 "#PWR?" H 2150 1850 50  0001 C CNN
F 1 "GND" H 2155 1927 50  0000 C CNN
F 2 "" H 2150 2100 50  0001 C CNN
F 3 "" H 2150 2100 50  0001 C CNN
	1    2150 2100
	1    0    0    -1  
$EndComp
$Comp
L power:GND #PWR?
U 1 1 606722F8
P 1700 2100
AR Path="/5D562501/606722F8" Ref="#PWR?"  Part="1" 
AR Path="/5D587C46/606722F8" Ref="#PWR?"  Part="1" 
AR Path="/5D591ABD/606722F8" Ref="#PWR?"  Part="1" 
AR Path="/60664CFF/606722F8" Ref="#PWR?"  Part="1" 
AR Path="/605A4C0E/606722F8" Ref="#PWR?"  Part="1" 
AR Path="/605746B5/6065B34E/606722F8" Ref="#PWR?"  Part="1" 
F 0 "#PWR?" H 1700 1850 50  0001 C CNN
F 1 "GND" H 1705 1927 50  0000 C CNN
F 2 "" H 1700 2100 50  0001 C CNN
F 3 "" H 1700 2100 50  0001 C CNN
	1    1700 2100
	1    0    0    -1  
$EndComp
$Comp
L power:GND #PWR?
U 1 1 606722FE
P 1250 2100
AR Path="/5D562501/606722FE" Ref="#PWR?"  Part="1" 
AR Path="/5D587C46/606722FE" Ref="#PWR?"  Part="1" 
AR Path="/5D591ABD/606722FE" Ref="#PWR?"  Part="1" 
AR Path="/60664CFF/606722FE" Ref="#PWR?"  Part="1" 
AR Path="/605A4C0E/606722FE" Ref="#PWR?"  Part="1" 
AR Path="/605746B5/6065B34E/606722FE" Ref="#PWR?"  Part="1" 
F 0 "#PWR?" H 1250 1850 50  0001 C CNN
F 1 "GND" H 1255 1927 50  0000 C CNN
F 2 "" H 1250 2100 50  0001 C CNN
F 3 "" H 1250 2100 50  0001 C CNN
	1    1250 2100
	1    0    0    -1  
$EndComp
Wire Wire Line
	1250 2100 1250 2000
Wire Wire Line
	1700 2100 1700 2000
Wire Wire Line
	2150 2100 2150 2000
Wire Wire Line
	3700 1500 3500 1500
Wire Wire Line
	2150 1500 2150 1700
Wire Wire Line
	2150 1500 1700 1500
Wire Wire Line
	1700 1500 1700 1700
Connection ~ 2150 1500
Wire Wire Line
	1700 1500 1250 1500
Wire Wire Line
	1250 1500 1250 1700
Connection ~ 1700 1500
Wire Wire Line
	3700 1400 3500 1400
Wire Wire Line
	3500 1400 3500 1500
Connection ~ 3500 1500
Connection ~ 1250 1500
$Comp
L Device:L L?
U 1 1 60672318
P 4300 1000
AR Path="/5D562501/60672318" Ref="L?"  Part="1" 
AR Path="/5D587C46/60672318" Ref="L?"  Part="1" 
AR Path="/5D591ABD/60672318" Ref="L?"  Part="1" 
AR Path="/60664CFF/60672318" Ref="L?"  Part="1" 
AR Path="/605A4C0E/60672318" Ref="L?"  Part="1" 
AR Path="/605746B5/6065B34E/60672318" Ref="L3501"  Part="1" 
F 0 "L3501" V 4490 1000 50  0000 C CNN
F 1 "1.5uH" V 4399 1000 50  0000 C CNN
F 2 "Inductor_SMD:L_Taiyo-Yuden_MD-4040" H 4300 1000 50  0001 C CNN
F 3 "~" H 4300 1000 50  0001 C CNN
F 4 "ABRACON" H 4300 1000 50  0001 C CNN "Manufacturer"
F 5 "ASPI-4030S-1R5N-T" H 4300 1000 50  0001 C CNN "PartNumber"
F 6 "3000-0000000076" V 4300 1000 50  0001 C CNN "PartSpecification"
	1    4300 1000
	0    -1   -1   0   
$EndComp
Wire Wire Line
	4150 1000 4100 1000
Wire Wire Line
	4100 1000 4100 1150
Wire Wire Line
	4450 1000 4500 1000
Wire Wire Line
	4500 1000 4500 1150
$Comp
L Device:C C?
U 1 1 60672325
P 6450 1700
AR Path="/5D562501/60672325" Ref="C?"  Part="1" 
AR Path="/5D587C46/60672325" Ref="C?"  Part="1" 
AR Path="/5D591ABD/60672325" Ref="C?"  Part="1" 
AR Path="/60664CFF/60672325" Ref="C?"  Part="1" 
AR Path="/605A4C0E/60672325" Ref="C?"  Part="1" 
AR Path="/605746B5/6065B34E/60672325" Ref="C3501"  Part="1" 
F 0 "C3501" H 6565 1746 50  0000 L CNN
F 1 "10uF" H 6565 1655 50  0000 L CNN
F 2 "Capacitor_SMD:C_0603_1608Metric" H 6488 1550 50  0001 C CNN
F 3 "~" H 6450 1700 50  0001 C CNN
F 4 "Murata Electronics" H 6450 1700 50  0001 C CNN "Manufacturer"
F 5 "GRM188R6YA106MA73D" H 6450 1700 50  0001 C CNN "PartNumber"
F 6 "3000-0000000135" H 6450 1700 50  0001 C CNN "PartSpecification"
	1    6450 1700
	1    0    0    -1  
$EndComp
$Comp
L Device:R R?
U 1 1 6067232E
P 6000 1700
AR Path="/5D562501/6067232E" Ref="R?"  Part="1" 
AR Path="/5D587C46/6067232E" Ref="R?"  Part="1" 
AR Path="/5D591ABD/6067232E" Ref="R?"  Part="1" 
AR Path="/60664CFF/6067232E" Ref="R?"  Part="1" 
AR Path="/605A4C0E/6067232E" Ref="R?"  Part="1" 
AR Path="/605746B5/6065B34E/6067232E" Ref="R3501"  Part="1" 
F 0 "R3501" H 6070 1746 50  0000 L CNN
F 1 "1M" H 6070 1655 50  0000 L CNN
F 2 "Resistor_SMD:R_0402_1005Metric" V 5930 1700 50  0001 C CNN
F 3 "~" H 6000 1700 50  0001 C CNN
F 4 "" H 6000 1700 50  0001 C CNN "Manufacturer"
F 5 "" H 6000 1700 50  0001 C CNN "PartNumber"
F 6 "3000-0000000139" H 6000 1700 50  0001 C CNN "PartSpecification"
	1    6000 1700
	1    0    0    -1  
$EndComp
Wire Wire Line
	4900 1500 5100 1500
Wire Wire Line
	6000 1550 6000 1500
Connection ~ 6000 1500
$Comp
L Device:R R?
U 1 1 6067233A
P 6000 2100
AR Path="/5D562501/6067233A" Ref="R?"  Part="1" 
AR Path="/5D587C46/6067233A" Ref="R?"  Part="1" 
AR Path="/5D591ABD/6067233A" Ref="R?"  Part="1" 
AR Path="/60664CFF/6067233A" Ref="R?"  Part="1" 
AR Path="/605A4C0E/6067233A" Ref="R?"  Part="1" 
AR Path="/605746B5/6065B34E/6067233A" Ref="R3502"  Part="1" 
F 0 "R3502" H 6070 2146 50  0000 L CNN
F 1 "150k" H 6070 2055 50  0000 L CNN
F 2 "Resistor_SMD:R_0402_1005Metric" V 5930 2100 50  0001 C CNN
F 3 "~" H 6000 2100 50  0001 C CNN
F 4 "Stackpole Electronics Inc" H 6000 2100 50  0001 C CNN "Manufacturer"
F 5 "" H 6000 2100 50  0001 C CNN "PartNumber"
F 6 "3000-0000000579" H 6000 2100 50  0001 C CNN "PartSpecification"
	1    6000 2100
	1    0    0    -1  
$EndComp
Wire Wire Line
	6000 1850 6000 1900
Wire Wire Line
	4900 1750 5650 1750
Connection ~ 6000 1900
Wire Wire Line
	6000 1900 6000 1950
Wire Wire Line
	5650 1900 5650 1750
Wire Wire Line
	5650 1900 6000 1900
$Comp
L power:GND #PWR?
U 1 1 60672346
P 6000 2350
AR Path="/5D562501/60672346" Ref="#PWR?"  Part="1" 
AR Path="/5D587C46/60672346" Ref="#PWR?"  Part="1" 
AR Path="/5D591ABD/60672346" Ref="#PWR?"  Part="1" 
AR Path="/60664CFF/60672346" Ref="#PWR?"  Part="1" 
AR Path="/605A4C0E/60672346" Ref="#PWR?"  Part="1" 
AR Path="/605746B5/6065B34E/60672346" Ref="#PWR?"  Part="1" 
F 0 "#PWR?" H 6000 2100 50  0001 C CNN
F 1 "GND" H 6005 2177 50  0000 C CNN
F 2 "" H 6000 2350 50  0001 C CNN
F 3 "" H 6000 2350 50  0001 C CNN
	1    6000 2350
	1    0    0    -1  
$EndComp
Wire Wire Line
	6000 2350 6000 2250
Wire Wire Line
	6450 1550 6450 1500
Wire Wire Line
	6000 1500 6450 1500
$Comp
L power:GND #PWR?
U 1 1 6067234F
P 6450 1950
AR Path="/5D562501/6067234F" Ref="#PWR?"  Part="1" 
AR Path="/5D587C46/6067234F" Ref="#PWR?"  Part="1" 
AR Path="/5D591ABD/6067234F" Ref="#PWR?"  Part="1" 
AR Path="/60664CFF/6067234F" Ref="#PWR?"  Part="1" 
AR Path="/605A4C0E/6067234F" Ref="#PWR?"  Part="1" 
AR Path="/605746B5/6065B34E/6067234F" Ref="#PWR?"  Part="1" 
F 0 "#PWR?" H 6450 1700 50  0001 C CNN
F 1 "GND" H 6455 1777 50  0000 C CNN
F 2 "" H 6450 1950 50  0001 C CNN
F 3 "" H 6450 1950 50  0001 C CNN
	1    6450 1950
	1    0    0    -1  
$EndComp
Wire Wire Line
	6450 1950 6450 1850
$Comp
L power:GND #PWR?
U 1 1 60672356
P 6950 1950
AR Path="/5D562501/60672356" Ref="#PWR?"  Part="1" 
AR Path="/5D587C46/60672356" Ref="#PWR?"  Part="1" 
AR Path="/5D591ABD/60672356" Ref="#PWR?"  Part="1" 
AR Path="/60664CFF/60672356" Ref="#PWR?"  Part="1" 
AR Path="/605A4C0E/60672356" Ref="#PWR?"  Part="1" 
AR Path="/605746B5/6065B34E/60672356" Ref="#PWR?"  Part="1" 
F 0 "#PWR?" H 6950 1700 50  0001 C CNN
F 1 "GND" H 6955 1777 50  0000 C CNN
F 2 "" H 6950 1950 50  0001 C CNN
F 3 "" H 6950 1950 50  0001 C CNN
	1    6950 1950
	1    0    0    -1  
$EndComp
Wire Wire Line
	6950 1950 6950 1850
Wire Wire Line
	6950 1550 6950 1500
Wire Wire Line
	6950 1500 6800 1500
Connection ~ 6450 1500
$Comp
L power:GND #PWR?
U 1 1 60672360
P 7750 1950
AR Path="/5D562501/60672360" Ref="#PWR?"  Part="1" 
AR Path="/5D587C46/60672360" Ref="#PWR?"  Part="1" 
AR Path="/5D591ABD/60672360" Ref="#PWR?"  Part="1" 
AR Path="/60664CFF/60672360" Ref="#PWR?"  Part="1" 
AR Path="/605A4C0E/60672360" Ref="#PWR?"  Part="1" 
AR Path="/605746B5/6065B34E/60672360" Ref="#PWR?"  Part="1" 
F 0 "#PWR?" H 7750 1700 50  0001 C CNN
F 1 "GND" H 7755 1777 50  0000 C CNN
F 2 "" H 7750 1950 50  0001 C CNN
F 3 "" H 7750 1950 50  0001 C CNN
	1    7750 1950
	1    0    0    -1  
$EndComp
Wire Wire Line
	7750 1950 7750 1850
Wire Wire Line
	7750 1550 7750 1500
$Comp
L power:GND #PWR?
U 1 1 60672368
P 8550 1950
AR Path="/5D562501/60672368" Ref="#PWR?"  Part="1" 
AR Path="/5D587C46/60672368" Ref="#PWR?"  Part="1" 
AR Path="/5D591ABD/60672368" Ref="#PWR?"  Part="1" 
AR Path="/60664CFF/60672368" Ref="#PWR?"  Part="1" 
AR Path="/605A4C0E/60672368" Ref="#PWR?"  Part="1" 
AR Path="/605746B5/6065B34E/60672368" Ref="#PWR?"  Part="1" 
F 0 "#PWR?" H 8550 1700 50  0001 C CNN
F 1 "GND" H 8555 1777 50  0000 C CNN
F 2 "" H 8550 1950 50  0001 C CNN
F 3 "" H 8550 1950 50  0001 C CNN
	1    8550 1950
	1    0    0    -1  
$EndComp
Wire Wire Line
	8550 1950 8550 1850
Wire Wire Line
	8550 1550 8550 1500
Wire Wire Line
	6950 1500 7750 1500
Connection ~ 6950 1500
Connection ~ 7750 1500
Wire Wire Line
	7750 1500 8550 1500
Text Label 2650 1750 0    50   ~ 0
V_AUX
Text Label 5100 1750 0    50   ~ 0
FB
Text Label 4100 1000 0    50   ~ 0
L1
Text Label 4500 1000 0    50   ~ 0
L2
$Comp
L 000_PreferredParts:C_10uF_0805 C?
U 1 1 6067237B
P 6950 1700
AR Path="/5D562501/6067237B" Ref="C?"  Part="1" 
AR Path="/5D587C46/6067237B" Ref="C?"  Part="1" 
AR Path="/60664CFF/6067237B" Ref="C?"  Part="1" 
AR Path="/605A4C0E/6067237B" Ref="C?"  Part="1" 
AR Path="/605746B5/6065B34E/6067237B" Ref="C3502"  Part="1" 
F 0 "C3502" H 7065 1746 50  0000 L CNN
F 1 "C_10uF_0805" H 7065 1655 50  0000 L CNN
F 2 "Capacitor_SMD:C_0805_2012Metric" H 6988 1550 50  0001 C CNN
F 3 "~" H 6950 1700 50  0001 C CNN
F 4 "Murata Electronics" H 6950 1700 50  0001 C CNN "Manufacturer"
F 5 "GRM21BC8YA106ME11L" H 6950 1700 50  0001 C CNN "PartNumber"
F 6 "3000-0000000134" H 6950 1700 50  0001 C CNN "PartSpecification"
	1    6950 1700
	1    0    0    -1  
$EndComp
$Comp
L 000_PreferredParts:C_10uF_0805 C?
U 1 1 60672384
P 7750 1700
AR Path="/5D562501/60672384" Ref="C?"  Part="1" 
AR Path="/5D587C46/60672384" Ref="C?"  Part="1" 
AR Path="/60664CFF/60672384" Ref="C?"  Part="1" 
AR Path="/605A4C0E/60672384" Ref="C?"  Part="1" 
AR Path="/605746B5/6065B34E/60672384" Ref="C3503"  Part="1" 
F 0 "C3503" H 7865 1746 50  0000 L CNN
F 1 "C_10uF_0805" H 7865 1655 50  0000 L CNN
F 2 "Capacitor_SMD:C_0805_2012Metric" H 7788 1550 50  0001 C CNN
F 3 "~" H 7750 1700 50  0001 C CNN
F 4 "Murata Electronics" H 7750 1700 50  0001 C CNN "Manufacturer"
F 5 "GRM21BC8YA106ME11L" H 7750 1700 50  0001 C CNN "PartNumber"
F 6 "3000-0000000134" H 7750 1700 50  0001 C CNN "PartSpecification"
	1    7750 1700
	1    0    0    -1  
$EndComp
$Comp
L 000_PreferredParts:C_10uF_0805 C?
U 1 1 6067238D
P 8550 1700
AR Path="/5D562501/6067238D" Ref="C?"  Part="1" 
AR Path="/5D587C46/6067238D" Ref="C?"  Part="1" 
AR Path="/60664CFF/6067238D" Ref="C?"  Part="1" 
AR Path="/605A4C0E/6067238D" Ref="C?"  Part="1" 
AR Path="/605746B5/6065B34E/6067238D" Ref="C3504"  Part="1" 
F 0 "C3504" H 8665 1746 50  0000 L CNN
F 1 "C_10uF_0805" H 8665 1655 50  0000 L CNN
F 2 "Capacitor_SMD:C_0805_2012Metric" H 8588 1550 50  0001 C CNN
F 3 "~" H 8550 1700 50  0001 C CNN
F 4 "Murata Electronics" H 8550 1700 50  0001 C CNN "Manufacturer"
F 5 "GRM21BC8YA106ME11L" H 8550 1700 50  0001 C CNN "PartNumber"
F 6 "3000-0000000134" H 8550 1700 50  0001 C CNN "PartSpecification"
	1    8550 1700
	1    0    0    -1  
$EndComp
$Comp
L power:GND #PWR?
U 1 1 60672393
P 6950 2700
AR Path="/5D562501/60672393" Ref="#PWR?"  Part="1" 
AR Path="/5D587C46/60672393" Ref="#PWR?"  Part="1" 
AR Path="/5D591ABD/60672393" Ref="#PWR?"  Part="1" 
AR Path="/60664CFF/60672393" Ref="#PWR?"  Part="1" 
AR Path="/605A4C0E/60672393" Ref="#PWR?"  Part="1" 
AR Path="/605746B5/6065B34E/60672393" Ref="#PWR?"  Part="1" 
F 0 "#PWR?" H 6950 2450 50  0001 C CNN
F 1 "GND" H 6955 2527 50  0000 C CNN
F 2 "" H 6950 2700 50  0001 C CNN
F 3 "" H 6950 2700 50  0001 C CNN
	1    6950 2700
	1    0    0    -1  
$EndComp
Wire Wire Line
	6950 2700 6950 2600
Wire Wire Line
	6950 2300 6950 2250
Wire Wire Line
	6950 2250 6800 2250
$Comp
L power:GND #PWR?
U 1 1 6067239C
P 7750 2700
AR Path="/5D562501/6067239C" Ref="#PWR?"  Part="1" 
AR Path="/5D587C46/6067239C" Ref="#PWR?"  Part="1" 
AR Path="/5D591ABD/6067239C" Ref="#PWR?"  Part="1" 
AR Path="/60664CFF/6067239C" Ref="#PWR?"  Part="1" 
AR Path="/605A4C0E/6067239C" Ref="#PWR?"  Part="1" 
AR Path="/605746B5/6065B34E/6067239C" Ref="#PWR?"  Part="1" 
F 0 "#PWR?" H 7750 2450 50  0001 C CNN
F 1 "GND" H 7755 2527 50  0000 C CNN
F 2 "" H 7750 2700 50  0001 C CNN
F 3 "" H 7750 2700 50  0001 C CNN
	1    7750 2700
	1    0    0    -1  
$EndComp
Wire Wire Line
	7750 2700 7750 2600
Wire Wire Line
	7750 2300 7750 2250
$Comp
L power:GND #PWR?
U 1 1 606723A4
P 9350 1950
AR Path="/5D562501/606723A4" Ref="#PWR?"  Part="1" 
AR Path="/5D587C46/606723A4" Ref="#PWR?"  Part="1" 
AR Path="/5D591ABD/606723A4" Ref="#PWR?"  Part="1" 
AR Path="/60664CFF/606723A4" Ref="#PWR?"  Part="1" 
AR Path="/605A4C0E/606723A4" Ref="#PWR?"  Part="1" 
AR Path="/605746B5/6065B34E/606723A4" Ref="#PWR?"  Part="1" 
F 0 "#PWR?" H 9350 1700 50  0001 C CNN
F 1 "GND" H 9355 1777 50  0000 C CNN
F 2 "" H 9350 1950 50  0001 C CNN
F 3 "" H 9350 1950 50  0001 C CNN
	1    9350 1950
	1    0    0    -1  
$EndComp
Wire Wire Line
	9350 1950 9350 1850
Wire Wire Line
	9350 1550 9350 1500
Wire Wire Line
	6950 2250 7750 2250
Connection ~ 6950 2250
Wire Wire Line
	8550 1500 9350 1500
$Comp
L 000_PreferredParts:C_10uF_0805 C?
U 1 1 606723B2
P 6950 2450
AR Path="/5D562501/606723B2" Ref="C?"  Part="1" 
AR Path="/5D587C46/606723B2" Ref="C?"  Part="1" 
AR Path="/60664CFF/606723B2" Ref="C?"  Part="1" 
AR Path="/605A4C0E/606723B2" Ref="C?"  Part="1" 
AR Path="/605746B5/6065B34E/606723B2" Ref="C3510"  Part="1" 
F 0 "C3510" H 7065 2496 50  0000 L CNN
F 1 "C_10uF_0805" H 7065 2405 50  0000 L CNN
F 2 "Capacitor_SMD:C_0805_2012Metric" H 6988 2300 50  0001 C CNN
F 3 "~" H 6950 2450 50  0001 C CNN
F 4 "Murata Electronics" H 6950 2450 50  0001 C CNN "Manufacturer"
F 5 "GRM21BC8YA106ME11L" H 6950 2450 50  0001 C CNN "PartNumber"
F 6 "3000-0000000134" H 6950 2450 50  0001 C CNN "PartSpecification"
	1    6950 2450
	1    0    0    -1  
$EndComp
$Comp
L 000_PreferredParts:C_10uF_0805 C?
U 1 1 606723BB
P 7750 2450
AR Path="/5D562501/606723BB" Ref="C?"  Part="1" 
AR Path="/5D587C46/606723BB" Ref="C?"  Part="1" 
AR Path="/60664CFF/606723BB" Ref="C?"  Part="1" 
AR Path="/605A4C0E/606723BB" Ref="C?"  Part="1" 
AR Path="/605746B5/6065B34E/606723BB" Ref="C3511"  Part="1" 
F 0 "C3511" H 7865 2496 50  0000 L CNN
F 1 "C_10uF_0805" H 7865 2405 50  0000 L CNN
F 2 "Capacitor_SMD:C_0805_2012Metric" H 7788 2300 50  0001 C CNN
F 3 "~" H 7750 2450 50  0001 C CNN
F 4 "Murata Electronics" H 7750 2450 50  0001 C CNN "Manufacturer"
F 5 "GRM21BC8YA106ME11L" H 7750 2450 50  0001 C CNN "PartNumber"
F 6 "3000-0000000134" H 7750 2450 50  0001 C CNN "PartSpecification"
	1    7750 2450
	1    0    0    -1  
$EndComp
$Comp
L 000_PreferredParts:C_10uF_0805 C?
U 1 1 606723C4
P 9350 1700
AR Path="/5D562501/606723C4" Ref="C?"  Part="1" 
AR Path="/5D587C46/606723C4" Ref="C?"  Part="1" 
AR Path="/60664CFF/606723C4" Ref="C?"  Part="1" 
AR Path="/605A4C0E/606723C4" Ref="C?"  Part="1" 
AR Path="/605746B5/6065B34E/606723C4" Ref="C3505"  Part="1" 
F 0 "C3505" H 9465 1746 50  0000 L CNN
F 1 "C_10uF_0805" H 9465 1655 50  0000 L CNN
F 2 "Capacitor_SMD:C_0805_2012Metric" H 9388 1550 50  0001 C CNN
F 3 "~" H 9350 1700 50  0001 C CNN
F 4 "Murata Electronics" H 9350 1700 50  0001 C CNN "Manufacturer"
F 5 "GRM21BC8YA106ME11L" H 9350 1700 50  0001 C CNN "PartNumber"
F 6 "3000-0000000134" H 9350 1700 50  0001 C CNN "PartSpecification"
	1    9350 1700
	1    0    0    -1  
$EndComp
Wire Wire Line
	6800 1500 6800 2250
Connection ~ 6800 1500
Wire Wire Line
	6800 1500 6450 1500
Wire Wire Line
	2550 1750 3700 1750
Wire Wire Line
	3500 2350 3500 2100
Wire Wire Line
	3500 2100 3700 2100
Wire Wire Line
	3400 2000 3700 2000
Wire Wire Line
	4900 1400 5100 1400
Wire Wire Line
	5100 1400 5100 1500
Connection ~ 5100 1500
Wire Wire Line
	5100 1500 6000 1500
Text Label 7250 1500 0    50   ~ 0
DCDC_OUT
$Comp
L POWDER_Power:TPS63070RNM U?
U 1 1 606723E2
P 4300 1800
AR Path="/5D562501/606723E2" Ref="U?"  Part="1" 
AR Path="/5D587C46/606723E2" Ref="U?"  Part="1" 
AR Path="/5D591ABD/606723E2" Ref="U?"  Part="1" 
AR Path="/60664CFF/606723E2" Ref="U?"  Part="1" 
AR Path="/605A4C0E/606723E2" Ref="U?"  Part="1" 
AR Path="/605746B5/6065B34E/606723E2" Ref="U3501"  Part="1" 
F 0 "U3501" H 4650 2400 60  0000 C CNN
F 1 "TPS63070RNM" H 4300 2000 60  0000 C CNN
F 2 "POWDER_Power:TPS63070RNMR" H 4300 1740 60  0001 C CNN
F 3 "" H 4300 1800 60  0000 C CNN
F 4 "Texas Instruments" H 4300 1800 50  0001 C CNN "Manufacturer"
F 5 "TPS63070RNMR" H 4300 1800 50  0001 C CNN "PartNumber"
F 6 "3000-0000000079" H 4300 1800 50  0001 C CNN "PartSpecification"
	1    4300 1800
	1    0    0    -1  
$EndComp
Wire Wire Line
	2150 1500 3500 1500
Wire Wire Line
	3400 2000 3400 2250
Wire Wire Line
	3050 2350 3500 2350
$Comp
L power:GND #PWR?
U 1 1 60672401
P 5000 1850
AR Path="/5D562501/60672401" Ref="#PWR?"  Part="1" 
AR Path="/5D587C46/60672401" Ref="#PWR?"  Part="1" 
AR Path="/5D591ABD/60672401" Ref="#PWR?"  Part="1" 
AR Path="/60664CFF/60672401" Ref="#PWR?"  Part="1" 
AR Path="/605A4C0E/60672401" Ref="#PWR?"  Part="1" 
AR Path="/605746B5/6065B34E/60672401" Ref="#PWR?"  Part="1" 
F 0 "#PWR?" H 5000 1600 50  0001 C CNN
F 1 "GND" H 5005 1677 50  0000 C CNN
F 2 "" H 5000 1850 50  0001 C CNN
F 3 "" H 5000 1850 50  0001 C CNN
	1    5000 1850
	1    0    0    -1  
$EndComp
Wire Wire Line
	5000 1850 4900 1850
Connection ~ 8550 1500
$Comp
L power:GND #PWR?
U 1 1 6067240E
P 3600 2300
AR Path="/5D562501/6067240E" Ref="#PWR?"  Part="1" 
AR Path="/5D587C46/6067240E" Ref="#PWR?"  Part="1" 
AR Path="/5D591ABD/6067240E" Ref="#PWR?"  Part="1" 
AR Path="/60664CFF/6067240E" Ref="#PWR?"  Part="1" 
AR Path="/605A4C0E/6067240E" Ref="#PWR?"  Part="1" 
AR Path="/605746B5/6065B34E/6067240E" Ref="#PWR?"  Part="1" 
F 0 "#PWR?" H 3600 2050 50  0001 C CNN
F 1 "GND" H 3605 2127 50  0000 C CNN
F 2 "" H 3600 2300 50  0001 C CNN
F 3 "" H 3600 2300 50  0001 C CNN
	1    3600 2300
	1    0    0    -1  
$EndComp
Wire Wire Line
	3600 2300 3600 2200
Wire Wire Line
	3600 2200 3700 2200
Wire Wire Line
	3050 2250 3250 2250
$Comp
L power:+12V #PWR?
U 1 1 60679F73
P 1250 1300
F 0 "#PWR?" H 1250 1150 50  0001 C CNN
F 1 "+12V" H 1265 1473 50  0000 C CNN
F 2 "" H 1250 1300 50  0001 C CNN
F 3 "" H 1250 1300 50  0001 C CNN
	1    1250 1300
	1    0    0    -1  
$EndComp
Wire Wire Line
	1250 1300 1250 1500
Text HLabel 10000 1500 2    50   Output ~ 0
MAX10_6V
Wire Wire Line
	9350 1500 10000 1500
Connection ~ 9350 1500
$Comp
L Device:R R?
U 1 1 609FE85D
P 3250 2750
AR Path="/605746B5/5F853053/609FE85D" Ref="R?"  Part="1" 
AR Path="/605746B5/61256AAD/609FE85D" Ref="R?"  Part="1" 
AR Path="/605746B5/6065B34E/609FE85D" Ref="R3503"  Part="1" 
F 0 "R3503" V 3330 2750 50  0000 C CNN
F 1 "10k" V 3250 2750 50  0000 C CNN
F 2 "Resistor_SMD:R_0402_1005Metric" V 3180 2750 50  0001 C CNN
F 3 "~" H 3250 2750 50  0001 C CNN
F 4 "3000-0000000131" H 3250 2750 50  0001 C CNN "PartSpecification"
	1    3250 2750
	1    0    0    -1  
$EndComp
$Comp
L power:GND #PWR?
U 1 1 609FE863
P 3250 3000
AR Path="/605746B5/5F853053/609FE863" Ref="#PWR?"  Part="1" 
AR Path="/605746B5/6065B34E/609FE863" Ref="#PWR?"  Part="1" 
F 0 "#PWR?" H 3250 2750 50  0001 C CNN
F 1 "GND" H 3250 2850 50  0000 C CNN
F 2 "" H 3250 3000 50  0001 C CNN
F 3 "" H 3250 3000 50  0001 C CNN
	1    3250 3000
	1    0    0    -1  
$EndComp
Wire Wire Line
	3250 3000 3250 2900
Wire Wire Line
	3250 2600 3250 2250
Connection ~ 3250 2250
Wire Wire Line
	3250 2250 3400 2250
$EndSCHEMATC
