EESchema Schematic File Version 4
EELAYER 30 0
EELAYER END
$Descr A4 11693 8268
encoding utf-8
Sheet 5 13
Title ""
Date ""
Rev ""
Comp ""
Comment1 ""
Comment2 ""
Comment3 ""
Comment4 ""
$EndDescr
$Comp
L Connector:Screw_Terminal_01x02 J?
U 1 1 614C3F7D
P 4100 3150
AR Path="/614C3F7D" Ref="J?"  Part="1" 
AR Path="/614BD53A/614C3F7D" Ref="J5"  Part="1" 
F 0 "J5" H 4018 3367 50  0000 C CNN
F 1 "Screw_Terminal_01x02" H 4018 3276 50  0000 C CNN
F 2 "TerminalBlock:TerminalBlock_bornier-2_P5.08mm" H 4100 3150 50  0001 C CNN
F 3 "~" H 4100 3150 50  0001 C CNN
	1    4100 3150
	-1   0    0    -1  
$EndComp
Wire Wire Line
	4300 3250 4400 3250
$Comp
L Connector:Screw_Terminal_01x02 J?
U 1 1 614C3F84
P 4100 4000
AR Path="/614C3F84" Ref="J?"  Part="1" 
AR Path="/614BD53A/614C3F84" Ref="J6"  Part="1" 
F 0 "J6" H 4018 4217 50  0000 C CNN
F 1 "Screw_Terminal_01x02" H 4018 4126 50  0000 C CNN
F 2 "TerminalBlock:TerminalBlock_bornier-2_P5.08mm" H 4100 4000 50  0001 C CNN
F 3 "~" H 4100 4000 50  0001 C CNN
	1    4100 4000
	-1   0    0    -1  
$EndComp
Wire Wire Line
	4300 4100 4400 4100
Wire Wire Line
	4400 4100 4400 4200
$Comp
L power:GND #PWR?
U 1 1 614C3F8E
P 4400 4200
AR Path="/614C3F8E" Ref="#PWR?"  Part="1" 
AR Path="/614BD53A/614C3F8E" Ref="#PWR?"  Part="1" 
F 0 "#PWR?" H 4400 3950 50  0001 C CNN
F 1 "GND" H 4405 4027 50  0000 C CNN
F 2 "" H 4400 4200 50  0001 C CNN
F 3 "" H 4400 4200 50  0001 C CNN
	1    4400 4200
	1    0    0    -1  
$EndComp
$Comp
L Connector:Screw_Terminal_01x02 J?
U 1 1 614C3F95
P 4150 2300
AR Path="/614C3F95" Ref="J?"  Part="1" 
AR Path="/614BD53A/614C3F95" Ref="J7"  Part="1" 
F 0 "J7" H 4068 2517 50  0000 C CNN
F 1 "Screw_Terminal_01x02" H 4068 2426 50  0000 C CNN
F 2 "TerminalBlock:TerminalBlock_bornier-2_P5.08mm" H 4150 2300 50  0001 C CNN
F 3 "~" H 4150 2300 50  0001 C CNN
	1    4150 2300
	-1   0    0    -1  
$EndComp
Wire Wire Line
	4350 2400 4450 2400
Wire Wire Line
	4450 2400 4450 2500
$Comp
L power:GND #PWR?
U 1 1 614C3F9E
P 4450 2500
AR Path="/614C3F9E" Ref="#PWR?"  Part="1" 
AR Path="/614BD53A/614C3F9E" Ref="#PWR?"  Part="1" 
F 0 "#PWR?" H 4450 2250 50  0001 C CNN
F 1 "GND" H 4455 2327 50  0000 C CNN
F 2 "" H 4450 2500 50  0001 C CNN
F 3 "" H 4450 2500 50  0001 C CNN
	1    4450 2500
	1    0    0    -1  
$EndComp
$Comp
L power:+12V #PWR?
U 1 1 614C3FA5
P 5350 2200
AR Path="/614C3FA5" Ref="#PWR?"  Part="1" 
AR Path="/614BD53A/614C3FA5" Ref="#PWR?"  Part="1" 
F 0 "#PWR?" H 5350 2050 50  0001 C CNN
F 1 "+12V" H 5365 2373 50  0000 C CNN
F 2 "" H 5350 2200 50  0001 C CNN
F 3 "" H 5350 2200 50  0001 C CNN
	1    5350 2200
	1    0    0    -1  
$EndComp
Wire Wire Line
	4400 3250 4400 3350
$Comp
L power:GND #PWR?
U 1 1 614C3FAC
P 4400 3350
AR Path="/614C3FAC" Ref="#PWR?"  Part="1" 
AR Path="/614BD53A/614C3FAC" Ref="#PWR?"  Part="1" 
F 0 "#PWR?" H 4400 3100 50  0001 C CNN
F 1 "GND" H 4405 3177 50  0000 C CNN
F 2 "" H 4400 3350 50  0001 C CNN
F 3 "" H 4400 3350 50  0001 C CNN
	1    4400 3350
	1    0    0    -1  
$EndComp
$Comp
L Device:D_Schottky D5
U 1 1 614C51EF
P 5000 2300
F 0 "D5" H 5000 2083 50  0000 C CNN
F 1 "D_Schottky" H 5000 2174 50  0000 C CNN
F 2 "Diode_SMD:D_SOD-123F" H 5000 2300 50  0001 C CNN
F 3 "~" H 5000 2300 50  0001 C CNN
	1    5000 2300
	-1   0    0    1   
$EndComp
$Comp
L Device:D_Schottky D3
U 1 1 614C60AE
P 4950 3150
F 0 "D3" H 4950 2933 50  0000 C CNN
F 1 "D_Schottky" H 4950 3024 50  0000 C CNN
F 2 "Diode_SMD:D_SOD-123F" H 4950 3150 50  0001 C CNN
F 3 "~" H 4950 3150 50  0001 C CNN
	1    4950 3150
	-1   0    0    1   
$EndComp
$Comp
L Device:D_Schottky D4
U 1 1 614C6682
P 4950 4000
F 0 "D4" H 4950 3783 50  0000 C CNN
F 1 "D_Schottky" H 4950 3874 50  0000 C CNN
F 2 "Diode_SMD:D_SOD-123F" H 4950 4000 50  0001 C CNN
F 3 "~" H 4950 4000 50  0001 C CNN
	1    4950 4000
	1    0    0    -1  
$EndComp
Wire Wire Line
	4300 4000 4800 4000
Wire Wire Line
	5600 4000 5800 4000
Wire Wire Line
	4300 3150 4650 3150
Wire Wire Line
	4350 2300 4850 2300
Wire Wire Line
	5150 2300 5350 2300
Wire Wire Line
	5350 2300 5350 2200
$Comp
L power:VEE #PWR?
U 1 1 614DBDD7
P 5800 4100
F 0 "#PWR?" H 5800 3950 50  0001 C CNN
F 1 "VEE" H 5815 4273 50  0000 C CNN
F 2 "" H 5800 4100 50  0001 C CNN
F 3 "" H 5800 4100 50  0001 C CNN
	1    5800 4100
	-1   0    0    1   
$EndComp
Wire Wire Line
	5800 4000 5800 4100
$Comp
L Device:D_Schottky D6
U 1 1 614E560B
P 5450 4000
F 0 "D6" H 5450 3783 50  0000 C CNN
F 1 "D_Schottky" H 5450 3874 50  0000 C CNN
F 2 "Diode_SMD:D_SOD-123F" H 5450 4000 50  0001 C CNN
F 3 "~" H 5450 4000 50  0001 C CNN
	1    5450 4000
	1    0    0    -1  
$EndComp
Wire Wire Line
	5100 4000 5300 4000
Wire Wire Line
	5450 3250 5450 3150
$Comp
L 000_PreferredParts:C_10uF_0603 C?
U 1 1 6147C901
P 5450 3400
AR Path="/5D587C46/6147C901" Ref="C?"  Part="1" 
AR Path="/5D562501/6147C901" Ref="C?"  Part="1" 
AR Path="/60664CFF/6147C901" Ref="C?"  Part="1" 
AR Path="/612ADC7E/6147C901" Ref="C?"  Part="1" 
AR Path="/614BD53A/6147C901" Ref="C7"  Part="1" 
F 0 "C7" H 5475 3500 50  0000 L CNN
F 1 "C_10uF_0603" H 5475 3300 50  0001 L CNN
F 2 "Capacitor_SMD:C_0603_1608Metric" H 5488 3250 50  0001 C CNN
F 3 "~" H 5450 3400 50  0001 C CNN
F 4 "10uF" H 5600 3300 50  0000 C CNN "DisplayValue"
F 5 "0603" H 5600 3200 50  0000 C CNN "DisplayFootprint"
F 6 "3000-0000000135" H -4550 -300 50  0001 C CNN "PartSpecification"
	1    5450 3400
	1    0    0    -1  
$EndComp
Wire Wire Line
	5450 3550 5450 3650
$Comp
L power:GND #PWR?
U 1 1 614835D9
P 5450 3650
F 0 "#PWR?" H 5450 3400 50  0001 C CNN
F 1 "GND" H 5455 3477 50  0000 C CNN
F 2 "" H 5450 3650 50  0001 C CNN
F 3 "" H 5450 3650 50  0001 C CNN
	1    5450 3650
	1    0    0    -1  
$EndComp
Wire Wire Line
	5800 3250 5800 3150
$Comp
L 000_PreferredParts:C_10uF_0603 C?
U 1 1 6148CD47
P 5800 3400
AR Path="/5D587C46/6148CD47" Ref="C?"  Part="1" 
AR Path="/5D562501/6148CD47" Ref="C?"  Part="1" 
AR Path="/60664CFF/6148CD47" Ref="C?"  Part="1" 
AR Path="/612ADC7E/6148CD47" Ref="C?"  Part="1" 
AR Path="/614BD53A/6148CD47" Ref="C9"  Part="1" 
F 0 "C9" H 5825 3500 50  0000 L CNN
F 1 "C_10uF_0603" H 5825 3300 50  0001 L CNN
F 2 "Capacitor_SMD:C_0603_1608Metric" H 5838 3250 50  0001 C CNN
F 3 "~" H 5800 3400 50  0001 C CNN
F 4 "10uF" H 5950 3300 50  0000 C CNN "DisplayValue"
F 5 "0603" H 5950 3200 50  0000 C CNN "DisplayFootprint"
F 6 "3000-0000000135" H -4200 -300 50  0001 C CNN "PartSpecification"
	1    5800 3400
	1    0    0    -1  
$EndComp
Wire Wire Line
	5800 3550 5800 3650
$Comp
L power:GND #PWR?
U 1 1 6148CD4E
P 5800 3650
F 0 "#PWR?" H 5800 3400 50  0001 C CNN
F 1 "GND" H 5805 3477 50  0000 C CNN
F 2 "" H 5800 3650 50  0001 C CNN
F 3 "" H 5800 3650 50  0001 C CNN
	1    5800 3650
	1    0    0    -1  
$EndComp
Connection ~ 5450 3150
Wire Wire Line
	5450 3150 5800 3150
Connection ~ 5300 3150
Wire Wire Line
	5300 3150 5450 3150
Wire Wire Line
	5100 3150 5300 3150
Wire Wire Line
	5300 3150 5300 3050
$Comp
L power:+5V #PWR?
U 1 1 614C3FB4
P 5300 3050
AR Path="/614C3FB4" Ref="#PWR?"  Part="1" 
AR Path="/614BD53A/614C3FB4" Ref="#PWR?"  Part="1" 
F 0 "#PWR?" H 5300 2900 50  0001 C CNN
F 1 "+5V" H 5315 3223 50  0000 C CNN
F 2 "" H 5300 3050 50  0001 C CNN
F 3 "" H 5300 3050 50  0001 C CNN
	1    5300 3050
	1    0    0    -1  
$EndComp
Wire Wire Line
	5500 2400 5500 2300
$Comp
L 000_PreferredParts:C_10uF_0603 C?
U 1 1 6149285D
P 5500 2550
AR Path="/5D587C46/6149285D" Ref="C?"  Part="1" 
AR Path="/5D562501/6149285D" Ref="C?"  Part="1" 
AR Path="/60664CFF/6149285D" Ref="C?"  Part="1" 
AR Path="/612ADC7E/6149285D" Ref="C?"  Part="1" 
AR Path="/614BD53A/6149285D" Ref="C8"  Part="1" 
F 0 "C8" H 5525 2650 50  0000 L CNN
F 1 "C_10uF_0603" H 5525 2450 50  0001 L CNN
F 2 "Capacitor_SMD:C_0603_1608Metric" H 5538 2400 50  0001 C CNN
F 3 "~" H 5500 2550 50  0001 C CNN
F 4 "10uF" H 5650 2450 50  0000 C CNN "DisplayValue"
F 5 "0603" H 5650 2350 50  0000 C CNN "DisplayFootprint"
F 6 "3000-0000000135" H -4500 -1150 50  0001 C CNN "PartSpecification"
	1    5500 2550
	1    0    0    -1  
$EndComp
Wire Wire Line
	5500 2700 5500 2800
$Comp
L power:GND #PWR?
U 1 1 61492864
P 5500 2800
F 0 "#PWR?" H 5500 2550 50  0001 C CNN
F 1 "GND" H 5505 2627 50  0000 C CNN
F 2 "" H 5500 2800 50  0001 C CNN
F 3 "" H 5500 2800 50  0001 C CNN
	1    5500 2800
	1    0    0    -1  
$EndComp
Wire Wire Line
	5850 2400 5850 2300
$Comp
L 000_PreferredParts:C_10uF_0603 C?
U 1 1 6149286E
P 5850 2550
AR Path="/5D587C46/6149286E" Ref="C?"  Part="1" 
AR Path="/5D562501/6149286E" Ref="C?"  Part="1" 
AR Path="/60664CFF/6149286E" Ref="C?"  Part="1" 
AR Path="/612ADC7E/6149286E" Ref="C?"  Part="1" 
AR Path="/614BD53A/6149286E" Ref="C10"  Part="1" 
F 0 "C10" H 5875 2650 50  0000 L CNN
F 1 "C_10uF_0603" H 5875 2450 50  0001 L CNN
F 2 "Capacitor_SMD:C_0603_1608Metric" H 5888 2400 50  0001 C CNN
F 3 "~" H 5850 2550 50  0001 C CNN
F 4 "10uF" H 6000 2450 50  0000 C CNN "DisplayValue"
F 5 "0603" H 6000 2350 50  0000 C CNN "DisplayFootprint"
F 6 "3000-0000000135" H -4150 -1150 50  0001 C CNN "PartSpecification"
	1    5850 2550
	1    0    0    -1  
$EndComp
Wire Wire Line
	5850 2700 5850 2800
$Comp
L power:GND #PWR?
U 1 1 61492875
P 5850 2800
F 0 "#PWR?" H 5850 2550 50  0001 C CNN
F 1 "GND" H 5855 2627 50  0000 C CNN
F 2 "" H 5850 2800 50  0001 C CNN
F 3 "" H 5850 2800 50  0001 C CNN
	1    5850 2800
	1    0    0    -1  
$EndComp
Connection ~ 5500 2300
Wire Wire Line
	5500 2300 5850 2300
Wire Wire Line
	5350 2300 5500 2300
Wire Wire Line
	6050 4100 6050 4000
$Comp
L 000_PreferredParts:C_10uF_0603 C?
U 1 1 61497050
P 6050 4250
AR Path="/5D587C46/61497050" Ref="C?"  Part="1" 
AR Path="/5D562501/61497050" Ref="C?"  Part="1" 
AR Path="/60664CFF/61497050" Ref="C?"  Part="1" 
AR Path="/612ADC7E/61497050" Ref="C?"  Part="1" 
AR Path="/614BD53A/61497050" Ref="C11"  Part="1" 
F 0 "C11" H 6075 4350 50  0000 L CNN
F 1 "C_10uF_0603" H 6075 4150 50  0001 L CNN
F 2 "Capacitor_SMD:C_0603_1608Metric" H 6088 4100 50  0001 C CNN
F 3 "~" H 6050 4250 50  0001 C CNN
F 4 "10uF" H 6200 4150 50  0000 C CNN "DisplayValue"
F 5 "0603" H 6200 4050 50  0000 C CNN "DisplayFootprint"
F 6 "3000-0000000135" H -3950 550 50  0001 C CNN "PartSpecification"
	1    6050 4250
	1    0    0    -1  
$EndComp
Wire Wire Line
	6050 4400 6050 4500
$Comp
L power:GND #PWR?
U 1 1 61497057
P 6050 4500
F 0 "#PWR?" H 6050 4250 50  0001 C CNN
F 1 "GND" H 6055 4327 50  0000 C CNN
F 2 "" H 6050 4500 50  0001 C CNN
F 3 "" H 6050 4500 50  0001 C CNN
	1    6050 4500
	1    0    0    -1  
$EndComp
Wire Wire Line
	6400 4100 6400 4000
$Comp
L 000_PreferredParts:C_10uF_0603 C?
U 1 1 61497061
P 6400 4250
AR Path="/5D587C46/61497061" Ref="C?"  Part="1" 
AR Path="/5D562501/61497061" Ref="C?"  Part="1" 
AR Path="/60664CFF/61497061" Ref="C?"  Part="1" 
AR Path="/612ADC7E/61497061" Ref="C?"  Part="1" 
AR Path="/614BD53A/61497061" Ref="C12"  Part="1" 
F 0 "C12" H 6425 4350 50  0000 L CNN
F 1 "C_10uF_0603" H 6425 4150 50  0001 L CNN
F 2 "Capacitor_SMD:C_0603_1608Metric" H 6438 4100 50  0001 C CNN
F 3 "~" H 6400 4250 50  0001 C CNN
F 4 "10uF" H 6550 4150 50  0000 C CNN "DisplayValue"
F 5 "0603" H 6550 4050 50  0000 C CNN "DisplayFootprint"
F 6 "3000-0000000135" H -3600 550 50  0001 C CNN "PartSpecification"
	1    6400 4250
	1    0    0    -1  
$EndComp
Wire Wire Line
	6400 4400 6400 4500
$Comp
L power:GND #PWR?
U 1 1 61497068
P 6400 4500
F 0 "#PWR?" H 6400 4250 50  0001 C CNN
F 1 "GND" H 6405 4327 50  0000 C CNN
F 2 "" H 6400 4500 50  0001 C CNN
F 3 "" H 6400 4500 50  0001 C CNN
	1    6400 4500
	1    0    0    -1  
$EndComp
Wire Wire Line
	5800 4000 6050 4000
Connection ~ 5800 4000
Connection ~ 6050 4000
Wire Wire Line
	6050 4000 6400 4000
Text Label 4600 4000 3    50   ~ 0
neg_0_1
Text Label 5200 4000 3    50   ~ 0
neg_0_2
$Comp
L power:+3V3 #PWR?
U 1 1 614A8B70
P 8100 2300
F 0 "#PWR?" H 8100 2150 50  0001 C CNN
F 1 "+3V3" H 8115 2473 50  0000 C CNN
F 2 "" H 8100 2300 50  0001 C CNN
F 3 "" H 8100 2300 50  0001 C CNN
	1    8100 2300
	1    0    0    -1  
$EndComp
Wire Wire Line
	8100 2500 8100 2400
$Comp
L 000_PreferredParts:C_10uF_0603 C?
U 1 1 614AC002
P 8100 2650
AR Path="/5D587C46/614AC002" Ref="C?"  Part="1" 
AR Path="/5D562501/614AC002" Ref="C?"  Part="1" 
AR Path="/60664CFF/614AC002" Ref="C?"  Part="1" 
AR Path="/612ADC7E/614AC002" Ref="C?"  Part="1" 
AR Path="/614BD53A/614AC002" Ref="C13"  Part="1" 
F 0 "C13" H 8125 2750 50  0000 L CNN
F 1 "C_10uF_0603" H 8125 2550 50  0001 L CNN
F 2 "Capacitor_SMD:C_0603_1608Metric" H 8138 2500 50  0001 C CNN
F 3 "~" H 8100 2650 50  0001 C CNN
F 4 "10uF" H 8250 2550 50  0000 C CNN "DisplayValue"
F 5 "0603" H 8250 2450 50  0000 C CNN "DisplayFootprint"
F 6 "3000-0000000135" H -1900 -1050 50  0001 C CNN "PartSpecification"
	1    8100 2650
	1    0    0    -1  
$EndComp
Wire Wire Line
	8100 2800 8100 2900
$Comp
L power:GND #PWR?
U 1 1 614AC009
P 8100 2900
F 0 "#PWR?" H 8100 2650 50  0001 C CNN
F 1 "GND" H 8105 2727 50  0000 C CNN
F 2 "" H 8100 2900 50  0001 C CNN
F 3 "" H 8100 2900 50  0001 C CNN
	1    8100 2900
	1    0    0    -1  
$EndComp
Wire Wire Line
	8450 2500 8450 2400
$Comp
L 000_PreferredParts:C_10uF_0603 C?
U 1 1 614AC013
P 8450 2650
AR Path="/5D587C46/614AC013" Ref="C?"  Part="1" 
AR Path="/5D562501/614AC013" Ref="C?"  Part="1" 
AR Path="/60664CFF/614AC013" Ref="C?"  Part="1" 
AR Path="/612ADC7E/614AC013" Ref="C?"  Part="1" 
AR Path="/614BD53A/614AC013" Ref="C14"  Part="1" 
F 0 "C14" H 8475 2750 50  0000 L CNN
F 1 "C_10uF_0603" H 8475 2550 50  0001 L CNN
F 2 "Capacitor_SMD:C_0603_1608Metric" H 8488 2500 50  0001 C CNN
F 3 "~" H 8450 2650 50  0001 C CNN
F 4 "10uF" H 8600 2550 50  0000 C CNN "DisplayValue"
F 5 "0603" H 8600 2450 50  0000 C CNN "DisplayFootprint"
F 6 "3000-0000000135" H -1550 -1050 50  0001 C CNN "PartSpecification"
	1    8450 2650
	1    0    0    -1  
$EndComp
Wire Wire Line
	8450 2800 8450 2900
$Comp
L power:GND #PWR?
U 1 1 614AC01A
P 8450 2900
F 0 "#PWR?" H 8450 2650 50  0001 C CNN
F 1 "GND" H 8455 2727 50  0000 C CNN
F 2 "" H 8450 2900 50  0001 C CNN
F 3 "" H 8450 2900 50  0001 C CNN
	1    8450 2900
	1    0    0    -1  
$EndComp
Wire Wire Line
	8100 2400 8450 2400
Wire Wire Line
	8100 2300 8100 2400
Connection ~ 8100 2400
Text GLabel 4650 3100 1    50   Output ~ 0
5v_pre
Wire Wire Line
	4650 3100 4650 3150
Connection ~ 4650 3150
Wire Wire Line
	4650 3150 4800 3150
$EndSCHEMATC
