EESchema Schematic File Version 4
EELAYER 30 0
EELAYER END
$Descr A4 11693 8268
encoding utf-8
Sheet 21 27
Title ""
Date ""
Rev ""
Comp ""
Comment1 ""
Comment2 ""
Comment3 ""
Comment4 ""
$EndDescr
Text HLabel 1000 1650 0    50   Input ~ 0
v_in
Text HLabel 1000 1750 0    50   Input ~ 0
en
$Sheet
S 2500 1500 1000 500 
U 5E179864
F0 "buck_boost_misc" 50
F1 "buck_boost_misc.sch" 50
F2 "v_in" I L 2500 1650 50 
F3 "en" I L 2500 1750 50 
F4 "v_out" O R 3500 1650 50 
F5 "p_good" O R 3500 1750 50 
F6 "sync" I L 2500 1850 50 
$EndSheet
Text HLabel 1000 1850 0    50   Input ~ 0
sync
$Comp
L POWDER_Power:LM3724 U2301
U 1 1 5E17BF99
P 1700 2700
F 0 "U2301" H 2000 3050 50  0000 C CNN
F 1 "LM3724" H 1700 2700 50  0000 C CNN
F 2 "Package_TO_SOT_SMD:SOT-23-5" H 1900 2950 50  0001 C CNN
F 3 "" H 1700 2700 50  0001 C CNN
F 4 "LM3724EM5-3.08/NOPB" H 1700 2700 50  0001 C CNN "PartNumber"
F 5 "3000-0000000529" H 1700 2700 50  0001 C CNN "PartSpecification"
	1    1700 2700
	1    0    0    -1  
$EndComp
$Comp
L power:GND #PWR?
U 1 1 5E17C869
P 1750 3300
F 0 "#PWR?" H 1750 3050 50  0001 C CNN
F 1 "GND" H 1750 3150 50  0000 C CNN
F 2 "" H 1750 3300 50  0001 C CNN
F 3 "" H 1750 3300 50  0001 C CNN
	1    1750 3300
	1    0    0    -1  
$EndComp
Wire Wire Line
	1750 3300 1750 3200
Wire Wire Line
	1650 3100 1650 3200
Wire Wire Line
	1650 3200 1750 3200
Connection ~ 1750 3200
Wire Wire Line
	1750 3200 1750 3100
Text HLabel 4800 5050 0    50   Input ~ 0
en_switch
Text HLabel 5000 6550 0    50   Input ~ 0
en_iris
Text HLabel 4950 2750 0    50   Input ~ 0
en_b210_1
Text HLabel 4950 2850 0    50   Input ~ 0
en_b210_2
Text HLabel 4600 1500 2    50   Output ~ 0
v_12
Text HLabel 4150 4400 2    50   Output ~ 0
pg_12
Text HLabel 7000 2400 2    50   Output ~ 0
pg_b210_1
Text HLabel 6700 2800 2    50   Output ~ 0
pg_b210_2
Text HLabel 9850 1500 2    50   Output ~ 0
i_sense_12
Text HLabel 9850 3800 2    50   Output ~ 0
i_sense_switch
Text HLabel 9850 4100 2    50   Output ~ 0
i_sense_iris
Text HLabel 9850 2100 2    50   Output ~ 0
i_sense_b210_1
Text HLabel 9850 2400 2    50   Output ~ 0
i_sense_b210_2
Text HLabel 9850 1800 2    50   Output ~ 0
i_sense_3v3
Text HLabel 8600 4350 0    50   Input ~ 0
rsm_misc_1
Text HLabel 8600 4450 0    50   Input ~ 0
rsp_misc_1
Text HLabel 9850 4400 2    50   Output ~ 0
i_sense_misc_1
Text Notes 2200 5000 0    50   ~ 0
12V misc\n6V 1A x2 - B210s\n12V - switch\n3.3V - MCU, etc\n12V - IRIS
Text Label 4600 1650 0    50   ~ 0
v_12_misc
$Sheet
S 5500 2200 1000 1300
U 5E2CF5EB
F0 "buck_boost_6" 50
F1 "buck_boost_6.sch" 50
F2 "v_12" I L 5500 2550 50 
F3 "pg_b210_1" O R 6500 2400 50 
F4 "rsp_b210_1" O R 6500 2500 50 
F5 "rsn_b210_1" O R 6500 2600 50 
F6 "pg_b210_2" O R 6500 2800 50 
F7 "rsp_b210_2" O R 6500 2900 50 
F8 "rsn_b210_2" O R 6500 3000 50 
F9 "en_b210_1" I L 5500 2750 50 
F10 "en_b210_2" I L 5500 2850 50 
F11 "rsp_b210_3" O R 6500 3300 50 
F12 "en_b210_3" I L 5500 2950 50 
F13 "rsn_b210_3" O R 6500 3400 50 
F14 "pg_b210_3" O R 6500 3200 50 
F15 "v_sense_b210_1" O R 6500 2300 50 
F16 "v_sense_b210_2" O R 6500 2700 50 
F17 "v_sense_b210_3" O R 6500 3100 50 
$EndSheet
Text HLabel 7000 1650 2    50   Output ~ 0
pg_3_3
Wire Wire Line
	7000 1650 6500 1650
Wire Wire Line
	4600 1500 4500 1500
Wire Wire Line
	4500 1500 4500 1650
Wire Wire Line
	5500 2550 5000 2550
Connection ~ 5000 1650
Wire Wire Line
	5000 1650 5500 1650
Wire Wire Line
	7000 2400 6500 2400
Wire Wire Line
	6700 2800 6500 2800
Wire Wire Line
	1000 1650 2500 1650
Wire Wire Line
	1000 1850 2500 1850
Wire Wire Line
	4950 2850 5500 2850
Wire Wire Line
	5500 2750 4950 2750
$Comp
L POWDER_Power:TPS22810-Q1 U2303
U 1 1 5E43DC4E
P 5750 4900
F 0 "U2303" H 5900 4450 50  0000 C CNN
F 1 "TPS22810-Q1" H 5750 5250 50  0000 C CNN
F 2 "Package_TO_SOT_SMD:SOT-23-6" H 6000 5300 50  0001 C CNN
F 3 "" H 6000 5300 50  0001 C CNN
F 4 "3000-0000000535" H 5750 4900 50  0001 C CNN "PartSpecification"
	1    5750 4900
	1    0    0    -1  
$EndComp
$Comp
L POWDER_Power:TPS22810-Q1 U2304
U 1 1 5E43F304
P 5750 6400
F 0 "U2304" H 5900 5950 50  0000 C CNN
F 1 "TPS22810-Q1" H 5750 6750 50  0000 C CNN
F 2 "Package_TO_SOT_SMD:SOT-23-6" H 6000 6800 50  0001 C CNN
F 3 "" H 6000 6800 50  0001 C CNN
F 4 "3000-0000000535" H 5750 6400 50  0001 C CNN "PartSpecification"
	1    5750 6400
	1    0    0    -1  
$EndComp
$Comp
L power:GND #PWR?
U 1 1 5E43FC1E
P 5750 5600
F 0 "#PWR?" H 5750 5350 50  0001 C CNN
F 1 "GND" H 5750 5450 50  0000 C CNN
F 2 "" H 5750 5600 50  0001 C CNN
F 3 "" H 5750 5600 50  0001 C CNN
	1    5750 5600
	1    0    0    -1  
$EndComp
$Comp
L power:GND #PWR?
U 1 1 5E43FED3
P 5750 7100
F 0 "#PWR?" H 5750 6850 50  0001 C CNN
F 1 "GND" H 5750 6950 50  0000 C CNN
F 2 "" H 5750 7100 50  0001 C CNN
F 3 "" H 5750 7100 50  0001 C CNN
	1    5750 7100
	1    0    0    -1  
$EndComp
Wire Wire Line
	5750 7100 5750 6900
Wire Wire Line
	5750 5600 5750 5400
$Comp
L 000_PreferredParts:C_10uF_0603 C2304
U 1 1 5E440EF8
P 6650 5050
F 0 "C2304" H 6675 5150 50  0000 L CNN
F 1 "C_10uF_0603" H 6675 4950 50  0001 L CNN
F 2 "Capacitor_SMD:C_0603_1608Metric" H 6688 4900 50  0001 C CNN
F 3 "~" H 6650 5050 50  0001 C CNN
F 4 "10uF" H 6800 4950 50  0000 C CNN "DisplayValue"
F 5 "0603" H 6800 4850 50  0000 C CNN "DisplayFootprint"
F 6 "3000-0000000135" H 6650 5050 50  0001 C CNN "PartSpecification"
	1    6650 5050
	1    0    0    -1  
$EndComp
$Comp
L 000_PreferredParts:C_10uF_0603 C2305
U 1 1 5E441416
P 6650 6550
F 0 "C2305" H 6675 6650 50  0000 L CNN
F 1 "C_10uF_0603" H 6675 6450 50  0001 L CNN
F 2 "Capacitor_SMD:C_0603_1608Metric" H 6688 6400 50  0001 C CNN
F 3 "~" H 6650 6550 50  0001 C CNN
F 4 "10uF" H 6800 6450 50  0000 C CNN "DisplayValue"
F 5 "0603" H 6800 6350 50  0000 C CNN "DisplayFootprint"
F 6 "3000-0000000135" H 6650 6550 50  0001 C CNN "PartSpecification"
	1    6650 6550
	1    0    0    -1  
$EndComp
Wire Wire Line
	6650 6400 6650 6250
Wire Wire Line
	6650 6250 6250 6250
Wire Wire Line
	6100 6350 6250 6350
Wire Wire Line
	6250 6350 6250 6250
Connection ~ 6250 6250
Wire Wire Line
	6250 6250 6100 6250
Wire Wire Line
	6650 4900 6650 4750
Wire Wire Line
	6650 4750 6250 4750
Wire Wire Line
	6100 4850 6250 4850
Wire Wire Line
	6250 4850 6250 4750
Connection ~ 6250 4750
Wire Wire Line
	6250 4750 6100 4750
$Comp
L 000_PreferredParts:C_1nF C2303
U 1 1 5E4433F2
P 6300 6950
F 0 "C2303" H 6325 7050 50  0000 L CNN
F 1 "C_1nF" H 6325 6850 50  0000 L CNN
F 2 "Capacitor_SMD:C_0402_1005Metric" H 6338 6800 50  0001 C CNN
F 3 "~" H 6300 6950 50  0001 C CNN
F 4 "3000-0000000128" H 6300 6950 50  0001 C CNN "PartSpecification"
	1    6300 6950
	1    0    0    -1  
$EndComp
$Comp
L 000_PreferredParts:C_1nF C2302
U 1 1 5E44375A
P 6300 5450
F 0 "C2302" H 6325 5550 50  0000 L CNN
F 1 "C_1nF" H 6325 5350 50  0000 L CNN
F 2 "Capacitor_SMD:C_0402_1005Metric" H 6338 5300 50  0001 C CNN
F 3 "~" H 6300 5450 50  0001 C CNN
F 4 "3000-0000000128" H 6300 5450 50  0001 C CNN "PartSpecification"
	1    6300 5450
	1    0    0    -1  
$EndComp
$Comp
L power:GND #PWR?
U 1 1 5E443AB8
P 6300 5600
F 0 "#PWR?" H 6300 5350 50  0001 C CNN
F 1 "GND" H 6300 5450 50  0000 C CNN
F 2 "" H 6300 5600 50  0001 C CNN
F 3 "" H 6300 5600 50  0001 C CNN
	1    6300 5600
	1    0    0    -1  
$EndComp
$Comp
L power:GND #PWR?
U 1 1 5E443CB3
P 6300 7100
F 0 "#PWR?" H 6300 6850 50  0001 C CNN
F 1 "GND" H 6300 6950 50  0000 C CNN
F 2 "" H 6300 7100 50  0001 C CNN
F 3 "" H 6300 7100 50  0001 C CNN
	1    6300 7100
	1    0    0    -1  
$EndComp
Wire Wire Line
	6300 6800 6300 6650
Wire Wire Line
	6300 6650 6100 6650
Wire Wire Line
	6300 5300 6300 5150
Wire Wire Line
	6300 5150 6100 5150
Wire Wire Line
	5000 6550 5400 6550
Wire Wire Line
	5400 5050 4800 5050
Wire Wire Line
	5000 2550 5000 4750
Wire Wire Line
	5000 4750 5400 4750
Connection ~ 5000 2550
Wire Wire Line
	5000 4750 5000 6250
Wire Wire Line
	5000 6250 5400 6250
Connection ~ 5000 4750
$Comp
L power:GND #PWR?
U 1 1 5E44E9FB
P 6650 7100
F 0 "#PWR?" H 6650 6850 50  0001 C CNN
F 1 "GND" H 6650 6950 50  0000 C CNN
F 2 "" H 6650 7100 50  0001 C CNN
F 3 "" H 6650 7100 50  0001 C CNN
	1    6650 7100
	1    0    0    -1  
$EndComp
$Comp
L power:GND #PWR?
U 1 1 5E44EBF7
P 6650 5600
F 0 "#PWR?" H 6650 5350 50  0001 C CNN
F 1 "GND" H 6650 5450 50  0000 C CNN
F 2 "" H 6650 5600 50  0001 C CNN
F 3 "" H 6650 5600 50  0001 C CNN
	1    6650 5600
	1    0    0    -1  
$EndComp
Wire Wire Line
	6650 5600 6650 5200
Wire Wire Line
	6650 7100 6650 6700
Wire Wire Line
	1000 1750 1050 1750
Wire Wire Line
	1050 1750 1050 2700
Wire Wire Line
	1050 2700 1150 2700
Wire Wire Line
	2250 2700 2300 2700
Wire Wire Line
	2300 2700 2300 1750
Wire Wire Line
	2300 1750 2500 1750
$Comp
L POWDER_Power:INA4180-Q1 U2305
U 1 1 5EC3CD55
P 9200 1950
F 0 "U2305" H 9350 2600 50  0000 L CNN
F 1 "INA4180-Q1" H 9350 1250 50  0000 L CNN
F 2 "Package_SO:TSSOP-14_4.4x5mm_P0.65mm" H 11100 2800 100 0001 C CNN
F 3 "" H 9450 2650 100 0001 C CNN
F 4 "3000-0000000510" H 9200 1950 50  0001 C CNN "PartSpecification"
	1    9200 1950
	1    0    0    -1  
$EndComp
$Comp
L POWDER_Power:INA4180-Q1 U2306
U 1 1 5EC42A7B
P 9200 3950
F 0 "U2306" H 9350 4600 50  0000 L CNN
F 1 "INA4180-Q1" H 9350 3250 50  0000 L CNN
F 2 "Package_SO:TSSOP-14_4.4x5mm_P0.65mm" H 11100 4800 100 0001 C CNN
F 3 "" H 9450 4650 100 0001 C CNN
F 4 "3000-0000000510" H 9200 3950 50  0001 C CNN "PartSpecification"
	1    9200 3950
	1    0    0    -1  
$EndComp
Wire Wire Line
	4500 1650 5000 1650
$Comp
L Device:R R2301
U 1 1 5EC5222D
P 3850 1650
F 0 "R2301" V 3930 1650 50  0000 C CNN
F 1 "3m" V 3850 1650 50  0000 C CNN
F 2 "POWDER_Power:R_0508_1220Metric" V 3780 1650 50  0001 C CNN
F 3 "~" H 3850 1650 50  0001 C CNN
F 4 "3000-0000000499" H 3850 1650 50  0001 C CNN "PartSpecification"
	1    3850 1650
	0    1    1    0   
$EndComp
Wire Wire Line
	3700 1650 3650 1650
Wire Wire Line
	4000 1650 4350 1650
Connection ~ 4500 1650
Connection ~ 3650 1650
Wire Wire Line
	3650 1650 3500 1650
$Comp
L power:GND #PWR?
U 1 1 5EC7415B
P 9200 2750
F 0 "#PWR?" H 9200 2500 50  0001 C CNN
F 1 "GND" H 9200 2600 50  0000 C CNN
F 2 "" H 9200 2750 50  0001 C CNN
F 3 "" H 9200 2750 50  0001 C CNN
	1    9200 2750
	1    0    0    -1  
$EndComp
Wire Wire Line
	9200 2750 9200 2650
$Comp
L power:+3.3V #PWR?
U 1 1 5EC78E13
P 9200 1150
F 0 "#PWR?" H 9200 1000 50  0001 C CNN
F 1 "+3.3V" H 9200 1290 50  0000 C CNN
F 2 "" H 9200 1150 50  0001 C CNN
F 3 "" H 9200 1150 50  0001 C CNN
	1    9200 1150
	1    0    0    -1  
$EndComp
Wire Wire Line
	9200 1150 9200 1250
$Comp
L 000_PreferredParts:C_0_1uF C2308
U 1 1 5EC7D8B1
P 10750 1750
F 0 "C2308" H 10775 1850 50  0000 L CNN
F 1 "C_0_1uF" H 10775 1650 50  0001 L CNN
F 2 "Capacitor_SMD:C_0402_1005Metric" H 10788 1600 50  0001 C CNN
F 3 "~" H 10750 1750 50  0001 C CNN
F 4 "0.1uF" H 10900 1650 50  0000 C CNN "DisplayValue"
F 5 "3000-0000000125" H 10750 1750 50  0001 C CNN "PartSpecification"
	1    10750 1750
	1    0    0    -1  
$EndComp
$Comp
L power:GND #PWR?
U 1 1 5EC7E272
P 10750 2000
F 0 "#PWR?" H 10750 1750 50  0001 C CNN
F 1 "GND" H 10750 1850 50  0000 C CNN
F 2 "" H 10750 2000 50  0001 C CNN
F 3 "" H 10750 2000 50  0001 C CNN
	1    10750 2000
	1    0    0    -1  
$EndComp
Wire Wire Line
	10750 2000 10750 1900
$Comp
L power:+3.3V #PWR?
U 1 1 5EC87426
P 10750 1500
F 0 "#PWR?" H 10750 1350 50  0001 C CNN
F 1 "+3.3V" H 10750 1640 50  0000 C CNN
F 2 "" H 10750 1500 50  0001 C CNN
F 3 "" H 10750 1500 50  0001 C CNN
	1    10750 1500
	1    0    0    -1  
$EndComp
Wire Wire Line
	10750 1500 10750 1600
$Comp
L 000_PreferredParts:C_0_1uF C2309
U 1 1 5EC8CE13
P 10750 3750
F 0 "C2309" H 10775 3850 50  0000 L CNN
F 1 "C_0_1uF" H 10775 3650 50  0001 L CNN
F 2 "Capacitor_SMD:C_0402_1005Metric" H 10788 3600 50  0001 C CNN
F 3 "~" H 10750 3750 50  0001 C CNN
F 4 "0.1uF" H 10900 3650 50  0000 C CNN "DisplayValue"
F 5 "3000-0000000125" H 10750 3750 50  0001 C CNN "PartSpecification"
	1    10750 3750
	1    0    0    -1  
$EndComp
$Comp
L power:GND #PWR?
U 1 1 5EC8CE19
P 10750 4000
F 0 "#PWR?" H 10750 3750 50  0001 C CNN
F 1 "GND" H 10750 3850 50  0000 C CNN
F 2 "" H 10750 4000 50  0001 C CNN
F 3 "" H 10750 4000 50  0001 C CNN
	1    10750 4000
	1    0    0    -1  
$EndComp
Wire Wire Line
	10750 4000 10750 3900
$Comp
L power:+3.3V #PWR?
U 1 1 5EC8CE20
P 10750 3500
F 0 "#PWR?" H 10750 3350 50  0001 C CNN
F 1 "+3.3V" H 10750 3640 50  0000 C CNN
F 2 "" H 10750 3500 50  0001 C CNN
F 3 "" H 10750 3500 50  0001 C CNN
	1    10750 3500
	1    0    0    -1  
$EndComp
Wire Wire Line
	10750 3500 10750 3600
$Comp
L power:+3.3V #PWR?
U 1 1 5EC9082C
P 9200 3150
F 0 "#PWR?" H 9200 3000 50  0001 C CNN
F 1 "+3.3V" H 9200 3290 50  0000 C CNN
F 2 "" H 9200 3150 50  0001 C CNN
F 3 "" H 9200 3150 50  0001 C CNN
	1    9200 3150
	1    0    0    -1  
$EndComp
Wire Wire Line
	9200 3150 9200 3250
$Comp
L power:GND #PWR?
U 1 1 5EC948BE
P 9200 4750
F 0 "#PWR?" H 9200 4500 50  0001 C CNN
F 1 "GND" H 9200 4600 50  0000 C CNN
F 2 "" H 9200 4750 50  0001 C CNN
F 3 "" H 9200 4750 50  0001 C CNN
	1    9200 4750
	1    0    0    -1  
$EndComp
Wire Wire Line
	9200 4750 9200 4650
Wire Wire Line
	9850 1500 9650 1500
Wire Wire Line
	9650 1800 9850 1800
Wire Wire Line
	9850 2100 9650 2100
Wire Wire Line
	9650 2400 9850 2400
Wire Wire Line
	9850 4100 9650 4100
Wire Wire Line
	8750 4350 8600 4350
Wire Wire Line
	8600 4450 8750 4450
Wire Wire Line
	9650 4400 9850 4400
Wire Wire Line
	9850 3800 9650 3800
Wire Wire Line
	9650 3500 9850 3500
$Comp
L Connector_Generic:Conn_01x02 J?
U 1 1 5ECF676A
P 7350 4850
AR Path="/5ECF676A" Ref="J?"  Part="1" 
AR Path="/5E179620/5E2CF5EB/5ECF676A" Ref="J?"  Part="1" 
AR Path="/5E179620/5ECF676A" Ref="J2301"  Part="1" 
F 0 "J2301" H 7350 4950 50  0000 C CNN
F 1 "Conn_01x02" H 7350 4650 50  0000 C CNN
F 2 "TerminalBlock:TerminalBlock_bornier-2_P5.08mm" H 7350 4850 50  0001 C CNN
F 3 "~" H 7350 4850 50  0001 C CNN
F 4 "3000-0000000184" H 7350 4850 50  0001 C CNN "PartSpecification"
	1    7350 4850
	1    0    0    1   
$EndComp
$Comp
L Connector_Generic:Conn_01x02 J?
U 1 1 5ECFB1DB
P 7350 6350
AR Path="/5ECFB1DB" Ref="J?"  Part="1" 
AR Path="/5E179620/5E2CF5EB/5ECFB1DB" Ref="J?"  Part="1" 
AR Path="/5E179620/5ECFB1DB" Ref="J2302"  Part="1" 
F 0 "J2302" H 7350 6450 50  0000 C CNN
F 1 "Conn_01x02" H 7350 6150 50  0000 C CNN
F 2 "TerminalBlock:TerminalBlock_bornier-2_P5.08mm" H 7350 6350 50  0001 C CNN
F 3 "~" H 7350 6350 50  0001 C CNN
F 4 "3000-0000000184" H 7350 6350 50  0001 C CNN "PartSpecification"
	1    7350 6350
	1    0    0    1   
$EndComp
Wire Wire Line
	7150 6250 7100 6250
Wire Wire Line
	7150 4750 7100 4750
$Comp
L power:GND #PWR?
U 1 1 5ED1B6E8
P 7150 4950
F 0 "#PWR?" H 7150 4700 50  0001 C CNN
F 1 "GND" H 7150 4800 50  0000 C CNN
F 2 "" H 7150 4950 50  0001 C CNN
F 3 "" H 7150 4950 50  0001 C CNN
	1    7150 4950
	1    0    0    -1  
$EndComp
Wire Wire Line
	7150 4950 7150 4850
$Comp
L power:GND #PWR?
U 1 1 5ED20284
P 7150 6450
F 0 "#PWR?" H 7150 6200 50  0001 C CNN
F 1 "GND" H 7150 6300 50  0000 C CNN
F 2 "" H 7150 6450 50  0001 C CNN
F 3 "" H 7150 6450 50  0001 C CNN
	1    7150 6450
	1    0    0    -1  
$EndComp
Wire Wire Line
	7150 6450 7150 6350
Wire Wire Line
	6750 6250 6650 6250
Connection ~ 6650 6250
Wire Wire Line
	6750 4750 6650 4750
Connection ~ 6650 4750
Text Notes 2650 2300 2    50   ~ 0
This is not the part used before (3.3V not 5V)
Text HLabel 4950 2950 0    50   Input ~ 0
en_b210_3
Wire Wire Line
	4950 2950 5500 2950
Wire Wire Line
	6500 1750 8750 1750
$Sheet
S 5500 1500 1000 500 
U 5E2CEBB7
F0 "buck_boost_3_3" 50
F1 "buck_boost_3_3.sch" 50
F2 "v_12" I L 5500 1650 50 
F3 "pg" O R 6500 1650 50 
F4 "rsp_3_3" O R 6500 1750 50 
F5 "rsn_3_3" O R 6500 1850 50 
F6 "v_sense_3_3" O R 6500 1550 50 
F7 "EN" I L 5500 1750 50 
$EndSheet
Wire Wire Line
	6500 1850 8750 1850
Wire Wire Line
	6600 1350 3650 1350
Wire Wire Line
	3650 1350 3650 1650
Wire Wire Line
	5000 1400 6700 1400
Wire Wire Line
	5000 1400 5000 1650
Wire Wire Line
	5000 1650 5000 2550
Wire Wire Line
	7650 2500 7650 2050
Wire Wire Line
	7650 2050 8750 2050
Wire Wire Line
	8750 2150 7750 2150
Wire Wire Line
	7750 2150 7750 2600
Wire Wire Line
	6500 2500 7650 2500
Wire Wire Line
	6500 2600 7750 2600
Wire Wire Line
	7850 2900 7850 2350
Wire Wire Line
	7850 2350 8750 2350
Wire Wire Line
	6500 2900 7850 2900
Wire Wire Line
	7950 3000 7950 2450
Wire Wire Line
	7950 2450 8750 2450
Wire Wire Line
	6500 3000 7950 3000
Text HLabel 6700 3200 2    50   Output ~ 0
pg_b210_3
Wire Wire Line
	6700 3200 6500 3200
Wire Wire Line
	8750 1550 6700 1550
Wire Wire Line
	6700 1400 6700 1550
Wire Wire Line
	6600 1350 6600 1450
Wire Wire Line
	6600 1450 8750 1450
Wire Wire Line
	6500 3300 7950 3300
Wire Wire Line
	7950 3300 7950 3450
Wire Wire Line
	7950 3450 8750 3450
Text HLabel 9850 3500 2    50   Output ~ 0
i_sense_b210_3
Wire Wire Line
	8750 3550 7750 3550
Wire Wire Line
	7750 3550 7750 3400
Wire Wire Line
	7750 3400 6500 3400
Wire Wire Line
	6650 4750 6650 3750
Wire Wire Line
	6650 3750 8750 3750
Wire Wire Line
	8750 3850 7100 3850
Wire Wire Line
	7100 3850 7100 4500
Connection ~ 7100 4750
Wire Wire Line
	7100 4750 7050 4750
Wire Wire Line
	8750 4050 7600 4050
Wire Wire Line
	7600 4050 7600 5850
Wire Wire Line
	7600 5850 6650 5850
Wire Wire Line
	6650 5850 6650 6250
Wire Wire Line
	7100 6250 7100 5950
Wire Wire Line
	7100 5950 7700 5950
Wire Wire Line
	7700 5950 7700 4150
Wire Wire Line
	7700 4150 8750 4150
Connection ~ 7100 6250
Wire Wire Line
	7100 6250 7050 6250
$Comp
L Device:R R2305
U 1 1 5E4A6E09
P 6900 4750
F 0 "R2305" V 6980 4750 50  0000 C CNN
F 1 "3m" V 6900 4750 50  0000 C CNN
F 2 "POWDER_Power:R_0508_1220Metric" V 6830 4750 50  0001 C CNN
F 3 "~" H 6900 4750 50  0001 C CNN
F 4 "3000-0000000499" H 6900 4750 50  0001 C CNN "PartSpecification"
	1    6900 4750
	0    1    1    0   
$EndComp
$Comp
L Device:R R2306
U 1 1 5E4A7219
P 6900 6250
F 0 "R2306" V 6980 6250 50  0000 C CNN
F 1 "3m" V 6900 6250 50  0000 C CNN
F 2 "POWDER_Power:R_0508_1220Metric" V 6830 6250 50  0001 C CNN
F 3 "~" H 6900 6250 50  0001 C CNN
F 4 "3000-0000000499" H 6900 6250 50  0001 C CNN "PartSpecification"
	1    6900 6250
	0    1    1    0   
$EndComp
$Comp
L Device:R R2304
U 1 1 5E6116E7
P 4350 2650
F 0 "R2304" V 4430 2650 50  0000 C CNN
F 1 "R" V 4350 2650 50  0000 C CNN
F 2 "Resistor_SMD:R_0402_1005Metric" V 4280 2650 50  0001 C CNN
F 3 "~" H 4350 2650 50  0001 C CNN
	1    4350 2650
	1    0    0    -1  
$EndComp
$Comp
L Device:R R2303
U 1 1 5E611E03
P 4350 2250
F 0 "R2303" V 4430 2250 50  0000 C CNN
F 1 "R" V 4350 2250 50  0000 C CNN
F 2 "Resistor_SMD:R_0402_1005Metric" V 4280 2250 50  0001 C CNN
F 3 "~" H 4350 2250 50  0001 C CNN
	1    4350 2250
	1    0    0    -1  
$EndComp
Wire Wire Line
	4350 2100 4350 1650
Connection ~ 4350 1650
Wire Wire Line
	4350 1650 4500 1650
Wire Wire Line
	4350 2400 4350 2450
$Comp
L power:GND #PWR?
U 1 1 5E61DC87
P 4350 2900
F 0 "#PWR?" H 4350 2650 50  0001 C CNN
F 1 "GND" H 4350 2750 50  0000 C CNN
F 2 "" H 4350 2900 50  0001 C CNN
F 3 "" H 4350 2900 50  0001 C CNN
	1    4350 2900
	1    0    0    -1  
$EndComp
Wire Wire Line
	4350 2900 4350 2800
Wire Wire Line
	4000 2450 4350 2450
Connection ~ 4350 2450
Wire Wire Line
	4350 2450 4350 2500
Text HLabel 4500 2450 2    50   Output ~ 0
v_sense_12
Wire Wire Line
	4500 2450 4350 2450
Text HLabel 7450 1600 2    50   Output ~ 0
v_sense_3_3
Wire Wire Line
	7450 1600 6650 1600
Wire Wire Line
	6650 1600 6650 1550
Wire Wire Line
	6650 1550 6500 1550
Text HLabel 7000 2300 2    50   Output ~ 0
v_sense_b210_1
Text HLabel 7000 2700 2    50   Output ~ 0
v_sense_b210_2
Text HLabel 7000 3100 2    50   Output ~ 0
v_sense_b210_3
Wire Wire Line
	7000 2300 6500 2300
Wire Wire Line
	7000 2700 6500 2700
Wire Wire Line
	7000 3100 6500 3100
$Comp
L Device:R R2308
U 1 1 5E708232
P 8250 5250
F 0 "R2308" V 8330 5250 50  0000 C CNN
F 1 "R" V 8250 5250 50  0000 C CNN
F 2 "Resistor_SMD:R_0402_1005Metric" V 8180 5250 50  0001 C CNN
F 3 "~" H 8250 5250 50  0001 C CNN
	1    8250 5250
	1    0    0    -1  
$EndComp
$Comp
L Device:R R2307
U 1 1 5E708238
P 8250 4850
F 0 "R2307" V 8330 4850 50  0000 C CNN
F 1 "R" V 8250 4850 50  0000 C CNN
F 2 "Resistor_SMD:R_0402_1005Metric" V 8180 4850 50  0001 C CNN
F 3 "~" H 8250 4850 50  0001 C CNN
	1    8250 4850
	1    0    0    -1  
$EndComp
Wire Wire Line
	8250 5000 8250 5050
$Comp
L power:GND #PWR?
U 1 1 5E70823F
P 8250 5500
F 0 "#PWR?" H 8250 5250 50  0001 C CNN
F 1 "GND" H 8250 5350 50  0000 C CNN
F 2 "" H 8250 5500 50  0001 C CNN
F 3 "" H 8250 5500 50  0001 C CNN
	1    8250 5500
	1    0    0    -1  
$EndComp
Wire Wire Line
	8250 5500 8250 5400
Wire Wire Line
	7900 5050 8250 5050
Connection ~ 8250 5050
Wire Wire Line
	8250 5050 8250 5100
Text HLabel 8400 5050 2    50   Output ~ 0
v_sense_switch
Wire Wire Line
	8400 5050 8250 5050
$Comp
L Device:R R2310
U 1 1 5E70E5BB
P 9000 6050
F 0 "R2310" V 9080 6050 50  0000 C CNN
F 1 "R" V 9000 6050 50  0000 C CNN
F 2 "Resistor_SMD:R_0402_1005Metric" V 8930 6050 50  0001 C CNN
F 3 "~" H 9000 6050 50  0001 C CNN
	1    9000 6050
	1    0    0    -1  
$EndComp
$Comp
L Device:R R2309
U 1 1 5E70E5C1
P 9000 5650
F 0 "R2309" V 9080 5650 50  0000 C CNN
F 1 "R" V 9000 5650 50  0000 C CNN
F 2 "Resistor_SMD:R_0402_1005Metric" V 8930 5650 50  0001 C CNN
F 3 "~" H 9000 5650 50  0001 C CNN
	1    9000 5650
	1    0    0    -1  
$EndComp
Wire Wire Line
	9000 5800 9000 5850
$Comp
L power:GND #PWR?
U 1 1 5E70E5C8
P 9000 6300
F 0 "#PWR?" H 9000 6050 50  0001 C CNN
F 1 "GND" H 9000 6150 50  0000 C CNN
F 2 "" H 9000 6300 50  0001 C CNN
F 3 "" H 9000 6300 50  0001 C CNN
	1    9000 6300
	1    0    0    -1  
$EndComp
Wire Wire Line
	9000 6300 9000 6200
Wire Wire Line
	8650 5850 9000 5850
Connection ~ 9000 5850
Wire Wire Line
	9000 5850 9000 5900
Text HLabel 9150 5850 2    50   Output ~ 0
v_sense_iris
Wire Wire Line
	9150 5850 9000 5850
Wire Wire Line
	9000 5500 9000 5450
Wire Wire Line
	9000 5450 8500 5450
Wire Wire Line
	8500 5450 8500 5950
Wire Wire Line
	8500 5950 7700 5950
Connection ~ 7700 5950
Wire Wire Line
	8250 4700 8250 4500
Wire Wire Line
	8250 4500 7100 4500
Connection ~ 7100 4500
Wire Wire Line
	7100 4500 7100 4750
Wire Wire Line
	3500 1750 3650 1750
$Comp
L POWDER_Power:EL3H7-G U?
U 1 1 5E917AA2
P 3850 4300
AR Path="/5E179620/5E2CF5EB/5E917AA2" Ref="U?"  Part="1" 
AR Path="/5E179620/5E917AA2" Ref="U2302"  Part="1" 
F 0 "U2302" H 3800 4450 50  0000 C CNN
F 1 "EL3H7-G" H 3850 4150 50  0000 C CNN
F 2 "POWDER_Power:EL3H7-G" H 3850 4000 50  0001 C CNN
F 3 "" H 3850 4300 50  0001 C CNN
F 4 "3000-0000000432" H 3850 4300 50  0001 C CNN "PartSpecification"
	1    3850 4300
	1    0    0    -1  
$EndComp
$Comp
L power:GND #PWR?
U 1 1 5E917AA8
P 3650 4450
AR Path="/5E179620/5E2CEBB7/5E917AA8" Ref="#PWR?"  Part="1" 
AR Path="/5E179620/5E2CF5EB/5E917AA8" Ref="#PWR?"  Part="1" 
AR Path="/5E179620/5E917AA8" Ref="#PWR?"  Part="1" 
F 0 "#PWR?" H 3650 4200 50  0001 C CNN
F 1 "GND" H 3650 4300 50  0000 C CNN
F 2 "" H 3650 4450 50  0001 C CNN
F 3 "" H 3650 4450 50  0001 C CNN
	1    3650 4450
	1    0    0    -1  
$EndComp
Wire Wire Line
	3650 4450 3650 4350
$Comp
L Device:R R?
U 1 1 5E917AB0
P 4050 4600
AR Path="/5E179620/5E2CEBB7/5E917AB0" Ref="R?"  Part="1" 
AR Path="/5E179620/5E2CF5EB/5E917AB0" Ref="R?"  Part="1" 
AR Path="/5E179620/5E917AB0" Ref="R2302"  Part="1" 
F 0 "R2302" V 4130 4600 50  0000 C CNN
F 1 "100k" V 4050 4600 50  0000 C CNN
F 2 "Resistor_SMD:R_0402_1005Metric" V 3980 4600 50  0001 C CNN
F 3 "~" H 4050 4600 50  0001 C CNN
F 4 "3000-0000000575" H 4050 4600 50  0001 C CNN "PartSpecification"
	1    4050 4600
	-1   0    0    1   
$EndComp
$Comp
L power:+3.3V #PWR?
U 1 1 5E917AB6
P 4050 3700
AR Path="/5E179620/5E2CF5EB/5E917AB6" Ref="#PWR?"  Part="1" 
AR Path="/5E179620/5E917AB6" Ref="#PWR?"  Part="1" 
F 0 "#PWR?" H 4050 3550 50  0001 C CNN
F 1 "+3.3V" H 4050 3840 50  0000 C CNN
F 2 "" H 4050 3700 50  0001 C CNN
F 3 "" H 4050 3700 50  0001 C CNN
	1    4050 3700
	1    0    0    -1  
$EndComp
$Comp
L power:GND #PWR?
U 1 1 5E917ABD
P 4050 4850
AR Path="/5E179620/5E2CEBB7/5E917ABD" Ref="#PWR?"  Part="1" 
AR Path="/5E179620/5E2CF5EB/5E917ABD" Ref="#PWR?"  Part="1" 
AR Path="/5E179620/5E917ABD" Ref="#PWR?"  Part="1" 
F 0 "#PWR?" H 4050 4600 50  0001 C CNN
F 1 "GND" H 4050 4700 50  0000 C CNN
F 2 "" H 4050 4850 50  0001 C CNN
F 3 "" H 4050 4850 50  0001 C CNN
	1    4050 4850
	1    0    0    -1  
$EndComp
Wire Wire Line
	4050 4450 4050 4400
Wire Wire Line
	3650 1750 3650 4250
Connection ~ 3650 1750
Wire Wire Line
	3650 1750 5500 1750
Wire Wire Line
	4150 4400 4050 4400
Wire Wire Line
	4000 2400 4000 2450
$Comp
L power:+3.3V #PWR?
U 1 1 5E967B78
P 4000 2000
AR Path="/5E967B78" Ref="#PWR?"  Part="1" 
AR Path="/5E179620/5E967B78" Ref="#PWR?"  Part="1" 
F 0 "#PWR?" H 4000 1850 50  0001 C CNN
F 1 "+3.3V" H 4000 2140 50  0000 C CNN
F 2 "" H 4000 2000 50  0001 C CNN
F 3 "" H 4000 2000 50  0001 C CNN
	1    4000 2000
	1    0    0    -1  
$EndComp
Wire Wire Line
	4000 2000 4000 2100
Text Label 7250 4500 0    50   ~ 0
v_switch
Text Label 6150 4750 0    50   ~ 0
v_switch_ldo
Text Label 7200 5950 0    50   ~ 0
v_iris
Text Label 6200 6250 0    50   ~ 0
v_iris_ldo
Text Label 6150 6650 0    50   ~ 0
CT_iris
Text Label 6150 5150 0    50   ~ 0
CT_switch
Wire Wire Line
	4050 4850 4050 4750
Connection ~ 4050 4400
Wire Wire Line
	4050 4400 4050 4350
Wire Wire Line
	4050 3700 4050 4250
Text HLabel 1600 2100 0    50   Input ~ 0
v_3_3_pre
Wire Wire Line
	1600 2100 1700 2100
Wire Wire Line
	1700 2100 1700 2300
$Comp
L 000_PreferredDiodes:D_Schottky_60V_1A D2301
U 1 1 5F97B8BE
P 4000 2250
F 0 "D2301" H 4000 2350 50  0000 C CNN
F 1 "D_Schottky_60V_1A" H 4000 2150 50  0001 C CNN
F 2 "Diode_SMD:D_SOD-123F" H 4000 2250 50  0001 C CNN
F 3 "~" H 4000 2250 50  0001 C CNN
F 4 "DSS16UTR" H 4000 2250 50  0001 C CNN "PartNumber"
F 5 "Schottky" H 4000 2150 50  0000 C CNN "DisplayValue"
F 6 "60V_1A" H 4000 2050 50  0000 C CNN "DisplayValue2"
F 7 "3000-0000000481" H 4000 2250 50  0001 C CNN "PartSpecification"
	1    4000 2250
	0    1    1    0   
$EndComp
$Comp
L 000_PreferredDiodes:D_Schottky_60V_1A D2303
U 1 1 5F99E4D2
P 8650 5650
F 0 "D2303" H 8650 5750 50  0000 C CNN
F 1 "D_Schottky_60V_1A" H 8650 5550 50  0001 C CNN
F 2 "Diode_SMD:D_SOD-123F" H 8650 5650 50  0001 C CNN
F 3 "~" H 8650 5650 50  0001 C CNN
F 4 "DSS16UTR" H 8650 5650 50  0001 C CNN "PartNumber"
F 5 "Schottky" H 8650 5550 50  0000 C CNN "DisplayValue"
F 6 "60V_1A" H 8650 5450 50  0000 C CNN "DisplayValue2"
F 7 "3000-0000000481" H 8650 5650 50  0001 C CNN "PartSpecification"
	1    8650 5650
	0    1    1    0   
$EndComp
$Comp
L 000_PreferredDiodes:D_Schottky_60V_1A D2302
U 1 1 5F99FFB2
P 7900 4800
F 0 "D2302" H 7900 4900 50  0000 C CNN
F 1 "D_Schottky_60V_1A" H 7900 4700 50  0001 C CNN
F 2 "Diode_SMD:D_SOD-123F" H 7900 4800 50  0001 C CNN
F 3 "~" H 7900 4800 50  0001 C CNN
F 4 "DSS16UTR" H 7900 4800 50  0001 C CNN "PartNumber"
F 5 "Schottky" H 7900 4700 50  0000 C CNN "DisplayValue"
F 6 "60V_1A" H 7900 4600 50  0000 C CNN "DisplayValue2"
F 7 "3000-0000000481" H 7900 4800 50  0001 C CNN "PartSpecification"
	1    7900 4800
	0    1    1    0   
$EndComp
$Comp
L power:+3.3V #PWR?
U 1 1 5F9A09C0
P 8650 5400
F 0 "#PWR?" H 8650 5250 50  0001 C CNN
F 1 "+3.3V" H 8650 5540 50  0000 C CNN
F 2 "" H 8650 5400 50  0001 C CNN
F 3 "" H 8650 5400 50  0001 C CNN
	1    8650 5400
	1    0    0    -1  
$EndComp
$Comp
L power:+3.3V #PWR?
U 1 1 5F9A13FC
P 7900 4550
F 0 "#PWR?" H 7900 4400 50  0001 C CNN
F 1 "+3.3V" H 7900 4690 50  0000 C CNN
F 2 "" H 7900 4550 50  0001 C CNN
F 3 "" H 7900 4550 50  0001 C CNN
	1    7900 4550
	1    0    0    -1  
$EndComp
Wire Wire Line
	7900 4550 7900 4650
Wire Wire Line
	7900 4950 7900 5050
Wire Wire Line
	8650 5400 8650 5500
Wire Wire Line
	8650 5800 8650 5850
$Comp
L 000_PreferredParts:C_0_1uF C2310
U 1 1 5F9F26E4
P 2500 2750
F 0 "C2310" H 2525 2850 50  0000 L CNN
F 1 "C_0_1uF" H 2525 2650 50  0001 L CNN
F 2 "Capacitor_SMD:C_0402_1005Metric" H 2538 2600 50  0001 C CNN
F 3 "~" H 2500 2750 50  0001 C CNN
F 4 "0.1uF" H 2650 2650 50  0000 C CNN "DisplayValue"
F 5 "3000-0000000125" H 2500 2750 50  0001 C CNN "PartSpecification"
F 6 "100V" H 2500 2750 50  0001 C CNN "Voltage"
	1    2500 2750
	1    0    0    -1  
$EndComp
$Comp
L power:GND #PWR?
U 1 1 5F9F2D76
P 2500 3000
F 0 "#PWR?" H 2500 2750 50  0001 C CNN
F 1 "GND" H 2500 2850 50  0000 C CNN
F 2 "" H 2500 3000 50  0001 C CNN
F 3 "" H 2500 3000 50  0001 C CNN
	1    2500 3000
	1    0    0    -1  
$EndComp
Wire Wire Line
	2500 3000 2500 2900
Wire Wire Line
	2500 2600 2500 2100
Wire Wire Line
	2500 2100 1700 2100
Connection ~ 1700 2100
$EndSCHEMATC
