EESchema Schematic File Version 4
EELAYER 30 0
EELAYER END
$Descr A4 11693 8268
encoding utf-8
Sheet 32 39
Title ""
Date ""
Rev ""
Comp ""
Comment1 ""
Comment2 ""
Comment3 ""
Comment4 ""
$EndDescr
$Comp
L POWDER_Digital:10M50DAF256 U2201
U 5 1 5F9B3C6F
P 4500 3250
F 0 "U2201" H 4500 3400 50  0000 C CNN
F 1 "‎10M08DAF256C8G" H 4500 3250 50  0000 C CNN
F 2 "Package_BGA:BGA-256_17.0x17.0mm_Layout16x16_P1.0mm_Ball0.5mm_Pad0.4mm_NSMD" H 4500 3250 50  0001 C CNN
F 3 "" H 4500 3250 50  0001 C CNN
F 4 "3000-0000001300" H 4500 3250 50  0001 C CNN "PartSpecification"
	5    4500 3250
	1    0    0    -1  
$EndComp
$Comp
L 000_PreferredParts:C_1nF C?
U 1 1 5FBA70C6
P 4800 2000
AR Path="/5F8E5420/5F971A6D/5FBA70C6" Ref="C?"  Part="1" 
AR Path="/5F8E5420/5F9AA234/5FBA70C6" Ref="C803"  Part="1" 
AR Path="/605746B5/5F8E5420/5F9AA234/5FBA70C6" Ref="C3303"  Part="1" 
F 0 "C3303" H 4825 2100 50  0000 L CNN
F 1 "C_1nF" H 4825 1900 50  0000 L CNN
F 2 "Capacitor_SMD:C_0402_1005Metric" H 4838 1850 50  0001 C CNN
F 3 "~" H 4800 2000 50  0001 C CNN
F 4 "3000-0000000128" H 4800 2000 50  0001 C CNN "PartSpecification"
	1    4800 2000
	1    0    0    -1  
$EndComp
$Comp
L 000_PreferredParts:C_1nF C?
U 1 1 5FBA70CD
P 3750 2000
AR Path="/5F8E5420/5F971A6D/5FBA70CD" Ref="C?"  Part="1" 
AR Path="/5F8E5420/5F9AA234/5FBA70CD" Ref="C801"  Part="1" 
AR Path="/605746B5/5F8E5420/5F9AA234/5FBA70CD" Ref="C3301"  Part="1" 
F 0 "C3301" H 3775 2100 50  0000 L CNN
F 1 "C_1nF" H 3775 1900 50  0000 L CNN
F 2 "Capacitor_SMD:C_0402_1005Metric" H 3788 1850 50  0001 C CNN
F 3 "~" H 3750 2000 50  0001 C CNN
F 4 "3000-0000000128" H 3750 2000 50  0001 C CNN "PartSpecification"
	1    3750 2000
	1    0    0    -1  
$EndComp
$Comp
L 000_PreferredParts:C_0_1uF C?
U 1 1 5FBA70D6
P 5150 2000
AR Path="/5F8E5420/5F971A6D/5FBA70D6" Ref="C?"  Part="1" 
AR Path="/5F8E5420/5F9AA234/5FBA70D6" Ref="C804"  Part="1" 
AR Path="/605746B5/5F8E5420/5F9AA234/5FBA70D6" Ref="C3304"  Part="1" 
F 0 "C3304" H 5175 2100 50  0000 L CNN
F 1 "C_0_1uF" H 5175 1900 50  0001 L CNN
F 2 "Capacitor_SMD:C_0402_1005Metric" H 5188 1850 50  0001 C CNN
F 3 "~" H 5150 2000 50  0001 C CNN
F 4 "0.1uF" H 5300 1900 50  0000 C CNN "DisplayValue"
F 5 "3000-0000000125" H 5150 2000 50  0001 C CNN "PartSpecification"
F 6 "100V" H 5150 2000 50  0001 C CNN "Voltage"
	1    5150 2000
	1    0    0    -1  
$EndComp
$Comp
L power:GND #PWR?
U 1 1 5FBA70E2
P 5500 2200
AR Path="/5F8E5420/5F971A6D/5FBA70E2" Ref="#PWR?"  Part="1" 
AR Path="/5F8E5420/5F9AA234/5FBA70E2" Ref="#PWR?"  Part="1" 
AR Path="/605746B5/5F8E5420/5F9AA234/5FBA70E2" Ref="#PWR?"  Part="1" 
F 0 "#PWR?" H 5500 1950 50  0001 C CNN
F 1 "GND" H 5500 2050 50  0000 C CNN
F 2 "" H 5500 2200 50  0001 C CNN
F 3 "" H 5500 2200 50  0001 C CNN
	1    5500 2200
	1    0    0    -1  
$EndComp
Wire Wire Line
	4800 2150 4800 2200
Wire Wire Line
	4800 2200 5150 2200
Wire Wire Line
	5150 2200 5150 2150
Connection ~ 5150 2200
Wire Wire Line
	5150 2200 5500 2200
Wire Wire Line
	4600 2350 4600 1750
Wire Wire Line
	4600 1750 4800 1750
Wire Wire Line
	5150 1850 5150 1750
Wire Wire Line
	4800 1850 4800 1750
Connection ~ 4800 1750
Wire Wire Line
	4800 1750 5150 1750
$Comp
L power:GND #PWR?
U 1 1 5FBA70F8
P 3750 2200
AR Path="/5F8E5420/5F971A6D/5FBA70F8" Ref="#PWR?"  Part="1" 
AR Path="/5F8E5420/5F9AA234/5FBA70F8" Ref="#PWR?"  Part="1" 
AR Path="/605746B5/5F8E5420/5F9AA234/5FBA70F8" Ref="#PWR?"  Part="1" 
F 0 "#PWR?" H 3750 1950 50  0001 C CNN
F 1 "GND" H 3750 2050 50  0000 C CNN
F 2 "" H 3750 2200 50  0001 C CNN
F 3 "" H 3750 2200 50  0001 C CNN
	1    3750 2200
	1    0    0    -1  
$EndComp
Wire Wire Line
	3750 2200 3750 2150
Wire Wire Line
	3750 1850 3750 1750
Wire Wire Line
	3750 1750 4500 1750
Wire Wire Line
	4500 1750 4500 2350
Wire Wire Line
	4500 1750 4500 1650
Wire Wire Line
	4500 1650 4600 1650
Wire Wire Line
	4600 1650 4600 1750
Connection ~ 4500 1750
Connection ~ 4600 1750
$Comp
L 000_PreferredParts:C_1nF C?
U 1 1 5FBA7108
P 4100 2000
AR Path="/5F8E5420/5F971A6D/5FBA7108" Ref="C?"  Part="1" 
AR Path="/5F8E5420/5F9AA234/5FBA7108" Ref="C802"  Part="1" 
AR Path="/605746B5/5F8E5420/5F9AA234/5FBA7108" Ref="C3302"  Part="1" 
F 0 "C3302" H 4125 2100 50  0000 L CNN
F 1 "C_1nF" H 4125 1900 50  0000 L CNN
F 2 "Capacitor_SMD:C_0402_1005Metric" H 4138 1850 50  0001 C CNN
F 3 "~" H 4100 2000 50  0001 C CNN
F 4 "3000-0000000128" H 4100 2000 50  0001 C CNN "PartSpecification"
	1    4100 2000
	1    0    0    -1  
$EndComp
$Comp
L power:GND #PWR?
U 1 1 5FBA710E
P 4100 2200
AR Path="/5F8E5420/5F971A6D/5FBA710E" Ref="#PWR?"  Part="1" 
AR Path="/5F8E5420/5F9AA234/5FBA710E" Ref="#PWR?"  Part="1" 
AR Path="/605746B5/5F8E5420/5F9AA234/5FBA710E" Ref="#PWR?"  Part="1" 
F 0 "#PWR?" H 4100 1950 50  0001 C CNN
F 1 "GND" H 4100 2050 50  0000 C CNN
F 2 "" H 4100 2200 50  0001 C CNN
F 3 "" H 4100 2200 50  0001 C CNN
	1    4100 2200
	1    0    0    -1  
$EndComp
Wire Wire Line
	4100 2200 4100 2150
Wire Wire Line
	4100 1850 4400 1850
Wire Wire Line
	4400 1850 4400 2350
Wire Wire Line
	4400 1850 4400 1650
Wire Wire Line
	4400 1650 4500 1650
Connection ~ 4400 1850
Connection ~ 4500 1650
Wire Wire Line
	2600 3000 3350 3000
Wire Wire Line
	2600 3600 3350 3600
Wire Wire Line
	2600 2900 3350 2900
Wire Wire Line
	6400 3500 5650 3500
Wire Wire Line
	6400 3700 5650 3700
Wire Wire Line
	3350 3100 2600 3100
Wire Wire Line
	6400 3600 5650 3600
Wire Wire Line
	2600 3400 3350 3400
Wire Wire Line
	3350 3500 2600 3500
Wire Wire Line
	6400 2800 5650 2800
Wire Wire Line
	6400 3000 5650 3000
Wire Wire Line
	5650 2900 6400 2900
Text HLabel 7000 2500 2    50   BiDi ~ 0
SDR_GPIO[0..11]
$Comp
L power:+3.3V #PWR?
U 1 1 60DD66DF
P 4500 1500
F 0 "#PWR?" H 4500 1350 50  0001 C CNN
F 1 "+3.3V" H 4515 1673 50  0000 C CNN
F 2 "" H 4500 1500 50  0001 C CNN
F 3 "" H 4500 1500 50  0001 C CNN
	1    4500 1500
	1    0    0    -1  
$EndComp
Wire Wire Line
	4500 1500 4500 1650
$Comp
L Device:R R?
U 1 1 61514810
P 2150 2800
AR Path="/60834A7B/6083FA27/61514810" Ref="R?"  Part="1" 
AR Path="/605746B5/5F8E5420/5F9AA234/61514810" Ref="R3301"  Part="1" 
F 0 "R3301" V 2230 2800 50  0000 C CNN
F 1 "66.5" V 2150 2800 50  0000 C CNN
F 2 "Resistor_SMD:R_0402_1005Metric" V 2080 2800 50  0001 C CNN
F 3 "~" H 2150 2800 50  0001 C CNN
F 4 "3000-0000000242" V 2150 2800 50  0001 C CNN "PartSpecification"
	1    2150 2800
	0    1    1    0   
$EndComp
$Comp
L Device:R R?
U 1 1 61514817
P 2650 3700
AR Path="/60834A7B/6083FA27/61514817" Ref="R?"  Part="1" 
AR Path="/605746B5/5F8E5420/5F9AA234/61514817" Ref="R3302"  Part="1" 
F 0 "R3302" V 2730 3700 50  0000 C CNN
F 1 "10" V 2650 3700 50  0000 C CNN
F 2 "Resistor_SMD:R_0402_1005Metric" V 2580 3700 50  0001 C CNN
F 3 "~" H 2650 3700 50  0001 C CNN
F 4 "3000-0000000146" V 2650 3700 50  0001 C CNN "PartSpecification"
	1    2650 3700
	0    1    1    0   
$EndComp
Wire Wire Line
	2800 3700 3350 3700
$Comp
L Device:LED D?
U 1 1 61514820
P 2500 4550
AR Path="/60834A7B/6083FA27/61514820" Ref="D?"  Part="1" 
AR Path="/605746B5/5F8E5420/5F9AA234/61514820" Ref="D3302"  Part="1" 
F 0 "D3302" H 2500 4650 50  0000 C CNN
F 1 "BLUE LED" H 2500 4450 50  0000 C CNN
F 2 "LED_SMD:LED_0805_2012Metric_Castellated" H 2500 4550 50  0001 C CNN
F 3 "~" H 2500 4550 50  0001 C CNN
F 4 "3000-0000000220" H 2500 4550 50  0001 C CNN "PartSpecification"
	1    2500 4550
	0    -1   -1   0   
$EndComp
$Comp
L Device:LED D?
U 1 1 61514827
P 1550 3450
AR Path="/60834A7B/6083FA27/61514827" Ref="D?"  Part="1" 
AR Path="/605746B5/5F8E5420/5F9AA234/61514827" Ref="D3301"  Part="1" 
F 0 "D3301" H 1550 3550 50  0000 C CNN
F 1 "YELLOW LED" H 1550 3350 50  0000 C CNN
F 2 "LED_SMD:LED_0805_2012Metric_Castellated" H 1550 3450 50  0001 C CNN
F 3 "~" H 1550 3450 50  0001 C CNN
F 4 "3000-0000000217" H 1550 3450 50  0001 C CNN "PartSpecification"
	1    1550 3450
	0    -1   -1   0   
$EndComp
Wire Wire Line
	2500 4400 2500 3700
Wire Wire Line
	1550 3300 1550 2800
Wire Wire Line
	1550 2800 2000 2800
$Comp
L power:GND #PWR?
U 1 1 61514830
P 2500 4800
AR Path="/60834A7B/6083FA27/61514830" Ref="#PWR?"  Part="1" 
AR Path="/605746B5/5F8E5420/5F9AA234/61514830" Ref="#PWR?"  Part="1" 
F 0 "#PWR?" H 2500 4550 50  0001 C CNN
F 1 "GND" H 2505 4627 50  0000 C CNN
F 2 "" H 2500 4800 50  0001 C CNN
F 3 "" H 2500 4800 50  0001 C CNN
	1    2500 4800
	1    0    0    -1  
$EndComp
$Comp
L power:GND #PWR?
U 1 1 61514836
P 1550 4000
AR Path="/60834A7B/6083FA27/61514836" Ref="#PWR?"  Part="1" 
AR Path="/605746B5/5F8E5420/5F9AA234/61514836" Ref="#PWR?"  Part="1" 
F 0 "#PWR?" H 1550 3750 50  0001 C CNN
F 1 "GND" H 1555 3827 50  0000 C CNN
F 2 "" H 1550 4000 50  0001 C CNN
F 3 "" H 1550 4000 50  0001 C CNN
	1    1550 4000
	1    0    0    -1  
$EndComp
Wire Wire Line
	1550 3600 1550 4000
Wire Wire Line
	2500 4800 2500 4700
Text Label 1750 2800 0    50   ~ 0
L2_C
Text Label 2500 3900 1    50   ~ 0
L3_C
Text Label 3250 2800 0    50   ~ 0
L2
Text Label 3250 3700 0    50   ~ 0
L3
Wire Bus Line
	7000 2500 6500 2500
Entry Wire Line
	6500 3600 6400 3700
Entry Wire Line
	6500 3500 6400 3600
Entry Wire Line
	6500 3400 6400 3500
Entry Wire Line
	2500 3000 2600 3100
Entry Wire Line
	2500 3400 2600 3500
Entry Wire Line
	6500 2900 6400 3000
Entry Wire Line
	6500 2800 6400 2900
Entry Wire Line
	6500 2700 6400 2800
Entry Wire Line
	2500 3500 2600 3600
Entry Wire Line
	2500 2800 2600 2900
Entry Wire Line
	2500 2900 2600 3000
Wire Bus Line
	6500 2500 6500 1000
Wire Bus Line
	6500 1000 2500 1000
Connection ~ 6500 2500
Text Label 2650 3400 0    50   ~ 0
SDR_GPIO0
Text Label 5750 2800 0    50   ~ 0
SDR_GPIO1
Text Label 2650 3500 0    50   ~ 0
SDR_GPIO2
Text Label 5750 3500 0    50   ~ 0
SDR_GPIO3
Text Label 5750 3600 0    50   ~ 0
SDR_GPIO4
Text Label 5750 3700 0    50   ~ 0
SDR_GPIO5
Text Label 5750 3000 0    50   ~ 0
SDR_GPIO6
Text Label 5750 2900 0    50   ~ 0
SDR_GPIO7
Text Label 2650 3600 0    50   ~ 0
SDR_GPIO8
Text Label 2650 3000 0    50   ~ 0
SDR_GPIO9
Text Label 2650 2900 0    50   ~ 0
SDR_GPIO10
Text Label 2650 3100 0    50   ~ 0
SDR_GPIO11
NoConn ~ 3350 3200
NoConn ~ 3350 3300
NoConn ~ 5650 3300
NoConn ~ 5650 3200
Entry Wire Line
	2500 3300 2600 3400
Wire Wire Line
	2600 2800 2600 2700
Wire Wire Line
	2600 2700 2400 2700
Wire Wire Line
	2400 2700 2400 2800
Wire Wire Line
	2400 2800 2300 2800
Wire Wire Line
	2600 2800 3350 2800
$Comp
L Device:R R3202
U 1 1 62B17357
P 7000 3650
F 0 "R3202" H 7070 3696 50  0000 L CNN
F 1 "49.9" H 7070 3605 50  0000 L CNN
F 2 "Resistor_SMD:R_0402_1005Metric" V 6930 3650 50  0001 C CNN
F 3 "~" H 7000 3650 50  0001 C CNN
F 4 "3000-0000000577" H 7000 3650 50  0001 C CNN "PartSpecification"
	1    7000 3650
	1    0    0    -1  
$EndComp
Wire Wire Line
	7000 3400 7000 3500
$Comp
L 000_PreferredParts:C_0_1uF C3219
U 1 1 62B19129
P 7000 4050
F 0 "C3219" H 7115 4096 50  0000 L CNN
F 1 "C_0_1uF" H 7025 3950 50  0001 L CNN
F 2 "Capacitor_SMD:C_0402_1005Metric" H 7038 3900 50  0001 C CNN
F 3 "~" H 7000 4050 50  0001 C CNN
F 4 "0.1uF" H 7115 4005 50  0000 L CNN "DisplayValue"
F 5 "3000-0000000125" H 7000 4050 50  0001 C CNN "PartSpecification"
F 6 "100V" H 7000 4050 50  0001 C CNN "Voltage"
	1    7000 4050
	1    0    0    -1  
$EndComp
$Comp
L power:GND #PWR?
U 1 1 62B19651
P 7000 4300
AR Path="/5F8E5420/5F971A6D/62B19651" Ref="#PWR?"  Part="1" 
AR Path="/5F8E5420/5F9AA234/62B19651" Ref="#PWR?"  Part="1" 
AR Path="/605746B5/5F8E5420/5F9AA234/62B19651" Ref="#PWR?"  Part="1" 
F 0 "#PWR?" H 7000 4050 50  0001 C CNN
F 1 "GND" H 7000 4150 50  0000 C CNN
F 2 "" H 7000 4300 50  0001 C CNN
F 3 "" H 7000 4300 50  0001 C CNN
	1    7000 4300
	1    0    0    -1  
$EndComp
Wire Wire Line
	7000 4300 7000 4200
Wire Wire Line
	7000 3900 7000 3800
$Comp
L Connector:Conn_Coaxial J3202
U 1 1 62B1BE74
P 7700 3400
F 0 "J3202" H 7800 3375 50  0000 L CNN
F 1 "Conn_Coaxial" H 7800 3284 50  0000 L CNN
F 2 "POWDER_RF:SMP_RA_MSLD-PCS17T" H 7700 3400 50  0001 C CNN
F 3 " ~" H 7700 3400 50  0001 C CNN
F 4 "3000-0000000485" H 7700 3400 50  0001 C CNN "PartSpecification"
	1    7700 3400
	1    0    0    -1  
$EndComp
$Comp
L power:GND #PWR?
U 1 1 62B1C638
P 7700 3700
AR Path="/5F8E5420/5F971A6D/62B1C638" Ref="#PWR?"  Part="1" 
AR Path="/5F8E5420/5F9AA234/62B1C638" Ref="#PWR?"  Part="1" 
AR Path="/605746B5/5F8E5420/5F9AA234/62B1C638" Ref="#PWR?"  Part="1" 
F 0 "#PWR?" H 7700 3450 50  0001 C CNN
F 1 "GND" H 7700 3550 50  0000 C CNN
F 2 "" H 7700 3700 50  0001 C CNN
F 3 "" H 7700 3700 50  0001 C CNN
	1    7700 3700
	1    0    0    -1  
$EndComp
Wire Wire Line
	7700 3700 7700 3600
Wire Wire Line
	7500 3400 7000 3400
Connection ~ 7000 3400
$Comp
L Interface:LTC6957xDD-3 U3201
U 1 1 62B2EC9A
P 8800 1500
F 0 "U3201" H 9244 1546 50  0000 L CNN
F 1 "LTC6957xDD-3" H 9244 1455 50  0000 L CNN
F 2 "Package_DFN_QFN:DFN-12-1EP_3x3mm_P0.45mm_EP1.66x2.38mm" H 8800 850 50  0001 C CNN
F 3 "https://www.analog.com/media/en/technical-documentation/data-sheets/6957fb.pdf" H 8800 1500 50  0001 C CNN
F 4 "3000-0000001316" H 8800 1500 50  0001 C CNN "PartSpecification"
	1    8800 1500
	1    0    0    -1  
$EndComp
$Comp
L power:GND #PWR?
U 1 1 62B30D8F
P 8300 2000
AR Path="/5F8E5420/5F971A6D/62B30D8F" Ref="#PWR?"  Part="1" 
AR Path="/5F8E5420/5F9AA234/62B30D8F" Ref="#PWR?"  Part="1" 
AR Path="/605746B5/5F8E5420/5F9AA234/62B30D8F" Ref="#PWR?"  Part="1" 
F 0 "#PWR?" H 8300 1750 50  0001 C CNN
F 1 "GND" H 8300 1850 50  0000 C CNN
F 2 "" H 8300 2000 50  0001 C CNN
F 3 "" H 8300 2000 50  0001 C CNN
	1    8300 2000
	1    0    0    -1  
$EndComp
Wire Wire Line
	8300 1800 8400 1800
$Comp
L power:+3.3V #PWR?
U 1 1 62B330BE
P 8800 800
F 0 "#PWR?" H 8800 650 50  0001 C CNN
F 1 "+3.3V" H 8815 973 50  0000 C CNN
F 2 "" H 8800 800 50  0001 C CNN
F 3 "" H 8800 800 50  0001 C CNN
	1    8800 800 
	1    0    0    -1  
$EndComp
Wire Wire Line
	8800 800  8800 850 
Wire Wire Line
	8800 850  8900 850 
Wire Wire Line
	8900 850  8900 900 
Connection ~ 8800 850 
Wire Wire Line
	8800 850  8800 900 
$Comp
L power:GND #PWR?
U 1 1 62B3590F
P 8800 2200
AR Path="/5F8E5420/5F971A6D/62B3590F" Ref="#PWR?"  Part="1" 
AR Path="/5F8E5420/5F9AA234/62B3590F" Ref="#PWR?"  Part="1" 
AR Path="/605746B5/5F8E5420/5F9AA234/62B3590F" Ref="#PWR?"  Part="1" 
F 0 "#PWR?" H 8800 1950 50  0001 C CNN
F 1 "GND" H 8800 2050 50  0000 C CNN
F 2 "" H 8800 2200 50  0001 C CNN
F 3 "" H 8800 2200 50  0001 C CNN
	1    8800 2200
	1    0    0    -1  
$EndComp
$Comp
L power:GND #PWR?
U 1 1 62B35B2E
P 8900 2200
AR Path="/5F8E5420/5F971A6D/62B35B2E" Ref="#PWR?"  Part="1" 
AR Path="/5F8E5420/5F9AA234/62B35B2E" Ref="#PWR?"  Part="1" 
AR Path="/605746B5/5F8E5420/5F9AA234/62B35B2E" Ref="#PWR?"  Part="1" 
F 0 "#PWR?" H 8900 1950 50  0001 C CNN
F 1 "GND" H 8900 2050 50  0000 C CNN
F 2 "" H 8900 2200 50  0001 C CNN
F 3 "" H 8900 2200 50  0001 C CNN
	1    8900 2200
	1    0    0    -1  
$EndComp
Wire Wire Line
	8900 2200 8900 2100
Wire Wire Line
	8800 2100 8800 2200
NoConn ~ 9200 1600
$Comp
L power:+3.3V #PWR?
U 1 1 62B39987
P 8100 1800
F 0 "#PWR?" H 8100 1650 50  0001 C CNN
F 1 "+3.3V" H 8115 1973 50  0000 C CNN
F 2 "" H 8100 1800 50  0001 C CNN
F 3 "" H 8100 1800 50  0001 C CNN
	1    8100 1800
	1    0    0    -1  
$EndComp
Wire Wire Line
	8100 1800 8100 1900
Wire Wire Line
	8300 1800 8300 1600
Wire Wire Line
	8300 1500 8400 1500
Connection ~ 8300 1800
Wire Wire Line
	8400 1600 8300 1600
Connection ~ 8300 1600
Wire Wire Line
	8300 1600 8300 1500
Wire Wire Line
	8300 1800 8300 2000
Wire Wire Line
	8100 1900 8400 1900
Wire Wire Line
	9500 3100 9500 1400
Wire Wire Line
	9500 1400 9200 1400
$Comp
L Connector:Conn_Coaxial J3201
U 1 1 62B4B083
P 7000 1100
F 0 "J3201" H 6928 1338 50  0000 C CNN
F 1 "Conn_Coaxial" H 6928 1247 50  0000 C CNN
F 2 "POWDER_RF:SMP_RA_MSLD-PCS17T" H 7000 1100 50  0001 C CNN
F 3 " ~" H 7000 1100 50  0001 C CNN
F 4 "3000-0000000485" H 7000 1100 50  0001 C CNN "PartSpecification"
	1    7000 1100
	-1   0    0    -1  
$EndComp
$Comp
L power:GND #PWR?
U 1 1 62B4B92E
P 7000 1400
AR Path="/5F8E5420/5F971A6D/62B4B92E" Ref="#PWR?"  Part="1" 
AR Path="/5F8E5420/5F9AA234/62B4B92E" Ref="#PWR?"  Part="1" 
AR Path="/605746B5/5F8E5420/5F9AA234/62B4B92E" Ref="#PWR?"  Part="1" 
F 0 "#PWR?" H 7000 1150 50  0001 C CNN
F 1 "GND" H 7000 1250 50  0000 C CNN
F 2 "" H 7000 1400 50  0001 C CNN
F 3 "" H 7000 1400 50  0001 C CNN
	1    7000 1400
	1    0    0    -1  
$EndComp
Wire Wire Line
	7000 1400 7000 1300
$Comp
L Device:R R3201
U 1 1 62B4DBBC
P 7300 1350
F 0 "R3201" H 7370 1396 50  0000 L CNN
F 1 "49.9" H 7370 1305 50  0000 L CNN
F 2 "Resistor_SMD:R_0805_2012Metric" V 7230 1350 50  0001 C CNN
F 3 "~" H 7300 1350 50  0001 C CNN
F 4 "At least 0.4W" H 7300 1350 50  0001 C CNN "Power"
F 5 "CRCW080549R9FKEAHP" H 7300 1350 50  0001 C CNN "PartNumber"
F 6 "3000-0000001304" H 7300 1350 50  0001 C CNN "PartSpecification"
	1    7300 1350
	1    0    0    -1  
$EndComp
$Comp
L 000_PreferredParts:C_10nF C3218
U 1 1 62B505CD
P 7900 1450
F 0 "C3218" H 8015 1496 50  0000 L CNN
F 1 "C_10nF" H 7925 1350 50  0001 L CNN
F 2 "Capacitor_SMD:C_0402_1005Metric" H 7938 1300 50  0001 C CNN
F 3 "~" H 7900 1450 50  0001 C CNN
F 4 "10nF" H 8015 1405 50  0000 L CNN "DisplayValue"
F 5 "3000-0000000203" H 7900 1450 50  0001 C CNN "PartSpecification"
F 6 "50V" H 7900 1450 50  0001 C CNN "Voltage"
	1    7900 1450
	1    0    0    -1  
$EndComp
$Comp
L power:GND #PWR?
U 1 1 62B510E3
P 7900 1700
AR Path="/5F8E5420/5F971A6D/62B510E3" Ref="#PWR?"  Part="1" 
AR Path="/5F8E5420/5F9AA234/62B510E3" Ref="#PWR?"  Part="1" 
AR Path="/605746B5/5F8E5420/5F9AA234/62B510E3" Ref="#PWR?"  Part="1" 
F 0 "#PWR?" H 7900 1450 50  0001 C CNN
F 1 "GND" H 7900 1550 50  0000 C CNN
F 2 "" H 7900 1700 50  0001 C CNN
F 3 "" H 7900 1700 50  0001 C CNN
	1    7900 1700
	1    0    0    -1  
$EndComp
Wire Wire Line
	7900 1700 7900 1600
Wire Wire Line
	7900 1300 7900 1200
Wire Wire Line
	7900 1200 8400 1200
$Comp
L 000_PreferredParts:C_10nF C3217
U 1 1 62B5453C
P 7750 1100
F 0 "C3217" V 8002 1100 50  0000 C CNN
F 1 "C_10nF" H 7775 1000 50  0001 L CNN
F 2 "Capacitor_SMD:C_0402_1005Metric" H 7788 950 50  0001 C CNN
F 3 "~" H 7750 1100 50  0001 C CNN
F 4 "10nF" V 7911 1100 50  0000 C CNN "DisplayValue"
F 5 "3000-0000000203" H 7750 1100 50  0001 C CNN "PartSpecification"
F 6 "50V" H 7750 1100 50  0001 C CNN "Voltage"
	1    7750 1100
	0    -1   -1   0   
$EndComp
Wire Wire Line
	7900 1100 8400 1100
Wire Wire Line
	7600 1100 7300 1100
Wire Wire Line
	7300 1100 7300 1200
Connection ~ 7300 1100
Wire Wire Line
	7300 1100 7200 1100
$Comp
L power:GND #PWR?
U 1 1 62B59C05
P 7300 1600
AR Path="/5F8E5420/5F971A6D/62B59C05" Ref="#PWR?"  Part="1" 
AR Path="/5F8E5420/5F9AA234/62B59C05" Ref="#PWR?"  Part="1" 
AR Path="/605746B5/5F8E5420/5F9AA234/62B59C05" Ref="#PWR?"  Part="1" 
F 0 "#PWR?" H 7300 1350 50  0001 C CNN
F 1 "GND" H 7300 1450 50  0000 C CNN
F 2 "" H 7300 1600 50  0001 C CNN
F 3 "" H 7300 1600 50  0001 C CNN
	1    7300 1600
	1    0    0    -1  
$EndComp
Wire Wire Line
	7300 1600 7300 1500
Wire Wire Line
	5650 3100 9500 3100
Text Label 7150 3400 0    50   ~ 0
PPS_IN
Text Label 7000 3850 0    50   ~ 0
PPS_IN_HF_TERM
Text Label 7450 1100 1    50   ~ 0
REF_10_MHZ
Text Label 7950 1200 0    50   ~ 0
REF_IN_M
Text Label 8000 3100 0    50   ~ 0
REF_10_MHZ_CMOS
Text Label 7950 1100 0    50   ~ 0
REF_IN_P
$Comp
L 000_PreferredParts:C_0_1uF C?
U 1 1 62B9C85C
P 10000 1250
AR Path="/5F8E5420/5F971A6D/62B9C85C" Ref="C?"  Part="1" 
AR Path="/5F8E5420/5F9AA234/62B9C85C" Ref="C?"  Part="1" 
AR Path="/605746B5/5F8E5420/5F9AA234/62B9C85C" Ref="C3220"  Part="1" 
F 0 "C3220" H 10025 1350 50  0000 L CNN
F 1 "C_0_1uF" H 10025 1150 50  0001 L CNN
F 2 "Capacitor_SMD:C_0402_1005Metric" H 10038 1100 50  0001 C CNN
F 3 "~" H 10000 1250 50  0001 C CNN
F 4 "0.1uF" H 10150 1150 50  0000 C CNN "DisplayValue"
F 5 "3000-0000000125" H 10000 1250 50  0001 C CNN "PartSpecification"
F 6 "100V" H 10000 1250 50  0001 C CNN "Voltage"
	1    10000 1250
	1    0    0    -1  
$EndComp
$Comp
L 000_PreferredParts:C_1nF C?
U 1 1 62B9D299
P 10500 1250
AR Path="/5F8E5420/5F971A6D/62B9D299" Ref="C?"  Part="1" 
AR Path="/5F8E5420/5F9AA234/62B9D299" Ref="C?"  Part="1" 
AR Path="/605746B5/5F8E5420/5F9AA234/62B9D299" Ref="C3221"  Part="1" 
F 0 "C3221" H 10525 1350 50  0000 L CNN
F 1 "C_1nF" H 10525 1150 50  0000 L CNN
F 2 "Capacitor_SMD:C_0402_1005Metric" H 10538 1100 50  0001 C CNN
F 3 "~" H 10500 1250 50  0001 C CNN
F 4 "3000-0000000128" H 10500 1250 50  0001 C CNN "PartSpecification"
	1    10500 1250
	1    0    0    -1  
$EndComp
$Comp
L power:+3.3V #PWR?
U 1 1 62B9D85C
P 10000 1000
F 0 "#PWR?" H 10000 850 50  0001 C CNN
F 1 "+3.3V" H 10015 1173 50  0000 C CNN
F 2 "" H 10000 1000 50  0001 C CNN
F 3 "" H 10000 1000 50  0001 C CNN
	1    10000 1000
	1    0    0    -1  
$EndComp
$Comp
L power:+3.3V #PWR?
U 1 1 62B9DBC5
P 10500 1000
F 0 "#PWR?" H 10500 850 50  0001 C CNN
F 1 "+3.3V" H 10515 1173 50  0000 C CNN
F 2 "" H 10500 1000 50  0001 C CNN
F 3 "" H 10500 1000 50  0001 C CNN
	1    10500 1000
	1    0    0    -1  
$EndComp
$Comp
L power:GND #PWR?
U 1 1 62B9DEAE
P 10500 1500
AR Path="/5F8E5420/5F971A6D/62B9DEAE" Ref="#PWR?"  Part="1" 
AR Path="/5F8E5420/5F9AA234/62B9DEAE" Ref="#PWR?"  Part="1" 
AR Path="/605746B5/5F8E5420/5F9AA234/62B9DEAE" Ref="#PWR?"  Part="1" 
F 0 "#PWR?" H 10500 1250 50  0001 C CNN
F 1 "GND" H 10500 1350 50  0000 C CNN
F 2 "" H 10500 1500 50  0001 C CNN
F 3 "" H 10500 1500 50  0001 C CNN
	1    10500 1500
	1    0    0    -1  
$EndComp
$Comp
L power:GND #PWR?
U 1 1 62B9E0DD
P 10000 1500
AR Path="/5F8E5420/5F971A6D/62B9E0DD" Ref="#PWR?"  Part="1" 
AR Path="/5F8E5420/5F9AA234/62B9E0DD" Ref="#PWR?"  Part="1" 
AR Path="/605746B5/5F8E5420/5F9AA234/62B9E0DD" Ref="#PWR?"  Part="1" 
F 0 "#PWR?" H 10000 1250 50  0001 C CNN
F 1 "GND" H 10000 1350 50  0000 C CNN
F 2 "" H 10000 1500 50  0001 C CNN
F 3 "" H 10000 1500 50  0001 C CNN
	1    10000 1500
	1    0    0    -1  
$EndComp
Wire Wire Line
	10000 1500 10000 1400
Wire Wire Line
	10500 1400 10500 1500
Wire Wire Line
	10500 1100 10500 1000
Wire Wire Line
	10000 1000 10000 1100
Wire Wire Line
	5650 3400 7000 3400
Wire Bus Line
	6500 2500 6500 3600
Wire Bus Line
	2500 1000 2500 3500
$EndSCHEMATC
