EESchema Schematic File Version 4
EELAYER 30 0
EELAYER END
$Descr A4 11693 8268
encoding utf-8
Sheet 12 13
Title ""
Date ""
Rev ""
Comp ""
Comment1 ""
Comment2 ""
Comment3 ""
Comment4 ""
$EndDescr
Text Notes 3650 650  0    50   ~ 0
FPGA Schematic: https://drive.google.com/file/d/1EVex5S8G8tYduuJaUQhj2tnuy_VA0cvg/view?usp=sharing
$Comp
L power:GND #PWR?
U 1 1 612555DF
P 4400 2650
F 0 "#PWR?" H 4400 2400 50  0001 C CNN
F 1 "GND" H 4405 2477 50  0000 C CNN
F 2 "" H 4400 2650 50  0001 C CNN
F 3 "" H 4400 2650 50  0001 C CNN
	1    4400 2650
	1    0    0    -1  
$EndComp
Text HLabel 6650 2550 2    50   Input ~ 0
PPS
Text HLabel 6650 3850 2    50   Input ~ 0
Fan1_TACH
Text HLabel 6650 4050 2    50   Input ~ 0
Fan2_TACH
Text HLabel 6650 3750 2    50   Output ~ 0
Fan1_PWM
Text HLabel 6650 3950 2    50   Output ~ 0
Fan2_PWM
Text HLabel 6650 3450 2    50   Input ~ 0
USB_TX
Text HLabel 6650 3550 2    50   Output ~ 0
USB_RX
Text HLabel 6650 3350 2    50   Output ~ 0
USB_CTS
Text HLabel 6650 3650 2    50   Input ~ 0
USB_DTR
Wire Wire Line
	5850 1850 5950 1850
NoConn ~ 5950 1850
Wire Wire Line
	5850 1950 5950 1950
$Comp
L power:GND #PWR?
U 1 1 613988B5
P 5950 2650
F 0 "#PWR?" H 5950 2400 50  0001 C CNN
F 1 "GND" H 5955 2477 50  0000 C CNN
F 2 "" H 5950 2650 50  0001 C CNN
F 3 "" H 5950 2650 50  0001 C CNN
	1    5950 2650
	1    0    0    -1  
$EndComp
Text Label 9850 2400 2    50   ~ 0
GPIO_1
Text Label 9850 2500 2    50   ~ 0
GPIO_3
Text Label 9850 2600 2    50   ~ 0
GPIO_5
Text Label 9850 2700 2    50   ~ 0
GPIO_7
Text Label 9850 2800 2    50   ~ 0
GPIO_9
Text Label 9850 3100 2    50   ~ 0
GPIO_13
Text Label 9850 3200 2    50   ~ 0
GPIO_15
Text Label 9850 3300 2    50   ~ 0
GPIO_17
Text Label 9850 3400 2    50   ~ 0
GPIO_19
Text Label 9850 3500 2    50   ~ 0
GPIO_21
Text Label 9850 3600 2    50   ~ 0
GPIO_23
Text Label 9850 3900 2    50   ~ 0
GPIO_27
Text Label 9850 4000 2    50   ~ 0
GPIO_29
Text Label 9850 4100 2    50   ~ 0
GPIO_31
Text Label 9850 4200 2    50   ~ 0
GPIO_33
Text Label 9850 4300 2    50   ~ 0
GPIO_35
Text Label 9850 3000 2    50   ~ 0
GPIO_11
Text Label 9850 3700 2    50   ~ 0
GPIO_25
Wire Wire Line
	9450 2900 9450 3800
Connection ~ 9450 3800
Wire Wire Line
	9450 3800 9450 4500
$Comp
L power:GND #PWR?
U 1 1 614BA0F3
P 9450 4500
F 0 "#PWR?" H 9450 4250 50  0001 C CNN
F 1 "GND" H 9455 4327 50  0000 C CNN
F 2 "" H 9450 4500 50  0001 C CNN
F 3 "" H 9450 4500 50  0001 C CNN
	1    9450 4500
	1    0    0    -1  
$EndComp
Text Label 8350 3400 0    50   ~ 0
GPIO_18
Text Label 8350 4300 0    50   ~ 0
GPIO_34
Text Label 8350 4200 0    50   ~ 0
GPIO_32
Text Label 8350 4100 0    50   ~ 0
GPIO_30
Text Label 8350 4000 0    50   ~ 0
GPIO_28
Text Label 8350 3900 0    50   ~ 0
GPIO_26
Text Label 8350 3700 0    50   ~ 0
GPIO_24
Text Label 8350 3600 0    50   ~ 0
GPIO_22
Text Label 8350 3500 0    50   ~ 0
GPIO_20
Text Label 8350 3300 0    50   ~ 0
GPIO_16
Text Label 8350 3200 0    50   ~ 0
GPIO_14
Text Label 8350 3100 0    50   ~ 0
GPIO_12
Text Label 8350 3000 0    50   ~ 0
GPIO_10
Text Label 8350 2800 0    50   ~ 0
GPIO_8
Text Label 8350 2700 0    50   ~ 0
GPIO_6
Text Label 8350 2600 0    50   ~ 0
GPIO_4
Text Label 8350 2500 0    50   ~ 0
GPIO_2
Text Label 8350 2400 0    50   ~ 0
GPIO_0
Text Label 8350 2900 0    50   ~ 0
VCC5
Text Label 8350 3800 0    50   ~ 0
VCC3V3
NoConn ~ 8250 3400
NoConn ~ 8250 3900
NoConn ~ 8250 4200
NoConn ~ 8250 4300
NoConn ~ 9950 4300
NoConn ~ 9950 4200
NoConn ~ 9950 4100
Wire Wire Line
	4300 3350 4900 3350
Wire Wire Line
	4300 3450 4900 3450
Wire Wire Line
	4300 3550 4900 3550
Wire Wire Line
	4300 3750 4900 3750
Wire Wire Line
	4300 3850 4900 3850
Text Label 6550 1650 2    50   ~ 0
Arduino_IO15
Text Label 6550 1750 2    50   ~ 0
Arduino_IO14
Wire Wire Line
	5950 1950 5950 2650
Wire Wire Line
	5850 1650 6650 1650
Wire Wire Line
	5850 1750 6650 1750
Wire Wire Line
	5850 2050 6650 2050
Wire Wire Line
	5850 2150 6650 2150
Wire Wire Line
	5850 2250 6650 2250
Wire Wire Line
	5850 2350 6650 2350
Wire Wire Line
	5850 2450 6650 2450
Wire Wire Line
	5850 2550 6650 2550
Text Label 6550 2050 2    50   ~ 0
Arduino_IO13
Text Label 6550 2150 2    50   ~ 0
Arduino_IO12
Text Label 6550 2250 2    50   ~ 0
Arduino_IO11
Text Label 6550 2350 2    50   ~ 0
Arduino_IO10
Text Label 6550 2450 2    50   ~ 0
Arduino_IO9
Text Label 6550 2550 2    50   ~ 0
Arduino_IO8
Wire Wire Line
	5850 3350 6650 3350
Wire Wire Line
	5850 3450 6650 3450
Wire Wire Line
	5850 3550 6650 3550
Wire Wire Line
	5850 3650 6650 3650
Wire Wire Line
	5850 3750 6650 3750
Wire Wire Line
	5850 3850 6650 3850
Wire Wire Line
	5850 3950 6650 3950
Wire Wire Line
	5850 4050 6650 4050
Text Label 6550 3350 2    50   ~ 0
Arduino_IO7
Text Label 6550 3450 2    50   ~ 0
Arduino_IO6
Text Label 6550 3550 2    50   ~ 0
Arduino_IO5
Text Label 6550 3650 2    50   ~ 0
Arduino_IO4
Text Label 6550 3750 2    50   ~ 0
Arduino_IO3
Text Label 6550 3850 2    50   ~ 0
Arduino_IO2
Text Label 6550 3950 2    50   ~ 0
Arduino_IO1
Text Label 6550 4050 2    50   ~ 0
Arduino_IO0
Text Label 4800 3350 2    50   ~ 0
ADC_IN0
Text Label 4800 3450 2    50   ~ 0
ADC_IN1
Text Label 4800 3550 2    50   ~ 0
ADC_IN2
Text Label 4800 3650 2    50   ~ 0
ADC_IN3
Text Label 4800 3750 2    50   ~ 0
ADC_IN4
Text Label 4800 3850 2    50   ~ 0
ADC_IN5
Wire Wire Line
	4300 1850 4400 1850
NoConn ~ 4400 1850
Text Label 5150 2050 2    50   ~ 0
Arduino_Reset_n
Wire Wire Line
	4300 2050 5250 2050
Wire Wire Line
	4300 2250 5250 2250
Text Label 5150 2250 2    50   ~ 0
VCC5_Out
NoConn ~ 5250 2250
Wire Wire Line
	4300 2550 5250 2550
Wire Wire Line
	4300 2450 4400 2450
Wire Wire Line
	4400 2450 4400 2650
Wire Wire Line
	4300 2350 4400 2350
Wire Wire Line
	4400 2350 4400 2450
Connection ~ 4400 2450
Text Label 5150 2550 2    50   ~ 0
Vin
NoConn ~ 5250 2550
NoConn ~ 5250 2050
Text Notes 5250 1200 2    50   ~ 0
Arduino_Reset_n is a gpio signal to fpga
$Comp
L Connector_Generic:Conn_01x02 J19
U 1 1 616D78B8
P 7550 5400
F 0 "J19" H 7468 5617 50  0000 C CNN
F 1 "Conn_01x02" H 7468 5526 50  0000 C CNN
F 2 "Connector_PinHeader_2.54mm:PinHeader_1x02_P2.54mm_Vertical" H 7550 5400 50  0001 C CNN
F 3 "~" H 7550 5400 50  0001 C CNN
	1    7550 5400
	-1   0    0    -1  
$EndComp
Wire Wire Line
	7750 5500 7950 5500
Wire Wire Line
	7950 5500 7950 5700
$Comp
L power:GND #PWR?
U 1 1 616E1037
P 7950 5700
F 0 "#PWR?" H 7950 5450 50  0001 C CNN
F 1 "GND" H 7955 5527 50  0000 C CNN
F 2 "" H 7950 5700 50  0001 C CNN
F 3 "" H 7950 5700 50  0001 C CNN
	1    7950 5700
	1    0    0    -1  
$EndComp
Wire Wire Line
	7750 5400 7950 5400
Wire Wire Line
	7950 5400 7950 5200
Wire Wire Line
	9350 2700 9950 2700
Wire Wire Line
	8250 2700 8850 2700
Wire Wire Line
	9350 2600 9950 2600
Wire Wire Line
	8250 2600 8850 2600
Wire Wire Line
	9350 4300 9950 4300
Wire Wire Line
	9350 2500 9950 2500
Wire Wire Line
	8250 4300 8850 4300
Wire Wire Line
	9350 4200 9950 4200
Wire Wire Line
	8250 4200 8850 4200
Wire Wire Line
	9350 4100 9950 4100
Wire Wire Line
	8250 4100 8850 4100
Wire Wire Line
	9350 4000 9950 4000
Wire Wire Line
	8250 4000 8850 4000
Wire Wire Line
	9350 3900 9950 3900
Wire Wire Line
	8250 3900 8850 3900
Wire Wire Line
	9350 3800 9450 3800
Wire Wire Line
	8250 2500 8850 2500
Wire Wire Line
	9350 3700 9950 3700
Wire Wire Line
	8250 3700 8850 3700
Wire Wire Line
	9350 3600 9950 3600
Wire Wire Line
	8250 3600 8850 3600
Wire Wire Line
	9350 3500 9950 3500
Wire Wire Line
	8250 3500 8850 3500
Wire Wire Line
	9350 3400 9950 3400
Wire Wire Line
	8250 3400 8850 3400
Wire Wire Line
	9350 3300 9950 3300
Wire Wire Line
	9350 2400 9950 2400
Wire Wire Line
	8250 3300 8850 3300
Wire Wire Line
	9350 3200 9950 3200
Wire Wire Line
	8250 3200 8850 3200
Wire Wire Line
	9350 3100 9950 3100
Wire Wire Line
	8250 3100 8850 3100
Wire Wire Line
	9350 3000 9950 3000
Wire Wire Line
	8250 3000 8850 3000
Wire Wire Line
	9350 2900 9450 2900
Wire Wire Line
	8850 2900 8250 2900
Wire Wire Line
	9350 2800 9950 2800
Wire Wire Line
	8250 2400 8850 2400
$Comp
L Connector_Generic:Conn_01x10 J22
U 1 1 6128572E
P 5650 2050
F 0 "J22" H 5568 2667 50  0000 C CNN
F 1 "Conn_01x10" H 5568 2576 50  0000 C CNN
F 2 "Connector_PinHeader_2.54mm:PinHeader_1x10_P2.54mm_Vertical" H 5650 2050 50  0001 C CNN
F 3 "~" H 5650 2050 50  0001 C CNN
	1    5650 2050
	-1   0    0    -1  
$EndComp
$Comp
L Connector_Generic:Conn_01x08 J23
U 1 1 612453A3
P 5650 3650
F 0 "J23" H 5650 4200 50  0000 C CNN
F 1 "Conn_01x08" H 5650 4100 50  0000 C CNN
F 2 "Connector_PinHeader_2.54mm:PinHeader_1x08_P2.54mm_Vertical" H 5650 3650 50  0001 C CNN
F 3 "~" H 5650 3650 50  0001 C CNN
F 4 "FPGA_J5" H 5650 3100 50  0000 C CNN "Label"
	1    5650 3650
	-1   0    0    -1  
$EndComp
$Comp
L Connector_Generic:Conn_01x06 J21
U 1 1 6128344C
P 4100 3550
F 0 "J21" H 4018 3967 50  0000 C CNN
F 1 "Conn_01x06" H 4018 3876 50  0000 C CNN
F 2 "Connector_PinHeader_2.54mm:PinHeader_1x06_P2.54mm_Vertical" H 4100 3550 50  0001 C CNN
F 3 "~" H 4100 3550 50  0001 C CNN
	1    4100 3550
	-1   0    0    -1  
$EndComp
$Comp
L Connector_Generic:Conn_01x08 J20
U 1 1 61242D47
P 4100 2150
F 0 "J20" H 4100 2700 50  0000 C CNN
F 1 "Conn_01x08" H 4100 2600 50  0000 C CNN
F 2 "Connector_PinHeader_2.54mm:PinHeader_1x08_P2.54mm_Vertical" H 4100 2150 50  0001 C CNN
F 3 "~" H 4100 2150 50  0001 C CNN
F 4 "FPGA_J2" H 4100 1600 50  0000 C CNN "Label"
	1    4100 2150
	-1   0    0    -1  
$EndComp
$Comp
L Connector_Generic:Conn_02x20_Odd_Even J24
U 1 1 6144F101
P 9050 3300
F 0 "J24" H 9100 4417 50  0000 C CNN
F 1 "Conn_02x20_Odd_Even" H 9100 4326 50  0000 C CNN
F 2 "Connector_PinSocket_2.54mm:PinSocket_2x20_P2.54mm_Vertical" H 9050 3300 50  0001 C CNN
F 3 "~" H 9050 3300 50  0001 C CNN
	1    9050 3300
	1    0    0    -1  
$EndComp
Text GLabel 8050 800  0    50   BiDi ~ 0
SDR_GPIO[0..11]
Wire Bus Line
	8050 800  8250 800 
Entry Wire Line
	8250 800  8350 900 
Wire Wire Line
	8350 900  8550 900 
Text Label 8550 900  0    50   ~ 0
SDR_GPIO0
Entry Wire Line
	8250 900  8350 1000
Wire Wire Line
	8350 1000 8550 1000
Text Label 8550 1000 0    50   ~ 0
SDR_GPIO1
Entry Wire Line
	8250 1000 8350 1100
Wire Wire Line
	8350 1100 8550 1100
Text Label 8550 1100 0    50   ~ 0
SDR_GPIO2
Entry Wire Line
	8250 1100 8350 1200
Wire Wire Line
	8350 1200 8550 1200
Text Label 8550 1200 0    50   ~ 0
SDR_GPIO3
Entry Wire Line
	8250 1200 8350 1300
Wire Wire Line
	8350 1300 8550 1300
Text Label 8550 1300 0    50   ~ 0
SDR_GPIO4
Entry Wire Line
	8250 1300 8350 1400
Wire Wire Line
	8350 1400 8550 1400
Text Label 8550 1400 0    50   ~ 0
SDR_GPIO5
Entry Wire Line
	8250 1400 8350 1500
Wire Wire Line
	8350 1500 8550 1500
Text Label 8550 1500 0    50   ~ 0
SDR_GPIO6
Entry Wire Line
	8250 1500 8350 1600
Wire Wire Line
	8350 1600 8550 1600
Text Label 8550 1600 0    50   ~ 0
SDR_GPIO7
Entry Wire Line
	8250 1600 8350 1700
Wire Wire Line
	8350 1700 8550 1700
Text Label 8550 1700 0    50   ~ 0
SDR_GPIO8
Entry Wire Line
	8250 1700 8350 1800
Wire Wire Line
	8350 1800 8550 1800
Entry Wire Line
	8250 1800 8350 1900
Wire Wire Line
	8350 1900 8550 1900
Text Label 8550 1900 0    50   ~ 0
SDR_GPIO10
Text Label 8550 1800 0    50   ~ 0
SDR_GPIO9
Entry Wire Line
	8250 1900 8350 2000
Wire Wire Line
	8350 2000 8550 2000
Text Label 8550 2000 0    50   ~ 0
SDR_GPIO11
Wire Wire Line
	8250 2800 8850 2800
Text Label 9950 2400 0    50   ~ 0
SDR_GPIO6
Text Label 9950 3400 0    50   ~ 0
SDR_GPIO7
Text Label 9950 3300 0    50   ~ 0
SDR_GPIO8
Text Label 9950 3200 0    50   ~ 0
SDR_GPIO9
Text Label 9950 3100 0    50   ~ 0
SDR_GPIO10
Text Label 9950 3000 0    50   ~ 0
SDR_GPIO11
NoConn ~ 8250 2900
Text Label 8250 2600 2    50   ~ 0
SDR_GPIO0
Text Label 8250 2700 2    50   ~ 0
SDR_GPIO1
Text Label 8250 2800 2    50   ~ 0
SDR_GPIO2
Text Label 8250 3000 2    50   ~ 0
SDR_GPIO3
Text Label 8250 3100 2    50   ~ 0
SDR_GPIO4
Text Label 8250 3200 2    50   ~ 0
SDR_GPIO5
Text HLabel 8250 2400 0    50   Input ~ 0
10MHz_p
Text HLabel 8250 2500 0    50   Input ~ 0
10MHz_n
Text GLabel 1350 2600 0    50   Input ~ 0
RF_Power_Sense
Text GLabel 9950 3900 2    50   Input ~ 0
RF_Power_Sense_en
Text GLabel 9950 3500 2    50   Output ~ 0
Att_SI
Text GLabel 9950 3600 2    50   Output ~ 0
ATT_CLK
Text GLabel 9950 3700 2    50   Output ~ 0
ATT_LE
Text GLabel 1350 1550 0    50   Input ~ 0
Temp_Sense
Text GLabel 6650 2050 2    50   Output ~ 0
FPGA_1A
Text GLabel 6650 2150 2    50   Output ~ 0
FPGA_1B
Text GLabel 6650 2250 2    50   Output ~ 0
FPGA_2A
Text GLabel 6650 2350 2    50   Output ~ 0
FPGA_2B
Text GLabel 6650 2450 2    50   Output ~ 0
AMP_EN
Wire Wire Line
	8050 3800 8850 3800
$Comp
L power:+3V3 #PWR?
U 1 1 6164E74E
P 8050 3800
F 0 "#PWR?" H 8050 3650 50  0001 C CNN
F 1 "+3V3" H 8065 3973 50  0000 C CNN
F 2 "" H 8050 3800 50  0001 C CNN
F 3 "" H 8050 3800 50  0001 C CNN
	1    8050 3800
	0    -1   -1   0   
$EndComp
NoConn ~ 4300 2150
NoConn ~ 4300 1950
Text GLabel 7950 5200 1    50   Input ~ 0
5v_pre
Text HLabel 6650 1650 2    50   Output ~ 0
LNA_PWR_EN
Text GLabel 6650 1750 2    50   BiDi ~ 0
SER_GPIO
$Comp
L Device:Opamp_Dual_Generic U5
U 1 1 616B82B2
P 2550 1650
F 0 "U5" H 2550 2017 50  0000 C CNN
F 1 "Opamp_Dual_Generic" H 2550 1926 50  0000 C CNN
F 2 "Package_SO:SOIC-8_3.9x4.9mm_P1.27mm" H 2550 1650 50  0001 C CNN
F 3 "~" H 2550 1650 50  0001 C CNN
	1    2550 1650
	1    0    0    -1  
$EndComp
$Comp
L Device:Opamp_Dual_Generic U5
U 2 1 616B8B27
P 2550 2700
F 0 "U5" H 2550 3067 50  0000 C CNN
F 1 "Opamp_Dual_Generic" H 2550 2976 50  0000 C CNN
F 2 "Package_SO:SOIC-8_3.9x4.9mm_P1.27mm" H 2550 2700 50  0001 C CNN
F 3 "~" H 2550 2700 50  0001 C CNN
	2    2550 2700
	1    0    0    -1  
$EndComp
$Comp
L Device:Opamp_Dual_Generic U5
U 3 1 616B9358
P 6100 5150
F 0 "U5" H 6058 5196 50  0000 L CNN
F 1 "Opamp_Dual_Generic" H 6058 5105 50  0000 L CNN
F 2 "Package_SO:SOIC-8_3.9x4.9mm_P1.27mm" H 6100 5150 50  0001 C CNN
F 3 "~" H 6100 5150 50  0001 C CNN
	3    6100 5150
	1    0    0    -1  
$EndComp
Wire Wire Line
	2250 2800 2150 2800
Wire Wire Line
	2150 2800 2150 3000
Wire Wire Line
	2150 3000 2950 3000
Wire Wire Line
	2950 3000 2950 2700
Wire Wire Line
	2950 2700 2850 2700
Wire Wire Line
	2250 1750 2150 1750
Wire Wire Line
	2150 1750 2150 1950
Wire Wire Line
	2150 1950 2950 1950
Wire Wire Line
	2950 1950 2950 1650
Wire Wire Line
	2950 1650 2850 1650
Wire Wire Line
	2950 1650 3050 1650
Connection ~ 2950 1650
Text Label 3050 1650 0    50   ~ 0
Temp_Sense_buf
Wire Wire Line
	2950 2700 3050 2700
Connection ~ 2950 2700
Text Label 3050 2700 0    50   ~ 0
RF_Power_Sense_buf
Text Label 4900 3850 0    50   ~ 0
Temp_Sense_buf
Text Label 4900 3750 0    50   ~ 0
RF_Power_Sense_buf
$Comp
L power:GND #PWR?
U 1 1 6172580E
P 6000 5550
F 0 "#PWR?" H 6000 5300 50  0001 C CNN
F 1 "GND" H 6005 5377 50  0000 C CNN
F 2 "" H 6000 5550 50  0001 C CNN
F 3 "" H 6000 5550 50  0001 C CNN
	1    6000 5550
	1    0    0    -1  
$EndComp
Wire Wire Line
	6000 5450 6000 5500
Wire Wire Line
	6000 4850 6000 4800
$Comp
L power:+5V #PWR?
U 1 1 6172F564
P 6000 4750
F 0 "#PWR?" H 6000 4600 50  0001 C CNN
F 1 "+5V" H 6015 4923 50  0000 C CNN
F 2 "" H 6000 4750 50  0001 C CNN
F 3 "" H 6000 4750 50  0001 C CNN
	1    6000 4750
	1    0    0    -1  
$EndComp
$Comp
L Device:C C23
U 1 1 61730C2C
P 5550 5150
F 0 "C23" H 5665 5196 50  0000 L CNN
F 1 "C" H 5665 5105 50  0000 L CNN
F 2 "Capacitor_SMD:C_0402_1005Metric" H 5588 5000 50  0001 C CNN
F 3 "~" H 5550 5150 50  0001 C CNN
	1    5550 5150
	1    0    0    -1  
$EndComp
Wire Wire Line
	5550 5000 5550 4800
Wire Wire Line
	5550 4800 6000 4800
Connection ~ 6000 4800
Wire Wire Line
	6000 4800 6000 4750
Wire Wire Line
	5550 5300 5550 5500
Wire Wire Line
	5550 5500 6000 5500
Connection ~ 6000 5500
Wire Wire Line
	6000 5500 6000 5550
Text GLabel 9850 800  0    50   Input ~ 0
LNA_BIAS_IN[0..3]
Wire Bus Line
	9850 800  10050 800 
Entry Wire Line
	10050 800  10150 900 
Entry Wire Line
	10050 900  10150 1000
Entry Wire Line
	10050 1000 10150 1100
Entry Wire Line
	10050 1100 10150 1200
Text Label 10350 900  0    50   ~ 0
LNA_BIAS_IN0
Text Label 10350 1000 0    50   ~ 0
LNA_BIAS_IN1
Text Label 10350 1100 0    50   ~ 0
LNA_BIAS_IN2
Text Label 10350 1200 0    50   ~ 0
LNA_BIAS_IN3
Wire Wire Line
	10150 900  10350 900 
Wire Wire Line
	10150 1000 10350 1000
Wire Wire Line
	10150 1100 10350 1100
Wire Wire Line
	10150 1200 10350 1200
Text Label 9950 2500 0    50   ~ 0
LNA_BIAS_IN3
Text Label 9950 2700 0    50   ~ 0
LNA_BIAS_IN2
Text Label 9950 2600 0    50   ~ 0
LNA_BIAS_IN1
Text Label 9950 2800 0    50   ~ 0
LNA_BIAS_IN0
Text GLabel 1350 3650 0    50   Input ~ 0
LNA_VREG_SENSE
Text GLabel 1350 4700 0    50   Input ~ 0
LNA_BIAS_SENSE
$Comp
L Device:Opamp_Dual_Generic U10
U 1 1 6169994C
P 2550 4800
F 0 "U10" H 2550 5167 50  0000 C CNN
F 1 "Opamp_Dual_Generic" H 2550 5076 50  0000 C CNN
F 2 "Package_SO:SOIC-8_3.9x4.9mm_P1.27mm" H 2550 4800 50  0001 C CNN
F 3 "~" H 2550 4800 50  0001 C CNN
	1    2550 4800
	1    0    0    -1  
$EndComp
$Comp
L Device:Opamp_Dual_Generic U10
U 3 1 61699958
P 6100 6700
F 0 "U10" H 6058 6746 50  0000 L CNN
F 1 "Opamp_Dual_Generic" H 6058 6655 50  0000 L CNN
F 2 "Package_SO:SOIC-8_3.9x4.9mm_P1.27mm" H 6100 6700 50  0001 C CNN
F 3 "~" H 6100 6700 50  0001 C CNN
	3    6100 6700
	1    0    0    -1  
$EndComp
Wire Wire Line
	2150 5100 2950 5100
Wire Wire Line
	2950 5100 2950 4800
Wire Wire Line
	2950 4800 2850 4800
Wire Wire Line
	2150 4050 2950 4050
Wire Wire Line
	2950 4050 2950 3750
Wire Wire Line
	2950 3750 3050 3750
Connection ~ 2950 3750
Text Label 3050 3750 0    50   ~ 0
LNA_VREG_buf
Wire Wire Line
	2950 4800 3050 4800
Connection ~ 2950 4800
Text Label 3050 4800 0    50   ~ 0
LNA_BIAS_buf
$Comp
L power:GND #PWR?
U 1 1 6169996A
P 6000 7100
F 0 "#PWR?" H 6000 6850 50  0001 C CNN
F 1 "GND" H 6005 6927 50  0000 C CNN
F 2 "" H 6000 7100 50  0001 C CNN
F 3 "" H 6000 7100 50  0001 C CNN
	1    6000 7100
	1    0    0    -1  
$EndComp
Wire Wire Line
	6000 7000 6000 7050
Wire Wire Line
	6000 6400 6000 6350
$Comp
L power:+5V #PWR?
U 1 1 61699972
P 6000 6300
F 0 "#PWR?" H 6000 6150 50  0001 C CNN
F 1 "+5V" H 6015 6473 50  0000 C CNN
F 2 "" H 6000 6300 50  0001 C CNN
F 3 "" H 6000 6300 50  0001 C CNN
	1    6000 6300
	1    0    0    -1  
$EndComp
$Comp
L Device:C C34
U 1 1 61699978
P 5550 6700
F 0 "C34" H 5665 6746 50  0000 L CNN
F 1 "C" H 5665 6655 50  0000 L CNN
F 2 "Capacitor_SMD:C_0402_1005Metric" H 5588 6550 50  0001 C CNN
F 3 "~" H 5550 6700 50  0001 C CNN
	1    5550 6700
	1    0    0    -1  
$EndComp
Wire Wire Line
	5550 6550 5550 6350
Wire Wire Line
	5550 6350 6000 6350
Connection ~ 6000 6350
Wire Wire Line
	6000 6350 6000 6300
Wire Wire Line
	5550 6850 5550 7050
Wire Wire Line
	5550 7050 6000 7050
Connection ~ 6000 7050
Wire Wire Line
	6000 7050 6000 7100
Wire Wire Line
	2150 4050 2150 3850
Wire Wire Line
	2150 3850 2250 3850
Wire Wire Line
	2150 5100 2150 4900
Wire Wire Line
	2150 4900 2250 4900
Wire Wire Line
	4300 3650 4900 3650
Text Label 4900 3650 0    50   ~ 0
LNA_VREG_buf
Text Label 4900 3550 0    50   ~ 0
LNA_BIAS_buf
$Comp
L Device:R R24
U 1 1 61810953
P 1600 4700
F 0 "R24" V 1393 4700 50  0000 C CNN
F 1 "R" V 1484 4700 50  0000 C CNN
F 2 "Resistor_SMD:R_0402_1005Metric" V 1530 4700 50  0001 C CNN
F 3 "~" H 1600 4700 50  0001 C CNN
	1    1600 4700
	0    1    1    0   
$EndComp
$Comp
L Device:C C38
U 1 1 61810E21
P 1850 5000
F 0 "C38" H 1965 5046 50  0000 L CNN
F 1 "C" H 1965 4955 50  0000 L CNN
F 2 "Capacitor_SMD:C_0402_1005Metric" H 1888 4850 50  0001 C CNN
F 3 "~" H 1850 5000 50  0001 C CNN
	1    1850 5000
	1    0    0    -1  
$EndComp
Wire Wire Line
	2250 4700 1850 4700
Wire Wire Line
	1850 4700 1850 4850
Wire Wire Line
	1850 4700 1750 4700
Connection ~ 1850 4700
Wire Wire Line
	1450 4700 1350 4700
Wire Wire Line
	1850 5150 1850 5250
$Comp
L power:GND #PWR?
U 1 1 6185E349
P 1850 5250
F 0 "#PWR?" H 1850 5000 50  0001 C CNN
F 1 "GND" H 1855 5077 50  0000 C CNN
F 2 "" H 1850 5250 50  0001 C CNN
F 3 "" H 1850 5250 50  0001 C CNN
	1    1850 5250
	1    0    0    -1  
$EndComp
$Comp
L Device:R R23
U 1 1 61864333
P 1600 3650
F 0 "R23" V 1393 3650 50  0000 C CNN
F 1 "R" V 1484 3650 50  0000 C CNN
F 2 "Resistor_SMD:R_0402_1005Metric" V 1530 3650 50  0001 C CNN
F 3 "~" H 1600 3650 50  0001 C CNN
	1    1600 3650
	0    1    1    0   
$EndComp
$Comp
L Device:C C37
U 1 1 61864339
P 1850 3950
F 0 "C37" H 1965 3996 50  0000 L CNN
F 1 "C" H 1965 3905 50  0000 L CNN
F 2 "Capacitor_SMD:C_0402_1005Metric" H 1888 3800 50  0001 C CNN
F 3 "~" H 1850 3950 50  0001 C CNN
	1    1850 3950
	1    0    0    -1  
$EndComp
Wire Wire Line
	2250 3650 1850 3650
Wire Wire Line
	1850 3650 1850 3800
Wire Wire Line
	1850 3650 1750 3650
Connection ~ 1850 3650
Wire Wire Line
	1450 3650 1350 3650
Wire Wire Line
	1850 4100 1850 4200
$Comp
L power:GND #PWR?
U 1 1 61864345
P 1850 4200
F 0 "#PWR?" H 1850 3950 50  0001 C CNN
F 1 "GND" H 1855 4027 50  0000 C CNN
F 2 "" H 1850 4200 50  0001 C CNN
F 3 "" H 1850 4200 50  0001 C CNN
	1    1850 4200
	1    0    0    -1  
$EndComp
$Comp
L Device:R R22
U 1 1 6186CCEF
P 1600 2600
F 0 "R22" V 1393 2600 50  0000 C CNN
F 1 "R" V 1484 2600 50  0000 C CNN
F 2 "Resistor_SMD:R_0402_1005Metric" V 1530 2600 50  0001 C CNN
F 3 "~" H 1600 2600 50  0001 C CNN
	1    1600 2600
	0    1    1    0   
$EndComp
$Comp
L Device:C C36
U 1 1 6186CCF5
P 1850 2900
F 0 "C36" H 1965 2946 50  0000 L CNN
F 1 "C" H 1965 2855 50  0000 L CNN
F 2 "Capacitor_SMD:C_0402_1005Metric" H 1888 2750 50  0001 C CNN
F 3 "~" H 1850 2900 50  0001 C CNN
	1    1850 2900
	1    0    0    -1  
$EndComp
Wire Wire Line
	2250 2600 1850 2600
Wire Wire Line
	1850 2600 1850 2750
Wire Wire Line
	1850 2600 1750 2600
Connection ~ 1850 2600
Wire Wire Line
	1450 2600 1350 2600
Wire Wire Line
	1850 3050 1850 3150
$Comp
L power:GND #PWR?
U 1 1 6186CD01
P 1850 3150
F 0 "#PWR?" H 1850 2900 50  0001 C CNN
F 1 "GND" H 1855 2977 50  0000 C CNN
F 2 "" H 1850 3150 50  0001 C CNN
F 3 "" H 1850 3150 50  0001 C CNN
	1    1850 3150
	1    0    0    -1  
$EndComp
$Comp
L Device:R R21
U 1 1 6187643B
P 1600 1550
F 0 "R21" V 1393 1550 50  0000 C CNN
F 1 "R" V 1484 1550 50  0000 C CNN
F 2 "Resistor_SMD:R_0402_1005Metric" V 1530 1550 50  0001 C CNN
F 3 "~" H 1600 1550 50  0001 C CNN
	1    1600 1550
	0    1    1    0   
$EndComp
$Comp
L Device:C C35
U 1 1 61876441
P 1850 1850
F 0 "C35" H 1965 1896 50  0000 L CNN
F 1 "C" H 1965 1805 50  0000 L CNN
F 2 "Capacitor_SMD:C_0402_1005Metric" H 1888 1700 50  0001 C CNN
F 3 "~" H 1850 1850 50  0001 C CNN
	1    1850 1850
	1    0    0    -1  
$EndComp
Wire Wire Line
	2250 1550 1850 1550
Wire Wire Line
	1850 1550 1850 1700
Wire Wire Line
	1850 1550 1750 1550
Connection ~ 1850 1550
Wire Wire Line
	1450 1550 1350 1550
Wire Wire Line
	1850 2000 1850 2100
$Comp
L power:GND #PWR?
U 1 1 6187644D
P 1850 2100
F 0 "#PWR?" H 1850 1850 50  0001 C CNN
F 1 "GND" H 1855 1927 50  0000 C CNN
F 2 "" H 1850 2100 50  0001 C CNN
F 3 "" H 1850 2100 50  0001 C CNN
	1    1850 2100
	1    0    0    -1  
$EndComp
Wire Wire Line
	2950 3750 2850 3750
$Comp
L Device:Opamp_Dual_Generic U10
U 2 1 61699952
P 2550 3750
F 0 "U10" H 2550 4117 50  0000 C CNN
F 1 "Opamp_Dual_Generic" H 2550 4026 50  0000 C CNN
F 2 "Package_SO:SOIC-8_3.9x4.9mm_P1.27mm" H 2550 3750 50  0001 C CNN
F 3 "~" H 2550 3750 50  0001 C CNN
	2    2550 3750
	1    0    0    -1  
$EndComp
$Comp
L Device:Opamp_Dual_Generic U11
U 1 1 6154F17B
P 2550 6900
F 0 "U11" H 2550 7267 50  0000 C CNN
F 1 "Opamp_Dual_Generic" H 2550 7176 50  0000 C CNN
F 2 "Package_SO:SOIC-8_3.9x4.9mm_P1.27mm" H 2550 6900 50  0001 C CNN
F 3 "~" H 2550 6900 50  0001 C CNN
	1    2550 6900
	1    0    0    -1  
$EndComp
Wire Wire Line
	2150 7200 2950 7200
Wire Wire Line
	2950 7200 2950 6900
Wire Wire Line
	2950 6900 2850 6900
Wire Wire Line
	2150 6150 2950 6150
Wire Wire Line
	2950 6150 2950 5850
Wire Wire Line
	2950 5850 3050 5850
Connection ~ 2950 5850
Wire Wire Line
	2950 6900 3050 6900
Connection ~ 2950 6900
Wire Wire Line
	2150 6150 2150 5950
Wire Wire Line
	2150 5950 2250 5950
Wire Wire Line
	2150 7200 2150 7000
Wire Wire Line
	2150 7000 2250 7000
$Comp
L Device:R R26
U 1 1 6154F190
P 1600 6800
F 0 "R26" V 1393 6800 50  0000 C CNN
F 1 "R" V 1484 6800 50  0000 C CNN
F 2 "Resistor_SMD:R_0402_1005Metric" V 1530 6800 50  0001 C CNN
F 3 "~" H 1600 6800 50  0001 C CNN
	1    1600 6800
	0    1    1    0   
$EndComp
$Comp
L Device:C C40
U 1 1 6154F196
P 1850 7100
F 0 "C40" H 1965 7146 50  0000 L CNN
F 1 "C" H 1965 7055 50  0000 L CNN
F 2 "Capacitor_SMD:C_0402_1005Metric" H 1888 6950 50  0001 C CNN
F 3 "~" H 1850 7100 50  0001 C CNN
	1    1850 7100
	1    0    0    -1  
$EndComp
Wire Wire Line
	2250 6800 1850 6800
Wire Wire Line
	1850 6800 1850 6950
Wire Wire Line
	1850 6800 1750 6800
Connection ~ 1850 6800
Wire Wire Line
	1450 6800 1350 6800
Wire Wire Line
	1850 7250 1850 7350
$Comp
L power:GND #PWR?
U 1 1 6154F1A2
P 1850 7350
F 0 "#PWR?" H 1850 7100 50  0001 C CNN
F 1 "GND" H 1855 7177 50  0000 C CNN
F 2 "" H 1850 7350 50  0001 C CNN
F 3 "" H 1850 7350 50  0001 C CNN
	1    1850 7350
	1    0    0    -1  
$EndComp
$Comp
L Device:R R25
U 1 1 6154F1A8
P 1600 5750
F 0 "R25" V 1393 5750 50  0000 C CNN
F 1 "R" V 1484 5750 50  0000 C CNN
F 2 "Resistor_SMD:R_0402_1005Metric" V 1530 5750 50  0001 C CNN
F 3 "~" H 1600 5750 50  0001 C CNN
	1    1600 5750
	0    1    1    0   
$EndComp
$Comp
L Device:C C39
U 1 1 6154F1AE
P 1850 6050
F 0 "C39" H 1965 6096 50  0000 L CNN
F 1 "C" H 1965 6005 50  0000 L CNN
F 2 "Capacitor_SMD:C_0402_1005Metric" H 1888 5900 50  0001 C CNN
F 3 "~" H 1850 6050 50  0001 C CNN
	1    1850 6050
	1    0    0    -1  
$EndComp
Wire Wire Line
	2250 5750 1850 5750
Wire Wire Line
	1850 5750 1850 5900
Wire Wire Line
	1850 5750 1750 5750
Connection ~ 1850 5750
Wire Wire Line
	1450 5750 1350 5750
Wire Wire Line
	1850 6200 1850 6300
$Comp
L power:GND #PWR?
U 1 1 6154F1BA
P 1850 6300
F 0 "#PWR?" H 1850 6050 50  0001 C CNN
F 1 "GND" H 1855 6127 50  0000 C CNN
F 2 "" H 1850 6300 50  0001 C CNN
F 3 "" H 1850 6300 50  0001 C CNN
	1    1850 6300
	1    0    0    -1  
$EndComp
Wire Wire Line
	2950 5850 2850 5850
$Comp
L Device:Opamp_Dual_Generic U11
U 2 1 6154F1C1
P 2550 5850
F 0 "U11" H 2550 6217 50  0000 C CNN
F 1 "Opamp_Dual_Generic" H 2550 6126 50  0000 C CNN
F 2 "Package_SO:SOIC-8_3.9x4.9mm_P1.27mm" H 2550 5850 50  0001 C CNN
F 3 "~" H 2550 5850 50  0001 C CNN
	2    2550 5850
	1    0    0    -1  
$EndComp
$Comp
L Device:Opamp_Dual_Generic U11
U 3 1 61582312
P 4400 6600
F 0 "U11" H 4358 6646 50  0000 L CNN
F 1 "Opamp_Dual_Generic" H 4358 6555 50  0000 L CNN
F 2 "Package_SO:SOIC-8_3.9x4.9mm_P1.27mm" H 4400 6600 50  0001 C CNN
F 3 "~" H 4400 6600 50  0001 C CNN
	3    4400 6600
	1    0    0    -1  
$EndComp
$Comp
L power:GND #PWR?
U 1 1 61582318
P 4300 7000
F 0 "#PWR?" H 4300 6750 50  0001 C CNN
F 1 "GND" H 4305 6827 50  0000 C CNN
F 2 "" H 4300 7000 50  0001 C CNN
F 3 "" H 4300 7000 50  0001 C CNN
	1    4300 7000
	1    0    0    -1  
$EndComp
Wire Wire Line
	4300 6900 4300 6950
Wire Wire Line
	4300 6300 4300 6250
$Comp
L power:+5V #PWR?
U 1 1 61582320
P 4300 6200
F 0 "#PWR?" H 4300 6050 50  0001 C CNN
F 1 "+5V" H 4315 6373 50  0000 C CNN
F 2 "" H 4300 6200 50  0001 C CNN
F 3 "" H 4300 6200 50  0001 C CNN
	1    4300 6200
	1    0    0    -1  
$EndComp
$Comp
L Device:C C41
U 1 1 61582326
P 3850 6600
F 0 "C41" H 3965 6646 50  0000 L CNN
F 1 "C" H 3965 6555 50  0000 L CNN
F 2 "Capacitor_SMD:C_0402_1005Metric" H 3888 6450 50  0001 C CNN
F 3 "~" H 3850 6600 50  0001 C CNN
	1    3850 6600
	1    0    0    -1  
$EndComp
Wire Wire Line
	3850 6450 3850 6250
Wire Wire Line
	3850 6250 4300 6250
Connection ~ 4300 6250
Wire Wire Line
	4300 6250 4300 6200
Wire Wire Line
	3850 6750 3850 6950
Wire Wire Line
	3850 6950 4300 6950
Connection ~ 4300 6950
Wire Wire Line
	4300 6950 4300 7000
Text GLabel 1350 5750 0    50   Input ~ 0
AMP_isense
Text GLabel 1350 6800 0    50   Input ~ 0
AMP_temp
Text Label 3050 5850 0    50   ~ 0
AMP_isense_buf
Text Label 3050 6900 0    50   ~ 0
AMP_temp_buf
Text Label 4900 3450 0    50   ~ 0
AMP_isense_buf
Text Label 4900 3350 0    50   ~ 0
AMP_temp_buf
Text GLabel 8250 3300 0    50   Input ~ 0
LDO_PG
NoConn ~ 9950 4000
NoConn ~ 8250 3700
$Comp
L Connector:TestPoint TP3
U 1 1 617854DD
P 9100 5700
F 0 "TP3" V 9295 5772 50  0000 C CNN
F 1 "TestPoint" V 9204 5772 50  0000 C CNN
F 2 "POWDER_Misc:S1751-46" H 9300 5700 50  0001 C CNN
F 3 "~" H 9300 5700 50  0001 C CNN
	1    9100 5700
	0    -1   -1   0   
$EndComp
$Comp
L Connector:TestPoint TP4
U 1 1 617B6079
P 9100 6050
F 0 "TP4" V 9295 6122 50  0000 C CNN
F 1 "TestPoint" V 9204 6122 50  0000 C CNN
F 2 "POWDER_Misc:S1751-46" H 9300 6050 50  0001 C CNN
F 3 "~" H 9300 6050 50  0001 C CNN
	1    9100 6050
	0    -1   -1   0   
$EndComp
$Comp
L Connector:TestPoint TP1
U 1 1 617EB73D
P 9100 5000
F 0 "TP1" V 9295 5072 50  0000 C CNN
F 1 "TestPoint" V 9204 5072 50  0000 C CNN
F 2 "POWDER_Misc:S1751-46" H 9300 5000 50  0001 C CNN
F 3 "~" H 9300 5000 50  0001 C CNN
	1    9100 5000
	0    -1   -1   0   
$EndComp
$Comp
L Connector:TestPoint TP2
U 1 1 617EB743
P 9100 5350
F 0 "TP2" V 9295 5422 50  0000 C CNN
F 1 "TestPoint" V 9204 5422 50  0000 C CNN
F 2 "POWDER_Misc:S1751-46" H 9300 5350 50  0001 C CNN
F 3 "~" H 9300 5350 50  0001 C CNN
	1    9100 5350
	0    -1   -1   0   
$EndComp
Wire Wire Line
	9100 5000 9400 5000
Wire Wire Line
	9100 5350 9400 5350
Wire Wire Line
	9100 5700 9400 5700
Wire Wire Line
	9100 6050 9400 6050
Text Label 9400 5000 0    50   ~ 0
tp1
Text Label 9400 5350 0    50   ~ 0
tp2
Text Label 9400 5700 0    50   ~ 0
tp3
Text Label 9400 6050 0    50   ~ 0
tp4
Text Label 8250 3500 2    50   ~ 0
tp1
Text Label 8250 3600 2    50   ~ 0
tp2
Text Label 8250 4000 2    50   ~ 0
tp3
Text Label 8250 4100 2    50   ~ 0
tp4
$Comp
L Connector:TestPoint TP7
U 1 1 6185F9C1
P 9850 5700
F 0 "TP7" V 10045 5772 50  0000 C CNN
F 1 "TestPoint" V 9954 5772 50  0000 C CNN
F 2 "POWDER_Misc:S1751-46" H 10050 5700 50  0001 C CNN
F 3 "~" H 10050 5700 50  0001 C CNN
	1    9850 5700
	0    -1   -1   0   
$EndComp
$Comp
L Connector:TestPoint TP8
U 1 1 6185F9C7
P 9850 6050
F 0 "TP8" V 10045 6122 50  0000 C CNN
F 1 "TestPoint" V 9954 6122 50  0000 C CNN
F 2 "POWDER_Misc:S1751-46" H 10050 6050 50  0001 C CNN
F 3 "~" H 10050 6050 50  0001 C CNN
	1    9850 6050
	0    -1   -1   0   
$EndComp
$Comp
L Connector:TestPoint TP5
U 1 1 6185F9CD
P 9850 5000
F 0 "TP5" V 10045 5072 50  0000 C CNN
F 1 "TestPoint" V 9954 5072 50  0000 C CNN
F 2 "POWDER_Misc:S1751-46" H 10050 5000 50  0001 C CNN
F 3 "~" H 10050 5000 50  0001 C CNN
	1    9850 5000
	0    -1   -1   0   
$EndComp
$Comp
L Connector:TestPoint TP6
U 1 1 6185F9D3
P 9850 5350
F 0 "TP6" V 10045 5422 50  0000 C CNN
F 1 "TestPoint" V 9954 5422 50  0000 C CNN
F 2 "POWDER_Misc:S1751-46" H 10050 5350 50  0001 C CNN
F 3 "~" H 10050 5350 50  0001 C CNN
	1    9850 5350
	0    -1   -1   0   
$EndComp
Wire Wire Line
	9850 5000 10150 5000
Wire Wire Line
	9850 5350 10150 5350
Wire Wire Line
	9850 5700 10150 5700
Wire Wire Line
	9850 6050 10150 6050
$Comp
L power:GND #PWR?
U 1 1 61882DE8
P 10150 5050
F 0 "#PWR?" H 10150 4800 50  0001 C CNN
F 1 "GND" H 10155 4877 50  0000 C CNN
F 2 "" H 10150 5050 50  0001 C CNN
F 3 "" H 10150 5050 50  0001 C CNN
	1    10150 5050
	1    0    0    -1  
$EndComp
$Comp
L power:GND #PWR?
U 1 1 61883879
P 10150 5400
F 0 "#PWR?" H 10150 5150 50  0001 C CNN
F 1 "GND" H 10155 5227 50  0000 C CNN
F 2 "" H 10150 5400 50  0001 C CNN
F 3 "" H 10150 5400 50  0001 C CNN
	1    10150 5400
	1    0    0    -1  
$EndComp
$Comp
L power:GND #PWR?
U 1 1 6188403F
P 10150 5750
F 0 "#PWR?" H 10150 5500 50  0001 C CNN
F 1 "GND" H 10155 5577 50  0000 C CNN
F 2 "" H 10150 5750 50  0001 C CNN
F 3 "" H 10150 5750 50  0001 C CNN
	1    10150 5750
	1    0    0    -1  
$EndComp
$Comp
L power:GND #PWR?
U 1 1 61884821
P 10150 6100
F 0 "#PWR?" H 10150 5850 50  0001 C CNN
F 1 "GND" H 10155 5927 50  0000 C CNN
F 2 "" H 10150 6100 50  0001 C CNN
F 3 "" H 10150 6100 50  0001 C CNN
	1    10150 6100
	1    0    0    -1  
$EndComp
Wire Wire Line
	10150 5000 10150 5050
Wire Wire Line
	10150 5350 10150 5400
Wire Wire Line
	10150 5700 10150 5750
Wire Wire Line
	10150 6050 10150 6100
Wire Bus Line
	10050 800  10050 1100
Wire Bus Line
	8250 800  8250 1900
$EndSCHEMATC
