EESchema Schematic File Version 4
EELAYER 30 0
EELAYER END
$Descr A4 11693 8268
encoding utf-8
Sheet 4 27
Title ""
Date ""
Rev ""
Comp ""
Comment1 ""
Comment2 ""
Comment3 ""
Comment4 ""
$EndDescr
Text HLabel 3000 2000 0    50   Input ~ 0
v_in
Text HLabel 3900 2200 0    50   Input ~ 0
p2
Text HLabel 3900 3700 0    50   Input ~ 0
p3
Text HLabel 3900 5200 0    50   Input ~ 0
p4
Text HLabel 7400 2800 0    50   Input ~ 0
p5
Text HLabel 7400 2900 0    50   Input ~ 0
en_byod_2
Text HLabel 3900 5300 0    50   Input ~ 0
en_n300
Text HLabel 3900 3800 0    50   Input ~ 0
en_exp
Text HLabel 3900 2300 0    50   Input ~ 0
en_nuc
Text HLabel 5100 2200 2    50   Output ~ 0
pg_nuc
Text HLabel 5100 3700 2    50   Output ~ 0
pg_exp
Text HLabel 5100 5200 2    50   Output ~ 0
pg_n300
Text HLabel 8600 2800 2    50   Output ~ 0
pg_byod_2
Text HLabel 9000 4650 2    50   Output ~ 0
i_sense_exp
Text HLabel 9000 4950 2    50   Output ~ 0
i_sense_n300
Text HLabel 10700 4000 2    50   Output ~ 0
i_sense_byod_2
Text Notes 4400 2050 0    50   ~ 0
NUC 19V
Text Notes 4400 3550 0    50   ~ 0
EXP 12V
Text Notes 4300 5000 0    50   ~ 0
N300 12V
Text Notes 7800 3050 0    50   ~ 0
BYOD_2 <48
$Sheet
S 7500 2500 1000 1000
U 5F777EC8
F0 "BYOD_2_PS" 50
F1 "BYOD_2_PS.sch" 50
F2 "v_in" I L 7500 2600 50 
F3 "v_out" O R 8500 2600 50 
F4 "p_good" O R 8500 2800 50 
F5 "sync" I L 7500 2800 50 
F6 "en" I L 7500 2900 50 
F7 "v_sense" O R 8500 2900 50 
$EndSheet
$Sheet
S 4000 1500 1000 1000
U 5F8A93F2
F0 "NUC" 50
F1 "other_ps.sch" 50
F2 "v_in" I L 4000 2000 50 
F3 "v_out" O R 5000 2000 50 
F4 "p_good" O R 5000 2200 50 
F5 "sync" I L 4000 2200 50 
F6 "en" I L 4000 2300 50 
F7 "v_sense" O R 5000 2300 50 
$EndSheet
$Sheet
S 4000 3000 1000 1000
U 5F8F0FFE
F0 "EXP" 50
F1 "other_ps.sch" 50
F2 "v_in" I L 4000 3500 50 
F3 "v_out" O R 5000 3500 50 
F4 "p_good" O R 5000 3700 50 
F5 "sync" I L 4000 3700 50 
F6 "en" I L 4000 3800 50 
F7 "v_sense" O R 5000 3800 50 
$EndSheet
$Sheet
S 4000 4500 1000 1000
U 5F8F1079
F0 "N300" 50
F1 "other_ps.sch" 50
F2 "v_in" I L 4000 5000 50 
F3 "v_out" O R 5000 5000 50 
F4 "p_good" O R 5000 5200 50 
F5 "sync" I L 4000 5200 50 
F6 "en" I L 4000 5300 50 
F7 "v_sense" O R 5000 5300 50 
$EndSheet
Wire Wire Line
	3900 2200 4000 2200
Wire Wire Line
	3900 2300 4000 2300
Wire Wire Line
	3900 3700 4000 3700
Wire Wire Line
	3900 3800 4000 3800
Wire Wire Line
	3900 5200 4000 5200
Wire Wire Line
	3900 5300 4000 5300
Wire Wire Line
	4000 2000 3500 2000
Wire Wire Line
	3500 2000 3500 2600
Connection ~ 3500 2000
Wire Wire Line
	3500 2000 3000 2000
Wire Wire Line
	4000 5000 3500 5000
Wire Wire Line
	4000 3500 3500 3500
Connection ~ 3500 3500
Wire Wire Line
	3500 3500 3500 5000
Wire Wire Line
	5100 5200 5000 5200
Wire Wire Line
	5100 3700 5000 3700
Wire Wire Line
	5100 2200 5000 2200
Wire Wire Line
	7400 2800 7500 2800
Wire Wire Line
	7500 2900 7400 2900
Wire Wire Line
	8600 2800 8500 2800
$Comp
L POWDER_Analog:INA240-Q1 U?
U 1 1 5EBD8205
P 10200 4000
AR Path="/5EBD8205" Ref="U?"  Part="1" 
AR Path="/5E182A9D/5EBD8205" Ref="U402"  Part="1" 
F 0 "U402" H 10400 4550 50  0000 C CNN
F 1 "INA240-Q1" H 10200 4200 50  0000 C CNN
F 2 "Package_SO:TSSOP-8_4.4x3mm_P0.65mm" H 10200 4000 50  0001 C CNN
F 3 "" H 10200 4000 50  0001 C CNN
F 4 "INA240A3-Q1" H 10200 4000 50  0001 C CNN "PartNumber"
F 5 "3000-0000000503" H 10200 4000 50  0001 C CNN "PartSpecification"
	1    10200 4000
	1    0    0    -1  
$EndComp
$Comp
L POWDER_Power:INA4180-Q1 U?
U 1 1 5EBDF64E
P 8350 5100
AR Path="/5E179620/5EBDF64E" Ref="U?"  Part="1" 
AR Path="/5E182A9D/5EBDF64E" Ref="U401"  Part="1" 
F 0 "U401" H 8500 5750 50  0000 L CNN
F 1 "INA4180-Q1" H 8500 4400 50  0000 L CNN
F 2 "Package_SO:TSSOP-14_4.4x5mm_P0.65mm" H 10250 5950 100 0001 C CNN
F 3 "" H 8600 5800 100 0001 C CNN
F 4 "3000-0000000510" H 8350 5100 50  0001 C CNN "PartSpecification"
	1    8350 5100
	1    0    0    -1  
$EndComp
$Comp
L power:GND #PWR?
U 1 1 5EBDF654
P 8350 5900
AR Path="/5E179620/5EBDF654" Ref="#PWR?"  Part="1" 
AR Path="/5E182A9D/5EBDF654" Ref="#PWR?"  Part="1" 
F 0 "#PWR?" H 8350 5650 50  0001 C CNN
F 1 "GND" H 8350 5750 50  0000 C CNN
F 2 "" H 8350 5900 50  0001 C CNN
F 3 "" H 8350 5900 50  0001 C CNN
	1    8350 5900
	1    0    0    -1  
$EndComp
Wire Wire Line
	8350 5900 8350 5800
$Comp
L power:+3.3V #PWR?
U 1 1 5EBDF65B
P 8350 4300
AR Path="/5E179620/5EBDF65B" Ref="#PWR?"  Part="1" 
AR Path="/5E182A9D/5EBDF65B" Ref="#PWR?"  Part="1" 
F 0 "#PWR?" H 8350 4150 50  0001 C CNN
F 1 "+3.3V" H 8350 4440 50  0000 C CNN
F 2 "" H 8350 4300 50  0001 C CNN
F 3 "" H 8350 4300 50  0001 C CNN
	1    8350 4300
	1    0    0    -1  
$EndComp
Wire Wire Line
	8350 4300 8350 4400
$Comp
L power:GND #PWR?
U 1 1 5EBE2348
P 10200 4700
AR Path="/5E179620/5EBE2348" Ref="#PWR?"  Part="1" 
AR Path="/5E182A9D/5EBE2348" Ref="#PWR?"  Part="1" 
F 0 "#PWR?" H 10200 4450 50  0001 C CNN
F 1 "GND" H 10200 4550 50  0000 C CNN
F 2 "" H 10200 4700 50  0001 C CNN
F 3 "" H 10200 4700 50  0001 C CNN
	1    10200 4700
	1    0    0    -1  
$EndComp
Wire Wire Line
	10200 4700 10200 4650
Wire Wire Line
	10600 4200 10650 4200
Wire Wire Line
	10650 4200 10650 4300
Wire Wire Line
	10650 4650 10200 4650
Connection ~ 10200 4650
Wire Wire Line
	10200 4650 10200 4600
Wire Wire Line
	10600 4300 10650 4300
Connection ~ 10650 4300
Wire Wire Line
	10650 4300 10650 4650
Wire Wire Line
	10700 4000 10600 4000
$Comp
L power:+3.3V #PWR?
U 1 1 5EBE3E70
P 10200 3350
AR Path="/5E179620/5EBE3E70" Ref="#PWR?"  Part="1" 
AR Path="/5E182A9D/5EBE3E70" Ref="#PWR?"  Part="1" 
F 0 "#PWR?" H 10200 3200 50  0001 C CNN
F 1 "+3.3V" H 10200 3490 50  0000 C CNN
F 2 "" H 10200 3350 50  0001 C CNN
F 3 "" H 10200 3350 50  0001 C CNN
	1    10200 3350
	1    0    0    -1  
$EndComp
Wire Wire Line
	10200 3350 10200 3400
Text HLabel 5100 2300 2    50   Output ~ 0
v_sense_nuc
Wire Wire Line
	5100 2300 5000 2300
Text HLabel 5100 3800 2    50   Output ~ 0
v_sense_exp
Wire Wire Line
	5100 3800 5000 3800
Text HLabel 5100 5300 2    50   Output ~ 0
v_sense_n300
Wire Wire Line
	5100 5300 5000 5300
Text HLabel 8600 2900 2    50   Output ~ 0
v_sense_byod_2
Wire Wire Line
	8600 2900 8500 2900
$Comp
L Device:R R401
U 1 1 5EBFA372
P 5750 2000
F 0 "R401" V 5830 2000 50  0000 C CNN
F 1 "3m" V 5750 2000 50  0000 C CNN
F 2 "POWDER_Power:R_0508_1220Metric" V 5680 2000 50  0001 C CNN
F 3 "~" H 5750 2000 50  0001 C CNN
F 4 "3000-0000000499" H 5750 2000 50  0001 C CNN "PartSpecification"
	1    5750 2000
	0    1    1    0   
$EndComp
Wire Wire Line
	5600 2000 5550 2000
Wire Wire Line
	5900 2000 5950 2000
Wire Wire Line
	5950 2150 5950 2000
Connection ~ 5950 2000
Wire Wire Line
	5550 2250 5550 2000
Connection ~ 5550 2000
Wire Wire Line
	5550 2000 5000 2000
$Comp
L Connector_Generic:Conn_01x02 J?
U 1 1 5EC02E21
P 6700 2100
AR Path="/5EC02E21" Ref="J?"  Part="1" 
AR Path="/5E179620/5E2CF5EB/5EC02E21" Ref="J?"  Part="1" 
AR Path="/5E179620/5EC02E21" Ref="J?"  Part="1" 
AR Path="/5E182A9D/5EC02E21" Ref="J401"  Part="1" 
F 0 "J401" H 6700 2200 50  0000 C CNN
F 1 "Conn_01x02" H 6700 1900 50  0000 C CNN
F 2 "TerminalBlock:TerminalBlock_bornier-2_P5.08mm" H 6700 2100 50  0001 C CNN
F 3 "~" H 6700 2100 50  0001 C CNN
F 4 "3000-0000000184" H 6700 2100 50  0001 C CNN "PartSpecification"
	1    6700 2100
	1    0    0    1   
$EndComp
$Comp
L power:GND #PWR?
U 1 1 5EC02E27
P 6500 2200
AR Path="/5E179620/5EC02E27" Ref="#PWR?"  Part="1" 
AR Path="/5E182A9D/5EC02E27" Ref="#PWR?"  Part="1" 
F 0 "#PWR?" H 6500 1950 50  0001 C CNN
F 1 "GND" H 6500 2050 50  0000 C CNN
F 2 "" H 6500 2200 50  0001 C CNN
F 3 "" H 6500 2200 50  0001 C CNN
	1    6500 2200
	1    0    0    -1  
$EndComp
Wire Wire Line
	6500 2200 6500 2100
Wire Wire Line
	5950 2000 6500 2000
$Comp
L Device:R R402
U 1 1 5EC08AAB
P 5750 3500
F 0 "R402" V 5830 3500 50  0000 C CNN
F 1 "3m" V 5750 3500 50  0000 C CNN
F 2 "POWDER_Power:R_0508_1220Metric" V 5680 3500 50  0001 C CNN
F 3 "~" H 5750 3500 50  0001 C CNN
F 4 "3000-0000000499" H 5750 3500 50  0001 C CNN "PartSpecification"
	1    5750 3500
	0    1    1    0   
$EndComp
Wire Wire Line
	5600 3500 5550 3500
Wire Wire Line
	5900 3500 5950 3500
Connection ~ 5950 3500
Connection ~ 5550 3500
Wire Wire Line
	5550 3500 5000 3500
$Comp
L Connector_Generic:Conn_01x02 J?
U 1 1 5EC08ABB
P 6700 3600
AR Path="/5EC08ABB" Ref="J?"  Part="1" 
AR Path="/5E179620/5E2CF5EB/5EC08ABB" Ref="J?"  Part="1" 
AR Path="/5E179620/5EC08ABB" Ref="J?"  Part="1" 
AR Path="/5E182A9D/5EC08ABB" Ref="J402"  Part="1" 
F 0 "J402" H 6700 3700 50  0000 C CNN
F 1 "Conn_01x02" H 6700 3400 50  0000 C CNN
F 2 "TerminalBlock:TerminalBlock_bornier-2_P5.08mm" H 6700 3600 50  0001 C CNN
F 3 "~" H 6700 3600 50  0001 C CNN
F 4 "3000-0000000184" H 6700 3600 50  0001 C CNN "PartSpecification"
	1    6700 3600
	1    0    0    1   
$EndComp
$Comp
L power:GND #PWR?
U 1 1 5EC08AC1
P 6500 3700
AR Path="/5E179620/5EC08AC1" Ref="#PWR?"  Part="1" 
AR Path="/5E182A9D/5EC08AC1" Ref="#PWR?"  Part="1" 
F 0 "#PWR?" H 6500 3450 50  0001 C CNN
F 1 "GND" H 6500 3550 50  0000 C CNN
F 2 "" H 6500 3700 50  0001 C CNN
F 3 "" H 6500 3700 50  0001 C CNN
	1    6500 3700
	1    0    0    -1  
$EndComp
Wire Wire Line
	6500 3700 6500 3600
Wire Wire Line
	5950 3500 6500 3500
$Comp
L Device:R R403
U 1 1 5EC09F1D
P 5750 5000
F 0 "R403" V 5830 5000 50  0000 C CNN
F 1 "3m" V 5750 5000 50  0000 C CNN
F 2 "POWDER_Power:R_0508_1220Metric" V 5680 5000 50  0001 C CNN
F 3 "~" H 5750 5000 50  0001 C CNN
F 4 "3000-0000000499" H 5750 5000 50  0001 C CNN "PartSpecification"
	1    5750 5000
	0    1    1    0   
$EndComp
Wire Wire Line
	5600 5000 5550 5000
Wire Wire Line
	5900 5000 5950 5000
Connection ~ 5950 5000
Connection ~ 5550 5000
Wire Wire Line
	5550 5000 5000 5000
$Comp
L Connector_Generic:Conn_01x02 J?
U 1 1 5EC09F2D
P 6700 5100
AR Path="/5EC09F2D" Ref="J?"  Part="1" 
AR Path="/5E179620/5E2CF5EB/5EC09F2D" Ref="J?"  Part="1" 
AR Path="/5E179620/5EC09F2D" Ref="J?"  Part="1" 
AR Path="/5E182A9D/5EC09F2D" Ref="J403"  Part="1" 
F 0 "J403" H 6700 5200 50  0000 C CNN
F 1 "Conn_01x02" H 6700 4900 50  0000 C CNN
F 2 "TerminalBlock:TerminalBlock_bornier-2_P5.08mm" H 6700 5100 50  0001 C CNN
F 3 "~" H 6700 5100 50  0001 C CNN
F 4 "3000-0000000184" H 6700 5100 50  0001 C CNN "PartSpecification"
	1    6700 5100
	1    0    0    1   
$EndComp
$Comp
L power:GND #PWR?
U 1 1 5EC09F33
P 6500 5200
AR Path="/5E179620/5EC09F33" Ref="#PWR?"  Part="1" 
AR Path="/5E182A9D/5EC09F33" Ref="#PWR?"  Part="1" 
F 0 "#PWR?" H 6500 4950 50  0001 C CNN
F 1 "GND" H 6500 5050 50  0000 C CNN
F 2 "" H 6500 5200 50  0001 C CNN
F 3 "" H 6500 5200 50  0001 C CNN
	1    6500 5200
	1    0    0    -1  
$EndComp
Wire Wire Line
	6500 5200 6500 5100
Wire Wire Line
	5950 5000 6500 5000
$Comp
L Device:R R405
U 1 1 5EC0E591
P 9250 2600
F 0 "R405" V 9330 2600 50  0000 C CNN
F 1 "3m" V 9250 2600 50  0000 C CNN
F 2 "POWDER_Power:R_0508_1220Metric" V 9180 2600 50  0001 C CNN
F 3 "~" H 9250 2600 50  0001 C CNN
F 4 "3000-0000000499" H 9250 2600 50  0001 C CNN "PartSpecification"
	1    9250 2600
	0    1    1    0   
$EndComp
$Comp
L Connector_Generic:Conn_01x02 J?
U 1 1 5EC0E5A1
P 10200 2700
AR Path="/5EC0E5A1" Ref="J?"  Part="1" 
AR Path="/5E179620/5E2CF5EB/5EC0E5A1" Ref="J?"  Part="1" 
AR Path="/5E179620/5EC0E5A1" Ref="J?"  Part="1" 
AR Path="/5E182A9D/5EC0E5A1" Ref="J405"  Part="1" 
F 0 "J405" H 10200 2800 50  0000 C CNN
F 1 "Conn_01x02" H 10200 2500 50  0000 C CNN
F 2 "TerminalBlock:TerminalBlock_bornier-2_P5.08mm" H 10200 2700 50  0001 C CNN
F 3 "~" H 10200 2700 50  0001 C CNN
F 4 "3000-0000000184" H 10200 2700 50  0001 C CNN "PartSpecification"
	1    10200 2700
	1    0    0    1   
$EndComp
$Comp
L power:GND #PWR?
U 1 1 5EC0E5A7
P 10000 2800
AR Path="/5E179620/5EC0E5A7" Ref="#PWR?"  Part="1" 
AR Path="/5E182A9D/5EC0E5A7" Ref="#PWR?"  Part="1" 
F 0 "#PWR?" H 10000 2550 50  0001 C CNN
F 1 "GND" H 10000 2650 50  0000 C CNN
F 2 "" H 10000 2800 50  0001 C CNN
F 3 "" H 10000 2800 50  0001 C CNN
	1    10000 2800
	1    0    0    -1  
$EndComp
Wire Wire Line
	10000 2800 10000 2700
Wire Wire Line
	9400 2600 9450 2600
Wire Wire Line
	8500 2600 9050 2600
Wire Wire Line
	7500 2600 3500 2600
Connection ~ 3500 2600
Wire Wire Line
	3500 2600 3500 3500
Wire Wire Line
	9800 3950 9450 3950
Wire Wire Line
	9450 3950 9450 2600
Connection ~ 9450 2600
Wire Wire Line
	9450 2600 10000 2600
Wire Wire Line
	9050 4050 9050 2600
Connection ~ 9050 2600
Wire Wire Line
	9050 2600 9100 2600
Wire Wire Line
	9050 4050 9800 4050
Wire Wire Line
	5550 4600 7900 4600
Wire Wire Line
	5550 3500 5550 4600
Wire Wire Line
	5950 4700 7900 4700
Wire Wire Line
	5950 3500 5950 4700
Wire Wire Line
	5950 5500 7500 5500
Wire Wire Line
	7500 5500 7500 5000
Wire Wire Line
	7500 5000 7900 5000
Wire Wire Line
	5950 5000 5950 5500
Wire Wire Line
	7900 4900 7400 4900
Wire Wire Line
	7400 4900 7400 5600
Wire Wire Line
	7400 5600 5550 5600
Wire Wire Line
	5550 5000 5550 5600
Wire Wire Line
	8800 4950 9000 4950
Wire Wire Line
	9000 4650 8800 4650
Text Label 6200 2000 0    50   ~ 0
V_NUC
Text Label 6200 3500 0    50   ~ 0
V_EXP
Text Label 6150 5000 0    50   ~ 0
V_N300
Text Label 9550 2600 0    50   ~ 0
V_BYOD_2
Text Label 5150 2000 0    50   ~ 0
V_NUC_REG
Text Label 5100 3500 0    50   ~ 0
V_EXP_REG
Text Label 5100 5000 0    50   ~ 0
V_N300_REG
Text Label 8650 2600 0    50   ~ 0
V_BYOD_2_REG
$Comp
L 000_PreferredParts:C_0_1uF C?
U 1 1 5F81E2BB
P 7750 4150
AR Path="/5E179620/5F81E2BB" Ref="C?"  Part="1" 
AR Path="/5E182A9D/5F81E2BB" Ref="C401"  Part="1" 
F 0 "C401" H 7775 4250 50  0000 L CNN
F 1 "C_0_1uF" H 7775 4050 50  0001 L CNN
F 2 "Capacitor_SMD:C_0402_1005Metric" H 7788 4000 50  0001 C CNN
F 3 "~" H 7750 4150 50  0001 C CNN
F 4 "0.1uF" H 7900 4050 50  0000 C CNN "DisplayValue"
F 5 "3000-0000000125" H 7750 4150 50  0001 C CNN "PartSpecification"
	1    7750 4150
	1    0    0    -1  
$EndComp
$Comp
L power:GND #PWR?
U 1 1 5F81E2C1
P 7750 4400
AR Path="/5E179620/5F81E2C1" Ref="#PWR?"  Part="1" 
AR Path="/5E182A9D/5F81E2C1" Ref="#PWR?"  Part="1" 
F 0 "#PWR?" H 7750 4150 50  0001 C CNN
F 1 "GND" H 7750 4250 50  0000 C CNN
F 2 "" H 7750 4400 50  0001 C CNN
F 3 "" H 7750 4400 50  0001 C CNN
	1    7750 4400
	1    0    0    -1  
$EndComp
Wire Wire Line
	7750 4400 7750 4300
$Comp
L power:+3.3V #PWR?
U 1 1 5F81E2C8
P 7750 3900
AR Path="/5E179620/5F81E2C8" Ref="#PWR?"  Part="1" 
AR Path="/5E182A9D/5F81E2C8" Ref="#PWR?"  Part="1" 
F 0 "#PWR?" H 7750 3750 50  0001 C CNN
F 1 "+3.3V" H 7750 4040 50  0000 C CNN
F 2 "" H 7750 3900 50  0001 C CNN
F 3 "" H 7750 3900 50  0001 C CNN
	1    7750 3900
	1    0    0    -1  
$EndComp
Wire Wire Line
	7750 3900 7750 4000
$Comp
L 000_PreferredParts:C_0_1uF C?
U 1 1 5F821A38
P 10700 3000
AR Path="/5E179620/5F821A38" Ref="C?"  Part="1" 
AR Path="/5E182A9D/5F821A38" Ref="C402"  Part="1" 
F 0 "C402" H 10725 3100 50  0000 L CNN
F 1 "C_0_1uF" H 10725 2900 50  0001 L CNN
F 2 "Capacitor_SMD:C_0402_1005Metric" H 10738 2850 50  0001 C CNN
F 3 "~" H 10700 3000 50  0001 C CNN
F 4 "0.1uF" H 10850 2900 50  0000 C CNN "DisplayValue"
F 5 "3000-0000000125" H 10700 3000 50  0001 C CNN "PartSpecification"
	1    10700 3000
	1    0    0    -1  
$EndComp
$Comp
L power:GND #PWR?
U 1 1 5F821A3E
P 10700 3250
AR Path="/5E179620/5F821A3E" Ref="#PWR?"  Part="1" 
AR Path="/5E182A9D/5F821A3E" Ref="#PWR?"  Part="1" 
F 0 "#PWR?" H 10700 3000 50  0001 C CNN
F 1 "GND" H 10700 3100 50  0000 C CNN
F 2 "" H 10700 3250 50  0001 C CNN
F 3 "" H 10700 3250 50  0001 C CNN
	1    10700 3250
	1    0    0    -1  
$EndComp
Wire Wire Line
	10700 3250 10700 3150
$Comp
L power:+3.3V #PWR?
U 1 1 5F821A45
P 10700 2750
AR Path="/5E179620/5F821A45" Ref="#PWR?"  Part="1" 
AR Path="/5E182A9D/5F821A45" Ref="#PWR?"  Part="1" 
F 0 "#PWR?" H 10700 2600 50  0001 C CNN
F 1 "+3.3V" H 10700 2890 50  0000 C CNN
F 2 "" H 10700 2750 50  0001 C CNN
F 3 "" H 10700 2750 50  0001 C CNN
	1    10700 2750
	1    0    0    -1  
$EndComp
Wire Wire Line
	10700 2750 10700 2850
Wire Wire Line
	5550 2250 6050 2250
Wire Wire Line
	5950 2150 6050 2150
Text Label 7800 5500 0    50   ~ 0
V_NUC_REG
Wire Wire Line
	7800 5500 7900 5500
Wire Wire Line
	7900 5600 7800 5600
Text Label 7800 5600 0    50   ~ 0
V_NUC
Wire Wire Line
	9000 5550 8800 5550
Text HLabel 9000 5550 2    50   Output ~ 0
i_sense_nuc
NoConn ~ 7900 5200
NoConn ~ 7900 5300
$EndSCHEMATC
