EESchema Schematic File Version 4
EELAYER 30 0
EELAYER END
$Descr A4 11693 8268
encoding utf-8
Sheet 23 39
Title ""
Date ""
Rev ""
Comp ""
Comment1 ""
Comment2 ""
Comment3 ""
Comment4 ""
$EndDescr
$Comp
L POWDER_Digital:10M50DAF256 U2201
U 1 1 5F967B5E
P 7850 4400
F 0 "U2201" H 7850 4550 50  0000 C CNN
F 1 "‎10M08DAF256C8G" H 7850 4400 50  0000 C CNN
F 2 "Package_BGA:BGA-256_17.0x17.0mm_Layout16x16_P1.0mm_Ball0.5mm_Pad0.4mm_NSMD" H 7850 4400 50  0001 C CNN
F 3 "" H 7850 4400 50  0001 C CNN
F 4 "3000-0000001300" H 7850 4400 50  0001 C CNN "PartSpecification"
	1    7850 4400
	1    0    0    -1  
$EndComp
$Comp
L Device:Ferrite_Bead_Small FB2302
U 1 1 5FB7EDDA
P 7650 2700
F 0 "FB2302" H 7725 2750 50  0000 L CNN
F 1 "Ferrite_Bead_Small" H 7725 2650 50  0000 L CNN
F 2 "Inductor_SMD:L_0603_1608Metric" V 7580 2700 50  0001 C CNN
F 3 "~" H 7650 2700 50  0001 C CNN
F 4 "BLM18SP601SH1D" H 7650 2700 50  0001 C CNN "PartNumber"
F 5 "3000-0000001272" H 7650 2700 50  0001 C CNN "PartSpecification"
	1    7650 2700
	1    0    0    -1  
$EndComp
$Comp
L 000_PreferredParts:C_0_1uF C2304
U 1 1 5FB7F7BB
P 6950 3050
F 0 "C2304" H 6975 3150 50  0000 L CNN
F 1 "C_0_1uF" H 6975 2950 50  0001 L CNN
F 2 "Capacitor_SMD:C_0402_1005Metric" H 6988 2900 50  0001 C CNN
F 3 "~" H 6950 3050 50  0001 C CNN
F 4 "0.1uF" H 7100 2950 50  0000 C CNN "DisplayValue"
F 5 "3000-0000000125" H 6950 3050 50  0001 C CNN "PartSpecification"
F 6 "100V" H 6950 3050 50  0001 C CNN "Voltage"
	1    6950 3050
	1    0    0    -1  
$EndComp
$Comp
L 000_PreferredParts:C_1nF C2306
U 1 1 5FB809A3
P 7800 3050
F 0 "C2306" H 7825 3150 50  0000 L CNN
F 1 "C_1nF" H 7825 2950 50  0000 L CNN
F 2 "Capacitor_SMD:C_0402_1005Metric" H 7838 2900 50  0001 C CNN
F 3 "~" H 7800 3050 50  0001 C CNN
F 4 "3000-0000000128" H 7800 3050 50  0001 C CNN "PartSpecification"
	1    7800 3050
	1    0    0    -1  
$EndComp
$Comp
L 000_PreferredParts:C_1nF C2305
U 1 1 5FB80FFD
P 7300 3050
F 0 "C2305" H 7325 3150 50  0000 L CNN
F 1 "C_1nF" H 7325 2950 50  0000 L CNN
F 2 "Capacitor_SMD:C_0402_1005Metric" H 7338 2900 50  0001 C CNN
F 3 "~" H 7300 3050 50  0001 C CNN
F 4 "3000-0000000128" H 7300 3050 50  0001 C CNN "PartSpecification"
	1    7300 3050
	1    0    0    -1  
$EndComp
Wire Wire Line
	7650 3350 7650 2900
$Comp
L power:+2V5 #PWR?
U 1 1 5FB81EA3
P 7650 2500
F 0 "#PWR?" H 7650 2350 50  0001 C CNN
F 1 "+2V5" H 7650 2640 50  0000 C CNN
F 2 "" H 7650 2500 50  0001 C CNN
F 3 "" H 7650 2500 50  0001 C CNN
	1    7650 2500
	1    0    0    -1  
$EndComp
Wire Wire Line
	7650 2500 7650 2550
Wire Wire Line
	8050 3350 8050 2800
Wire Wire Line
	8050 2550 7650 2550
Connection ~ 7650 2550
Wire Wire Line
	7650 2550 7650 2600
$Comp
L 000_PreferredParts:C_0_1uF C2307
U 1 1 5FB82CE1
P 8250 3050
F 0 "C2307" H 8275 3150 50  0000 L CNN
F 1 "C_0_1uF" H 8275 2950 50  0001 L CNN
F 2 "Capacitor_SMD:C_0402_1005Metric" H 8288 2900 50  0001 C CNN
F 3 "~" H 8250 3050 50  0001 C CNN
F 4 "0.1uF" H 8400 2950 50  0000 C CNN "DisplayValue"
F 5 "3000-0000000125" H 8250 3050 50  0001 C CNN "PartSpecification"
F 6 "100V" H 8250 3050 50  0001 C CNN "Voltage"
	1    8250 3050
	1    0    0    -1  
$EndComp
$Comp
L 000_PreferredParts:C_1nF C2308
U 1 1 5FB832D8
P 8550 3050
F 0 "C2308" H 8575 3150 50  0000 L CNN
F 1 "C_1nF" H 8575 2950 50  0000 L CNN
F 2 "Capacitor_SMD:C_0402_1005Metric" H 8588 2900 50  0001 C CNN
F 3 "~" H 8550 3050 50  0001 C CNN
F 4 "3000-0000000128" H 8550 3050 50  0001 C CNN "PartSpecification"
	1    8550 3050
	1    0    0    -1  
$EndComp
$Comp
L power:GND #PWR?
U 1 1 5FB83D50
P 8250 3250
F 0 "#PWR?" H 8250 3000 50  0001 C CNN
F 1 "GND" H 8250 3100 50  0000 C CNN
F 2 "" H 8250 3250 50  0001 C CNN
F 3 "" H 8250 3250 50  0001 C CNN
	1    8250 3250
	1    0    0    -1  
$EndComp
$Comp
L power:GND #PWR?
U 1 1 5FB83E5B
P 8550 3250
F 0 "#PWR?" H 8550 3000 50  0001 C CNN
F 1 "GND" H 8550 3100 50  0000 C CNN
F 2 "" H 8550 3250 50  0001 C CNN
F 3 "" H 8550 3250 50  0001 C CNN
	1    8550 3250
	1    0    0    -1  
$EndComp
Wire Wire Line
	8550 3250 8550 3200
Wire Wire Line
	8250 3250 8250 3200
Wire Wire Line
	8550 2900 8550 2800
Wire Wire Line
	8550 2800 8250 2800
Connection ~ 8050 2800
Wire Wire Line
	8050 2800 8050 2550
Wire Wire Line
	8250 2900 8250 2800
Connection ~ 8250 2800
Wire Wire Line
	8250 2800 8050 2800
Wire Wire Line
	6950 2900 6950 2850
Wire Wire Line
	6950 2850 7400 2850
Connection ~ 7650 2850
Wire Wire Line
	7650 2850 7650 2800
$Comp
L power:GND #PWR?
U 1 1 5FB861B4
P 7800 3250
F 0 "#PWR?" H 7800 3000 50  0001 C CNN
F 1 "GND" H 7800 3100 50  0000 C CNN
F 2 "" H 7800 3250 50  0001 C CNN
F 3 "" H 7800 3250 50  0001 C CNN
	1    7800 3250
	1    0    0    -1  
$EndComp
Wire Wire Line
	7800 3250 7800 3200
Wire Wire Line
	7800 2900 7650 2900
Connection ~ 7650 2900
Wire Wire Line
	7650 2900 7650 2850
Wire Wire Line
	7550 2850 7550 2900
Connection ~ 7550 2850
Wire Wire Line
	7550 2850 7650 2850
$Comp
L power:GND #PWR?
U 1 1 5FB8A8CE
P 7300 3250
F 0 "#PWR?" H 7300 3000 50  0001 C CNN
F 1 "GND" H 7300 3100 50  0000 C CNN
F 2 "" H 7300 3250 50  0001 C CNN
F 3 "" H 7300 3250 50  0001 C CNN
	1    7300 3250
	1    0    0    -1  
$EndComp
Wire Wire Line
	7300 3200 7300 3250
Wire Wire Line
	7550 2900 7300 2900
Connection ~ 7550 2900
Wire Wire Line
	7550 2900 7550 3350
$Comp
L power:GND #PWR?
U 1 1 5FB8C1B0
P 6950 3250
F 0 "#PWR?" H 6950 3000 50  0001 C CNN
F 1 "GND" H 6950 3100 50  0000 C CNN
F 2 "" H 6950 3250 50  0001 C CNN
F 3 "" H 6950 3250 50  0001 C CNN
	1    6950 3250
	1    0    0    -1  
$EndComp
Wire Wire Line
	6950 3250 6950 3200
Wire Wire Line
	9350 3950 9600 3950
Wire Wire Line
	9350 4050 9800 4050
Wire Wire Line
	9350 4250 9500 4250
Wire Wire Line
	9350 4350 10000 4350
Wire Wire Line
	9350 4450 10500 4450
$Comp
L Device:R R2305
U 1 1 5FBC7B52
P 9500 5150
F 0 "R2305" V 9580 5150 50  0000 C CNN
F 1 "1k" V 9500 5150 50  0000 C CNN
F 2 "Resistor_SMD:R_0402_1005Metric" V 9430 5150 50  0001 C CNN
F 3 "~" H 9500 5150 50  0001 C CNN
F 4 "3000-0000000156" H 9500 5150 50  0001 C CNN "PartSpecification"
	1    9500 5150
	1    0    0    -1  
$EndComp
Wire Wire Line
	9500 5000 9500 4250
Connection ~ 9500 4250
Wire Wire Line
	9500 4250 10500 4250
$Comp
L Device:R R2301
U 1 1 5FBC8997
P 9600 3650
F 0 "R2301" V 9680 3650 50  0000 C CNN
F 1 "10k" V 9600 3650 50  0000 C CNN
F 2 "Resistor_SMD:R_0402_1005Metric" V 9530 3650 50  0001 C CNN
F 3 "~" H 9600 3650 50  0001 C CNN
F 4 "3000-0000000131" H 9600 3650 50  0001 C CNN "PartSpecification"
	1    9600 3650
	1    0    0    -1  
$EndComp
$Comp
L Device:R R2302
U 1 1 5FBC8FF2
P 9800 3650
F 0 "R2302" V 9880 3650 50  0000 C CNN
F 1 "10k" V 9800 3650 50  0000 C CNN
F 2 "Resistor_SMD:R_0402_1005Metric" V 9730 3650 50  0001 C CNN
F 3 "~" H 9800 3650 50  0001 C CNN
F 4 "3000-0000000131" H 9800 3650 50  0001 C CNN "PartSpecification"
	1    9800 3650
	1    0    0    -1  
$EndComp
$Comp
L Device:R R2303
U 1 1 5FBC950E
P 10000 3650
F 0 "R2303" V 10080 3650 50  0000 C CNN
F 1 "10k" V 10000 3650 50  0000 C CNN
F 2 "Resistor_SMD:R_0402_1005Metric" V 9930 3650 50  0001 C CNN
F 3 "~" H 10000 3650 50  0001 C CNN
F 4 "3000-0000000131" H 10000 3650 50  0001 C CNN "PartSpecification"
	1    10000 3650
	1    0    0    -1  
$EndComp
Wire Wire Line
	9600 3800 9600 3950
Connection ~ 9600 3950
Wire Wire Line
	9600 3950 10500 3950
Wire Wire Line
	9800 3800 9800 4050
Connection ~ 9800 4050
Wire Wire Line
	9800 4050 10500 4050
Wire Wire Line
	10000 3800 10000 4350
Connection ~ 10000 4350
Wire Wire Line
	10000 4350 10500 4350
$Comp
L power:GND #PWR?
U 1 1 5FBCC203
P 9500 5400
F 0 "#PWR?" H 9500 5150 50  0001 C CNN
F 1 "GND" H 9500 5250 50  0000 C CNN
F 2 "" H 9500 5400 50  0001 C CNN
F 3 "" H 9500 5400 50  0001 C CNN
	1    9500 5400
	1    0    0    -1  
$EndComp
Wire Wire Line
	9500 5400 9500 5300
Wire Wire Line
	9600 3500 9600 2800
Wire Wire Line
	9600 2800 8550 2800
Connection ~ 8550 2800
Wire Wire Line
	9800 3500 9800 2800
Wire Wire Line
	9800 2800 9600 2800
Connection ~ 9600 2800
Wire Wire Line
	9800 2800 10000 2800
Wire Wire Line
	10000 2800 10000 3500
Connection ~ 9800 2800
$Comp
L Connector_Generic:Conn_02x05_Odd_Even J2301
U 1 1 5FBD092C
P 8550 1750
F 0 "J2301" H 8600 2050 50  0000 C CNN
F 1 "Conn_02x05_Odd_Even" H 8600 1450 50  0000 C CNN
F 2 "Connector_PinHeader_2.54mm:PinHeader_2x05_P2.54mm_Vertical" H 8550 1750 50  0001 C CNN
F 3 "~" H 8550 1750 50  0001 C CNN
F 4 "3000-0000001280" H 8550 1750 50  0001 C CNN "PartSpecification"
	1    8550 1750
	1    0    0    -1  
$EndComp
Text Label 10100 3950 0    50   ~ 0
JTAGEN
Text Label 10100 4050 0    50   ~ 0
TMS
Text Label 10100 4250 0    50   ~ 0
TCK
Text Label 10100 4350 0    50   ~ 0
TDI
Text Label 10100 4450 0    50   ~ 0
TDO
$Comp
L power:GND #PWR?
U 1 1 5FBD5742
P 9100 2100
F 0 "#PWR?" H 9100 1850 50  0001 C CNN
F 1 "GND" H 9100 1950 50  0000 C CNN
F 2 "" H 9100 2100 50  0001 C CNN
F 3 "" H 9100 2100 50  0001 C CNN
	1    9100 2100
	1    0    0    -1  
$EndComp
Wire Wire Line
	8850 1950 9100 1950
Wire Wire Line
	9100 1950 9100 2100
Wire Wire Line
	8850 1550 9100 1550
Wire Wire Line
	9100 1550 9100 1950
Connection ~ 9100 1950
$Comp
L power:+2V5 #PWR?
U 1 1 5FBD885C
P 8950 1450
F 0 "#PWR?" H 8950 1300 50  0001 C CNN
F 1 "+2V5" H 8950 1590 50  0000 C CNN
F 2 "" H 8950 1450 50  0001 C CNN
F 3 "" H 8950 1450 50  0001 C CNN
	1    8950 1450
	1    0    0    -1  
$EndComp
Wire Wire Line
	8950 1450 8950 1650
Wire Wire Line
	8950 1650 8850 1650
Wire Wire Line
	8850 1850 9500 1850
Text Label 9200 1850 0    50   ~ 0
JTAGEN
Wire Wire Line
	8350 1550 8000 1550
Text Label 8050 1550 0    50   ~ 0
TCK
Wire Wire Line
	8350 1650 8000 1650
Wire Wire Line
	8350 1750 8000 1750
Wire Wire Line
	8350 1950 8000 1950
Text Label 8050 1650 0    50   ~ 0
TDO
Text Label 8050 1750 0    50   ~ 0
TMS
Text Label 8050 1950 0    50   ~ 0
TDI
Wire Wire Line
	9350 4550 9800 4550
Wire Wire Line
	9350 4650 9800 4650
Wire Wire Line
	9350 4750 10250 4750
Text Label 9550 4750 0    50   ~ 0
REF_EN
NoConn ~ 8850 1750
NoConn ~ 8350 1850
Text Label 7050 2850 0    50   ~ 0
VCCIO_1A
$Comp
L POWDER_Analog:SN74CBT16233 U2304
U 1 1 607B10C7
P 4100 4650
F 0 "U2304" H 4350 6700 50  0000 C CNN
F 1 "SN74CBT16233" H 3700 6700 50  0000 C CNN
F 2 "Package_SO:TSSOP-56_6.1x14mm_P0.5mm" H 3850 6700 50  0001 C CNN
F 3 "" H 3850 6700 50  0001 C CNN
F 4 "SN74CBT16233DGGR" H 4100 4650 50  0001 C CNN "PartNumber"
F 5 "3000-0000001314" H 4100 4650 50  0001 C CNN "PartSpecification"
	1    4100 4650
	-1   0    0    -1  
$EndComp
Wire Wire Line
	6350 3650 6000 3650
Wire Wire Line
	5000 2950 4500 2950
Wire Wire Line
	6350 3850 6000 3850
Wire Wire Line
	5000 3150 4500 3150
Wire Wire Line
	6350 4050 6000 4050
Wire Wire Line
	5000 3350 4500 3350
Wire Wire Line
	6350 4250 6000 4250
Wire Wire Line
	5000 3550 4500 3550
Wire Wire Line
	5000 3750 4500 3750
Wire Wire Line
	6350 4650 6000 4650
Wire Wire Line
	5000 3950 4500 3950
Wire Wire Line
	6350 4850 6000 4850
Wire Wire Line
	5000 4150 4500 4150
Wire Wire Line
	6350 5050 6000 5050
Wire Wire Line
	5000 4350 4500 4350
Wire Wire Line
	6350 4550 6000 4550
Wire Wire Line
	6350 5150 6000 5150
Wire Wire Line
	5000 6150 4500 6150
Wire Wire Line
	6350 4950 6000 4950
Wire Wire Line
	5000 5950 4500 5950
Wire Wire Line
	6000 4750 6350 4750
Wire Wire Line
	4500 5750 5000 5750
Wire Wire Line
	4500 5550 5000 5550
Wire Wire Line
	6350 4450 6000 4450
Wire Wire Line
	5000 5350 4500 5350
Wire Wire Line
	6350 4350 6000 4350
Wire Wire Line
	6350 4150 6000 4150
Wire Wire Line
	4500 5150 5000 5150
Wire Wire Line
	6350 3950 6000 3950
Wire Wire Line
	4500 4950 5000 4950
Wire Wire Line
	6350 3750 6000 3750
Wire Wire Line
	4500 4750 5000 4750
$Comp
L power:GND #PWR?
U 1 1 60A8D10F
P 3600 6350
F 0 "#PWR?" H 3600 6100 50  0001 C CNN
F 1 "GND" H 3600 6200 50  0000 C CNN
F 2 "" H 3600 6350 50  0001 C CNN
F 3 "" H 3600 6350 50  0001 C CNN
	1    3600 6350
	1    0    0    -1  
$EndComp
Wire Wire Line
	3600 6350 3600 6250
Wire Wire Line
	3600 6250 3700 6250
$Comp
L power:GND #PWR?
U 1 1 60A9F52B
P 3450 6250
F 0 "#PWR?" H 3450 6000 50  0001 C CNN
F 1 "GND" H 3450 6100 50  0000 C CNN
F 2 "" H 3450 6250 50  0001 C CNN
F 3 "" H 3450 6250 50  0001 C CNN
	1    3450 6250
	1    0    0    -1  
$EndComp
Wire Wire Line
	3450 6250 3450 6050
$Comp
L power:GND #PWR?
U 1 1 60AB4F6E
P 4050 6850
F 0 "#PWR?" H 4050 6600 50  0001 C CNN
F 1 "GND" H 4050 6700 50  0000 C CNN
F 2 "" H 4050 6850 50  0001 C CNN
F 3 "" H 4050 6850 50  0001 C CNN
	1    4050 6850
	1    0    0    -1  
$EndComp
$Comp
L power:GND #PWR?
U 1 1 60AB5406
P 4150 6850
F 0 "#PWR?" H 4150 6600 50  0001 C CNN
F 1 "GND" H 4150 6700 50  0000 C CNN
F 2 "" H 4150 6850 50  0001 C CNN
F 3 "" H 4150 6850 50  0001 C CNN
	1    4150 6850
	1    0    0    -1  
$EndComp
Wire Wire Line
	4150 6850 4150 6750
Wire Wire Line
	4050 6750 4050 6850
$Comp
L power:+2V5 #PWR?
U 1 1 60AE6AA4
P 6550 800
F 0 "#PWR?" H 6550 650 50  0001 C CNN
F 1 "+2V5" H 6550 940 50  0000 C CNN
F 2 "" H 6550 800 50  0001 C CNN
F 3 "" H 6550 800 50  0001 C CNN
	1    6550 800 
	1    0    0    -1  
$EndComp
$Comp
L power:GND #PWR?
U 1 1 60AF9D54
P 6550 2100
F 0 "#PWR?" H 6550 1850 50  0001 C CNN
F 1 "GND" H 6550 1950 50  0000 C CNN
F 2 "" H 6550 2100 50  0001 C CNN
F 3 "" H 6550 2100 50  0001 C CNN
	1    6550 2100
	1    0    0    -1  
$EndComp
$Comp
L POWDER_ESD:D5V0P4UR6SO U2301
U 1 1 60AFB079
P 6550 1450
F 0 "U2301" H 6150 1950 50  0000 C CNN
F 1 "D5V0P4UR6SO" H 6950 1950 50  0000 C CNN
F 2 "Package_TO_SOT_SMD:SOT-23-6" H 7200 2100 50  0001 C CNN
F 3 "" H 6550 1450 50  0001 C CNN
F 4 "3000-0000001313" H 6550 1450 50  0001 C CNN "PartSpecification"
	1    6550 1450
	1    0    0    -1  
$EndComp
Wire Wire Line
	6550 800  6550 900 
Wire Wire Line
	6550 2000 6550 2100
Wire Wire Line
	6000 1400 5650 1400
Text Label 5700 1400 0    50   ~ 0
TCK
Wire Wire Line
	6000 1500 5650 1500
Text Label 7400 1500 2    50   ~ 0
TDO
Wire Wire Line
	7100 1400 7450 1400
Text Label 7400 1400 2    50   ~ 0
TMS
Wire Wire Line
	7100 1500 7450 1500
Text Label 5700 1500 0    50   ~ 0
TDI
$Comp
L power:+2V5 #PWR?
U 1 1 60B747C8
P 10450 800
F 0 "#PWR?" H 10450 650 50  0001 C CNN
F 1 "+2V5" H 10450 940 50  0000 C CNN
F 2 "" H 10450 800 50  0001 C CNN
F 3 "" H 10450 800 50  0001 C CNN
	1    10450 800 
	1    0    0    -1  
$EndComp
$Comp
L power:GND #PWR?
U 1 1 60B747CE
P 10450 2100
F 0 "#PWR?" H 10450 1850 50  0001 C CNN
F 1 "GND" H 10450 1950 50  0000 C CNN
F 2 "" H 10450 2100 50  0001 C CNN
F 3 "" H 10450 2100 50  0001 C CNN
	1    10450 2100
	1    0    0    -1  
$EndComp
$Comp
L POWDER_ESD:D5V0P4UR6SO U2302
U 1 1 60B747D4
P 10450 1450
F 0 "U2302" H 10050 1950 50  0000 C CNN
F 1 "D5V0P4UR6SO" H 10850 1950 50  0000 C CNN
F 2 "Package_TO_SOT_SMD:SOT-23-6" H 11100 2100 50  0001 C CNN
F 3 "" H 10450 1450 50  0001 C CNN
F 4 "3000-0000001313" H 10450 1450 50  0001 C CNN "PartSpecification"
	1    10450 1450
	1    0    0    -1  
$EndComp
Wire Wire Line
	10450 800  10450 900 
Wire Wire Line
	10450 2000 10450 2100
Wire Wire Line
	9900 1400 9500 1400
Text Label 9550 1400 0    50   ~ 0
JTAGEN
Text HLabel 1500 6150 0    50   Input ~ 0
TEMP_SENSE_PA
Text HLabel 1500 5950 0    50   Input ~ 0
TEMP_SENSE_LNA
$Comp
L Device:Ferrite_Bead_Small FB2301
U 1 1 60C0A8CB
P 4150 1750
F 0 "FB2301" H 4225 1800 50  0000 L CNN
F 1 "Ferrite_Bead_Small" H 4225 1700 50  0000 L CNN
F 2 "Inductor_SMD:L_0603_1608Metric" V 4080 1750 50  0001 C CNN
F 3 "~" H 4150 1750 50  0001 C CNN
F 4 "BLM18SP601SH1D" H 4150 1750 50  0001 C CNN "PartNumber"
F 5 "3000-0000001272" H 4150 1750 50  0001 C CNN "PartSpecification"
	1    4150 1750
	1    0    0    -1  
$EndComp
Wire Wire Line
	4150 2550 4150 2450
Wire Wire Line
	4050 2550 4050 2450
Wire Wire Line
	4050 2450 4150 2450
Connection ~ 4150 2450
Wire Wire Line
	4150 2450 4150 2000
$Comp
L 000_PreferredParts:C_0_1uF C2302
U 1 1 60C3605B
P 3150 2250
F 0 "C2302" H 3175 2350 50  0000 L CNN
F 1 "C_0_1uF" H 3175 2150 50  0001 L CNN
F 2 "Capacitor_SMD:C_0402_1005Metric" H 3188 2100 50  0001 C CNN
F 3 "~" H 3150 2250 50  0001 C CNN
F 4 "0.1uF" H 3300 2150 50  0000 C CNN "DisplayValue"
F 5 "3000-0000000125" H 3150 2250 50  0001 C CNN "PartSpecification"
F 6 "100V" H 3150 2250 50  0001 C CNN "Voltage"
	1    3150 2250
	1    0    0    -1  
$EndComp
$Comp
L 000_PreferredParts:C_1nF C2303
U 1 1 60C36062
P 3500 2250
F 0 "C2303" H 3525 2350 50  0000 L CNN
F 1 "C_1nF" H 3525 2150 50  0000 L CNN
F 2 "Capacitor_SMD:C_0402_1005Metric" H 3538 2100 50  0001 C CNN
F 3 "~" H 3500 2250 50  0001 C CNN
F 4 "3000-0000000128" H 3500 2250 50  0001 C CNN "PartSpecification"
	1    3500 2250
	1    0    0    -1  
$EndComp
Wire Wire Line
	3150 2100 3150 2000
Wire Wire Line
	3150 2000 3500 2000
Connection ~ 4150 2000
Wire Wire Line
	4150 2000 4150 1850
Wire Wire Line
	3500 2100 3500 2000
Connection ~ 3500 2000
Wire Wire Line
	3500 2000 3850 2000
$Comp
L power:GND #PWR?
U 1 1 60C88DF2
P 3500 2500
F 0 "#PWR?" H 3500 2250 50  0001 C CNN
F 1 "GND" H 3500 2350 50  0000 C CNN
F 2 "" H 3500 2500 50  0001 C CNN
F 3 "" H 3500 2500 50  0001 C CNN
	1    3500 2500
	1    0    0    -1  
$EndComp
$Comp
L power:GND #PWR?
U 1 1 60C89222
P 3150 2500
F 0 "#PWR?" H 3150 2250 50  0001 C CNN
F 1 "GND" H 3150 2350 50  0000 C CNN
F 2 "" H 3150 2500 50  0001 C CNN
F 3 "" H 3150 2500 50  0001 C CNN
	1    3150 2500
	1    0    0    -1  
$EndComp
Wire Wire Line
	3150 2500 3150 2400
Wire Wire Line
	3500 2400 3500 2500
$Comp
L 000_PreferredParts:C_10pF C2301
U 1 1 60CB8233
P 2500 2250
F 0 "C2301" H 2615 2296 50  0000 L CNN
F 1 "C_10pF" H 2615 2205 50  0000 L CNN
F 2 "Capacitor_SMD:C_0402_1005Metric" H 2538 2100 50  0001 C CNN
F 3 "~" H 2500 2250 50  0001 C CNN
F 4 "3000-0000000582" H 2500 2250 50  0001 C CNN "PartSpecification"
	1    2500 2250
	1    0    0    -1  
$EndComp
Wire Wire Line
	2500 2100 2500 2000
Wire Wire Line
	2500 2000 3150 2000
Connection ~ 3150 2000
$Comp
L power:GND #PWR?
U 1 1 60CCEB74
P 2500 2500
F 0 "#PWR?" H 2500 2250 50  0001 C CNN
F 1 "GND" H 2500 2350 50  0000 C CNN
F 2 "" H 2500 2500 50  0001 C CNN
F 3 "" H 2500 2500 50  0001 C CNN
	1    2500 2500
	1    0    0    -1  
$EndComp
Wire Wire Line
	2500 2500 2500 2400
$Comp
L power:+5VA #PWR?
U 1 1 60CE8DE7
P 4150 1500
F 0 "#PWR?" H 4150 1350 50  0001 C CNN
F 1 "+5VA" H 4165 1673 50  0000 C CNN
F 2 "" H 4150 1500 50  0001 C CNN
F 3 "" H 4150 1500 50  0001 C CNN
	1    4150 1500
	1    0    0    -1  
$EndComp
Wire Wire Line
	4150 1500 4150 1650
$Comp
L Device:R R2308
U 1 1 60D02B4D
P 4600 6600
F 0 "R2308" V 4680 6600 50  0000 C CNN
F 1 "1k" V 4600 6600 50  0000 C CNN
F 2 "Resistor_SMD:R_0402_1005Metric" V 4530 6600 50  0001 C CNN
F 3 "~" H 4600 6600 50  0001 C CNN
F 4 "3000-0000000156" H 4600 6600 50  0001 C CNN "PartSpecification"
	1    4600 6600
	1    0    0    -1  
$EndComp
$Comp
L power:GND #PWR?
U 1 1 60D032A5
P 4600 6850
F 0 "#PWR?" H 4600 6600 50  0001 C CNN
F 1 "GND" H 4600 6700 50  0000 C CNN
F 2 "" H 4600 6850 50  0001 C CNN
F 3 "" H 4600 6850 50  0001 C CNN
	1    4600 6850
	1    0    0    -1  
$EndComp
Wire Wire Line
	4600 6850 4600 6750
Wire Wire Line
	4600 6350 4500 6350
Wire Wire Line
	4600 6350 4600 6450
$Comp
L Device:R R2304
U 1 1 60D4A434
P 4750 4550
F 0 "R2304" V 4830 4550 50  0000 C CNN
F 1 "1k" V 4750 4550 50  0000 C CNN
F 2 "Resistor_SMD:R_0402_1005Metric" V 4680 4550 50  0001 C CNN
F 3 "~" H 4750 4550 50  0001 C CNN
F 4 "3000-0000000156" H 4750 4550 50  0001 C CNN "PartSpecification"
	1    4750 4550
	0    1    1    0   
$EndComp
Wire Wire Line
	4600 4550 4500 4550
$Comp
L power:GND #PWR?
U 1 1 60D61971
P 4900 4800
F 0 "#PWR?" H 4900 4550 50  0001 C CNN
F 1 "GND" H 4900 4650 50  0000 C CNN
F 2 "" H 4900 4800 50  0001 C CNN
F 3 "" H 4900 4800 50  0001 C CNN
	1    4900 4800
	1    0    0    -1  
$EndComp
Wire Wire Line
	4900 4800 4900 4550
Wire Wire Line
	4800 4450 4500 4450
Wire Wire Line
	4800 6250 4500 6250
Text Label 4600 4450 0    50   ~ 0
SEL1
Text Label 4600 6250 0    50   ~ 0
SEL2
Text Label 9550 4550 0    50   ~ 0
SEL1
Text Label 9550 4650 0    50   ~ 0
SEL2
$Comp
L Device:R R2306
U 1 1 60E1A47D
P 2800 5950
F 0 "R2306" V 2593 5950 50  0000 C CNN
F 1 "1k" V 2684 5950 50  0000 C CNN
F 2 "Resistor_SMD:R_0402_1005Metric" V 2730 5950 50  0001 C CNN
F 3 "~" H 2800 5950 50  0001 C CNN
F 4 "3000-0000000156" H 2800 5950 50  0001 C CNN "PartSpecification"
	1    2800 5950
	0    1    1    0   
$EndComp
$Comp
L Device:R R2307
U 1 1 60E1ACB0
P 2250 6150
F 0 "R2307" V 2457 6150 50  0000 C CNN
F 1 "1k" V 2366 6150 50  0000 C CNN
F 2 "Resistor_SMD:R_0402_1005Metric" V 2180 6150 50  0001 C CNN
F 3 "~" H 2250 6150 50  0001 C CNN
F 4 "3000-0000000156" H 2250 6150 50  0001 C CNN "PartSpecification"
	1    2250 6150
	0    -1   -1   0   
$EndComp
$Comp
L 000_PreferredParts:C_1uF C2309
U 1 1 60E2F659
P 2550 6400
F 0 "C2309" H 2665 6446 50  0000 L CNN
F 1 "C_1uF" H 2665 6355 50  0000 L CNN
F 2 "Capacitor_SMD:C_0603_1608Metric" H 2588 6250 50  0001 C CNN
F 3 "~" H 2550 6400 50  0001 C CNN
F 4 "3000-0000000136" H 2550 6400 50  0001 C CNN "PartSpecification"
	1    2550 6400
	1    0    0    -1  
$EndComp
$Comp
L 000_PreferredParts:C_1uF C2310
U 1 1 60E437BC
P 3000 6400
F 0 "C2310" H 3115 6446 50  0000 L CNN
F 1 "C_1uF" H 3115 6355 50  0000 L CNN
F 2 "Capacitor_SMD:C_0603_1608Metric" H 3038 6250 50  0001 C CNN
F 3 "~" H 3000 6400 50  0001 C CNN
F 4 "3000-0000000136" H 3000 6400 50  0001 C CNN "PartSpecification"
	1    3000 6400
	1    0    0    -1  
$EndComp
Wire Wire Line
	3700 5950 3000 5950
Wire Wire Line
	2650 5950 1500 5950
Wire Wire Line
	1500 6150 2100 6150
Wire Wire Line
	2400 6150 2550 6150
Wire Wire Line
	3000 6250 3000 5950
Connection ~ 3000 5950
Wire Wire Line
	3000 5950 2950 5950
Wire Wire Line
	2550 6150 2550 6250
Connection ~ 2550 6150
Wire Wire Line
	2550 6150 3700 6150
$Comp
L power:GND #PWR?
U 1 1 60F13499
P 3000 6650
F 0 "#PWR?" H 3000 6400 50  0001 C CNN
F 1 "GND" H 3000 6500 50  0000 C CNN
F 2 "" H 3000 6650 50  0001 C CNN
F 3 "" H 3000 6650 50  0001 C CNN
	1    3000 6650
	1    0    0    -1  
$EndComp
$Comp
L power:GND #PWR?
U 1 1 60F1387A
P 2550 6650
F 0 "#PWR?" H 2550 6400 50  0001 C CNN
F 1 "GND" H 2550 6500 50  0000 C CNN
F 2 "" H 2550 6650 50  0001 C CNN
F 3 "" H 2550 6650 50  0001 C CNN
	1    2550 6650
	1    0    0    -1  
$EndComp
Wire Wire Line
	2550 6650 2550 6550
Wire Wire Line
	3000 6550 3000 6650
$Sheet
S 1550 2850 1950 3000
U 611AB01D
F0 "ADC_filter" 50
F1 "ADC_filter.sch" 50
F2 "VSENSE_PA_IN" I L 1550 2950 50 
F3 "VSENSE_PA_OUT" O R 3500 2950 50 
F4 "VSENSE_4_8_IN" I L 1550 3050 50 
F5 "VSENSE_4_8_OUT" O R 3500 3050 50 
F6 "VSENSE_3_3VFR_IN" I L 1550 3150 50 
F7 "VSENSE_3_3VRF_OUT" O R 3500 3150 50 
F8 "VSENSE_LNA_IN" I L 1550 3250 50 
F9 "VSENSE_LNA_OUT" O R 3500 3250 50 
F10 "VSENSE_LNA_BIAS_IN" I L 1550 3350 50 
F11 "VSENSE_LNA_BIAS_OUT" O R 3500 3350 50 
F12 "VSENSE_12_IN" I L 1550 3450 50 
F13 "VSENSE_12_OUT" O R 3500 3450 50 
F14 "VSENSE_MAX10_6_IN" I L 1550 3550 50 
F15 "VSENSE_MAX10_6_OUT" O R 3500 3550 50 
F16 "VSENSE_1_2_IN" I L 1550 3650 50 
F17 "VSENSE_1_2_OUT" O R 3500 3650 50 
F18 "VSENSE_2_5_IN" I L 1550 3750 50 
F19 "VSENSE_2_5_OUT" O R 3500 3750 50 
F20 "VSENSE_2_5A_IN" I L 1550 3850 50 
F21 "VSENSE_2_5A_OUT" O R 3500 3850 50 
F22 "ISENSE_VCC1_IN" I L 1550 3950 50 
F23 "ISENSE_VCC1_OUT" O R 3500 3950 50 
F24 "ISENSE_VCC2_IN" I L 1550 4050 50 
F25 "ISENSE_VCC2_OUT" O R 3500 4050 50 
F26 "ISENSE_VCC3_IN" I L 1550 4150 50 
F27 "ISENSE_VCC3_OUT" O R 3500 4150 50 
F28 "ISENSE_VBIAS_IN" I L 1550 4250 50 
F29 "ISENSE_VBIAS_OUT" O R 3500 4250 50 
F30 "ISENSE_LNA_IN" I L 1550 4350 50 
F31 "ISENSE_LNA_OUT" O R 3500 4350 50 
F32 "ISENSE_MAX10_6_IN" I L 1550 4450 50 
F33 "ISENSE_MAX10_6_OUT" O R 3500 4450 50 
F34 "ISENSE_1_2_IN" I L 1550 4750 50 
F35 "ISENSE_1_2_OUT" O R 3500 4750 50 
F36 "ISENSE_2_5_IN" I L 1550 4850 50 
F37 "ISENSE_2_5_OUT" O R 3500 4850 50 
F38 "ISENSE_2_5A_IN" I L 1550 4950 50 
F39 "ISENSE_2_5A_OUT" O R 3500 4950 50 
F40 "GPAI_F0" O R 3500 5050 50 
F41 "GPAI_F1" O R 3500 5150 50 
F42 "GPAI_F2" O R 3500 5250 50 
F43 "GPAI_F3" O R 3500 5350 50 
F44 "GPAI_F4" O R 3500 5450 50 
F45 "GPAI_F5" O R 3500 5650 50 
F46 "GPAI_F6" O R 3500 5550 50 
F47 "GPAI_F7" O R 3500 5750 50 
F48 "GPAI[0..7]" I L 1550 5150 50 
F49 "VSENSE_5VA" I L 1550 4550 50 
F50 "VSENSE_5VA_OUT" O R 3500 4550 50 
$EndSheet
Wire Wire Line
	3500 2950 3700 2950
Wire Wire Line
	3700 3050 3500 3050
Wire Wire Line
	3500 3150 3700 3150
Wire Wire Line
	3700 3250 3500 3250
Wire Wire Line
	3500 3350 3700 3350
Wire Wire Line
	3700 3450 3500 3450
Wire Wire Line
	3500 3550 3700 3550
Wire Wire Line
	3700 3650 3500 3650
Wire Wire Line
	3500 3750 3700 3750
Wire Wire Line
	3700 3850 3500 3850
Wire Wire Line
	3500 3950 3700 3950
Wire Wire Line
	3700 4050 3500 4050
Wire Wire Line
	3500 4150 3700 4150
Wire Wire Line
	3700 4250 3500 4250
Wire Wire Line
	3500 4350 3700 4350
Wire Wire Line
	3700 4450 3500 4450
Wire Wire Line
	3700 5850 3600 5850
Wire Wire Line
	3700 5750 3500 5750
Wire Wire Line
	3500 5650 3700 5650
Wire Wire Line
	3700 5550 3500 5550
Wire Wire Line
	3500 5450 3700 5450
Wire Wire Line
	3700 5350 3500 5350
Wire Wire Line
	3500 5250 3700 5250
Wire Wire Line
	3700 5150 3500 5150
Wire Wire Line
	3500 5050 3700 5050
Wire Wire Line
	3700 4950 3500 4950
Wire Wire Line
	3500 4850 3700 4850
Wire Wire Line
	3700 4750 3500 4750
Text HLabel 1450 2950 0    50   Input ~ 0
VSENSE_PA
Text HLabel 1450 3050 0    50   Input ~ 0
VSENSE_4_8
Text HLabel 1450 3150 0    50   Input ~ 0
VSENSE_3_3VFR
Text HLabel 1450 3250 0    50   Input ~ 0
VSENSE_LNA
Text HLabel 1450 3350 0    50   Input ~ 0
VSENSE_LNA_BIAS
Text HLabel 1450 3450 0    50   Input ~ 0
VSENSE_12
Text HLabel 1450 3550 0    50   Input ~ 0
VSENSE_MAX10_6
Text HLabel 1450 3650 0    50   Input ~ 0
VSENSE_1_2
Text HLabel 1450 3750 0    50   Input ~ 0
VSENSE_2_5
Text HLabel 1450 3850 0    50   Input ~ 0
VSENSE_2_5A
Text HLabel 1450 3950 0    50   Input ~ 0
ISENSE_VCC1
Text HLabel 1450 4050 0    50   Input ~ 0
ISENSE_VCC2
Text HLabel 1450 4150 0    50   Input ~ 0
ISENSE_VCC3
Text HLabel 1450 4250 0    50   Input ~ 0
ISENSE_VBIAS
Text HLabel 1450 4350 0    50   Input ~ 0
ISENSE_LNA
Text HLabel 1450 4450 0    50   Input ~ 0
ISENSE_MAX10_6
Text HLabel 1450 4750 0    50   Input ~ 0
ISENSE_1_2
Text HLabel 1450 4850 0    50   Input ~ 0
ISENSE_2_5
Text HLabel 1450 4950 0    50   Input ~ 0
ISENSE_2_5A
Wire Wire Line
	1450 2950 1550 2950
Wire Wire Line
	1550 3050 1450 3050
Wire Wire Line
	1450 3150 1550 3150
Wire Wire Line
	1550 3250 1450 3250
Wire Wire Line
	1450 3350 1550 3350
Wire Wire Line
	1450 3450 1550 3450
Wire Wire Line
	1550 3550 1450 3550
Wire Wire Line
	1450 3650 1550 3650
Wire Wire Line
	1550 3750 1450 3750
Wire Wire Line
	1450 3850 1550 3850
Wire Wire Line
	1550 3950 1450 3950
Wire Wire Line
	1450 4050 1550 4050
Wire Wire Line
	1550 4150 1450 4150
Wire Wire Line
	1450 4250 1550 4250
Wire Wire Line
	1550 4350 1450 4350
Wire Wire Line
	1450 4450 1550 4450
Wire Wire Line
	1550 4750 1450 4750
Wire Wire Line
	1450 4850 1550 4850
Wire Wire Line
	1550 4950 1450 4950
Text HLabel 1450 5150 0    50   Input ~ 0
GPAI[0..7]
Text HLabel 10250 4750 2    50   Output ~ 0
REF_EN
NoConn ~ 11000 1400
NoConn ~ 11000 1500
NoConn ~ 9900 1500
$Comp
L power:PWR_FLAG #FLG?
U 1 1 611C486D
P 3850 1900
F 0 "#FLG?" H 3850 1975 50  0001 C CNN
F 1 "PWR_FLAG" H 3850 2073 50  0000 C CNN
F 2 "" H 3850 1900 50  0001 C CNN
F 3 "~" H 3850 1900 50  0001 C CNN
	1    3850 1900
	1    0    0    -1  
$EndComp
Wire Wire Line
	3850 1900 3850 2000
Connection ~ 3850 2000
Wire Wire Line
	3850 2000 4150 2000
NoConn ~ 9350 4150
NoConn ~ 9350 4850
$Comp
L power:PWR_FLAG #FLG?
U 1 1 612D55D0
P 7400 2750
F 0 "#FLG?" H 7400 2825 50  0001 C CNN
F 1 "PWR_FLAG" H 7400 2923 50  0000 C CNN
F 2 "" H 7400 2750 50  0001 C CNN
F 3 "~" H 7400 2750 50  0001 C CNN
	1    7400 2750
	1    0    0    -1  
$EndComp
Wire Wire Line
	7400 2750 7400 2850
Connection ~ 7400 2850
Wire Wire Line
	7400 2850 7550 2850
Wire Bus Line
	1550 5150 1450 5150
Text HLabel 1450 4550 0    50   Input ~ 0
A_5VA_VSENSE
Wire Wire Line
	3450 6050 3700 6050
Wire Wire Line
	1550 4550 1450 4550
Wire Wire Line
	3500 4550 3600 4550
Wire Wire Line
	3600 4550 3600 5850
Text Label 4150 2150 0    50   ~ 0
VCC_MUX_F
Text Label 2700 6150 0    50   ~ 0
TEMP_SENSE_PA_F
Text Label 3000 5950 0    50   ~ 0
TEMP_SENSE_LNA_F
Text Label 4600 6350 0    50   ~ 0
TEST2
Text Label 4600 4550 1    50   ~ 0
TEST1
Text Label 4550 4350 0    50   ~ 0
A1_8
Text Label 4550 2950 0    50   ~ 0
A2_6
Text Label 4550 3150 0    50   ~ 0
A2_7
Text Label 4550 3550 0    50   ~ 0
A2_2
Text Label 4550 3350 0    50   ~ 0
A2_8
Text Label 4550 3750 0    50   ~ 0
A2_3
Text Label 4550 3950 0    50   ~ 0
A2_1
Text Label 4550 4150 0    50   ~ 0
A2_5
Text Label 6100 5050 0    50   ~ 0
A1_8
Text Label 4550 4750 0    50   ~ 0
A1_7
Text Label 4550 4950 0    50   ~ 0
A1_2
Text Label 4550 5150 0    50   ~ 0
A2_4
Text Label 4550 5350 0    50   ~ 0
A1_4
Text Label 4550 5550 0    50   ~ 0
A1_6
Text Label 4550 5950 0    50   ~ 0
A1_5
Text Label 4550 5750 0    50   ~ 0
A1_3
Text Label 4550 6150 0    50   ~ 0
A1_1
Text Label 6100 4750 0    50   ~ 0
A2_6
Text Label 6100 4950 0    50   ~ 0
A2_7
Text Label 6100 5150 0    50   ~ 0
A2_2
Text Label 6100 3950 0    50   ~ 0
A2_8
Text Label 6100 4150 0    50   ~ 0
A2_3
Text Label 6100 3750 0    50   ~ 0
A2_1
Text Label 6100 4550 0    50   ~ 0
A2_5
Text Label 6100 4850 0    50   ~ 0
A1_7
Text Label 6100 3850 0    50   ~ 0
A1_2
Text Label 6100 4350 0    50   ~ 0
A2_4
Text Label 6100 4250 0    50   ~ 0
A1_4
Text Label 6100 4650 0    50   ~ 0
A1_6
Text Label 6100 4050 0    50   ~ 0
A1_3
Text Label 6100 4450 0    50   ~ 0
A1_5
Text Label 6100 3650 0    50   ~ 0
A1_1
$EndSCHEMATC
