EESchema Schematic File Version 4
EELAYER 26 0
EELAYER END
$Descr A4 11693 8268
encoding utf-8
Sheet 1 1
Title ""
Date ""
Rev ""
Comp ""
Comment1 ""
Comment2 ""
Comment3 ""
Comment4 ""
$EndDescr
$Comp
L Connector:Conn_Coaxial J3
U 1 1 5B5506B2
P 2350 3800
F 0 "J3" H 2360 3920 50  0000 C CNN
F 1 "Conn_Coaxial" V 2465 3800 50  0000 C CNN
F 2 "rf:SMA_endlaunch_SD-73251-115" H 2350 3800 50  0001 C CNN
F 3 "" H 2350 3800 50  0001 C CNN
	1    2350 3800
	-1   0    0    -1  
$EndComp
$Comp
L Connector:Conn_Coaxial J4
U 1 1 5B550819
P 4300 3800
F 0 "J4" H 4310 3920 50  0000 C CNN
F 1 "Conn_Coaxial" V 4415 3800 50  0000 C CNN
F 2 "rf:SMA_endlaunch_SD-73251-115" H 4300 3800 50  0001 C CNN
F 3 "" H 4300 3800 50  0001 C CNN
	1    4300 3800
	1    0    0    -1  
$EndComp
$Comp
L power:GND #PWR?
U 1 1 5B550890
P 2350 4150
F 0 "#PWR?" H 2350 3900 50  0001 C CNN
F 1 "GND" H 2350 4000 50  0000 C CNN
F 2 "" H 2350 4150 50  0001 C CNN
F 3 "" H 2350 4150 50  0001 C CNN
	1    2350 4150
	1    0    0    -1  
$EndComp
$Comp
L power:GND #PWR?
U 1 1 5B5508AC
P 4300 4150
F 0 "#PWR?" H 4300 3900 50  0001 C CNN
F 1 "GND" H 4300 4000 50  0000 C CNN
F 2 "" H 4300 4150 50  0001 C CNN
F 3 "" H 4300 4150 50  0001 C CNN
	1    4300 4150
	1    0    0    -1  
$EndComp
Wire Wire Line
	4300 4150 4300 4000
Wire Wire Line
	2350 4000 2350 4150
Text Label 2650 3800 0    60   ~ 0
rf_line_2
Wire Wire Line
	3150 3800 2550 3800
Wire Wire Line
	4100 3800 3500 3800
Text Label 3550 3800 0    60   ~ 0
rf_line_3
$Comp
L Device:R R1
U 1 1 5B5534EC
P 3150 4050
F 0 "R1" V 3230 4050 50  0000 C CNN
F 1 "50" V 3150 4050 50  0000 C CNN
F 2 "Resistors_SMD:R_0201" V 3080 4050 50  0000 C CNN
F 3 "" H 3150 4050 50  0000 C CNN
	1    3150 4050
	1    0    0    -1  
$EndComp
$Comp
L Device:R R2
U 1 1 5B553528
P 3500 4050
F 0 "R2" V 3580 4050 50  0000 C CNN
F 1 "50" V 3500 4050 50  0000 C CNN
F 2 "Resistors_SMD:R_0201" V 3430 4050 50  0000 C CNN
F 3 "" H 3500 4050 50  0000 C CNN
	1    3500 4050
	1    0    0    -1  
$EndComp
$Comp
L power:GND #PWR?
U 1 1 5B55356A
P 3150 4300
F 0 "#PWR?" H 3150 4050 50  0001 C CNN
F 1 "GND" H 3150 4150 50  0000 C CNN
F 2 "" H 3150 4300 50  0001 C CNN
F 3 "" H 3150 4300 50  0001 C CNN
	1    3150 4300
	1    0    0    -1  
$EndComp
$Comp
L power:GND #PWR?
U 1 1 5B553581
P 3500 4300
F 0 "#PWR?" H 3500 4050 50  0001 C CNN
F 1 "GND" H 3500 4150 50  0000 C CNN
F 2 "" H 3500 4300 50  0001 C CNN
F 3 "" H 3500 4300 50  0001 C CNN
	1    3500 4300
	1    0    0    -1  
$EndComp
Wire Wire Line
	3500 4300 3500 4200
Wire Wire Line
	3500 3800 3500 3900
Wire Wire Line
	3150 3900 3150 3800
Wire Wire Line
	3150 4300 3150 4200
$Comp
L Connector:Conn_Coaxial J1
U 1 1 5B555CAB
P 2350 2350
F 0 "J1" H 2360 2470 50  0000 C CNN
F 1 "Conn_Coaxial" V 2465 2350 50  0000 C CNN
F 2 "rf:SMA_endlaunch_SD-73251-115" H 2350 2350 50  0001 C CNN
F 3 "" H 2350 2350 50  0001 C CNN
	1    2350 2350
	-1   0    0    -1  
$EndComp
$Comp
L Connector:Conn_Coaxial J2
U 1 1 5B555CB1
P 4300 2350
F 0 "J2" H 4310 2470 50  0000 C CNN
F 1 "Conn_Coaxial" V 4415 2350 50  0000 C CNN
F 2 "rf:SMA_endlaunch_SD-73251-115" H 4300 2350 50  0001 C CNN
F 3 "" H 4300 2350 50  0001 C CNN
	1    4300 2350
	1    0    0    -1  
$EndComp
$Comp
L power:GND #PWR?
U 1 1 5B555CB7
P 2350 2700
F 0 "#PWR?" H 2350 2450 50  0001 C CNN
F 1 "GND" H 2350 2550 50  0000 C CNN
F 2 "" H 2350 2700 50  0001 C CNN
F 3 "" H 2350 2700 50  0001 C CNN
	1    2350 2700
	1    0    0    -1  
$EndComp
$Comp
L power:GND #PWR?
U 1 1 5B555CBD
P 4300 2700
F 0 "#PWR?" H 4300 2450 50  0001 C CNN
F 1 "GND" H 4300 2550 50  0000 C CNN
F 2 "" H 4300 2700 50  0001 C CNN
F 3 "" H 4300 2700 50  0001 C CNN
	1    4300 2700
	1    0    0    -1  
$EndComp
Wire Wire Line
	4300 2700 4300 2550
Wire Wire Line
	2350 2550 2350 2700
Text Label 2650 2350 0    60   ~ 0
rf_line
Wire Wire Line
	2550 2350 4100 2350
$EndSCHEMATC
