(kicad_sch (version 20211123) (generator eeschema)

  (uuid 696874af-fc41-4a9f-9052-21d5a70e88b3)

  (paper "A4")

  (lib_symbols
    (symbol "000_PreferredParts:C_0_1uF" (pin_numbers hide) (pin_names (offset 0.254)) (in_bom yes) (on_board yes)
      (property "Reference" "C" (id 0) (at 0.635 2.54 0)
        (effects (font (size 1.27 1.27)) (justify left))
      )
      (property "Value" "C_0_1uF" (id 1) (at 0.635 -2.54 0)
        (effects (font (size 1.27 1.27)) (justify left) hide)
      )
      (property "Footprint" "Capacitor_SMD:C_0402_1005Metric" (id 2) (at 0.9652 -3.81 0)
        (effects (font (size 1.27 1.27)) hide)
      )
      (property "Datasheet" "~" (id 3) (at 0 0 0)
        (effects (font (size 1.27 1.27)) hide)
      )
      (property "DisplayValue" "0.1uF" (id 4) (at 3.81 -2.54 0)
        (effects (font (size 1.27 1.27)))
      )
      (property "PartSpecification" "3000-0000000125" (id 5) (at 0 0 0)
        (effects (font (size 1.27 1.27)) hide)
      )
      (property "Voltage" "100V" (id 6) (at 0 0 0)
        (effects (font (size 1.27 1.27)) hide)
      )
      (property "ki_keywords" "cap capacitor" (id 7) (at 0 0 0)
        (effects (font (size 1.27 1.27)) hide)
      )
      (property "ki_description" "Unpolarized capacitor" (id 8) (at 0 0 0)
        (effects (font (size 1.27 1.27)) hide)
      )
      (property "ki_fp_filters" "C_*" (id 9) (at 0 0 0)
        (effects (font (size 1.27 1.27)) hide)
      )
      (symbol "C_0_1uF_0_1"
        (polyline
          (pts
            (xy -2.032 -0.762)
            (xy 2.032 -0.762)
          )
          (stroke (width 0.508) (type default) (color 0 0 0 0))
          (fill (type none))
        )
        (polyline
          (pts
            (xy -2.032 0.762)
            (xy 2.032 0.762)
          )
          (stroke (width 0.508) (type default) (color 0 0 0 0))
          (fill (type none))
        )
      )
      (symbol "C_0_1uF_1_1"
        (pin passive line (at 0 3.81 270) (length 2.794)
          (name "~" (effects (font (size 1.27 1.27))))
          (number "1" (effects (font (size 1.27 1.27))))
        )
        (pin passive line (at 0 -3.81 90) (length 2.794)
          (name "~" (effects (font (size 1.27 1.27))))
          (number "2" (effects (font (size 1.27 1.27))))
        )
      )
    )
    (symbol "000_PreferredParts:C_1nF" (pin_numbers hide) (pin_names (offset 0.254)) (in_bom yes) (on_board yes)
      (property "Reference" "C" (id 0) (at 0.635 2.54 0)
        (effects (font (size 1.27 1.27)) (justify left))
      )
      (property "Value" "C_1nF" (id 1) (at 0.635 -2.54 0)
        (effects (font (size 1.27 1.27)) (justify left))
      )
      (property "Footprint" "Capacitor_SMD:C_0402_1005Metric" (id 2) (at 0.9652 -3.81 0)
        (effects (font (size 1.27 1.27)) hide)
      )
      (property "Datasheet" "~" (id 3) (at 0 0 0)
        (effects (font (size 1.27 1.27)) hide)
      )
      (property "PartSpecification" "3000-0000000128" (id 4) (at 0 0 0)
        (effects (font (size 1.27 1.27)) hide)
      )
      (property "ki_keywords" "cap capacitor" (id 5) (at 0 0 0)
        (effects (font (size 1.27 1.27)) hide)
      )
      (property "ki_description" "Unpolarized capacitor" (id 6) (at 0 0 0)
        (effects (font (size 1.27 1.27)) hide)
      )
      (property "ki_fp_filters" "C_*" (id 7) (at 0 0 0)
        (effects (font (size 1.27 1.27)) hide)
      )
      (symbol "C_1nF_0_1"
        (polyline
          (pts
            (xy -2.032 -0.762)
            (xy 2.032 -0.762)
          )
          (stroke (width 0.508) (type default) (color 0 0 0 0))
          (fill (type none))
        )
        (polyline
          (pts
            (xy -2.032 0.762)
            (xy 2.032 0.762)
          )
          (stroke (width 0.508) (type default) (color 0 0 0 0))
          (fill (type none))
        )
      )
      (symbol "C_1nF_1_1"
        (pin passive line (at 0 3.81 270) (length 2.794)
          (name "~" (effects (font (size 1.27 1.27))))
          (number "1" (effects (font (size 1.27 1.27))))
        )
        (pin passive line (at 0 -3.81 90) (length 2.794)
          (name "~" (effects (font (size 1.27 1.27))))
          (number "2" (effects (font (size 1.27 1.27))))
        )
      )
    )
    (symbol "POWDER_Digital:10M50DAF256" (pin_names (offset 1.016)) (in_bom yes) (on_board yes)
      (property "Reference" "U" (id 0) (at 0 3.81 0)
        (effects (font (size 1.27 1.27)))
      )
      (property "Value" "10M50DAF256" (id 1) (at 0 0 0)
        (effects (font (size 1.27 1.27)))
      )
      (property "Footprint" "" (id 2) (at 0 0 0)
        (effects (font (size 1.27 1.27)) hide)
      )
      (property "Datasheet" "" (id 3) (at 0 0 0)
        (effects (font (size 1.27 1.27)) hide)
      )
      (property "ki_description" "Max10 CPLD" (id 4) (at 0 0 0)
        (effects (font (size 1.27 1.27)) hide)
      )
      (symbol "10M50DAF256_1_0"
        (text "Bank 1A" (at -30.48 24.13 0)
          (effects (font (size 1.27 1.27)))
        )
        (text "Bank 1B" (at 29.21 24.13 0)
          (effects (font (size 1.27 1.27)))
        )
      )
      (symbol "10M50DAF256_1_1"
        (rectangle (start -34.29 22.86) (end 34.29 -22.86)
          (stroke (width 0) (type default) (color 0 0 0 0))
          (fill (type background))
        )
        (rectangle (start -1.27 22.86) (end 1.27 -22.86)
          (stroke (width 0) (type default) (color 0 0 0 0))
          (fill (type none))
        )
        (pin bidirectional line (at -38.1 -13.97 0) (length 3.81)
          (name "ADC2IN7_DIFFIO_RX_L8n" (effects (font (size 1.27 1.27))))
          (number "B1" (effects (font (size 1.27 1.27))))
        )
        (pin bidirectional line (at -38.1 -8.89 0) (length 3.81)
          (name "ADC2IN6_DIFFIO_RX_L6p" (effects (font (size 1.27 1.27))))
          (number "B2" (effects (font (size 1.27 1.27))))
        )
        (pin bidirectional line (at -38.1 -19.05 0) (length 3.81)
          (name "ADC2IN2_DIFFIO_RX_L8p" (effects (font (size 1.27 1.27))))
          (number "C1" (effects (font (size 1.27 1.27))))
        )
        (pin bidirectional line (at -38.1 -3.81 0) (length 3.81)
          (name "ADC2IN5_DIFFIO_RX_L6n" (effects (font (size 1.27 1.27))))
          (number "C2" (effects (font (size 1.27 1.27))))
        )
        (pin bidirectional line (at -38.1 11.43 0) (length 3.81)
          (name "ADC2IN8_DIFFIO_RX_L2p" (effects (font (size 1.27 1.27))))
          (number "C3" (effects (font (size 1.27 1.27))))
        )
        (pin bidirectional line (at -38.1 16.51 0) (length 3.81)
          (name "ADC2IN1_DIFFIO_RX_L2n" (effects (font (size 1.27 1.27))))
          (number "C4" (effects (font (size 1.27 1.27))))
        )
        (pin bidirectional line (at -38.1 -16.51 0) (length 3.81)
          (name "ADC1IN8_DIFFIO_RX_L7p" (effects (font (size 1.27 1.27))))
          (number "D1" (effects (font (size 1.27 1.27))))
        )
        (pin bidirectional line (at -38.1 -11.43 0) (length 3.81)
          (name "ADC1IN7_DIFFIO_RX_L7n" (effects (font (size 1.27 1.27))))
          (number "E1" (effects (font (size 1.27 1.27))))
        )
        (pin bidirectional line (at -38.1 6.35 0) (length 3.81)
          (name "ADC2IN3_DIFFIO_RX_L4n" (effects (font (size 1.27 1.27))))
          (number "E3" (effects (font (size 1.27 1.27))))
        )
        (pin bidirectional line (at -38.1 -6.35 0) (length 3.81)
          (name "ADC1IN6_DIFFIO_RX_L5p" (effects (font (size 1.27 1.27))))
          (number "F1" (effects (font (size 1.27 1.27))))
        )
        (pin bidirectional line (at -38.1 1.27 0) (length 3.81)
          (name "ADC2IN4_DIFFIO_RX_L4p" (effects (font (size 1.27 1.27))))
          (number "F2" (effects (font (size 1.27 1.27))))
        )
        (pin bidirectional line (at -38.1 13.97 0) (length 3.81)
          (name "ADC1IN2_DIFFIO_RX_L1p" (effects (font (size 1.27 1.27))))
          (number "F4" (effects (font (size 1.27 1.27))))
        )
        (pin bidirectional line (at -38.1 19.05 0) (length 3.81)
          (name "ADC1IN1_DIFFIO_RX_L1n" (effects (font (size 1.27 1.27))))
          (number "F5" (effects (font (size 1.27 1.27))))
        )
        (pin bidirectional line (at 38.1 1.27 180) (length 3.81)
          (name "TDI" (effects (font (size 1.27 1.27))))
          (number "G1" (effects (font (size 1.27 1.27))))
        )
        (pin bidirectional line (at -38.1 -1.27 0) (length 3.81)
          (name "ADC1IN5_DIFFIO_RX_L5n" (effects (font (size 1.27 1.27))))
          (number "G2" (effects (font (size 1.27 1.27))))
        )
        (pin power_in line (at -7.62 26.67 270) (length 3.81)
          (name "VCCIO1A" (effects (font (size 1.27 1.27))))
          (number "G4" (effects (font (size 1.27 1.27))))
        )
        (pin bidirectional line (at -38.1 3.81 0) (length 3.81)
          (name "ADC1IN4_DIFFIO_RX_L3p" (effects (font (size 1.27 1.27))))
          (number "G5" (effects (font (size 1.27 1.27))))
        )
        (pin bidirectional line (at 38.1 11.43 180) (length 3.81)
          (name "JTAGEN" (effects (font (size 1.27 1.27))))
          (number "G6" (effects (font (size 1.27 1.27))))
        )
        (pin bidirectional line (at 38.1 -1.27 180) (length 3.81)
          (name "TDO" (effects (font (size 1.27 1.27))))
          (number "H1" (effects (font (size 1.27 1.27))))
        )
        (pin bidirectional line (at 38.1 8.89 180) (length 3.81)
          (name "TMS" (effects (font (size 1.27 1.27))))
          (number "H2" (effects (font (size 1.27 1.27))))
        )
        (pin bidirectional line (at 38.1 3.81 180) (length 3.81)
          (name "TCK" (effects (font (size 1.27 1.27))))
          (number "H3" (effects (font (size 1.27 1.27))))
        )
        (pin power_in line (at -5.08 26.67 270) (length 3.81)
          (name "VCCIO1A" (effects (font (size 1.27 1.27))))
          (number "H4" (effects (font (size 1.27 1.27))))
        )
        (pin bidirectional line (at -38.1 8.89 0) (length 3.81)
          (name "ADC1IN3_DIFFIO_RX_L3n" (effects (font (size 1.27 1.27))))
          (number "H5" (effects (font (size 1.27 1.27))))
        )
        (pin bidirectional line (at 38.1 -6.35 180) (length 3.81)
          (name "DIFFIO_RX_L20p" (effects (font (size 1.27 1.27))))
          (number "H6" (effects (font (size 1.27 1.27))))
        )
        (pin bidirectional line (at 38.1 6.35 180) (length 3.81)
          (name "VREFB1N0" (effects (font (size 1.27 1.27))))
          (number "J1" (effects (font (size 1.27 1.27))))
        )
        (pin bidirectional line (at 38.1 -11.43 180) (length 3.81)
          (name "DIFFIO_RX_L22p" (effects (font (size 1.27 1.27))))
          (number "J2" (effects (font (size 1.27 1.27))))
        )
        (pin bidirectional line (at 38.1 -8.89 180) (length 3.81)
          (name "DIFFIO_RX_L22n" (effects (font (size 1.27 1.27))))
          (number "J3" (effects (font (size 1.27 1.27))))
        )
        (pin power_in line (at 5.08 26.67 270) (length 3.81)
          (name "VCCIO1B" (effects (font (size 1.27 1.27))))
          (number "J4" (effects (font (size 1.27 1.27))))
        )
        (pin bidirectional line (at 38.1 -3.81 180) (length 3.81)
          (name "DIFFIO_RX_L20n" (effects (font (size 1.27 1.27))))
          (number "J5" (effects (font (size 1.27 1.27))))
        )
      )
      (symbol "10M50DAF256_2_0"
        (rectangle (start -31.75 16.51) (end 31.75 -11.43)
          (stroke (width 0) (type default) (color 0 0 0 0))
          (fill (type background))
        )
        (text "Bank 2" (at -26.67 17.78 0)
          (effects (font (size 1.27 1.27)))
        )
      )
      (symbol "10M50DAF256_2_1"
        (pin bidirectional line (at -35.56 -1.27 0) (length 3.81)
          (name "CLK1n_DIFFIO_RX_L36n" (effects (font (size 1.27 1.27))))
          (number "J6" (effects (font (size 1.27 1.27))))
        )
        (pin bidirectional line (at -35.56 1.27 0) (length 3.81)
          (name "DIFFIO_RX_L29p" (effects (font (size 1.27 1.27))))
          (number "K2" (effects (font (size 1.27 1.27))))
        )
        (pin power_in line (at -1.27 20.32 270) (length 3.81)
          (name "VCCIO2" (effects (font (size 1.27 1.27))))
          (number "K4" (effects (font (size 1.27 1.27))))
        )
        (pin bidirectional line (at 35.56 -1.27 180) (length 3.81)
          (name "DIFFIO_RX_L41n" (effects (font (size 1.27 1.27))))
          (number "K5" (effects (font (size 1.27 1.27))))
        )
        (pin bidirectional line (at -35.56 -6.35 0) (length 3.81)
          (name "CLK1p_DIFFIO_RX_L36p" (effects (font (size 1.27 1.27))))
          (number "K6" (effects (font (size 1.27 1.27))))
        )
        (pin bidirectional line (at -35.56 6.35 0) (length 3.81)
          (name "DIFFIO_RX_L29n" (effects (font (size 1.27 1.27))))
          (number "L1" (effects (font (size 1.27 1.27))))
        )
        (pin bidirectional line (at -35.56 -8.89 0) (length 3.81)
          (name "DIFFIO_RX_L37p" (effects (font (size 1.27 1.27))))
          (number "L2" (effects (font (size 1.27 1.27))))
        )
        (pin bidirectional line (at -35.56 3.81 0) (length 3.81)
          (name "CLK0p_DIFFIO_RX_L28p" (effects (font (size 1.27 1.27))))
          (number "L3" (effects (font (size 1.27 1.27))))
        )
        (pin power_in line (at 1.27 20.32 270) (length 3.81)
          (name "VCCIO2" (effects (font (size 1.27 1.27))))
          (number "L4" (effects (font (size 1.27 1.27))))
        )
        (pin bidirectional line (at 35.56 -3.81 180) (length 3.81)
          (name "DIFFIO_RX_L41p" (effects (font (size 1.27 1.27))))
          (number "L6" (effects (font (size 1.27 1.27))))
        )
        (pin bidirectional line (at 35.56 6.35 180) (length 3.81)
          (name "VREFB2N0" (effects (font (size 1.27 1.27))))
          (number "M1" (effects (font (size 1.27 1.27))))
        )
        (pin bidirectional line (at -35.56 -3.81 0) (length 3.81)
          (name "DIFFIO_RX_L37n" (effects (font (size 1.27 1.27))))
          (number "M2" (effects (font (size 1.27 1.27))))
        )
        (pin bidirectional line (at -35.56 8.89 0) (length 3.81)
          (name "CLK0n_DIFFIO_RX_L28n" (effects (font (size 1.27 1.27))))
          (number "M3" (effects (font (size 1.27 1.27))))
        )
        (pin bidirectional line (at 35.56 1.27 180) (length 3.81)
          (name "IO_N1" (effects (font (size 1.27 1.27))))
          (number "N1" (effects (font (size 1.27 1.27))))
        )
        (pin bidirectional line (at 35.56 8.89 180) (length 3.81)
          (name "DPCLK0_DIFFIO_RX_L38n" (effects (font (size 1.27 1.27))))
          (number "N2" (effects (font (size 1.27 1.27))))
        )
        (pin bidirectional line (at 35.56 -6.35 180) (length 3.81)
          (name "PLL_L_CLKOUTn_DIFFIO_RX_L59n" (effects (font (size 1.27 1.27))))
          (number "N3" (effects (font (size 1.27 1.27))))
        )
        (pin bidirectional line (at 35.56 -8.89 180) (length 3.81)
          (name "PLL_L_CLKOUTp_DIFFIO_RX_L59p" (effects (font (size 1.27 1.27))))
          (number "N4" (effects (font (size 1.27 1.27))))
        )
        (pin bidirectional line (at 35.56 3.81 180) (length 3.81)
          (name "DPCLK1_DIFFIO_RX_L38p" (effects (font (size 1.27 1.27))))
          (number "P1" (effects (font (size 1.27 1.27))))
        )
      )
      (symbol "10M50DAF256_3_0"
        (text "Bank 3" (at -24.13 22.86 0)
          (effects (font (size 1.27 1.27)))
        )
      )
      (symbol "10M50DAF256_3_1"
        (rectangle (start -34.29 21.59) (end 34.29 -21.59)
          (stroke (width 0) (type default) (color 0 0 0 0))
          (fill (type background))
        )
        (pin bidirectional line (at -38.1 3.81 0) (length 3.81)
          (name "DIFFIO_TX_RX_B3p" (effects (font (size 1.27 1.27))))
          (number "L7" (effects (font (size 1.27 1.27))))
        )
        (pin bidirectional line (at 38.1 13.97 180) (length 3.81)
          (name "DIFFIO_TX_RX_B15p" (effects (font (size 1.27 1.27))))
          (number "L8" (effects (font (size 1.27 1.27))))
        )
        (pin bidirectional line (at -38.1 8.89 0) (length 3.81)
          (name "DIFFIO_TX_RX_B3n" (effects (font (size 1.27 1.27))))
          (number "M6" (effects (font (size 1.27 1.27))))
        )
        (pin bidirectional line (at 38.1 19.05 180) (length 3.81)
          (name "DIFFIO_TX_RX_B15n" (effects (font (size 1.27 1.27))))
          (number "M7" (effects (font (size 1.27 1.27))))
        )
        (pin bidirectional line (at 38.1 -11.43 180) (length 3.81)
          (name "*CLK7n_DIFFIO_TX_RX_B20n" (effects (font (size 1.27 1.27))))
          (number "M8" (effects (font (size 1.27 1.27))))
        )
        (pin bidirectional line (at 38.1 -13.97 180) (length 3.81)
          (name "*CLK7p_DIFFIO_TX_RX_B20p" (effects (font (size 1.27 1.27))))
          (number "M9" (effects (font (size 1.27 1.27))))
        )
        (pin bidirectional line (at -38.1 13.97 0) (length 3.81)
          (name "DIFFIO_TX_RX_B1p" (effects (font (size 1.27 1.27))))
          (number "N5" (effects (font (size 1.27 1.27))))
        )
        (pin power_in line (at -2.54 25.4 270) (length 3.81)
          (name "VCCIO3" (effects (font (size 1.27 1.27))))
          (number "N6" (effects (font (size 1.27 1.27))))
        )
        (pin power_in line (at 0 25.4 270) (length 3.81)
          (name "VCCIO3" (effects (font (size 1.27 1.27))))
          (number "N7" (effects (font (size 1.27 1.27))))
        )
        (pin power_in line (at 2.54 25.4 270) (length 3.81)
          (name "VCCIO3" (effects (font (size 1.27 1.27))))
          (number "N8" (effects (font (size 1.27 1.27))))
        )
        (pin bidirectional line (at -38.1 16.51 0) (length 3.81)
          (name "DIFFIO_RX_B2n" (effects (font (size 1.27 1.27))))
          (number "P2" (effects (font (size 1.27 1.27))))
        )
        (pin bidirectional line (at -38.1 19.05 0) (length 3.81)
          (name "DIFFIO_TX_RX_B1n" (effects (font (size 1.27 1.27))))
          (number "P4" (effects (font (size 1.27 1.27))))
        )
        (pin bidirectional line (at -38.1 -6.35 0) (length 3.81)
          (name "DIFFIO_TX_RX_B5p" (effects (font (size 1.27 1.27))))
          (number "P5" (effects (font (size 1.27 1.27))))
        )
        (pin bidirectional line (at 38.1 3.81 180) (length 3.81)
          (name "DIFFIO_TX_RX_B16p" (effects (font (size 1.27 1.27))))
          (number "P6" (effects (font (size 1.27 1.27))))
        )
        (pin bidirectional line (at 38.1 -6.35 180) (length 3.81)
          (name "*CLK6p_DIFFIO_TX_RX_B18p" (effects (font (size 1.27 1.27))))
          (number "P8" (effects (font (size 1.27 1.27))))
        )
        (pin bidirectional line (at 38.1 -1.27 180) (length 3.81)
          (name "*CLK6n_DIFFIO_TX_RX_B18n" (effects (font (size 1.27 1.27))))
          (number "P9" (effects (font (size 1.27 1.27))))
        )
        (pin bidirectional line (at -38.1 11.43 0) (length 3.81)
          (name "DIFFIO_RX_B2p" (effects (font (size 1.27 1.27))))
          (number "R1" (effects (font (size 1.27 1.27))))
        )
        (pin bidirectional line (at 38.1 -19.05 180) (length 3.81)
          (name "DIFFIO_TX_RX_B22p" (effects (font (size 1.27 1.27))))
          (number "R10" (effects (font (size 1.27 1.27))))
        )
        (pin bidirectional line (at -38.1 1.27 0) (length 3.81)
          (name "DIFFIO_RX_B4p" (effects (font (size 1.27 1.27))))
          (number "R2" (effects (font (size 1.27 1.27))))
        )
        (pin bidirectional line (at -38.1 6.35 0) (length 3.81)
          (name "DIFFIO_RX_B4n" (effects (font (size 1.27 1.27))))
          (number "R3" (effects (font (size 1.27 1.27))))
        )
        (pin bidirectional line (at -38.1 -1.27 0) (length 3.81)
          (name "DIFFIO_TX_RX_B5n" (effects (font (size 1.27 1.27))))
          (number "R4" (effects (font (size 1.27 1.27))))
        )
        (pin bidirectional line (at -38.1 -16.51 0) (length 3.81)
          (name "DIFFIO_TX_RX_B13p" (effects (font (size 1.27 1.27))))
          (number "R5" (effects (font (size 1.27 1.27))))
        )
        (pin bidirectional line (at -38.1 -11.43 0) (length 3.81)
          (name "DIFFIO_TX_RX_B13n" (effects (font (size 1.27 1.27))))
          (number "R6" (effects (font (size 1.27 1.27))))
        )
        (pin bidirectional line (at 38.1 8.89 180) (length 3.81)
          (name "DIFFIO_TX_RX_B16n" (effects (font (size 1.27 1.27))))
          (number "R7" (effects (font (size 1.27 1.27))))
        )
        (pin bidirectional line (at 38.1 1.27 180) (length 3.81)
          (name "DIFFIO_RX_B17p" (effects (font (size 1.27 1.27))))
          (number "R8" (effects (font (size 1.27 1.27))))
        )
        (pin bidirectional line (at 38.1 -8.89 180) (length 3.81)
          (name "DIFFIO_RX_B19p" (effects (font (size 1.27 1.27))))
          (number "R9" (effects (font (size 1.27 1.27))))
        )
        (pin bidirectional line (at 38.1 -16.51 180) (length 3.81)
          (name "DIFFIO_TX_RX_B22n" (effects (font (size 1.27 1.27))))
          (number "T11" (effects (font (size 1.27 1.27))))
        )
        (pin bidirectional line (at -38.1 -8.89 0) (length 3.81)
          (name "DIFFIO_RX_B6p" (effects (font (size 1.27 1.27))))
          (number "T2" (effects (font (size 1.27 1.27))))
        )
        (pin bidirectional line (at -38.1 -3.81 0) (length 3.81)
          (name "DIFFIO_RX_B6n" (effects (font (size 1.27 1.27))))
          (number "T3" (effects (font (size 1.27 1.27))))
        )
        (pin bidirectional line (at -38.1 -19.05 0) (length 3.81)
          (name "DIFFIO_RX_B14p" (effects (font (size 1.27 1.27))))
          (number "T4" (effects (font (size 1.27 1.27))))
        )
        (pin bidirectional line (at -38.1 -13.97 0) (length 3.81)
          (name "DIFFIO_RX_B14n" (effects (font (size 1.27 1.27))))
          (number "T5" (effects (font (size 1.27 1.27))))
        )
        (pin bidirectional line (at 38.1 11.43 180) (length 3.81)
          (name "IO_T6" (effects (font (size 1.27 1.27))))
          (number "T6" (effects (font (size 1.27 1.27))))
        )
        (pin bidirectional line (at 38.1 16.51 180) (length 3.81)
          (name "VREFB3N0" (effects (font (size 1.27 1.27))))
          (number "T7" (effects (font (size 1.27 1.27))))
        )
        (pin bidirectional line (at 38.1 6.35 180) (length 3.81)
          (name "DIFFIO_RX_B17n" (effects (font (size 1.27 1.27))))
          (number "T8" (effects (font (size 1.27 1.27))))
        )
        (pin bidirectional line (at 38.1 -3.81 180) (length 3.81)
          (name "DIFFIO_RX_B19n" (effects (font (size 1.27 1.27))))
          (number "T9" (effects (font (size 1.27 1.27))))
        )
      )
      (symbol "10M50DAF256_4_0"
        (rectangle (start -29.21 15.24) (end 29.21 -11.43)
          (stroke (width 0) (type default) (color 0 0 0 0))
          (fill (type background))
        )
        (text "Bank 4" (at -24.13 16.51 0)
          (effects (font (size 1.27 1.27)))
        )
      )
      (symbol "10M50DAF256_4_1"
        (pin bidirectional line (at 33.02 -6.35 180) (length 3.81)
          (name "*PLL_B_CLKOUTp_DIFFIO_TX_RX_B57p" (effects (font (size 1.27 1.27))))
          (number "L10" (effects (font (size 1.27 1.27))))
        )
        (pin bidirectional line (at -33.02 -8.89 0) (length 3.81)
          (name "DIFFIO_TX_RX_B36p" (effects (font (size 1.27 1.27))))
          (number "L9" (effects (font (size 1.27 1.27))))
        )
        (pin bidirectional line (at -33.02 -3.81 0) (length 3.81)
          (name "DIFFIO_TX_RX_B36n" (effects (font (size 1.27 1.27))))
          (number "M10" (effects (font (size 1.27 1.27))))
        )
        (pin bidirectional line (at 33.02 -3.81 180) (length 3.81)
          (name "*PLL_B_CLKOUTn_DIFFIO_TX_RX_B57n" (effects (font (size 1.27 1.27))))
          (number "M11" (effects (font (size 1.27 1.27))))
        )
        (pin power_in line (at -1.27 19.05 270) (length 3.81)
          (name "VCCIO4" (effects (font (size 1.27 1.27))))
          (number "N10" (effects (font (size 1.27 1.27))))
        )
        (pin power_in line (at 1.27 19.05 270) (length 3.81)
          (name "VCCIO4" (effects (font (size 1.27 1.27))))
          (number "N11" (effects (font (size 1.27 1.27))))
        )
        (pin bidirectional line (at -33.02 6.35 0) (length 3.81)
          (name "DIFFIO_TX_RX_B34n" (effects (font (size 1.27 1.27))))
          (number "P10" (effects (font (size 1.27 1.27))))
        )
        (pin bidirectional line (at -33.02 1.27 0) (length 3.81)
          (name "DIFFIO_TX_RX_B34p" (effects (font (size 1.27 1.27))))
          (number "P11" (effects (font (size 1.27 1.27))))
        )
        (pin bidirectional line (at 33.02 -1.27 180) (length 3.81)
          (name "DIFFIO_TX_RX_B37p" (effects (font (size 1.27 1.27))))
          (number "P12" (effects (font (size 1.27 1.27))))
        )
        (pin bidirectional line (at 33.02 1.27 180) (length 3.81)
          (name "DIFFIO_TX_RX_B37n" (effects (font (size 1.27 1.27))))
          (number "P13" (effects (font (size 1.27 1.27))))
        )
        (pin bidirectional line (at -33.02 3.81 0) (length 3.81)
          (name "DIFFIO_RX_B35n" (effects (font (size 1.27 1.27))))
          (number "R11" (effects (font (size 1.27 1.27))))
        )
        (pin bidirectional line (at -33.02 -1.27 0) (length 3.81)
          (name "DIFFIO_RX_B35p" (effects (font (size 1.27 1.27))))
          (number "R12" (effects (font (size 1.27 1.27))))
        )
        (pin bidirectional line (at 33.02 3.81 180) (length 3.81)
          (name "IO_T12" (effects (font (size 1.27 1.27))))
          (number "T12" (effects (font (size 1.27 1.27))))
        )
        (pin bidirectional line (at -33.02 -6.35 0) (length 3.81)
          (name "VREFB4N0" (effects (font (size 1.27 1.27))))
          (number "T13" (effects (font (size 1.27 1.27))))
        )
      )
      (symbol "10M50DAF256_5_0"
        (rectangle (start 25.4 -13.97) (end -25.4 19.05)
          (stroke (width 0) (type default) (color 0 0 0 0))
          (fill (type background))
        )
        (text "Bank 5" (at -20.32 20.32 0)
          (effects (font (size 1.27 1.27)))
        )
      )
      (symbol "10M50DAF256_5_1"
        (pin bidirectional line (at 29.21 1.27 180) (length 3.81)
          (name "DIFFIO_RX_R30p" (effects (font (size 1.27 1.27))))
          (number "K11" (effects (font (size 1.27 1.27))))
        )
        (pin bidirectional line (at 29.21 -1.27 180) (length 3.81)
          (name "DIFFIO_RX_R30n" (effects (font (size 1.27 1.27))))
          (number "K12" (effects (font (size 1.27 1.27))))
        )
        (pin power_in line (at -2.54 22.86 270) (length 3.81)
          (name "VCCIO5" (effects (font (size 1.27 1.27))))
          (number "K13" (effects (font (size 1.27 1.27))))
        )
        (pin bidirectional line (at 29.21 -3.81 180) (length 3.81)
          (name "DIFFIO_RX_R32p" (effects (font (size 1.27 1.27))))
          (number "K14" (effects (font (size 1.27 1.27))))
        )
        (pin bidirectional line (at -29.21 1.27 0) (length 3.81)
          (name "DIFFIO_RX_R25p" (effects (font (size 1.27 1.27))))
          (number "L11" (effects (font (size 1.27 1.27))))
        )
        (pin bidirectional line (at -29.21 -1.27 0) (length 3.81)
          (name "DIFFIO_RX_R25n" (effects (font (size 1.27 1.27))))
          (number "L12" (effects (font (size 1.27 1.27))))
        )
        (pin power_in line (at 0 22.86 270) (length 3.81)
          (name "VCCIO5" (effects (font (size 1.27 1.27))))
          (number "L13" (effects (font (size 1.27 1.27))))
        )
        (pin bidirectional line (at 29.21 -8.89 180) (length 3.81)
          (name "DIFFIO_RX_R32n" (effects (font (size 1.27 1.27))))
          (number "L15" (effects (font (size 1.27 1.27))))
        )
        (pin bidirectional line (at 29.21 -11.43 180) (length 3.81)
          (name "DIFFIO_RX_R33n" (effects (font (size 1.27 1.27))))
          (number "L16" (effects (font (size 1.27 1.27))))
        )
        (pin power_in line (at 2.54 22.86 270) (length 3.81)
          (name "VCCIO5" (effects (font (size 1.27 1.27))))
          (number "M13" (effects (font (size 1.27 1.27))))
        )
        (pin bidirectional line (at -29.21 -11.43 0) (length 3.81)
          (name "DIFFIO_RX_R28n" (effects (font (size 1.27 1.27))))
          (number "M14" (effects (font (size 1.27 1.27))))
        )
        (pin bidirectional line (at -29.21 -6.35 0) (length 3.81)
          (name "DIFFIO_RX_R28p" (effects (font (size 1.27 1.27))))
          (number "M15" (effects (font (size 1.27 1.27))))
        )
        (pin bidirectional line (at 29.21 -6.35 180) (length 3.81)
          (name "DIFFIO_RX_R33p" (effects (font (size 1.27 1.27))))
          (number "M16" (effects (font (size 1.27 1.27))))
        )
        (pin bidirectional line (at -29.21 -3.81 0) (length 3.81)
          (name "DIFFIO_RX_R27p" (effects (font (size 1.27 1.27))))
          (number "N14" (effects (font (size 1.27 1.27))))
        )
        (pin bidirectional line (at 29.21 11.43 180) (length 3.81)
          (name "DIFFIO_RX_R29p" (effects (font (size 1.27 1.27))))
          (number "N16" (effects (font (size 1.27 1.27))))
        )
        (pin bidirectional line (at -29.21 11.43 0) (length 3.81)
          (name "*RUP_DIFFIO_RX_R1p" (effects (font (size 1.27 1.27))))
          (number "P14" (effects (font (size 1.27 1.27))))
        )
        (pin bidirectional line (at -29.21 -8.89 0) (length 3.81)
          (name "DIFFIO_RX_R27n" (effects (font (size 1.27 1.27))))
          (number "P15" (effects (font (size 1.27 1.27))))
        )
        (pin bidirectional line (at 29.21 6.35 180) (length 3.81)
          (name "DIFFIO_RX_R29n" (effects (font (size 1.27 1.27))))
          (number "P16" (effects (font (size 1.27 1.27))))
        )
        (pin bidirectional line (at -29.21 6.35 0) (length 3.81)
          (name "*RDN_DIFFIO_RX_R1n" (effects (font (size 1.27 1.27))))
          (number "R14" (effects (font (size 1.27 1.27))))
        )
        (pin bidirectional line (at 29.21 8.89 180) (length 3.81)
          (name "IO_R15" (effects (font (size 1.27 1.27))))
          (number "R15" (effects (font (size 1.27 1.27))))
        )
        (pin bidirectional line (at 29.21 3.81 180) (length 3.81)
          (name "VREFB5N0" (effects (font (size 1.27 1.27))))
          (number "R16" (effects (font (size 1.27 1.27))))
        )
        (pin bidirectional line (at -29.21 8.89 0) (length 3.81)
          (name "DIFFIO_RX_R2p" (effects (font (size 1.27 1.27))))
          (number "T14" (effects (font (size 1.27 1.27))))
        )
        (pin bidirectional line (at -29.21 3.81 0) (length 3.81)
          (name "DIFFIO_RX_R2n" (effects (font (size 1.27 1.27))))
          (number "T15" (effects (font (size 1.27 1.27))))
        )
      )
      (symbol "10M50DAF256_6_0"
        (rectangle (start 31.75 -24.13) (end -31.75 27.94)
          (stroke (width 0) (type default) (color 0 0 0 0))
          (fill (type background))
        )
        (text "Bank 6" (at -26.67 29.21 0)
          (effects (font (size 1.27 1.27)))
        )
      )
      (symbol "10M50DAF256_6_1"
        (pin bidirectional line (at 35.56 8.89 180) (length 3.81)
          (name "VREFB6N0" (effects (font (size 1.27 1.27))))
          (number "B15" (effects (font (size 1.27 1.27))))
        )
        (pin bidirectional line (at 35.56 3.81 180) (length 3.81)
          (name "IO_B16" (effects (font (size 1.27 1.27))))
          (number "B16" (effects (font (size 1.27 1.27))))
        )
        (pin bidirectional line (at 35.56 -13.97 180) (length 3.81)
          (name "PLL_R_CLKOUTn_DIFFIO_RX_R69n" (effects (font (size 1.27 1.27))))
          (number "C14" (effects (font (size 1.27 1.27))))
        )
        (pin bidirectional line (at 35.56 -16.51 180) (length 3.81)
          (name "DIFFIO_RX_R70n" (effects (font (size 1.27 1.27))))
          (number "C15" (effects (font (size 1.27 1.27))))
        )
        (pin bidirectional line (at -35.56 -6.35 0) (length 3.81)
          (name "DIFFIO_RX_R42n" (effects (font (size 1.27 1.27))))
          (number "C16" (effects (font (size 1.27 1.27))))
        )
        (pin bidirectional line (at 35.56 -8.89 180) (length 3.81)
          (name "PLL_R_CLKOUTp_DIFFIO_RX_R69p" (effects (font (size 1.27 1.27))))
          (number "D14" (effects (font (size 1.27 1.27))))
        )
        (pin bidirectional line (at 35.56 -11.43 180) (length 3.81)
          (name "DIFFIO_RX_R70p" (effects (font (size 1.27 1.27))))
          (number "D15" (effects (font (size 1.27 1.27))))
        )
        (pin bidirectional line (at -35.56 -3.81 0) (length 3.81)
          (name "DIFFIO_RX_R42p" (effects (font (size 1.27 1.27))))
          (number "D16" (effects (font (size 1.27 1.27))))
        )
        (pin bidirectional line (at 35.56 -3.81 180) (length 3.81)
          (name "DIFFIO_RX_R51n" (effects (font (size 1.27 1.27))))
          (number "E14" (effects (font (size 1.27 1.27))))
        )
        (pin bidirectional line (at 35.56 -1.27 180) (length 3.81)
          (name "DIFFIO_RX_R52p" (effects (font (size 1.27 1.27))))
          (number "E15" (effects (font (size 1.27 1.27))))
        )
        (pin bidirectional line (at 35.56 -6.35 180) (length 3.81)
          (name "DIFFIO_RX_R52n" (effects (font (size 1.27 1.27))))
          (number "E16" (effects (font (size 1.27 1.27))))
        )
        (pin power_in line (at -3.81 31.75 270) (length 3.81)
          (name "VCCIO6" (effects (font (size 1.27 1.27))))
          (number "F13" (effects (font (size 1.27 1.27))))
        )
        (pin bidirectional line (at 35.56 1.27 180) (length 3.81)
          (name "DIFFIO_RX_R51p" (effects (font (size 1.27 1.27))))
          (number "F14" (effects (font (size 1.27 1.27))))
        )
        (pin bidirectional line (at -35.56 -21.59 0) (length 3.81)
          (name "DIFFIO_RX_R47n" (effects (font (size 1.27 1.27))))
          (number "F16" (effects (font (size 1.27 1.27))))
        )
        (pin bidirectional line (at 35.56 11.43 180) (length 3.81)
          (name "DPCLK3_DIFFIO_RX_R50p" (effects (font (size 1.27 1.27))))
          (number "G11" (effects (font (size 1.27 1.27))))
        )
        (pin bidirectional line (at 35.56 6.35 180) (length 3.81)
          (name "DPCLK2_DIFFIO_RX_R50n" (effects (font (size 1.27 1.27))))
          (number "G12" (effects (font (size 1.27 1.27))))
        )
        (pin power_in line (at -1.27 31.75 270) (length 3.81)
          (name "VCCIO6" (effects (font (size 1.27 1.27))))
          (number "G13" (effects (font (size 1.27 1.27))))
        )
        (pin bidirectional line (at -35.56 -13.97 0) (length 3.81)
          (name "DIFFIO_RX_R46p" (effects (font (size 1.27 1.27))))
          (number "G14" (effects (font (size 1.27 1.27))))
        )
        (pin bidirectional line (at -35.56 -19.05 0) (length 3.81)
          (name "DIFFIO_RX_R46n" (effects (font (size 1.27 1.27))))
          (number "G15" (effects (font (size 1.27 1.27))))
        )
        (pin bidirectional line (at -35.56 -16.51 0) (length 3.81)
          (name "DIFFIO_RX_R47p" (effects (font (size 1.27 1.27))))
          (number "G16" (effects (font (size 1.27 1.27))))
        )
        (pin bidirectional line (at -35.56 -8.89 0) (length 3.81)
          (name "DIFFIO_RX_R44p" (effects (font (size 1.27 1.27))))
          (number "H11" (effects (font (size 1.27 1.27))))
        )
        (pin bidirectional line (at -35.56 -11.43 0) (length 3.81)
          (name "DIFFIO_RX_R44n" (effects (font (size 1.27 1.27))))
          (number "H12" (effects (font (size 1.27 1.27))))
        )
        (pin power_in line (at 1.27 31.75 270) (length 3.81)
          (name "VCCIO6" (effects (font (size 1.27 1.27))))
          (number "H13" (effects (font (size 1.27 1.27))))
        )
        (pin bidirectional line (at -35.56 3.81 0) (length 3.81)
          (name "DIFFIO_RX_R41p" (effects (font (size 1.27 1.27))))
          (number "H15" (effects (font (size 1.27 1.27))))
        )
        (pin bidirectional line (at -35.56 -1.27 0) (length 3.81)
          (name "DIFFIO_RX_R41n" (effects (font (size 1.27 1.27))))
          (number "H16" (effects (font (size 1.27 1.27))))
        )
        (pin bidirectional line (at -35.56 16.51 0) (length 3.81)
          (name "CLK2p_DIFFIO_RX_R38p" (effects (font (size 1.27 1.27))))
          (number "J11" (effects (font (size 1.27 1.27))))
        )
        (pin bidirectional line (at -35.56 11.43 0) (length 3.81)
          (name "CLK2n_DIFFIO_RX_R38n" (effects (font (size 1.27 1.27))))
          (number "J12" (effects (font (size 1.27 1.27))))
        )
        (pin power_in line (at 3.81 31.75 270) (length 3.81)
          (name "VCCIO6" (effects (font (size 1.27 1.27))))
          (number "J13" (effects (font (size 1.27 1.27))))
        )
        (pin bidirectional line (at -35.56 13.97 0) (length 3.81)
          (name "DIFFIO_RX_R39p" (effects (font (size 1.27 1.27))))
          (number "J14" (effects (font (size 1.27 1.27))))
        )
        (pin bidirectional line (at -35.56 6.35 0) (length 3.81)
          (name "CLK3p_DIFFIO_RX_R40p" (effects (font (size 1.27 1.27))))
          (number "J15" (effects (font (size 1.27 1.27))))
        )
        (pin bidirectional line (at -35.56 1.27 0) (length 3.81)
          (name "CLK3n_DIFFIO_RX_R40n" (effects (font (size 1.27 1.27))))
          (number "J16" (effects (font (size 1.27 1.27))))
        )
        (pin bidirectional line (at -35.56 8.89 0) (length 3.81)
          (name "DIFFIO_RX_R39n" (effects (font (size 1.27 1.27))))
          (number "K15" (effects (font (size 1.27 1.27))))
        )
      )
      (symbol "10M50DAF256_7_0"
        (rectangle (start 24.13 -11.43) (end -24.13 16.51)
          (stroke (width 0) (type default) (color 0 0 0 0))
          (fill (type background))
        )
        (text "Bank 7" (at -19.05 17.78 0)
          (effects (font (size 1.27 1.27)))
        )
      )
      (symbol "10M50DAF256_7_1"
        (pin bidirectional line (at 27.94 -6.35 180) (length 3.81)
          (name "DIFFIO_RX_T30n" (effects (font (size 1.27 1.27))))
          (number "A13" (effects (font (size 1.27 1.27))))
        )
        (pin bidirectional line (at -27.94 -6.35 0) (length 3.81)
          (name "IO_A14" (effects (font (size 1.27 1.27))))
          (number "A14" (effects (font (size 1.27 1.27))))
        )
        (pin bidirectional line (at 27.94 3.81 180) (length 3.81)
          (name "VREFB7N0" (effects (font (size 1.27 1.27))))
          (number "A15" (effects (font (size 1.27 1.27))))
        )
        (pin bidirectional line (at 27.94 -3.81 180) (length 3.81)
          (name "DIFFIO_RX_T30p" (effects (font (size 1.27 1.27))))
          (number "B13" (effects (font (size 1.27 1.27))))
        )
        (pin bidirectional line (at -27.94 -1.27 0) (length 3.81)
          (name "DIFFIO_RX_T2n" (effects (font (size 1.27 1.27))))
          (number "C12" (effects (font (size 1.27 1.27))))
        )
        (pin bidirectional line (at -27.94 3.81 0) (length 3.81)
          (name "DIFFIO_RX_T2p" (effects (font (size 1.27 1.27))))
          (number "C13" (effects (font (size 1.27 1.27))))
        )
        (pin power_in line (at -1.27 20.32 270) (length 3.81)
          (name "VCCIO7" (effects (font (size 1.27 1.27))))
          (number "D10" (effects (font (size 1.27 1.27))))
        )
        (pin power_in line (at 1.27 20.32 270) (length 3.81)
          (name "VCCIO7" (effects (font (size 1.27 1.27))))
          (number "D11" (effects (font (size 1.27 1.27))))
        )
        (pin bidirectional line (at -27.94 6.35 0) (length 3.81)
          (name "DIFFIO_RX_T1p" (effects (font (size 1.27 1.27))))
          (number "D12" (effects (font (size 1.27 1.27))))
        )
        (pin bidirectional line (at 27.94 -1.27 180) (length 3.81)
          (name "DIFFIO_RX_T28n" (effects (font (size 1.27 1.27))))
          (number "E10" (effects (font (size 1.27 1.27))))
        )
        (pin bidirectional line (at -27.94 1.27 0) (length 3.81)
          (name "DIFFIO_RX_T1n" (effects (font (size 1.27 1.27))))
          (number "E11" (effects (font (size 1.27 1.27))))
        )
        (pin bidirectional line (at 27.94 1.27 180) (length 3.81)
          (name "DIFFIO_RX_T28p" (effects (font (size 1.27 1.27))))
          (number "F10" (effects (font (size 1.27 1.27))))
        )
        (pin bidirectional line (at -27.94 -3.81 0) (length 3.81)
          (name "DIFFIO_RX_T17p" (effects (font (size 1.27 1.27))))
          (number "F11" (effects (font (size 1.27 1.27))))
        )
        (pin bidirectional line (at -27.94 -8.89 0) (length 3.81)
          (name "DIFFIO_RX_T17n" (effects (font (size 1.27 1.27))))
          (number "F12" (effects (font (size 1.27 1.27))))
        )
      )
      (symbol "10M50DAF256_8_0"
        (rectangle (start 25.4 -24.13) (end -25.4 29.21)
          (stroke (width 0) (type default) (color 0 0 0 0))
          (fill (type background))
        )
        (text "Bank 8" (at -20.32 30.48 0)
          (effects (font (size 1.27 1.27)))
        )
      )
      (symbol "10M50DAF256_8_1"
        (pin bidirectional line (at -29.21 -8.89 0) (length 3.81)
          (name "IO_A10" (effects (font (size 1.27 1.27))))
          (number "A10" (effects (font (size 1.27 1.27))))
        )
        (pin bidirectional line (at -29.21 1.27 0) (length 3.81)
          (name "DIFFIO_RX_T43p" (effects (font (size 1.27 1.27))))
          (number "A11" (effects (font (size 1.27 1.27))))
        )
        (pin bidirectional line (at -29.21 -3.81 0) (length 3.81)
          (name "DIFFIO_RX_T43n" (effects (font (size 1.27 1.27))))
          (number "A12" (effects (font (size 1.27 1.27))))
        )
        (pin bidirectional line (at 29.21 -13.97 180) (length 3.81)
          (name "DIFFIO_RX_T51n" (effects (font (size 1.27 1.27))))
          (number "A2" (effects (font (size 1.27 1.27))))
        )
        (pin bidirectional line (at 29.21 -8.89 180) (length 3.81)
          (name "DIFFIO_RX_T51p" (effects (font (size 1.27 1.27))))
          (number "A3" (effects (font (size 1.27 1.27))))
        )
        (pin bidirectional line (at 29.21 -19.05 180) (length 3.81)
          (name "*PLL_T_CLKOUTn_DIFFIO_RX_T52n" (effects (font (size 1.27 1.27))))
          (number "A4" (effects (font (size 1.27 1.27))))
        )
        (pin bidirectional line (at 29.21 -3.81 180) (length 3.81)
          (name "DIFFIO_RX_T49n" (effects (font (size 1.27 1.27))))
          (number "A5" (effects (font (size 1.27 1.27))))
        )
        (pin bidirectional line (at 29.21 6.35 180) (length 3.81)
          (name "DIFFIO_RX_T47n" (effects (font (size 1.27 1.27))))
          (number "A6" (effects (font (size 1.27 1.27))))
        )
        (pin bidirectional line (at 29.21 11.43 180) (length 3.81)
          (name "DIFFIO_RX_T47p" (effects (font (size 1.27 1.27))))
          (number "A7" (effects (font (size 1.27 1.27))))
        )
        (pin bidirectional line (at -29.21 -21.59 0) (length 3.81)
          (name "DIFFIO_RX_T45n" (effects (font (size 1.27 1.27))))
          (number "A8" (effects (font (size 1.27 1.27))))
        )
        (pin bidirectional line (at -29.21 -13.97 0) (length 3.81)
          (name "VREFB8N0" (effects (font (size 1.27 1.27))))
          (number "A9" (effects (font (size 1.27 1.27))))
        )
        (pin bidirectional line (at -29.21 -1.27 0) (length 3.81)
          (name "~{DEV_CLR}" (effects (font (size 1.27 1.27))))
          (number "B10" (effects (font (size 1.27 1.27))))
        )
        (pin bidirectional line (at -29.21 6.35 0) (length 3.81)
          (name "DIFFIO_RX_T41n" (effects (font (size 1.27 1.27))))
          (number "B11" (effects (font (size 1.27 1.27))))
        )
        (pin bidirectional line (at -29.21 11.43 0) (length 3.81)
          (name "DIFFIO_RX_T41p" (effects (font (size 1.27 1.27))))
          (number "B12" (effects (font (size 1.27 1.27))))
        )
        (pin bidirectional line (at 29.21 -16.51 180) (length 3.81)
          (name "*PLL_T_CLKOUTp_DIFFIO_RX_T52p" (effects (font (size 1.27 1.27))))
          (number "B3" (effects (font (size 1.27 1.27))))
        )
        (pin bidirectional line (at 29.21 1.27 180) (length 3.81)
          (name "DIFFIO_RX_T49p" (effects (font (size 1.27 1.27))))
          (number "B4" (effects (font (size 1.27 1.27))))
        )
        (pin bidirectional line (at 29.21 3.81 180) (length 3.81)
          (name "DIFFIO_RX_T48p" (effects (font (size 1.27 1.27))))
          (number "B5" (effects (font (size 1.27 1.27))))
        )
        (pin bidirectional line (at 29.21 13.97 180) (length 3.81)
          (name "DIFFIO_RX_T46p" (effects (font (size 1.27 1.27))))
          (number "B6" (effects (font (size 1.27 1.27))))
        )
        (pin bidirectional line (at -29.21 -11.43 0) (length 3.81)
          (name "DIFFIO_RX_T44n" (effects (font (size 1.27 1.27))))
          (number "B7" (effects (font (size 1.27 1.27))))
        )
        (pin bidirectional line (at -29.21 -6.35 0) (length 3.81)
          (name "DEV_OE" (effects (font (size 1.27 1.27))))
          (number "B8" (effects (font (size 1.27 1.27))))
        )
        (pin bidirectional line (at -29.21 -19.05 0) (length 3.81)
          (name "DIFFIO_RX_T45p" (effects (font (size 1.27 1.27))))
          (number "B9" (effects (font (size 1.27 1.27))))
        )
        (pin bidirectional line (at -29.21 3.81 0) (length 3.81)
          (name "DIFFIO_RX_T42p" (effects (font (size 1.27 1.27))))
          (number "C10" (effects (font (size 1.27 1.27))))
        )
        (pin bidirectional line (at 29.21 -1.27 180) (length 3.81)
          (name "CRC_ERROR" (effects (font (size 1.27 1.27))))
          (number "C5" (effects (font (size 1.27 1.27))))
        )
        (pin bidirectional line (at 29.21 8.89 180) (length 3.81)
          (name "DIFFIO_RX_T46n" (effects (font (size 1.27 1.27))))
          (number "C6" (effects (font (size 1.27 1.27))))
        )
        (pin power_in line (at -2.54 33.02 270) (length 3.81)
          (name "VCCIO8" (effects (font (size 1.27 1.27))))
          (number "C7" (effects (font (size 1.27 1.27))))
        )
        (pin bidirectional line (at -29.21 16.51 0) (length 3.81)
          (name "*CLK4n_DIFFIO_RX_T38n" (effects (font (size 1.27 1.27))))
          (number "C9" (effects (font (size 1.27 1.27))))
        )
        (pin power_in line (at 0 33.02 270) (length 3.81)
          (name "VCCIO8" (effects (font (size 1.27 1.27))))
          (number "D7" (effects (font (size 1.27 1.27))))
        )
        (pin power_in line (at 2.54 33.02 270) (length 3.81)
          (name "VCCIO8" (effects (font (size 1.27 1.27))))
          (number "D8" (effects (font (size 1.27 1.27))))
        )
        (pin bidirectional line (at -29.21 19.05 0) (length 3.81)
          (name "*CLK4p_DIFFIO_RX_T38p" (effects (font (size 1.27 1.27))))
          (number "D9" (effects (font (size 1.27 1.27))))
        )
        (pin bidirectional line (at 29.21 -11.43 180) (length 3.81)
          (name "CONF_DONE" (effects (font (size 1.27 1.27))))
          (number "E7" (effects (font (size 1.27 1.27))))
        )
        (pin input line (at 29.21 16.51 180) (length 3.81)
          (name "~{CONFIG}" (effects (font (size 1.27 1.27))))
          (number "E8" (effects (font (size 1.27 1.27))))
        )
        (pin bidirectional line (at -29.21 8.89 0) (length 3.81)
          (name "*CLK5n_DIFFIO_RX_T40n" (effects (font (size 1.27 1.27))))
          (number "E9" (effects (font (size 1.27 1.27))))
        )
        (pin bidirectional line (at 29.21 -6.35 180) (length 3.81)
          (name "~{STATUS}" (effects (font (size 1.27 1.27))))
          (number "F7" (effects (font (size 1.27 1.27))))
        )
        (pin bidirectional line (at -29.21 -16.51 0) (length 3.81)
          (name "CONFIG_SEL" (effects (font (size 1.27 1.27))))
          (number "F8" (effects (font (size 1.27 1.27))))
        )
        (pin bidirectional line (at -29.21 13.97 0) (length 3.81)
          (name "*CLK5p_DIFFIO_RX_T40p" (effects (font (size 1.27 1.27))))
          (number "F9" (effects (font (size 1.27 1.27))))
        )
      )
      (symbol "10M50DAF256_9_0"
        (rectangle (start -41.91 -10.16) (end 41.91 13.97)
          (stroke (width 0) (type default) (color 0 0 0 0))
          (fill (type background))
        )
      )
      (symbol "10M50DAF256_9_1"
        (pin power_in line (at 39.37 -13.97 90) (length 3.81)
          (name "GND" (effects (font (size 1.27 1.27))))
          (number "A1" (effects (font (size 1.27 1.27))))
        )
        (pin power_in line (at 36.83 -13.97 90) (length 3.81)
          (name "GND" (effects (font (size 1.27 1.27))))
          (number "A16" (effects (font (size 1.27 1.27))))
        )
        (pin power_in line (at 34.29 -13.97 90) (length 3.81)
          (name "GND" (effects (font (size 1.27 1.27))))
          (number "B14" (effects (font (size 1.27 1.27))))
        )
        (pin power_in line (at 13.97 -13.97 90) (length 3.81)
          (name "GND" (effects (font (size 1.27 1.27))))
          (number "C11" (effects (font (size 1.27 1.27))))
        )
        (pin power_in line (at 31.75 -13.97 90) (length 3.81)
          (name "GND" (effects (font (size 1.27 1.27))))
          (number "C8" (effects (font (size 1.27 1.27))))
        )
        (pin power_in line (at 29.21 -13.97 90) (length 3.81)
          (name "GND" (effects (font (size 1.27 1.27))))
          (number "D3" (effects (font (size 1.27 1.27))))
        )
        (pin power_in line (at 26.67 -13.97 90) (length 3.81)
          (name "GND" (effects (font (size 1.27 1.27))))
          (number "D6" (effects (font (size 1.27 1.27))))
        )
        (pin power_in line (at 24.13 -13.97 90) (length 3.81)
          (name "GND" (effects (font (size 1.27 1.27))))
          (number "E13" (effects (font (size 1.27 1.27))))
        )
        (pin power_in line (at 21.59 -13.97 90) (length 3.81)
          (name "GND" (effects (font (size 1.27 1.27))))
          (number "E6" (effects (font (size 1.27 1.27))))
        )
        (pin power_in line (at 19.05 -13.97 90) (length 3.81)
          (name "GND" (effects (font (size 1.27 1.27))))
          (number "F15" (effects (font (size 1.27 1.27))))
        )
        (pin power_in line (at 16.51 -13.97 90) (length 3.81)
          (name "GND" (effects (font (size 1.27 1.27))))
          (number "G10" (effects (font (size 1.27 1.27))))
        )
        (pin power_in line (at 11.43 -13.97 90) (length 3.81)
          (name "GND" (effects (font (size 1.27 1.27))))
          (number "G3" (effects (font (size 1.27 1.27))))
        )
        (pin power_in line (at -11.43 17.78 270) (length 3.81)
          (name "VCC" (effects (font (size 1.27 1.27))))
          (number "G7" (effects (font (size 1.27 1.27))))
        )
        (pin power_in line (at 8.89 -13.97 90) (length 3.81)
          (name "GND" (effects (font (size 1.27 1.27))))
          (number "G8" (effects (font (size 1.27 1.27))))
        )
        (pin power_in line (at -8.89 17.78 270) (length 3.81)
          (name "VCC" (effects (font (size 1.27 1.27))))
          (number "G9" (effects (font (size 1.27 1.27))))
        )
        (pin power_in line (at -6.35 17.78 270) (length 3.81)
          (name "VCC" (effects (font (size 1.27 1.27))))
          (number "H10" (effects (font (size 1.27 1.27))))
        )
        (pin power_in line (at 6.35 -13.97 90) (length 3.81)
          (name "GND" (effects (font (size 1.27 1.27))))
          (number "H14" (effects (font (size 1.27 1.27))))
        )
        (pin power_in line (at 3.81 -13.97 90) (length 3.81)
          (name "GND" (effects (font (size 1.27 1.27))))
          (number "H7" (effects (font (size 1.27 1.27))))
        )
        (pin power_in line (at -3.81 17.78 270) (length 3.81)
          (name "VCC" (effects (font (size 1.27 1.27))))
          (number "H8" (effects (font (size 1.27 1.27))))
        )
        (pin power_in line (at -1.27 17.78 270) (length 3.81)
          (name "VCC" (effects (font (size 1.27 1.27))))
          (number "H9" (effects (font (size 1.27 1.27))))
        )
        (pin power_in line (at 1.27 -13.97 90) (length 3.81)
          (name "GND" (effects (font (size 1.27 1.27))))
          (number "J10" (effects (font (size 1.27 1.27))))
        )
        (pin power_in line (at 1.27 17.78 270) (length 3.81)
          (name "VCC" (effects (font (size 1.27 1.27))))
          (number "J7" (effects (font (size 1.27 1.27))))
        )
        (pin power_in line (at 3.81 17.78 270) (length 3.81)
          (name "VCC" (effects (font (size 1.27 1.27))))
          (number "J8" (effects (font (size 1.27 1.27))))
        )
        (pin power_in line (at 6.35 17.78 270) (length 3.81)
          (name "VCC" (effects (font (size 1.27 1.27))))
          (number "J9" (effects (font (size 1.27 1.27))))
        )
        (pin power_in line (at -1.27 -13.97 90) (length 3.81)
          (name "GND" (effects (font (size 1.27 1.27))))
          (number "K1" (effects (font (size 1.27 1.27))))
        )
        (pin power_in line (at 8.89 17.78 270) (length 3.81)
          (name "VCC" (effects (font (size 1.27 1.27))))
          (number "K10" (effects (font (size 1.27 1.27))))
        )
        (pin power_in line (at -3.81 -13.97 90) (length 3.81)
          (name "GND" (effects (font (size 1.27 1.27))))
          (number "K16" (effects (font (size 1.27 1.27))))
        )
        (pin power_in line (at -6.35 -13.97 90) (length 3.81)
          (name "GND" (effects (font (size 1.27 1.27))))
          (number "K3" (effects (font (size 1.27 1.27))))
        )
        (pin power_in line (at -8.89 -13.97 90) (length 3.81)
          (name "GND" (effects (font (size 1.27 1.27))))
          (number "K7" (effects (font (size 1.27 1.27))))
        )
        (pin power_in line (at 11.43 17.78 270) (length 3.81)
          (name "VCC" (effects (font (size 1.27 1.27))))
          (number "K8" (effects (font (size 1.27 1.27))))
        )
        (pin power_in line (at -11.43 -13.97 90) (length 3.81)
          (name "GND" (effects (font (size 1.27 1.27))))
          (number "K9" (effects (font (size 1.27 1.27))))
        )
        (pin power_in line (at -39.37 -13.97 90) (length 3.81)
          (name "GND" (effects (font (size 1.27 1.27))))
          (number "L14" (effects (font (size 1.27 1.27))))
        )
        (pin power_in line (at -13.97 -13.97 90) (length 3.81)
          (name "GND" (effects (font (size 1.27 1.27))))
          (number "M4" (effects (font (size 1.27 1.27))))
        )
        (pin power_in line (at -16.51 -13.97 90) (length 3.81)
          (name "GND" (effects (font (size 1.27 1.27))))
          (number "N12" (effects (font (size 1.27 1.27))))
        )
        (pin power_in line (at -19.05 -13.97 90) (length 3.81)
          (name "GND" (effects (font (size 1.27 1.27))))
          (number "N15" (effects (font (size 1.27 1.27))))
        )
        (pin power_in line (at -21.59 -13.97 90) (length 3.81)
          (name "GND" (effects (font (size 1.27 1.27))))
          (number "N9" (effects (font (size 1.27 1.27))))
        )
        (pin power_in line (at -24.13 -13.97 90) (length 3.81)
          (name "GND" (effects (font (size 1.27 1.27))))
          (number "P3" (effects (font (size 1.27 1.27))))
        )
        (pin power_in line (at -26.67 -13.97 90) (length 3.81)
          (name "GND" (effects (font (size 1.27 1.27))))
          (number "P7" (effects (font (size 1.27 1.27))))
        )
        (pin power_in line (at -29.21 -13.97 90) (length 3.81)
          (name "GND" (effects (font (size 1.27 1.27))))
          (number "R13" (effects (font (size 1.27 1.27))))
        )
        (pin power_in line (at -31.75 -13.97 90) (length 3.81)
          (name "GND" (effects (font (size 1.27 1.27))))
          (number "T1" (effects (font (size 1.27 1.27))))
        )
        (pin power_in line (at -34.29 -13.97 90) (length 3.81)
          (name "GND" (effects (font (size 1.27 1.27))))
          (number "T10" (effects (font (size 1.27 1.27))))
        )
        (pin power_in line (at -36.83 -13.97 90) (length 3.81)
          (name "GND" (effects (font (size 1.27 1.27))))
          (number "T16" (effects (font (size 1.27 1.27))))
        )
      )
      (symbol "10M50DAF256_10_1"
        (rectangle (start -19.05 17.78) (end 19.05 -3.81)
          (stroke (width 0) (type default) (color 0 0 0 0))
          (fill (type background))
        )
        (pin power_in line (at 22.86 1.27 180) (length 3.81)
          (name "ANAIN1" (effects (font (size 1.27 1.27))))
          (number "D2" (effects (font (size 1.27 1.27))))
        )
        (pin power_in line (at -22.86 -1.27 0) (length 3.81)
          (name "REFGND" (effects (font (size 1.27 1.27))))
          (number "E2" (effects (font (size 1.27 1.27))))
        )
        (pin power_in line (at -22.86 1.27 0) (length 3.81)
          (name "ADC_VREF" (effects (font (size 1.27 1.27))))
          (number "E4" (effects (font (size 1.27 1.27))))
        )
        (pin power_in line (at -2.54 21.59 270) (length 3.81)
          (name "VCCA_ADC" (effects (font (size 1.27 1.27))))
          (number "E5" (effects (font (size 1.27 1.27))))
        )
        (pin power_in line (at 22.86 -1.27 180) (length 3.81)
          (name "*ANAIN2" (effects (font (size 1.27 1.27))))
          (number "F3" (effects (font (size 1.27 1.27))))
        )
        (pin power_in line (at 3.81 21.59 270) (length 3.81)
          (name "VCCINT" (effects (font (size 1.27 1.27))))
          (number "F6" (effects (font (size 1.27 1.27))))
        )
      )
      (symbol "10M50DAF256_11_1"
        (rectangle (start -16.51 13.97) (end 16.51 -2.54)
          (stroke (width 0) (type default) (color 0 0 0 0))
          (fill (type background))
        )
        (pin power_in line (at -8.89 17.78 270) (length 3.81)
          (name "VCCD_PLL2" (effects (font (size 1.27 1.27))))
          (number "D13" (effects (font (size 1.27 1.27))))
        )
        (pin power_in line (at -11.43 17.78 270) (length 3.81)
          (name "*VCCD_PLL3" (effects (font (size 1.27 1.27))))
          (number "D4" (effects (font (size 1.27 1.27))))
        )
        (pin power_in line (at 11.43 17.78 270) (length 3.81)
          (name "VCCA3" (effects (font (size 1.27 1.27))))
          (number "D5" (effects (font (size 1.27 1.27))))
        )
        (pin power_in line (at 8.89 17.78 270) (length 3.81)
          (name "VCCA2" (effects (font (size 1.27 1.27))))
          (number "E12" (effects (font (size 1.27 1.27))))
        )
        (pin power_in line (at 6.35 17.78 270) (length 3.81)
          (name "VCCA1" (effects (font (size 1.27 1.27))))
          (number "L5" (effects (font (size 1.27 1.27))))
        )
        (pin power_in line (at 13.97 17.78 270) (length 3.81)
          (name "VCCA4" (effects (font (size 1.27 1.27))))
          (number "M12" (effects (font (size 1.27 1.27))))
        )
        (pin power_in line (at -6.35 17.78 270) (length 3.81)
          (name "VCCD_PLL1" (effects (font (size 1.27 1.27))))
          (number "M5" (effects (font (size 1.27 1.27))))
        )
        (pin power_in line (at -13.97 17.78 270) (length 3.81)
          (name "*VCCD_PLL4" (effects (font (size 1.27 1.27))))
          (number "N13" (effects (font (size 1.27 1.27))))
        )
      )
    )
    (symbol "power:+3.3V" (power) (pin_names (offset 0)) (in_bom yes) (on_board yes)
      (property "Reference" "#PWR" (id 0) (at 0 -3.81 0)
        (effects (font (size 1.27 1.27)) hide)
      )
      (property "Value" "+3.3V" (id 1) (at 0 3.556 0)
        (effects (font (size 1.27 1.27)))
      )
      (property "Footprint" "" (id 2) (at 0 0 0)
        (effects (font (size 1.27 1.27)) hide)
      )
      (property "Datasheet" "" (id 3) (at 0 0 0)
        (effects (font (size 1.27 1.27)) hide)
      )
      (property "ki_keywords" "power-flag" (id 4) (at 0 0 0)
        (effects (font (size 1.27 1.27)) hide)
      )
      (property "ki_description" "Power symbol creates a global label with name \"+3.3V\"" (id 5) (at 0 0 0)
        (effects (font (size 1.27 1.27)) hide)
      )
      (symbol "+3.3V_0_1"
        (polyline
          (pts
            (xy -0.762 1.27)
            (xy 0 2.54)
          )
          (stroke (width 0) (type default) (color 0 0 0 0))
          (fill (type none))
        )
        (polyline
          (pts
            (xy 0 0)
            (xy 0 2.54)
          )
          (stroke (width 0) (type default) (color 0 0 0 0))
          (fill (type none))
        )
        (polyline
          (pts
            (xy 0 2.54)
            (xy 0.762 1.27)
          )
          (stroke (width 0) (type default) (color 0 0 0 0))
          (fill (type none))
        )
      )
      (symbol "+3.3V_1_1"
        (pin power_in line (at 0 0 90) (length 0) hide
          (name "+3V3" (effects (font (size 1.27 1.27))))
          (number "1" (effects (font (size 1.27 1.27))))
        )
      )
    )
    (symbol "power:GND" (power) (pin_names (offset 0)) (in_bom yes) (on_board yes)
      (property "Reference" "#PWR" (id 0) (at 0 -6.35 0)
        (effects (font (size 1.27 1.27)) hide)
      )
      (property "Value" "GND" (id 1) (at 0 -3.81 0)
        (effects (font (size 1.27 1.27)))
      )
      (property "Footprint" "" (id 2) (at 0 0 0)
        (effects (font (size 1.27 1.27)) hide)
      )
      (property "Datasheet" "" (id 3) (at 0 0 0)
        (effects (font (size 1.27 1.27)) hide)
      )
      (property "ki_keywords" "power-flag" (id 4) (at 0 0 0)
        (effects (font (size 1.27 1.27)) hide)
      )
      (property "ki_description" "Power symbol creates a global label with name \"GND\" , ground" (id 5) (at 0 0 0)
        (effects (font (size 1.27 1.27)) hide)
      )
      (symbol "GND_0_1"
        (polyline
          (pts
            (xy 0 0)
            (xy 0 -1.27)
            (xy 1.27 -1.27)
            (xy 0 -2.54)
            (xy -1.27 -1.27)
            (xy 0 -1.27)
          )
          (stroke (width 0) (type default) (color 0 0 0 0))
          (fill (type none))
        )
      )
      (symbol "GND_1_1"
        (pin power_in line (at 0 0 270) (length 0) hide
          (name "GND" (effects (font (size 1.27 1.27))))
          (number "1" (effects (font (size 1.27 1.27))))
        )
      )
    )
  )

  (junction (at 120.65 41.91) (diameter 0) (color 0 0 0 0)
    (uuid 3e98ad27-28d2-45d3-9e47-366e175e1198)
  )
  (junction (at 120.65 44.45) (diameter 0) (color 0 0 0 0)
    (uuid 970e8e99-1a5e-487e-bac9-d226dbd9c340)
  )
  (junction (at 137.16 55.88) (diameter 0) (color 0 0 0 0)
    (uuid ac61babe-23ae-4305-bf32-9c836d1afb54)
  )
  (junction (at 128.27 44.45) (diameter 0) (color 0 0 0 0)
    (uuid d1ed641b-082d-4320-82a2-2e6376be81bc)
  )
  (junction (at 123.19 44.45) (diameter 0) (color 0 0 0 0)
    (uuid e551e6b8-bf64-4224-834c-5d7d19101098)
  )
  (junction (at 118.11 46.99) (diameter 0) (color 0 0 0 0)
    (uuid f9286911-4cc9-4eda-86a8-993bb5bd8c7b)
  )

  (no_connect (at 158.75 104.14) (uuid 262b1f3c-cb30-4a70-9039-f9a7352ede8d))
  (no_connect (at 158.75 68.58) (uuid 3ab3f867-57fd-4374-b645-9c169965e971))
  (no_connect (at 158.75 71.12) (uuid 622e54e8-9d1e-4190-8bf9-db3e56c03c57))
  (no_connect (at 158.75 99.06) (uuid 98d019fc-00c9-438a-b62b-ba70822fd331))

  (bus_entry (at 63.5 81.28) (size 2.54 2.54)
    (stroke (width 0) (type default) (color 0 0 0 0))
    (uuid 0786601c-4728-4dca-b1ff-96537d2f4352)
  )
  (bus_entry (at 177.8 83.82) (size -2.54 2.54)
    (stroke (width 0) (type default) (color 0 0 0 0))
    (uuid 08ea8446-7e3b-4099-b18f-5581d5dc6f44)
  )
  (bus_entry (at 63.5 101.6) (size 2.54 2.54)
    (stroke (width 0) (type default) (color 0 0 0 0))
    (uuid 09d861bf-7d62-41df-a0dc-ec517d9d3706)
  )
  (bus_entry (at 63.5 93.98) (size 2.54 2.54)
    (stroke (width 0) (type default) (color 0 0 0 0))
    (uuid 2144ba95-81d7-4d93-89a7-c17c40b6c543)
  )
  (bus_entry (at 177.8 91.44) (size -2.54 2.54)
    (stroke (width 0) (type default) (color 0 0 0 0))
    (uuid 2e6bb897-b316-442c-bb9f-107837164f4a)
  )
  (bus_entry (at 177.8 88.9) (size -2.54 2.54)
    (stroke (width 0) (type default) (color 0 0 0 0))
    (uuid 343da834-167e-434b-aead-b1ed835f7d0e)
  )
  (bus_entry (at 63.5 71.12) (size 2.54 2.54)
    (stroke (width 0) (type default) (color 0 0 0 0))
    (uuid 44cf8adb-4bc1-4d61-9012-d705a2ab2888)
  )
  (bus_entry (at 177.8 78.74) (size -2.54 2.54)
    (stroke (width 0) (type default) (color 0 0 0 0))
    (uuid 461abf57-6ba4-41dd-b478-aedbdf1a770c)
  )
  (bus_entry (at 177.8 81.28) (size -2.54 2.54)
    (stroke (width 0) (type default) (color 0 0 0 0))
    (uuid 4df21026-76aa-4230-a424-37b42633a23a)
  )
  (bus_entry (at 63.5 96.52) (size 2.54 2.54)
    (stroke (width 0) (type default) (color 0 0 0 0))
    (uuid 572d0a21-e3c3-48ef-92b1-e4f683119465)
  )
  (bus_entry (at 63.5 83.82) (size 2.54 2.54)
    (stroke (width 0) (type default) (color 0 0 0 0))
    (uuid 5b6bed3a-3343-4813-9679-be11b22cb103)
  )
  (bus_entry (at 63.5 88.9) (size 2.54 2.54)
    (stroke (width 0) (type default) (color 0 0 0 0))
    (uuid 69ccbe06-ca9a-4aeb-bcc7-f8f502535a9d)
  )
  (bus_entry (at 63.5 63.5) (size 2.54 2.54)
    (stroke (width 0) (type default) (color 0 0 0 0))
    (uuid 6e6974dc-5c0e-48d2-b436-3be8ef573c18)
  )
  (bus_entry (at 63.5 78.74) (size 2.54 2.54)
    (stroke (width 0) (type default) (color 0 0 0 0))
    (uuid 7696ec02-08f6-4513-9a47-810800cd5298)
  )
  (bus_entry (at 63.5 68.58) (size 2.54 2.54)
    (stroke (width 0) (type default) (color 0 0 0 0))
    (uuid 7b8f93a0-3899-4f7e-9fe6-049b98c612b5)
  )
  (bus_entry (at 177.8 71.12) (size -2.54 2.54)
    (stroke (width 0) (type default) (color 0 0 0 0))
    (uuid 838a163a-99a7-4295-850e-8327b7207c36)
  )
  (bus_entry (at 63.5 99.06) (size 2.54 2.54)
    (stroke (width 0) (type default) (color 0 0 0 0))
    (uuid 8b1a3af6-66d3-469f-a2d1-88543ae5df09)
  )
  (bus_entry (at 177.8 63.5) (size -2.54 2.54)
    (stroke (width 0) (type default) (color 0 0 0 0))
    (uuid 8fdd42e9-9967-4b01-a503-76b303af968c)
  )
  (bus_entry (at 63.5 73.66) (size 2.54 2.54)
    (stroke (width 0) (type default) (color 0 0 0 0))
    (uuid 97d6fd31-a505-4e41-ba9d-4e3f08375aa2)
  )
  (bus_entry (at 63.5 91.44) (size 2.54 2.54)
    (stroke (width 0) (type default) (color 0 0 0 0))
    (uuid 9b663168-67dc-4ce1-b95b-cf6d46b97ccc)
  )
  (bus_entry (at 63.5 86.36) (size 2.54 2.54)
    (stroke (width 0) (type default) (color 0 0 0 0))
    (uuid 9b7963e9-6933-497a-a23d-cf8d83058a73)
  )
  (bus_entry (at 177.8 86.36) (size -2.54 2.54)
    (stroke (width 0) (type default) (color 0 0 0 0))
    (uuid a48227dd-1ce7-486a-9113-a11d14882124)
  )
  (bus_entry (at 63.5 76.2) (size 2.54 2.54)
    (stroke (width 0) (type default) (color 0 0 0 0))
    (uuid a9e12d79-c513-4ee1-898f-01b23afc52e4)
  )
  (bus_entry (at 63.5 66.04) (size 2.54 2.54)
    (stroke (width 0) (type default) (color 0 0 0 0))
    (uuid bc27a030-1eda-447f-9208-ca5120613c5a)
  )
  (bus_entry (at 177.8 76.2) (size -2.54 2.54)
    (stroke (width 0) (type default) (color 0 0 0 0))
    (uuid c1d64978-9892-4c62-8576-21d45a1df1e9)
  )
  (bus_entry (at 177.8 73.66) (size -2.54 2.54)
    (stroke (width 0) (type default) (color 0 0 0 0))
    (uuid cd04a8a3-2ab6-421f-bfeb-80a7ecbb9c6b)
  )
  (bus_entry (at 177.8 93.98) (size -2.54 2.54)
    (stroke (width 0) (type default) (color 0 0 0 0))
    (uuid f12b37e5-d93b-4f75-ab9e-e3658dcc3818)
  )
  (bus_entry (at 177.8 99.06) (size -2.54 2.54)
    (stroke (width 0) (type default) (color 0 0 0 0))
    (uuid f413547d-cd14-4682-a463-aed7acf7fd6d)
  )

  (wire (pts (xy 66.04 81.28) (xy 82.55 81.28))
    (stroke (width 0) (type default) (color 0 0 0 0))
    (uuid 066afaa0-34fd-4bd8-8b80-701d9dd1936c)
  )
  (wire (pts (xy 137.16 55.88) (xy 146.05 55.88))
    (stroke (width 0) (type default) (color 0 0 0 0))
    (uuid 09bdf088-2ef7-48c5-894a-a1fc3193d5a3)
  )
  (wire (pts (xy 175.26 76.2) (xy 158.75 76.2))
    (stroke (width 0) (type default) (color 0 0 0 0))
    (uuid 0b6a54da-8f28-4444-a6fc-c6fb0781a089)
  )
  (bus (pts (xy 63.5 101.6) (xy 63.5 114.3))
    (stroke (width 0) (type default) (color 0 0 0 0))
    (uuid 196d843f-a39a-4713-b9c7-5e6a9b2557a8)
  )

  (wire (pts (xy 110.49 46.99) (xy 118.11 46.99))
    (stroke (width 0) (type default) (color 0 0 0 0))
    (uuid 1a6962db-0d7a-4ce6-9231-bb114692441d)
  )
  (wire (pts (xy 66.04 66.04) (xy 82.55 66.04))
    (stroke (width 0) (type default) (color 0 0 0 0))
    (uuid 1ab3e487-9619-491b-9c22-438a7534ad81)
  )
  (wire (pts (xy 66.04 83.82) (xy 82.55 83.82))
    (stroke (width 0) (type default) (color 0 0 0 0))
    (uuid 1d2cb11d-e313-4539-8208-f1f309c3a975)
  )
  (wire (pts (xy 66.04 71.12) (xy 82.55 71.12))
    (stroke (width 0) (type default) (color 0 0 0 0))
    (uuid 221527b5-c91c-4d38-b527-dc979fe536be)
  )
  (wire (pts (xy 118.11 46.99) (xy 118.11 41.91))
    (stroke (width 0) (type default) (color 0 0 0 0))
    (uuid 23a7e30c-b738-4c2c-9dea-ce3ad85cddc2)
  )
  (bus (pts (xy 63.5 81.28) (xy 63.5 83.82))
    (stroke (width 0) (type default) (color 0 0 0 0))
    (uuid 26ef2d57-79ff-4ddb-b100-6d4a6a4ef943)
  )
  (bus (pts (xy 63.5 99.06) (xy 63.5 101.6))
    (stroke (width 0) (type default) (color 0 0 0 0))
    (uuid 27bbcf42-32af-45b1-9154-e807a2f51d7c)
  )

  (wire (pts (xy 101.6 55.88) (xy 101.6 54.61))
    (stroke (width 0) (type default) (color 0 0 0 0))
    (uuid 34dac7c3-7498-4b54-979e-18cfb3e589c1)
  )
  (bus (pts (xy 63.5 78.74) (xy 63.5 81.28))
    (stroke (width 0) (type default) (color 0 0 0 0))
    (uuid 37ce28fa-d5a8-4eda-8b10-37d690c94f7b)
  )

  (wire (pts (xy 120.65 41.91) (xy 123.19 41.91))
    (stroke (width 0) (type default) (color 0 0 0 0))
    (uuid 3a040ff5-8f7b-44ed-87fc-18ea8b36e808)
  )
  (wire (pts (xy 120.65 44.45) (xy 120.65 41.91))
    (stroke (width 0) (type default) (color 0 0 0 0))
    (uuid 3b032e5e-9eca-44a1-bdcb-8a1f80754daf)
  )
  (bus (pts (xy 63.5 83.82) (xy 63.5 86.36))
    (stroke (width 0) (type default) (color 0 0 0 0))
    (uuid 3f31c3c2-77c9-45c2-9a0a-9ce2faa121df)
  )

  (wire (pts (xy 118.11 41.91) (xy 120.65 41.91))
    (stroke (width 0) (type default) (color 0 0 0 0))
    (uuid 40ea0fc9-63b4-4fe2-8f9e-0461098586a7)
  )
  (wire (pts (xy 137.16 46.99) (xy 137.16 44.45))
    (stroke (width 0) (type default) (color 0 0 0 0))
    (uuid 453009bf-86df-405c-9067-ab5eb4a53754)
  )
  (wire (pts (xy 120.65 38.1) (xy 120.65 41.91))
    (stroke (width 0) (type default) (color 0 0 0 0))
    (uuid 4792b825-4d43-4e56-9b6f-b22353e9ecce)
  )
  (wire (pts (xy 175.26 66.04) (xy 158.75 66.04))
    (stroke (width 0) (type default) (color 0 0 0 0))
    (uuid 49ddf0b7-81c8-4a8a-9a88-837d56527e42)
  )
  (bus (pts (xy 63.5 63.5) (xy 63.5 66.04))
    (stroke (width 0) (type default) (color 0 0 0 0))
    (uuid 4ab352ae-68ac-4981-83b0-e5a5627f1d0e)
  )
  (bus (pts (xy 177.8 63.5) (xy 177.8 71.12))
    (stroke (width 0) (type default) (color 0 0 0 0))
    (uuid 4d9a6310-79be-485f-a941-32108faca399)
  )

  (wire (pts (xy 101.6 44.45) (xy 120.65 44.45))
    (stroke (width 0) (type default) (color 0 0 0 0))
    (uuid 5286dbe7-118d-4bc6-8aff-da668a5b435d)
  )
  (bus (pts (xy 177.8 73.66) (xy 177.8 76.2))
    (stroke (width 0) (type default) (color 0 0 0 0))
    (uuid 52aad331-41dd-4fc5-85ca-43ed1bc199ab)
  )
  (bus (pts (xy 63.5 114.3) (xy 177.8 114.3))
    (stroke (width 0) (type default) (color 0 0 0 0))
    (uuid 540f5c9c-b596-4ce5-841e-2ee17a158760)
  )

  (wire (pts (xy 66.04 73.66) (xy 82.55 73.66))
    (stroke (width 0) (type default) (color 0 0 0 0))
    (uuid 54df4932-cd59-4260-9c3c-5b0f6d8a7d82)
  )
  (bus (pts (xy 177.8 76.2) (xy 177.8 78.74))
    (stroke (width 0) (type default) (color 0 0 0 0))
    (uuid 54eeeeb6-6d55-466e-acbf-57f24fd4861a)
  )

  (wire (pts (xy 175.26 78.74) (xy 158.75 78.74))
    (stroke (width 0) (type default) (color 0 0 0 0))
    (uuid 56557bcd-8562-42cc-a6f3-807f49dda5a2)
  )
  (wire (pts (xy 128.27 44.45) (xy 137.16 44.45))
    (stroke (width 0) (type default) (color 0 0 0 0))
    (uuid 5d8e0c3f-c401-4aa1-bd1e-9bac876d8330)
  )
  (wire (pts (xy 175.26 93.98) (xy 158.75 93.98))
    (stroke (width 0) (type default) (color 0 0 0 0))
    (uuid 62190a61-08d2-4d66-8cef-98cf76c6cea5)
  )
  (wire (pts (xy 66.04 68.58) (xy 82.55 68.58))
    (stroke (width 0) (type default) (color 0 0 0 0))
    (uuid 622548b7-771d-40f0-b703-f1016d14020d)
  )
  (wire (pts (xy 66.04 99.06) (xy 82.55 99.06))
    (stroke (width 0) (type default) (color 0 0 0 0))
    (uuid 651150e8-7df9-4024-a0a3-404153bf09fb)
  )
  (wire (pts (xy 128.27 46.99) (xy 128.27 44.45))
    (stroke (width 0) (type default) (color 0 0 0 0))
    (uuid 6563f292-9fd7-4ac0-8f81-c5ad541188ae)
  )
  (wire (pts (xy 175.26 81.28) (xy 158.75 81.28))
    (stroke (width 0) (type default) (color 0 0 0 0))
    (uuid 6aca8512-68eb-4662-8587-96dc23a883c7)
  )
  (bus (pts (xy 177.8 88.9) (xy 177.8 91.44))
    (stroke (width 0) (type default) (color 0 0 0 0))
    (uuid 73c34f71-2d21-4c7a-87de-17b7177b58e2)
  )

  (wire (pts (xy 66.04 93.98) (xy 82.55 93.98))
    (stroke (width 0) (type default) (color 0 0 0 0))
    (uuid 7ca78772-e694-4f40-aefb-dab713f2b096)
  )
  (bus (pts (xy 177.8 83.82) (xy 177.8 86.36))
    (stroke (width 0) (type default) (color 0 0 0 0))
    (uuid 7ed2443a-d74e-4c16-9eee-59b9193a966f)
  )

  (wire (pts (xy 175.26 96.52) (xy 158.75 96.52))
    (stroke (width 0) (type default) (color 0 0 0 0))
    (uuid 866b636f-aa94-4656-a861-a6db958ee2e6)
  )
  (wire (pts (xy 66.04 91.44) (xy 82.55 91.44))
    (stroke (width 0) (type default) (color 0 0 0 0))
    (uuid 8c1a7987-9e27-4a4e-8616-55a6371f477a)
  )
  (bus (pts (xy 177.8 93.98) (xy 177.8 99.06))
    (stroke (width 0) (type default) (color 0 0 0 0))
    (uuid 8f602b2f-63a9-43f0-a6f3-c7c723b2a6a9)
  )
  (bus (pts (xy 63.5 86.36) (xy 63.5 88.9))
    (stroke (width 0) (type default) (color 0 0 0 0))
    (uuid 9713aea4-2ab0-4bc6-8726-07bbdafe4a9e)
  )

  (wire (pts (xy 137.16 55.88) (xy 137.16 54.61))
    (stroke (width 0) (type default) (color 0 0 0 0))
    (uuid 97d30e80-d639-4192-bd53-0cd8127fc6f3)
  )
  (bus (pts (xy 63.5 93.98) (xy 63.5 96.52))
    (stroke (width 0) (type default) (color 0 0 0 0))
    (uuid 9bad76c0-1ec6-494a-85c3-abc5b61962f1)
  )
  (bus (pts (xy 177.8 86.36) (xy 177.8 88.9))
    (stroke (width 0) (type default) (color 0 0 0 0))
    (uuid 9c8e5a8e-d825-4637-a357-f51aa087fcb3)
  )
  (bus (pts (xy 177.8 78.74) (xy 177.8 81.28))
    (stroke (width 0) (type default) (color 0 0 0 0))
    (uuid 9dacd6eb-de6a-4d25-b9a4-7594fa54cc34)
  )
  (bus (pts (xy 50.8 50.8) (xy 63.5 50.8))
    (stroke (width 0) (type default) (color 0 0 0 0))
    (uuid 9f7fa977-473f-4f5d-9ba2-fe6e8c4186a9)
  )
  (bus (pts (xy 177.8 81.28) (xy 177.8 83.82))
    (stroke (width 0) (type default) (color 0 0 0 0))
    (uuid a1bcfee2-7ae2-46f6-a661-679f2148c3f5)
  )
  (bus (pts (xy 63.5 71.12) (xy 63.5 73.66))
    (stroke (width 0) (type default) (color 0 0 0 0))
    (uuid a3454563-796a-4aba-9792-089cd33d5893)
  )
  (bus (pts (xy 63.5 66.04) (xy 63.5 68.58))
    (stroke (width 0) (type default) (color 0 0 0 0))
    (uuid a3ed61d1-6165-430a-8bec-6051814cff84)
  )

  (wire (pts (xy 66.04 104.14) (xy 82.55 104.14))
    (stroke (width 0) (type default) (color 0 0 0 0))
    (uuid a50a4adc-1d56-49a6-9bb9-0a37f0fea835)
  )
  (bus (pts (xy 63.5 50.8) (xy 63.5 63.5))
    (stroke (width 0) (type default) (color 0 0 0 0))
    (uuid a9fc4e59-60b9-4e85-8607-9e307ddbaf07)
  )

  (wire (pts (xy 110.49 55.88) (xy 110.49 54.61))
    (stroke (width 0) (type default) (color 0 0 0 0))
    (uuid adcbb670-ac0f-4c22-976d-447ae1aebe5e)
  )
  (wire (pts (xy 128.27 54.61) (xy 128.27 55.88))
    (stroke (width 0) (type default) (color 0 0 0 0))
    (uuid b1302122-db6f-4031-b758-313273cc1700)
  )
  (bus (pts (xy 63.5 91.44) (xy 63.5 93.98))
    (stroke (width 0) (type default) (color 0 0 0 0))
    (uuid b1b49b86-0e0a-427f-84e6-1c6fc0e60bca)
  )

  (wire (pts (xy 175.26 91.44) (xy 158.75 91.44))
    (stroke (width 0) (type default) (color 0 0 0 0))
    (uuid b86d0b75-6aa0-45b7-9415-5d5b049891ad)
  )
  (wire (pts (xy 101.6 46.99) (xy 101.6 44.45))
    (stroke (width 0) (type default) (color 0 0 0 0))
    (uuid bb168830-8ffd-4d76-a8fb-07f592b2df4f)
  )
  (bus (pts (xy 177.8 91.44) (xy 177.8 93.98))
    (stroke (width 0) (type default) (color 0 0 0 0))
    (uuid bb6b0eff-69a6-4b9a-bf54-e6b50043fa79)
  )

  (wire (pts (xy 175.26 86.36) (xy 158.75 86.36))
    (stroke (width 0) (type default) (color 0 0 0 0))
    (uuid beb280a9-489e-454a-b64a-5520ed2b0b7d)
  )
  (wire (pts (xy 66.04 88.9) (xy 82.55 88.9))
    (stroke (width 0) (type default) (color 0 0 0 0))
    (uuid c19d0beb-1bd3-48d2-8346-318578866a4e)
  )
  (wire (pts (xy 66.04 96.52) (xy 82.55 96.52))
    (stroke (width 0) (type default) (color 0 0 0 0))
    (uuid c33bd450-c234-4ff4-86ac-f3434ceddb92)
  )
  (bus (pts (xy 177.8 71.12) (xy 177.8 73.66))
    (stroke (width 0) (type default) (color 0 0 0 0))
    (uuid c52ce128-4d59-4b38-8c1d-c21067e9be45)
  )

  (wire (pts (xy 128.27 55.88) (xy 137.16 55.88))
    (stroke (width 0) (type default) (color 0 0 0 0))
    (uuid c883ff33-d749-449d-b791-f52b9e5a04a0)
  )
  (bus (pts (xy 63.5 88.9) (xy 63.5 91.44))
    (stroke (width 0) (type default) (color 0 0 0 0))
    (uuid ca450c6b-8f25-4771-84e9-3b11bf9a9253)
  )
  (bus (pts (xy 63.5 68.58) (xy 63.5 71.12))
    (stroke (width 0) (type default) (color 0 0 0 0))
    (uuid ccb19ca2-8d18-4543-b1b8-d7da32cc616d)
  )

  (wire (pts (xy 118.11 46.99) (xy 118.11 59.69))
    (stroke (width 0) (type default) (color 0 0 0 0))
    (uuid cd1769d5-f24c-43ac-8166-8fd8c7801068)
  )
  (wire (pts (xy 66.04 86.36) (xy 82.55 86.36))
    (stroke (width 0) (type default) (color 0 0 0 0))
    (uuid ceb8390d-93d4-4562-ab90-ae99e01cfdbd)
  )
  (bus (pts (xy 63.5 76.2) (xy 63.5 78.74))
    (stroke (width 0) (type default) (color 0 0 0 0))
    (uuid d58cced6-a5a7-4705-8390-4f55680d6575)
  )

  (wire (pts (xy 120.65 44.45) (xy 120.65 59.69))
    (stroke (width 0) (type default) (color 0 0 0 0))
    (uuid d59fd23a-7044-468d-b652-660f4e634dbd)
  )
  (bus (pts (xy 63.5 73.66) (xy 63.5 76.2))
    (stroke (width 0) (type default) (color 0 0 0 0))
    (uuid d64282cf-14c0-4cdf-84b5-3651512e64fa)
  )

  (wire (pts (xy 66.04 78.74) (xy 82.55 78.74))
    (stroke (width 0) (type default) (color 0 0 0 0))
    (uuid d74a6ae8-3905-4d19-96ec-7c5e70a092f0)
  )
  (wire (pts (xy 123.19 41.91) (xy 123.19 44.45))
    (stroke (width 0) (type default) (color 0 0 0 0))
    (uuid d7d473f6-31bc-4d7c-b80d-bedee3f0bece)
  )
  (wire (pts (xy 66.04 101.6) (xy 82.55 101.6))
    (stroke (width 0) (type default) (color 0 0 0 0))
    (uuid db3471bc-75fb-4101-aeef-e33a71321970)
  )
  (wire (pts (xy 175.26 88.9) (xy 158.75 88.9))
    (stroke (width 0) (type default) (color 0 0 0 0))
    (uuid de49d56e-a2cd-4e79-bdf6-0c916e0b64fa)
  )
  (wire (pts (xy 66.04 76.2) (xy 82.55 76.2))
    (stroke (width 0) (type default) (color 0 0 0 0))
    (uuid ea993d8f-bf4a-4a63-aee9-9e0c4ad5205b)
  )
  (wire (pts (xy 158.75 101.6) (xy 175.26 101.6))
    (stroke (width 0) (type default) (color 0 0 0 0))
    (uuid ec4331aa-bc10-4056-b96f-e6abd2ee68d1)
  )
  (wire (pts (xy 123.19 59.69) (xy 123.19 44.45))
    (stroke (width 0) (type default) (color 0 0 0 0))
    (uuid eebb27e5-8c14-4d52-9201-60446f4aa868)
  )
  (wire (pts (xy 123.19 44.45) (xy 128.27 44.45))
    (stroke (width 0) (type default) (color 0 0 0 0))
    (uuid f2c57dce-ee2f-4673-9eed-36ea44e4881c)
  )
  (wire (pts (xy 175.26 83.82) (xy 158.75 83.82))
    (stroke (width 0) (type default) (color 0 0 0 0))
    (uuid f5a604c8-c05f-4259-8432-207141633348)
  )
  (bus (pts (xy 63.5 96.52) (xy 63.5 99.06))
    (stroke (width 0) (type default) (color 0 0 0 0))
    (uuid f64cebe8-316d-4b07-98dd-7d429a27762b)
  )

  (wire (pts (xy 175.26 73.66) (xy 158.75 73.66))
    (stroke (width 0) (type default) (color 0 0 0 0))
    (uuid f85fd955-069d-4c05-9fa4-bf1aee65b395)
  )
  (bus (pts (xy 177.8 99.06) (xy 177.8 114.3))
    (stroke (width 0) (type default) (color 0 0 0 0))
    (uuid ff6b718b-1243-4d78-87e8-4666998aa9e4)
  )

  (label "MCU_IO5" (at 68.58 86.36 0)
    (effects (font (size 1.27 1.27)) (justify left bottom))
    (uuid 0c9feefb-db3c-4448-b4c3-b2396495d72f)
  )
  (label "MCU_IO20" (at 68.58 68.58 0)
    (effects (font (size 1.27 1.27)) (justify left bottom))
    (uuid 0fd4ae20-68fa-4647-a3c3-5f97f65c2efb)
  )
  (label "MCU_IO22" (at 68.58 93.98 0)
    (effects (font (size 1.27 1.27)) (justify left bottom))
    (uuid 1de12680-9bc8-4bde-82f2-5b6f55866f6b)
  )
  (label "MCU_IO2" (at 68.58 78.74 0)
    (effects (font (size 1.27 1.27)) (justify left bottom))
    (uuid 2263bdb2-ef43-4cd5-85dd-a9f1c089aeb3)
  )
  (label "MCU_IO21" (at 68.58 73.66 0)
    (effects (font (size 1.27 1.27)) (justify left bottom))
    (uuid 2a2bf56c-199a-48c1-ace7-dd57abe70bda)
  )
  (label "MCU_IO6" (at 68.58 66.04 0)
    (effects (font (size 1.27 1.27)) (justify left bottom))
    (uuid 471a9dc0-32ae-4cb5-bb94-efe6f9efd4e7)
  )
  (label "MCU_IO7" (at 68.58 99.06 0)
    (effects (font (size 1.27 1.27)) (justify left bottom))
    (uuid 4783dc56-149f-4fe9-8e64-bfc10dc85522)
  )
  (label "MCU_IO12" (at 163.83 66.04 0)
    (effects (font (size 1.27 1.27)) (justify left bottom))
    (uuid 4a41949d-861d-499a-9a04-a2f88ea50938)
  )
  (label "MCU_IO14" (at 163.83 96.52 0)
    (effects (font (size 1.27 1.27)) (justify left bottom))
    (uuid 4fcff9b6-ec6a-44a6-bae7-08d5ad63c079)
  )
  (label "MCU_IO25" (at 163.83 81.28 0)
    (effects (font (size 1.27 1.27)) (justify left bottom))
    (uuid 501aea17-abb3-492c-81fc-b4f42c04a31d)
  )
  (label "MCU_IO26" (at 163.83 86.36 0)
    (effects (font (size 1.27 1.27)) (justify left bottom))
    (uuid 5809ecf0-ae88-4e94-a9c4-8cc73b6a1686)
  )
  (label "MCU_IO27" (at 163.83 101.6 0)
    (effects (font (size 1.27 1.27)) (justify left bottom))
    (uuid 5ebe0ff0-00d8-4a24-b4df-546dd5c2ba85)
  )
  (label "MCU_IO9" (at 68.58 91.44 0)
    (effects (font (size 1.27 1.27)) (justify left bottom))
    (uuid 67e5e8b2-a523-4f55-af07-652fedfa92c5)
  )
  (label "MCU_IO3" (at 68.58 104.14 0)
    (effects (font (size 1.27 1.27)) (justify left bottom))
    (uuid 814abea0-f500-4247-99e5-45533d7b8e56)
  )
  (label "MCU_IO1" (at 68.58 88.9 0)
    (effects (font (size 1.27 1.27)) (justify left bottom))
    (uuid 85889fd0-db06-45de-9246-98bbea13d42a)
  )
  (label "MCU_IO18" (at 163.83 88.9 0)
    (effects (font (size 1.27 1.27)) (justify left bottom))
    (uuid 8df30103-118b-4612-b215-37a17ff1c41e)
  )
  (label "MCU_IO10" (at 68.58 76.2 0)
    (effects (font (size 1.27 1.27)) (justify left bottom))
    (uuid 93afb913-0ddf-4154-8d33-0d7fca7d7159)
  )
  (label "MCU_IO13" (at 163.83 76.2 0)
    (effects (font (size 1.27 1.27)) (justify left bottom))
    (uuid ac8d8548-4df8-4c39-8021-1ae8f0fd4c70)
  )
  (label "MCU_IO16" (at 163.83 83.82 0)
    (effects (font (size 1.27 1.27)) (justify left bottom))
    (uuid b9acdf32-4bd0-48a8-a3c9-639942872ae6)
  )
  (label "MCU_IO8" (at 68.58 101.6 0)
    (effects (font (size 1.27 1.27)) (justify left bottom))
    (uuid cc552cdf-c926-4dee-aa55-fdb534dfcd68)
  )
  (label "MCU_IO11" (at 163.83 73.66 0)
    (effects (font (size 1.27 1.27)) (justify left bottom))
    (uuid da0cd1a7-2335-4d7a-a311-a0195f57c3fd)
  )
  (label "MCU_IO15" (at 163.83 78.74 0)
    (effects (font (size 1.27 1.27)) (justify left bottom))
    (uuid dc55cd2e-ee4d-4b24-92a1-790e6d5442ae)
  )
  (label "MCU_IO19" (at 163.83 93.98 0)
    (effects (font (size 1.27 1.27)) (justify left bottom))
    (uuid e99c881b-679f-4261-98a2-36ef47ab6863)
  )
  (label "MCU_IO0" (at 68.58 83.82 0)
    (effects (font (size 1.27 1.27)) (justify left bottom))
    (uuid edf359b2-3bb5-44db-88a6-dd4010238387)
  )
  (label "MCU_IO23" (at 68.58 71.12 0)
    (effects (font (size 1.27 1.27)) (justify left bottom))
    (uuid f261408c-5397-49a3-8eb2-867a9f318869)
  )
  (label "MCU_IO4" (at 68.58 81.28 0)
    (effects (font (size 1.27 1.27)) (justify left bottom))
    (uuid f7107c5d-546e-4da7-8c7d-05da00310a58)
  )
  (label "MCU_IO17" (at 163.83 91.44 0)
    (effects (font (size 1.27 1.27)) (justify left bottom))
    (uuid f7e2e16a-8399-40b3-a914-88c00862bafd)
  )
  (label "MCU_IO24" (at 68.58 96.52 0)
    (effects (font (size 1.27 1.27)) (justify left bottom))
    (uuid fd7cac6e-8eb5-4fd9-9c62-1576cd689537)
  )

  (hierarchical_label "MCU_IO[0..27]" (shape bidirectional) (at 50.8 50.8 180)
    (effects (font (size 1.27 1.27)) (justify right))
    (uuid 5b20ee0a-6aa5-4d00-bdd8-11a5d122f221)
  )

  (symbol (lib_id "POWDER_Digital:10M50DAF256") (at 120.65 85.09 0) (unit 3)
    (in_bom yes) (on_board yes)
    (uuid 00000000-0000-0000-0000-00005f996bb5)
    (property "Reference" "U2201" (id 0) (at 120.65 81.28 0))
    (property "Value" "‎10M08DAF256C8G" (id 1) (at 120.65 85.09 0))
    (property "Footprint" "Package_BGA:BGA-256_17.0x17.0mm_Layout16x16_P1.0mm_Ball0.5mm_Pad0.4mm_NSMD" (id 2) (at 120.65 85.09 0)
      (effects (font (size 1.27 1.27)) hide)
    )
    (property "Datasheet" "" (id 3) (at 120.65 85.09 0)
      (effects (font (size 1.27 1.27)) hide)
    )
    (property "PartSpecification" "3000-0000001300" (id 4) (at 120.65 85.09 0)
      (effects (font (size 1.27 1.27)) hide)
    )
    (pin "L7" (uuid f50d2417-7fb6-4d30-bf5d-954d976d6a06))
    (pin "L8" (uuid 8bc252d2-d881-4e18-ae45-53ac695f9597))
    (pin "M6" (uuid 2bae2f53-d769-4a63-b2f1-4649291370b6))
    (pin "M7" (uuid dbac0219-28a2-4463-808e-cccfb7c5d634))
    (pin "M8" (uuid 101eb366-15a0-4cbe-90f2-c623c0204977))
    (pin "M9" (uuid a8c7432b-1bbc-4bec-8fec-e5a49aa93c88))
    (pin "N5" (uuid af5e11da-e010-4393-9561-7c4fa5e9a2eb))
    (pin "N6" (uuid 3323c7ab-ad16-4289-b637-6f57823400c2))
    (pin "N7" (uuid ae68f1d8-3f54-405e-a20b-f9f5a737bc96))
    (pin "N8" (uuid a252e08b-89a9-478d-99ae-7ee7feb2325a))
    (pin "P2" (uuid 0d5e0720-ab19-41c9-aaeb-94be73ebe143))
    (pin "P4" (uuid 960ecf6a-eb8a-4c5e-bc15-9d399a69491f))
    (pin "P5" (uuid 1bec5d2d-0f8d-40fb-9323-d22875f4c83c))
    (pin "P6" (uuid 1bd2120d-10a8-4cdf-8c90-b10dc37dbe65))
    (pin "P8" (uuid c99b959c-96cb-4528-9f86-671b76097da7))
    (pin "P9" (uuid 4520c48f-e2ae-44f1-af9f-c9c0d9bb9250))
    (pin "R1" (uuid d35784b7-f4e2-4cf7-afff-90121af3770d))
    (pin "R10" (uuid f60178c5-55df-4e36-8ee5-38645cfdc7b7))
    (pin "R2" (uuid e874044b-198a-4d14-9f52-fbb7fee48919))
    (pin "R3" (uuid 1912f3a0-d136-4dd0-9b94-79ffe93c5b6f))
    (pin "R4" (uuid 91da5c01-20ae-4800-9510-ae42dc511670))
    (pin "R5" (uuid faf59d0f-ffd4-4539-aa45-2a58b4762091))
    (pin "R6" (uuid b1079312-2717-4768-b324-c23acccc1bd5))
    (pin "R7" (uuid 02c9fff6-c0d8-4a45-a954-0f0bcf137433))
    (pin "R8" (uuid dc39fbee-b91d-49b5-aee2-9b2bdf2d7f5e))
    (pin "R9" (uuid 994c0d9d-804b-4827-b163-871cf95e3c40))
    (pin "T11" (uuid e7a4e592-90e1-444f-9b65-a2fb02e939e7))
    (pin "T2" (uuid bc4f24b0-7f90-4fad-a8a2-466204e9dc65))
    (pin "T3" (uuid af8a5b1c-8786-4ea2-ac85-5bb7e742c6ba))
    (pin "T4" (uuid 5a10b0f5-91a2-42fb-9561-347fae172028))
    (pin "T5" (uuid 9edb8283-ca14-416e-89f8-bb004aace990))
    (pin "T6" (uuid d178a9a5-0499-4af4-b2c2-c0b7fef690c2))
    (pin "T7" (uuid 26482a69-2a1e-4859-b836-360bb3ceecbf))
    (pin "T8" (uuid 4c530f69-c388-4b5d-8814-4bb0839d616d))
    (pin "T9" (uuid 8616f7c2-b6b9-4a48-a422-02c42ec9fb3f))
  )

  (symbol (lib_id "000_PreferredParts:C_1nF") (at 128.27 50.8 0)
    (in_bom yes) (on_board yes)
    (uuid 00000000-0000-0000-0000-00005fb9cea2)
    (property "Reference" "C2603" (id 0) (at 128.905 48.26 0)
      (effects (font (size 1.27 1.27)) (justify left))
    )
    (property "Value" "C_1nF" (id 1) (at 128.905 53.34 0)
      (effects (font (size 1.27 1.27)) (justify left))
    )
    (property "Footprint" "Capacitor_SMD:C_0402_1005Metric" (id 2) (at 129.2352 54.61 0)
      (effects (font (size 1.27 1.27)) hide)
    )
    (property "Datasheet" "~" (id 3) (at 128.27 50.8 0)
      (effects (font (size 1.27 1.27)) hide)
    )
    (property "PartSpecification" "3000-0000000128" (id 4) (at 128.27 50.8 0)
      (effects (font (size 1.27 1.27)) hide)
    )
    (pin "1" (uuid 1477f78d-c758-4618-9797-92164d16e623))
    (pin "2" (uuid 52ae5d0f-5fe6-45fb-b091-5e46318701fc))
  )

  (symbol (lib_id "000_PreferredParts:C_1nF") (at 101.6 50.8 0)
    (in_bom yes) (on_board yes)
    (uuid 00000000-0000-0000-0000-00005fb9cea9)
    (property "Reference" "C2601" (id 0) (at 102.235 48.26 0)
      (effects (font (size 1.27 1.27)) (justify left))
    )
    (property "Value" "C_1nF" (id 1) (at 102.235 53.34 0)
      (effects (font (size 1.27 1.27)) (justify left))
    )
    (property "Footprint" "Capacitor_SMD:C_0402_1005Metric" (id 2) (at 102.5652 54.61 0)
      (effects (font (size 1.27 1.27)) hide)
    )
    (property "Datasheet" "~" (id 3) (at 101.6 50.8 0)
      (effects (font (size 1.27 1.27)) hide)
    )
    (property "PartSpecification" "3000-0000000128" (id 4) (at 101.6 50.8 0)
      (effects (font (size 1.27 1.27)) hide)
    )
    (pin "1" (uuid f91fbcfa-024b-475c-8e7d-afbc3bb38b32))
    (pin "2" (uuid 9626662b-b618-437d-b115-f300158bad6d))
  )

  (symbol (lib_id "000_PreferredParts:C_0_1uF") (at 137.16 50.8 0)
    (in_bom yes) (on_board yes)
    (uuid 00000000-0000-0000-0000-00005fb9ceb2)
    (property "Reference" "C2604" (id 0) (at 137.795 48.26 0)
      (effects (font (size 1.27 1.27)) (justify left))
    )
    (property "Value" "C_0_1uF" (id 1) (at 137.795 53.34 0)
      (effects (font (size 1.27 1.27)) (justify left) hide)
    )
    (property "Footprint" "Capacitor_SMD:C_0402_1005Metric" (id 2) (at 138.1252 54.61 0)
      (effects (font (size 1.27 1.27)) hide)
    )
    (property "Datasheet" "~" (id 3) (at 137.16 50.8 0)
      (effects (font (size 1.27 1.27)) hide)
    )
    (property "DisplayValue" "0.1uF" (id 4) (at 140.97 53.34 0))
    (property "PartSpecification" "3000-0000000125" (id 5) (at 137.16 50.8 0)
      (effects (font (size 1.27 1.27)) hide)
    )
    (property "Voltage" "100V" (id 6) (at 137.16 50.8 0)
      (effects (font (size 1.27 1.27)) hide)
    )
    (pin "1" (uuid e904ec4f-0b9c-4b73-8ae7-3f39b85f5b3f))
    (pin "2" (uuid 821c701f-d0ef-4f6c-a2a4-7493d0749e99))
  )

  (symbol (lib_id "power:GND") (at 146.05 55.88 0)
    (in_bom yes) (on_board yes)
    (uuid 00000000-0000-0000-0000-00005fb9cebe)
    (property "Reference" "#PWR?" (id 0) (at 146.05 62.23 0)
      (effects (font (size 1.27 1.27)) hide)
    )
    (property "Value" "GND" (id 1) (at 146.05 59.69 0))
    (property "Footprint" "" (id 2) (at 146.05 55.88 0)
      (effects (font (size 1.27 1.27)) hide)
    )
    (property "Datasheet" "" (id 3) (at 146.05 55.88 0)
      (effects (font (size 1.27 1.27)) hide)
    )
    (pin "1" (uuid da7d0237-2cb3-41b7-9b1a-ec19de8cd064))
  )

  (symbol (lib_id "power:GND") (at 101.6 55.88 0)
    (in_bom yes) (on_board yes)
    (uuid 00000000-0000-0000-0000-00005fb9ced4)
    (property "Reference" "#PWR?" (id 0) (at 101.6 62.23 0)
      (effects (font (size 1.27 1.27)) hide)
    )
    (property "Value" "GND" (id 1) (at 101.6 59.69 0))
    (property "Footprint" "" (id 2) (at 101.6 55.88 0)
      (effects (font (size 1.27 1.27)) hide)
    )
    (property "Datasheet" "" (id 3) (at 101.6 55.88 0)
      (effects (font (size 1.27 1.27)) hide)
    )
    (pin "1" (uuid c6a01587-1033-4a8d-bf9e-595177ee475f))
  )

  (symbol (lib_id "000_PreferredParts:C_1nF") (at 110.49 50.8 0)
    (in_bom yes) (on_board yes)
    (uuid 00000000-0000-0000-0000-00005fb9dd56)
    (property "Reference" "C2602" (id 0) (at 111.125 48.26 0)
      (effects (font (size 1.27 1.27)) (justify left))
    )
    (property "Value" "C_1nF" (id 1) (at 111.125 53.34 0)
      (effects (font (size 1.27 1.27)) (justify left))
    )
    (property "Footprint" "Capacitor_SMD:C_0402_1005Metric" (id 2) (at 111.4552 54.61 0)
      (effects (font (size 1.27 1.27)) hide)
    )
    (property "Datasheet" "~" (id 3) (at 110.49 50.8 0)
      (effects (font (size 1.27 1.27)) hide)
    )
    (property "PartSpecification" "3000-0000000128" (id 4) (at 110.49 50.8 0)
      (effects (font (size 1.27 1.27)) hide)
    )
    (pin "1" (uuid ed007350-ecf8-4b8a-bb10-ea3637f47b25))
    (pin "2" (uuid 5e1e6a59-3ef9-4f0d-b346-fb327234cbdf))
  )

  (symbol (lib_id "power:GND") (at 110.49 55.88 0)
    (in_bom yes) (on_board yes)
    (uuid 00000000-0000-0000-0000-00005fb9dd5c)
    (property "Reference" "#PWR?" (id 0) (at 110.49 62.23 0)
      (effects (font (size 1.27 1.27)) hide)
    )
    (property "Value" "GND" (id 1) (at 110.49 59.69 0))
    (property "Footprint" "" (id 2) (at 110.49 55.88 0)
      (effects (font (size 1.27 1.27)) hide)
    )
    (property "Datasheet" "" (id 3) (at 110.49 55.88 0)
      (effects (font (size 1.27 1.27)) hide)
    )
    (pin "1" (uuid 52718eef-6724-4431-92ec-88042bde2e74))
  )

  (symbol (lib_id "power:+3.3V") (at 120.65 38.1 0) (unit 1)
    (in_bom yes) (on_board yes)
    (uuid 00000000-0000-0000-0000-000060dfab6c)
    (property "Reference" "#PWR?" (id 0) (at 120.65 41.91 0)
      (effects (font (size 1.27 1.27)) hide)
    )
    (property "Value" "+3.3V" (id 1) (at 121.031 33.7058 0))
    (property "Footprint" "" (id 2) (at 120.65 38.1 0)
      (effects (font (size 1.27 1.27)) hide)
    )
    (property "Datasheet" "" (id 3) (at 120.65 38.1 0)
      (effects (font (size 1.27 1.27)) hide)
    )
    (pin "1" (uuid b3d2e239-2dfa-41fb-809d-49523e861d14))
  )
)
