EESchema Schematic File Version 4
LIBS:fdd_frontend_basestation-cache
EELAYER 30 0
EELAYER END
$Descr A4 11693 8268
encoding utf-8
Sheet 8 14
Title ""
Date ""
Rev ""
Comp ""
Comment1 ""
Comment2 ""
Comment3 ""
Comment4 ""
$EndDescr
$Comp
L Mechanical:MountingHole_Pad H?
U 1 1 5D630FA1
P 1800 1600
AR Path="/5D630FA1" Ref="H?"  Part="1" 
AR Path="/5D614D04/5D630FA1" Ref="H101"  Part="1" 
AR Path="/5D99036F/5D630FA1" Ref="H?"  Part="1" 
F 0 "H101" H 1900 1649 50  0000 L CNN
F 1 "MountingHole_Pad" H 1900 1558 50  0000 L CNN
F 2 "MountingHole:MountingHole_3.2mm_M3_ISO7380_Pad" H 1800 1600 50  0001 C CNN
F 3 "~" H 1800 1600 50  0001 C CNN
	1    1800 1600
	1    0    0    -1  
$EndComp
$Comp
L Mechanical:MountingHole_Pad H?
U 1 1 5D630FA7
P 2800 1600
AR Path="/5D630FA7" Ref="H?"  Part="1" 
AR Path="/5D614D04/5D630FA7" Ref="H102"  Part="1" 
AR Path="/5D99036F/5D630FA7" Ref="H?"  Part="1" 
F 0 "H102" H 2900 1649 50  0000 L CNN
F 1 "MountingHole_Pad" H 2900 1558 50  0000 L CNN
F 2 "MountingHole:MountingHole_3.2mm_M3_ISO7380_Pad" H 2800 1600 50  0001 C CNN
F 3 "~" H 2800 1600 50  0001 C CNN
	1    2800 1600
	1    0    0    -1  
$EndComp
$Comp
L Mechanical:MountingHole_Pad H?
U 1 1 5D630FAD
P 3800 1600
AR Path="/5D630FAD" Ref="H?"  Part="1" 
AR Path="/5D614D04/5D630FAD" Ref="H103"  Part="1" 
AR Path="/5D99036F/5D630FAD" Ref="H?"  Part="1" 
F 0 "H103" H 3900 1649 50  0000 L CNN
F 1 "MountingHole_Pad" H 3900 1558 50  0000 L CNN
F 2 "MountingHole:MountingHole_3.2mm_M3_ISO7380_Pad" H 3800 1600 50  0001 C CNN
F 3 "~" H 3800 1600 50  0001 C CNN
	1    3800 1600
	1    0    0    -1  
$EndComp
$Comp
L Mechanical:MountingHole_Pad H?
U 1 1 5D630FB3
P 4800 1600
AR Path="/5D630FB3" Ref="H?"  Part="1" 
AR Path="/5D614D04/5D630FB3" Ref="H104"  Part="1" 
AR Path="/5D99036F/5D630FB3" Ref="H?"  Part="1" 
F 0 "H104" H 4900 1649 50  0000 L CNN
F 1 "MountingHole_Pad" H 4900 1558 50  0000 L CNN
F 2 "MountingHole:MountingHole_3.2mm_M3_ISO7380_Pad" H 4800 1600 50  0001 C CNN
F 3 "~" H 4800 1600 50  0001 C CNN
	1    4800 1600
	1    0    0    -1  
$EndComp
$Comp
L power:GND #PWR?
U 1 1 5D630FB9
P 1800 1800
AR Path="/5D630FB9" Ref="#PWR?"  Part="1" 
AR Path="/5D614D04/5D630FB9" Ref="#PWR?"  Part="1" 
AR Path="/5D99036F/5D630FB9" Ref="#PWR?"  Part="1" 
F 0 "#PWR?" H 1800 1550 50  0001 C CNN
F 1 "GND" H 1805 1627 50  0000 C CNN
F 2 "" H 1800 1800 50  0001 C CNN
F 3 "" H 1800 1800 50  0001 C CNN
	1    1800 1800
	1    0    0    -1  
$EndComp
Wire Wire Line
	1800 1800 1800 1700
$Comp
L power:GND #PWR?
U 1 1 5D630FC0
P 2800 1800
AR Path="/5D630FC0" Ref="#PWR?"  Part="1" 
AR Path="/5D614D04/5D630FC0" Ref="#PWR?"  Part="1" 
AR Path="/5D99036F/5D630FC0" Ref="#PWR?"  Part="1" 
F 0 "#PWR?" H 2800 1550 50  0001 C CNN
F 1 "GND" H 2805 1627 50  0000 C CNN
F 2 "" H 2800 1800 50  0001 C CNN
F 3 "" H 2800 1800 50  0001 C CNN
	1    2800 1800
	1    0    0    -1  
$EndComp
Wire Wire Line
	2800 1800 2800 1700
$Comp
L power:GND #PWR?
U 1 1 5D630FC7
P 3800 1800
AR Path="/5D630FC7" Ref="#PWR?"  Part="1" 
AR Path="/5D614D04/5D630FC7" Ref="#PWR?"  Part="1" 
AR Path="/5D99036F/5D630FC7" Ref="#PWR?"  Part="1" 
F 0 "#PWR?" H 3800 1550 50  0001 C CNN
F 1 "GND" H 3805 1627 50  0000 C CNN
F 2 "" H 3800 1800 50  0001 C CNN
F 3 "" H 3800 1800 50  0001 C CNN
	1    3800 1800
	1    0    0    -1  
$EndComp
Wire Wire Line
	3800 1800 3800 1700
$Comp
L power:GND #PWR?
U 1 1 5D630FCE
P 4800 1800
AR Path="/5D630FCE" Ref="#PWR?"  Part="1" 
AR Path="/5D614D04/5D630FCE" Ref="#PWR?"  Part="1" 
AR Path="/5D99036F/5D630FCE" Ref="#PWR?"  Part="1" 
F 0 "#PWR?" H 4800 1550 50  0001 C CNN
F 1 "GND" H 4805 1627 50  0000 C CNN
F 2 "" H 4800 1800 50  0001 C CNN
F 3 "" H 4800 1800 50  0001 C CNN
	1    4800 1800
	1    0    0    -1  
$EndComp
Wire Wire Line
	4800 1800 4800 1700
$Comp
L Mechanical:MountingHole_Pad H?
U 1 1 5D6352A3
P 1800 2600
AR Path="/5D6352A3" Ref="H?"  Part="1" 
AR Path="/5D614D04/5D6352A3" Ref="H801"  Part="1" 
AR Path="/5D99036F/5D6352A3" Ref="H?"  Part="1" 
F 0 "H801" H 1900 2649 50  0000 L CNN
F 1 "MountingHole_Pad" H 1900 2558 50  0000 L CNN
F 2 "MountingHole:MountingHole_3.2mm_M3_ISO7380_Pad" H 1800 2600 50  0001 C CNN
F 3 "~" H 1800 2600 50  0001 C CNN
	1    1800 2600
	1    0    0    -1  
$EndComp
$Comp
L Mechanical:MountingHole_Pad H?
U 1 1 5D6352AD
P 2800 2600
AR Path="/5D6352AD" Ref="H?"  Part="1" 
AR Path="/5D614D04/5D6352AD" Ref="H802"  Part="1" 
AR Path="/5D99036F/5D6352AD" Ref="H?"  Part="1" 
F 0 "H802" H 2900 2649 50  0000 L CNN
F 1 "MountingHole_Pad" H 2900 2558 50  0000 L CNN
F 2 "MountingHole:MountingHole_3.2mm_M3_ISO7380_Pad" H 2800 2600 50  0001 C CNN
F 3 "~" H 2800 2600 50  0001 C CNN
	1    2800 2600
	1    0    0    -1  
$EndComp
$Comp
L Mechanical:MountingHole_Pad H?
U 1 1 5D6352B7
P 3800 2600
AR Path="/5D6352B7" Ref="H?"  Part="1" 
AR Path="/5D614D04/5D6352B7" Ref="H803"  Part="1" 
AR Path="/5D99036F/5D6352B7" Ref="H?"  Part="1" 
F 0 "H803" H 3900 2649 50  0000 L CNN
F 1 "MountingHole_Pad" H 3900 2558 50  0000 L CNN
F 2 "MountingHole:MountingHole_3.2mm_M3_ISO7380_Pad" H 3800 2600 50  0001 C CNN
F 3 "~" H 3800 2600 50  0001 C CNN
	1    3800 2600
	1    0    0    -1  
$EndComp
$Comp
L Mechanical:MountingHole_Pad H?
U 1 1 5D6352C1
P 4800 2600
AR Path="/5D6352C1" Ref="H?"  Part="1" 
AR Path="/5D614D04/5D6352C1" Ref="H804"  Part="1" 
AR Path="/5D99036F/5D6352C1" Ref="H?"  Part="1" 
F 0 "H804" H 4900 2649 50  0000 L CNN
F 1 "MountingHole_Pad" H 4900 2558 50  0000 L CNN
F 2 "MountingHole:MountingHole_3.2mm_M3_ISO7380_Pad" H 4800 2600 50  0001 C CNN
F 3 "~" H 4800 2600 50  0001 C CNN
	1    4800 2600
	1    0    0    -1  
$EndComp
NoConn ~ 4800 2700
NoConn ~ 3800 2700
NoConn ~ 2800 2700
NoConn ~ 1800 2700
$EndSCHEMATC
