EESchema Schematic File Version 4
LIBS:fdd_frontend_basestation-cache
EELAYER 30 0
EELAYER END
$Descr A4 11693 8268
encoding utf-8
Sheet 5 14
Title ""
Date ""
Rev ""
Comp ""
Comment1 ""
Comment2 ""
Comment3 ""
Comment4 ""
$EndDescr
$Comp
L POWDER_MCU:MSP432E401YTPDTR U501
U 2 1 5D69BE6F
P 9350 2200
F 0 "U501" H 10150 3500 60  0000 C CNN
F 1 "MSP432E401YTPDTR" H 9400 3500 60  0000 C CNN
F 2 "POWDER_MCU:MSP432E401YTPDTR" H 9350 1740 60  0001 C CNN
F 3 "" H 9350 1800 60  0000 C CNN
F 4 "Texas Instruments" H 9350 2200 50  0001 C CNN "Manufacturer"
F 5 "MSP432E401YTPDTR" H 9350 2200 50  0001 C CNN "PartNumber"
F 6 "3000-0000000080" H 9350 2200 50  0001 C CNN "PartSpecification"
	2    9350 2200
	1    0    0    -1  
$EndComp
$Comp
L POWDER_MCU:MSP432E401YTPDTR U501
U 1 1 5D69BFA2
P 5350 2650
F 0 "U501" H 6050 4450 60  0000 C CNN
F 1 "MSP432E401YTPDTR" H 5350 3332 60  0000 C CNN
F 2 "POWDER_MCU:MSP432E401YTPDTR" H 5350 2190 60  0001 C CNN
F 3 "" H 5350 2250 60  0000 C CNN
F 4 "Texas Instruments" H 5350 2650 50  0001 C CNN "Manufacturer"
F 5 "MSP432E401YTPDTR" H 5350 2650 50  0001 C CNN "PartNumber"
F 6 "3000-0000000080" H 5350 2650 50  0001 C CNN "PartSpecification"
	1    5350 2650
	1    0    0    -1  
$EndComp
Wire Wire Line
	6250 1700 6750 1700
Wire Wire Line
	6250 2100 6750 2100
Text HLabel 6750 1700 2    50   Output ~ 0
LINK_LED
Text HLabel 6750 2100 2    50   Output ~ 0
ACT_LED
$Comp
L Connector:USB_B_Micro J502
U 1 1 5D876CF9
P 3450 6250
F 0 "J502" H 3505 6717 50  0000 C CNN
F 1 "USB_B_Micro" H 3505 6626 50  0000 C CNN
F 2 "Connector_USB:USB_Micro-B_Amphenol_10103594-0001LF_Horizontal" H 3600 6200 50  0001 C CNN
F 3 "~" H 3600 6200 50  0001 C CNN
F 4 "Amphenol ICC (FCI)" H 3450 6250 50  0001 C CNN "Manufacturer"
F 5 "10103594-0001LF" H 3450 6250 50  0001 C CNN "PartNumber"
F 6 "3000-0000000158" H 3450 6250 50  0001 C CNN "PartSpecification"
	1    3450 6250
	1    0    0    -1  
$EndComp
Wire Wire Line
	4450 2000 3900 2000
Text Label 3900 2000 0    50   ~ 0
VBUS
Wire Wire Line
	8500 1650 8050 1650
Wire Wire Line
	8050 1750 8500 1750
Text Label 8050 1650 0    50   ~ 0
USBPD_P
Text Label 8050 1750 0    50   ~ 0
USBPD_N
$Comp
L Device:R R501
U 1 1 5D8778AC
P 3650 1900
F 0 "R501" V 3443 1900 50  0000 C CNN
F 1 "100" V 3534 1900 50  0000 C CNN
F 2 "Resistor_SMD:R_0402_1005Metric" V 3580 1900 50  0001 C CNN
F 3 "~" H 3650 1900 50  0001 C CNN
F 4 "Delta Electronics/Cyntec" H 3650 1900 50  0001 C CNN "Manufacturer"
F 5 "PFR05S-101-FNH" H 3650 1900 50  0001 C CNN "PartNumber"
F 6 "3000-0000000149" H 3650 1900 50  0001 C CNN "PartSpecification"
	1    3650 1900
	0    1    1    0   
$EndComp
Text Label 3850 1900 0    50   ~ 0
USB_ID_MCU
Wire Wire Line
	3800 1900 4450 1900
Text Label 3200 1900 0    50   ~ 0
USB_ID
Wire Wire Line
	3200 1900 3500 1900
Wire Wire Line
	3750 6450 4150 6450
Wire Wire Line
	4150 6450 4150 6500
Wire Wire Line
	4150 6500 4700 6500
Wire Wire Line
	4700 6350 3750 6350
Wire Wire Line
	3750 6250 4150 6250
Wire Wire Line
	4150 6250 4150 6200
Wire Wire Line
	4150 6200 4700 6200
Text Label 4200 6200 0    50   ~ 0
USBPD_P
Text Label 4200 6350 0    50   ~ 0
USBPD_N
Text Label 4200 6500 0    50   ~ 0
USB_ID
Wire Wire Line
	3750 6050 4150 6050
Text Label 3900 6050 0    50   ~ 0
VBUS
$Comp
L power:GND #PWR?
U 1 1 5D879561
P 3750 6750
F 0 "#PWR?" H 3750 6500 50  0001 C CNN
F 1 "GND" H 3755 6577 50  0000 C CNN
F 2 "" H 3750 6750 50  0001 C CNN
F 3 "" H 3750 6750 50  0001 C CNN
	1    3750 6750
	1    0    0    -1  
$EndComp
$Comp
L power:GND #PWR?
U 1 1 5D879712
P 3350 7150
F 0 "#PWR?" H 3350 6900 50  0001 C CNN
F 1 "GND" H 3355 6977 50  0000 C CNN
F 2 "" H 3350 7150 50  0001 C CNN
F 3 "" H 3350 7150 50  0001 C CNN
	1    3350 7150
	1    0    0    -1  
$EndComp
$Comp
L Device:R R502
U 1 1 5D879736
P 3350 6900
F 0 "R502" H 3280 6854 50  0000 R CNN
F 1 "1M" H 3280 6945 50  0000 R CNN
F 2 "Resistor_SMD:R_0402_1005Metric" V 3280 6900 50  0001 C CNN
F 3 "~" H 3350 6900 50  0001 C CNN
F 4 "Delta Electronics/Cyntec" H 3350 6900 50  0001 C CNN "Manufacturer"
F 5 "PFR05S-105-FNH" H 3350 6900 50  0001 C CNN "PartNumber"
F 6 "3000-0000000139" H 3350 6900 50  0001 C CNN "PartSpecification"
	1    3350 6900
	-1   0    0    1   
$EndComp
Wire Wire Line
	3450 6650 3450 6700
Wire Wire Line
	3450 6700 3750 6700
Wire Wire Line
	3750 6700 3750 6750
Wire Wire Line
	3350 7050 3350 7150
$Comp
L 000_PreferredParts:C_1nF C503
U 1 1 5D87AA0C
P 2900 6950
F 0 "C503" H 3015 6996 50  0000 L CNN
F 1 "C_1nF" H 3015 6905 50  0000 L CNN
F 2 "Capacitor_SMD:C_0402_1005Metric" H 2938 6800 50  0001 C CNN
F 3 "~" H 2900 6950 50  0001 C CNN
F 4 "Wurth Electronics Inc." H 2900 6950 50  0001 C CNN "Manufacturer"
F 5 "885012205061" H 2900 6950 50  0001 C CNN "PartNumber"
F 6 "3000-0000000128" H 0   0   50  0001 C CNN "PartSpecification"
	1    2900 6950
	1    0    0    -1  
$EndComp
$Comp
L 000_PreferredParts:C_1nF C502
U 1 1 5D87AA50
P 2400 6950
F 0 "C502" H 2515 6996 50  0000 L CNN
F 1 "C_1nF" H 2515 6905 50  0000 L CNN
F 2 "Capacitor_SMD:C_0402_1005Metric" H 2438 6800 50  0001 C CNN
F 3 "~" H 2400 6950 50  0001 C CNN
F 4 "Wurth Electronics Inc." H 2400 6950 50  0001 C CNN "Manufacturer"
F 5 "885012205061" H 2400 6950 50  0001 C CNN "PartNumber"
F 6 "3000-0000000128" H 0   0   50  0001 C CNN "PartSpecification"
	1    2400 6950
	1    0    0    -1  
$EndComp
$Comp
L 000_PreferredParts:C_1nF C501
U 1 1 5D87AA80
P 1900 6950
F 0 "C501" H 2015 6996 50  0000 L CNN
F 1 "C_1nF" H 2015 6905 50  0000 L CNN
F 2 "Capacitor_SMD:C_0402_1005Metric" H 1938 6800 50  0001 C CNN
F 3 "~" H 1900 6950 50  0001 C CNN
F 4 "Wurth Electronics Inc." H 1900 6950 50  0001 C CNN "Manufacturer"
F 5 "885012205061" H 1900 6950 50  0001 C CNN "PartNumber"
F 6 "3000-0000000128" H 0   0   50  0001 C CNN "PartSpecification"
	1    1900 6950
	1    0    0    -1  
$EndComp
$Comp
L power:GND #PWR?
U 1 1 5D87AAB4
P 2900 7200
F 0 "#PWR?" H 2900 6950 50  0001 C CNN
F 1 "GND" H 2905 7027 50  0000 C CNN
F 2 "" H 2900 7200 50  0001 C CNN
F 3 "" H 2900 7200 50  0001 C CNN
	1    2900 7200
	1    0    0    -1  
$EndComp
$Comp
L power:GND #PWR?
U 1 1 5D87AAD1
P 2400 7200
F 0 "#PWR?" H 2400 6950 50  0001 C CNN
F 1 "GND" H 2405 7027 50  0000 C CNN
F 2 "" H 2400 7200 50  0001 C CNN
F 3 "" H 2400 7200 50  0001 C CNN
	1    2400 7200
	1    0    0    -1  
$EndComp
$Comp
L power:GND #PWR?
U 1 1 5D87AAEE
P 1900 7200
F 0 "#PWR?" H 1900 6950 50  0001 C CNN
F 1 "GND" H 1905 7027 50  0000 C CNN
F 2 "" H 1900 7200 50  0001 C CNN
F 3 "" H 1900 7200 50  0001 C CNN
	1    1900 7200
	1    0    0    -1  
$EndComp
Wire Wire Line
	1900 7200 1900 7100
Wire Wire Line
	2400 7100 2400 7200
Wire Wire Line
	2900 7200 2900 7100
Wire Wire Line
	3350 6700 2900 6700
Wire Wire Line
	1900 6700 1900 6800
Wire Wire Line
	2400 6800 2400 6700
Connection ~ 2400 6700
Wire Wire Line
	2400 6700 1900 6700
Wire Wire Line
	2900 6800 2900 6700
Connection ~ 2900 6700
Wire Wire Line
	2900 6700 2400 6700
Text Label 3800 2600 0    50   ~ 0
TCK
Text Label 3800 2700 0    50   ~ 0
TMS
Text Label 3800 2800 0    50   ~ 0
TDI
Text Label 3800 2900 0    50   ~ 0
TDO
$Comp
L Connector_Generic:Conn_02x05_Odd_Even J501
U 1 1 5D87FEC7
P 1600 3000
F 0 "J501" H 1650 3417 50  0000 C CNN
F 1 "Conn_02x05_Odd_Even" H 1650 3326 50  0000 C CNN
F 2 "POWDER_MCU:ARM_JTAG_0.127_10" H 1600 3000 50  0001 C CNN
F 3 "~" H 1600 3000 50  0001 C CNN
F 4 "Amphenol ICC (FCI)" H 1600 3000 50  0001 C CNN "Manufacturer"
F 5 "20021521-00010T4LF" H 1600 3000 50  0001 C CNN "PartNumber"
F 6 "3000-0000000164" H 1600 3000 50  0001 C CNN "PartSpecification"
	1    1600 3000
	1    0    0    -1  
$EndComp
$Comp
L power:+3.3V #PWR?
U 1 1 5D880060
P 1150 2600
F 0 "#PWR?" H 1150 2450 50  0001 C CNN
F 1 "+3.3V" H 1165 2773 50  0000 C CNN
F 2 "" H 1150 2600 50  0001 C CNN
F 3 "" H 1150 2600 50  0001 C CNN
	1    1150 2600
	1    0    0    -1  
$EndComp
Wire Wire Line
	1150 2600 1150 2800
Wire Wire Line
	1150 2800 1400 2800
Wire Wire Line
	2500 2800 1900 2800
$Comp
L power:GND #PWR?
U 1 1 5D88118A
P 1300 3300
F 0 "#PWR?" H 1300 3050 50  0001 C CNN
F 1 "GND" H 1305 3127 50  0000 C CNN
F 2 "" H 1300 3300 50  0001 C CNN
F 3 "" H 1300 3300 50  0001 C CNN
	1    1300 3300
	1    0    0    -1  
$EndComp
Wire Wire Line
	1300 3300 1300 3200
Wire Wire Line
	1300 3200 1400 3200
Wire Wire Line
	1400 3100 1300 3100
Wire Wire Line
	1300 3100 1300 3200
Connection ~ 1300 3200
Wire Wire Line
	1300 3100 1300 3000
Wire Wire Line
	1300 3000 1400 3000
Connection ~ 1300 3100
Wire Wire Line
	1400 2900 1300 2900
Wire Wire Line
	1300 2900 1300 3000
Connection ~ 1300 3000
Wire Wire Line
	2400 2900 1900 2900
Wire Wire Line
	1900 3000 2500 3000
Wire Wire Line
	2500 3000 2500 2900
Wire Wire Line
	1900 3100 2600 3100
Wire Wire Line
	2600 3100 2600 2800
Wire Wire Line
	1900 3200 2150 3200
Text HLabel 2150 3200 2    50   Output ~ 0
RST
Wire Wire Line
	4450 1000 4050 1000
Wire Wire Line
	4050 1100 4450 1100
Wire Wire Line
	4450 1200 4050 1200
Wire Wire Line
	4050 1300 4450 1300
Wire Wire Line
	6250 1000 6700 1000
Wire Wire Line
	6700 1100 6250 1100
Wire Wire Line
	6250 1200 6700 1200
Wire Wire Line
	6700 1300 6250 1300
Wire Wire Line
	8500 2850 8200 2850
Wire Wire Line
	8200 2950 8500 2950
Wire Wire Line
	8500 3050 8200 3050
Wire Wire Line
	8200 3150 8500 3150
Text HLabel 4050 1000 0    50   BiDi ~ 0
PA0
Text HLabel 4050 1100 0    50   BiDi ~ 0
PA1
Text HLabel 4050 1200 0    50   BiDi ~ 0
PA2
Text HLabel 4050 1300 0    50   BiDi ~ 0
PA3
Text HLabel 8200 2850 0    50   BiDi ~ 0
PN0
Text HLabel 8200 2950 0    50   BiDi ~ 0
PN1
Text HLabel 8200 3050 0    50   BiDi ~ 0
PN2
Text HLabel 8200 3150 0    50   BiDi ~ 0
PN3
Text HLabel 6700 1000 2    50   Input ~ 0
ADC3
Text HLabel 6700 1100 2    50   Input ~ 0
ADC2
Text HLabel 6700 1200 2    50   Input ~ 0
ADC1
Text HLabel 6700 1300 2    50   Input ~ 0
ADC0
Wire Wire Line
	6250 2600 6700 2600
Wire Wire Line
	6700 2700 6250 2700
Wire Wire Line
	6250 2800 6700 2800
Wire Wire Line
	6700 2900 6250 2900
Text HLabel 6700 2600 2    50   BiDi ~ 0
PH0
Text HLabel 6700 2700 2    50   BiDi ~ 0
PH1
Text HLabel 6700 2800 2    50   BiDi ~ 0
PH2
Text HLabel 6700 2900 2    50   BiDi ~ 0
PH3
Wire Wire Line
	6250 3400 6700 3400
Wire Wire Line
	6700 3500 6250 3500
Wire Wire Line
	6250 3600 6700 3600
Wire Wire Line
	6700 3700 6250 3700
Text HLabel 6700 3400 2    50   BiDi ~ 0
PK0
Text HLabel 6700 3500 2    50   BiDi ~ 0
PK1
Text HLabel 6700 3600 2    50   BiDi ~ 0
PK2
Text HLabel 6700 3700 2    50   BiDi ~ 0
PK3
Wire Wire Line
	6250 3800 6700 3800
Wire Wire Line
	6700 3900 6250 3900
Wire Wire Line
	6250 4000 6700 4000
Wire Wire Line
	6700 4100 6250 4100
Text HLabel 6700 3800 2    50   BiDi ~ 0
PK4
Text HLabel 6700 3900 2    50   BiDi ~ 0
PK5
Text HLabel 6700 4000 2    50   BiDi ~ 0
PK6
Text HLabel 6700 4100 2    50   BiDi ~ 0
PK7
Wire Wire Line
	8500 1050 8050 1050
Wire Wire Line
	8050 1150 8500 1150
Wire Wire Line
	8500 1250 8050 1250
Wire Wire Line
	8050 1350 8500 1350
Text HLabel 8050 1050 0    50   BiDi ~ 0
PL0
Text HLabel 8050 1150 0    50   BiDi ~ 0
PL1
Text HLabel 8050 1250 0    50   BiDi ~ 0
PL2
Text HLabel 8050 1350 0    50   BiDi ~ 0
PL3
$Comp
L POWDER_ESD:TPD6E004 U502
U 1 1 5DE71314
P 1700 5250
F 0 "U502" H 2350 6000 50  0000 C CNN
F 1 "TPD6E004" H 1100 6000 50  0000 C CNN
F 2 "POWDER_ESD:TPD6E004_RSE_8" H 950 6400 50  0001 C CNN
F 3 "" H 1000 6100 50  0001 C CNN
F 4 "Texas Instruments" H 1700 5250 50  0001 C CNN "Manufacturer"
F 5 "TPD6E004RSER" H 1700 5250 50  0001 C CNN "PartNumber"
F 6 "3000-0000000082" H 1700 5250 50  0001 C CNN "PartSpecification"
	1    1700 5250
	1    0    0    -1  
$EndComp
$Comp
L power:+3.3V #PWR?
U 1 1 5DE71434
P 1700 4300
F 0 "#PWR?" H 1700 4150 50  0001 C CNN
F 1 "+3.3V" H 1715 4473 50  0000 C CNN
F 2 "" H 1700 4300 50  0001 C CNN
F 3 "" H 1700 4300 50  0001 C CNN
	1    1700 4300
	1    0    0    -1  
$EndComp
Wire Wire Line
	1700 4300 1700 4400
Wire Wire Line
	750  5100 550  5100
Wire Wire Line
	550  5250 750  5250
Wire Wire Line
	750  5400 550  5400
Wire Wire Line
	2650 5100 2850 5100
Wire Wire Line
	2850 5250 2650 5250
Wire Wire Line
	2650 5400 2850 5400
Text Label 600  5250 0    50   ~ 0
TCK
Text Label 600  5100 0    50   ~ 0
TMS
Text Label 2700 5400 0    50   ~ 0
TDI
Text Label 600  5400 0    50   ~ 0
TDO
$Comp
L POWDER_ESD:TPD6E004 U503
U 1 1 5DE823EC
P 5650 6350
F 0 "U503" H 6300 7100 50  0000 C CNN
F 1 "TPD6E004" H 5050 7100 50  0000 C CNN
F 2 "POWDER_ESD:TPD6E004_RSE_8" H 4900 7500 50  0001 C CNN
F 3 "" H 4950 7200 50  0001 C CNN
F 4 "Texas Instruments" H 5650 6350 50  0001 C CNN "Manufacturer"
F 5 "TPD6E004RSER" H 5650 6350 50  0001 C CNN "PartNumber"
F 6 "3000-0000000082" H 5650 6350 50  0001 C CNN "PartSpecification"
	1    5650 6350
	1    0    0    -1  
$EndComp
Wire Wire Line
	4150 5300 5650 5300
Wire Wire Line
	5650 5300 5650 5500
Wire Wire Line
	4150 5300 4150 6050
Text Label 1950 3200 0    50   ~ 0
RST
Text Label 2700 5250 0    50   ~ 0
RST
$Comp
L power:GND #PWR?
U 1 1 5DE87B29
P 5650 7300
F 0 "#PWR?" H 5650 7050 50  0001 C CNN
F 1 "GND" H 5655 7127 50  0000 C CNN
F 2 "" H 5650 7300 50  0001 C CNN
F 3 "" H 5650 7300 50  0001 C CNN
	1    5650 7300
	1    0    0    -1  
$EndComp
Wire Wire Line
	5650 7300 5650 7200
Text Label 2500 6700 0    50   ~ 0
USB_SHIELD
$Comp
L power:GND #PWR?
U 1 1 5D66311B
P 1700 6200
F 0 "#PWR?" H 1700 5950 50  0001 C CNN
F 1 "GND" H 1705 6027 50  0000 C CNN
F 2 "" H 1700 6200 50  0001 C CNN
F 3 "" H 1700 6200 50  0001 C CNN
	1    1700 6200
	1    0    0    -1  
$EndComp
Wire Wire Line
	1700 6200 1700 6100
Text Label 4200 3900 0    50   ~ 0
RXD
Text Label 4200 4000 0    50   ~ 0
TXD
$Comp
L Connector:TestPoint TP502
U 1 1 5D8440DA
P 3350 3900
F 0 "TP502" H 3408 4018 50  0000 L CNN
F 1 "TestPoint" H 3408 3927 50  0000 L CNN
F 2 "TestPoint:TestPoint_Pad_D1.0mm" H 3550 3900 50  0001 C CNN
F 3 "~" H 3550 3900 50  0001 C CNN
	1    3350 3900
	1    0    0    -1  
$EndComp
$Comp
L Connector:TestPoint TP501
U 1 1 5D8448C3
P 3550 4000
F 0 "TP501" H 3608 4118 50  0000 L CNN
F 1 "TestPoint" H 3608 4027 50  0000 L CNN
F 2 "TestPoint:TestPoint_Pad_D1.0mm" H 3750 4000 50  0001 C CNN
F 3 "~" H 3750 4000 50  0001 C CNN
	1    3550 4000
	1    0    0    1   
$EndComp
Wire Wire Line
	3350 3900 4450 3900
$Comp
L POWDER_Misc:25AA02E48 U504
U 1 1 5EBB6AE1
P 8550 5650
F 0 "U504" H 8850 6000 50  0000 C CNN
F 1 "25AA02E48" H 8550 5650 50  0000 C CNN
F 2 "Package_SO:SOIC-8_3.9x4.9mm_P1.27mm" H 9450 5200 50  0001 C CNN
F 3 "" H 8550 5650 50  0001 C CNN
F 4 "3000-0000000189" H 8550 5650 50  0001 C CNN "PartSpecification"
	1    8550 5650
	1    0    0    -1  
$EndComp
Wire Wire Line
	6700 1400 6250 1400
Wire Wire Line
	6700 1500 6250 1500
Text HLabel 6700 1400 2    50   Input ~ 0
ADC9
Text HLabel 6700 1500 2    50   Input ~ 0
ADC8
Wire Wire Line
	3350 6650 3350 6700
Connection ~ 3350 6700
Wire Wire Line
	3350 6700 3350 6750
Wire Wire Line
	8500 3250 8200 3250
Wire Wire Line
	8200 3350 8500 3350
Text HLabel 8200 3250 0    50   BiDi ~ 0
PN4
Text HLabel 8200 3350 0    50   BiDi ~ 0
PN5
Wire Wire Line
	4450 1400 4050 1400
Wire Wire Line
	4050 1500 4450 1500
Text HLabel 4050 1400 0    50   BiDi ~ 0
PA4
Text HLabel 4050 1500 0    50   BiDi ~ 0
PA5
Wire Wire Line
	4450 3500 4000 3500
Text Label 4050 3500 0    50   ~ 0
SSI2RX
Wire Wire Line
	4450 3600 4000 3600
Wire Wire Line
	4000 3700 4450 3700
Wire Wire Line
	4000 3800 4450 3800
Text Label 4050 3600 0    50   ~ 0
SSI2TX
Text Label 4050 3700 0    50   ~ 0
SSI2Fss
Text Label 4050 3800 0    50   ~ 0
SSI2Clk
Text HLabel 4000 3500 0    50   BiDi ~ 0
SSI2RX
Wire Wire Line
	2500 2900 4450 2900
Wire Wire Line
	2600 2800 4450 2800
Wire Wire Line
	2500 2700 4450 2700
Wire Wire Line
	2400 2600 4450 2600
Text HLabel 4000 3600 0    50   BiDi ~ 0
SSI2TX
Text HLabel 4000 3700 0    50   BiDi ~ 0
SSI2Fss
Text HLabel 4000 3800 0    50   BiDi ~ 0
SSI2Clk
Wire Wire Line
	7950 5500 7500 5500
Text Label 7550 5500 0    50   ~ 0
SSI2RX
Wire Wire Line
	7950 5600 7500 5600
Wire Wire Line
	7500 5800 7950 5800
Wire Wire Line
	7500 5700 7950 5700
Text Label 7550 5600 0    50   ~ 0
SSI2TX
Text Label 7550 5800 0    50   ~ 0
MAC_CS
Text Label 7550 5700 0    50   ~ 0
SSI2Clk
$Comp
L power:GND #PWR?
U 1 1 5DF4AACC
P 8550 6150
F 0 "#PWR?" H 8550 5900 50  0001 C CNN
F 1 "GND" H 8555 5977 50  0000 C CNN
F 2 "" H 8550 6150 50  0001 C CNN
F 3 "" H 8550 6150 50  0001 C CNN
	1    8550 6150
	1    0    0    -1  
$EndComp
$Comp
L power:+3.3V #PWR?
U 1 1 5DF55195
P 8550 5200
F 0 "#PWR?" H 8550 5050 50  0001 C CNN
F 1 "+3.3V" H 8565 5373 50  0000 C CNN
F 2 "" H 8550 5200 50  0001 C CNN
F 3 "" H 8550 5200 50  0001 C CNN
	1    8550 5200
	1    0    0    -1  
$EndComp
Wire Wire Line
	8550 5200 8550 5250
Wire Wire Line
	4000 4100 4450 4100
Text Label 4050 4100 0    50   ~ 0
MAC_CS
$Comp
L Device:R R515
U 1 1 5DF769EB
P 9400 5250
F 0 "R515" V 9193 5250 50  0000 C CNN
F 1 "100" V 9284 5250 50  0000 C CNN
F 2 "Resistor_SMD:R_0402_1005Metric" V 9330 5250 50  0001 C CNN
F 3 "~" H 9400 5250 50  0001 C CNN
F 4 "Delta Electronics/Cyntec" H 9400 5250 50  0001 C CNN "Manufacturer"
F 5 "PFR05S-101-FNH" H 9400 5250 50  0001 C CNN "PartNumber"
F 6 "3000-0000000149" H 9400 5250 50  0001 C CNN "PartSpecification"
	1    9400 5250
	-1   0    0    1   
$EndComp
$Comp
L power:+3.3V #PWR?
U 1 1 5DF7736A
P 9400 5000
F 0 "#PWR?" H 9400 4850 50  0001 C CNN
F 1 "+3.3V" H 9415 5173 50  0000 C CNN
F 2 "" H 9400 5000 50  0001 C CNN
F 3 "" H 9400 5000 50  0001 C CNN
	1    9400 5000
	1    0    0    -1  
$EndComp
Wire Wire Line
	9400 5000 9400 5100
Wire Wire Line
	9400 5400 9400 5750
Wire Wire Line
	9400 5750 9150 5750
Wire Wire Line
	8550 6050 8550 6150
Wire Wire Line
	4450 4200 4000 4200
$Comp
L Device:R R516
U 1 1 5DF8AEE0
P 9600 5850
F 0 "R516" V 9393 5850 50  0000 C CNN
F 1 "100" V 9484 5850 50  0000 C CNN
F 2 "Resistor_SMD:R_0402_1005Metric" V 9530 5850 50  0001 C CNN
F 3 "~" H 9600 5850 50  0001 C CNN
F 4 "Delta Electronics/Cyntec" H 9600 5850 50  0001 C CNN "Manufacturer"
F 5 "PFR05S-101-FNH" H 9600 5850 50  0001 C CNN "PartNumber"
F 6 "3000-0000000149" H 9600 5850 50  0001 C CNN "PartSpecification"
	1    9600 5850
	-1   0    0    1   
$EndComp
Wire Wire Line
	9600 5700 9600 5550
Wire Wire Line
	9600 5550 9150 5550
$Comp
L power:GND #PWR?
U 1 1 5DF9039C
P 9600 6150
F 0 "#PWR?" H 9600 5900 50  0001 C CNN
F 1 "GND" H 9605 5977 50  0000 C CNN
F 2 "" H 9600 6150 50  0001 C CNN
F 3 "" H 9600 6150 50  0001 C CNN
	1    9600 6150
	1    0    0    -1  
$EndComp
Wire Wire Line
	9600 6150 9600 6000
$Comp
L Connector:TestPoint TP503
U 1 1 5DF99858
P 9900 5400
F 0 "TP503" H 9958 5518 50  0000 L CNN
F 1 "TestPoint" H 9958 5427 50  0000 L CNN
F 2 "TestPoint:TestPoint_Pad_D1.0mm" H 10100 5400 50  0001 C CNN
F 3 "~" H 10100 5400 50  0001 C CNN
	1    9900 5400
	1    0    0    -1  
$EndComp
Wire Wire Line
	9900 5400 9900 5550
Wire Wire Line
	9900 5550 9600 5550
Connection ~ 9600 5550
Text Label 7950 1950 0    50   ~ 0
SDR_GPIO0
Wire Wire Line
	7850 2650 8500 2650
Text Label 7950 2050 0    50   ~ 0
SDR_GPIO1
Text Label 7950 2150 0    50   ~ 0
SDR_GPIO2
Text Label 7950 2250 0    50   ~ 0
SDR_GPIO3
Text Label 7950 2350 0    50   ~ 0
SDR_GPIO4
Text Label 7950 2450 0    50   ~ 0
SDR_GPIO5
Text Label 7950 2550 0    50   ~ 0
SDR_GPIO6
Text Label 7950 2650 0    50   ~ 0
SDR_GPIO7
Text Label 10350 1750 0    50   ~ 0
SDR_GPIO8
Text Label 10350 1850 0    50   ~ 0
SDR_GPIO9
Text Label 10350 1950 0    50   ~ 0
SDR_GPIO10
Text Label 10350 2050 0    50   ~ 0
SDR_GPIO11
Entry Wire Line
	7850 2650 7750 2750
Wire Bus Line
	7750 4500 11000 4500
Entry Wire Line
	7750 2650 7850 2550
Entry Wire Line
	7750 2550 7850 2450
Entry Wire Line
	7750 2450 7850 2350
Entry Wire Line
	7750 2350 7850 2250
Entry Wire Line
	7750 2250 7850 2150
Entry Wire Line
	7750 2150 7850 2050
Entry Wire Line
	7750 2050 7850 1950
Wire Wire Line
	7850 1950 8500 1950
Wire Wire Line
	7850 2050 8500 2050
Wire Wire Line
	7850 2150 8500 2150
Wire Wire Line
	7850 2250 8500 2250
Wire Wire Line
	7850 2350 8500 2350
Wire Wire Line
	7850 2450 8500 2450
Wire Wire Line
	7850 2550 8500 2550
Entry Wire Line
	10900 1750 11000 1850
Entry Wire Line
	10900 1850 11000 1950
Entry Wire Line
	10900 1950 11000 2050
Entry Wire Line
	10900 2050 11000 2150
Wire Wire Line
	10250 1750 10900 1750
Wire Wire Line
	10250 1850 10900 1850
Wire Wire Line
	10250 1950 10900 1950
Wire Wire Line
	10250 2050 10900 2050
Text HLabel 7650 4500 0    50   BiDi ~ 0
SDR_GPIO[0..11]
Wire Bus Line
	7650 4500 7750 4500
Connection ~ 7750 4500
Text Label 7900 4500 0    50   ~ 0
SDR_GPIO[0..11]
$Comp
L Switch:SW_Push SW?
U 1 1 5E3102F6
P 1000 1300
AR Path="/5D69D382/5E3102F6" Ref="SW?"  Part="1" 
AR Path="/5D67C7FD/5E3102F6" Ref="SW501"  Part="1" 
F 0 "SW501" V 954 1448 50  0000 L CNN
F 1 "SW_Push" V 1045 1448 50  0000 L CNN
F 2 "Button_Switch_SMD:SW_SPST_PTS645" H 1000 1500 50  0001 C CNN
F 3 "" H 1000 1500 50  0001 C CNN
F 4 "C&K" H 1000 1300 50  0001 C CNN "Manufacturer"
F 5 "PTS645SK43SMTR92 LFS" H 1000 1300 50  0001 C CNN "PartNumber"
F 6 "3000-0000000176" H 1000 1300 50  0001 C CNN "PartSpecification"
	1    1000 1300
	0    1    1    0   
$EndComp
$Comp
L Switch:SW_Push SW?
U 1 1 5E315FAA
P 1500 1300
AR Path="/5D69D382/5E315FAA" Ref="SW?"  Part="1" 
AR Path="/5D67C7FD/5E315FAA" Ref="SW502"  Part="1" 
F 0 "SW502" V 1454 1448 50  0000 L CNN
F 1 "SW_Push" V 1545 1448 50  0000 L CNN
F 2 "Button_Switch_SMD:SW_SPST_PTS645" H 1500 1500 50  0001 C CNN
F 3 "" H 1500 1500 50  0001 C CNN
F 4 "C&K" H 1500 1300 50  0001 C CNN "Manufacturer"
F 5 "PTS645SK43SMTR92 LFS" H 1500 1300 50  0001 C CNN "PartNumber"
F 6 "3000-0000000176" H 1500 1300 50  0001 C CNN "PartSpecification"
	1    1500 1300
	0    1    1    0   
$EndComp
$Comp
L Switch:SW_Push SW?
U 1 1 5E31BCEB
P 2000 1300
AR Path="/5D69D382/5E31BCEB" Ref="SW?"  Part="1" 
AR Path="/5D67C7FD/5E31BCEB" Ref="SW503"  Part="1" 
F 0 "SW503" V 1954 1448 50  0000 L CNN
F 1 "SW_Push" V 2045 1448 50  0000 L CNN
F 2 "Button_Switch_SMD:SW_SPST_PTS645" H 2000 1500 50  0001 C CNN
F 3 "" H 2000 1500 50  0001 C CNN
F 4 "C&K" H 2000 1300 50  0001 C CNN "Manufacturer"
F 5 "PTS645SK43SMTR92 LFS" H 2000 1300 50  0001 C CNN "PartNumber"
F 6 "3000-0000000176" H 2000 1300 50  0001 C CNN "PartSpecification"
	1    2000 1300
	0    1    1    0   
$EndComp
$Comp
L Switch:SW_Push SW?
U 1 1 5E321A7F
P 2500 1300
AR Path="/5D69D382/5E321A7F" Ref="SW?"  Part="1" 
AR Path="/5D67C7FD/5E321A7F" Ref="SW504"  Part="1" 
F 0 "SW504" V 2454 1448 50  0000 L CNN
F 1 "SW_Push" V 2545 1448 50  0000 L CNN
F 2 "Button_Switch_SMD:SW_SPST_PTS645" H 2500 1500 50  0001 C CNN
F 3 "" H 2500 1500 50  0001 C CNN
F 4 "C&K" H 2500 1300 50  0001 C CNN "Manufacturer"
F 5 "PTS645SK43SMTR92 LFS" H 2500 1300 50  0001 C CNN "PartNumber"
F 6 "3000-0000000176" H 2500 1300 50  0001 C CNN "PartSpecification"
	1    2500 1300
	0    1    1    0   
$EndComp
$Comp
L Device:R R?
U 1 1 5E32D4F5
P 2500 1850
AR Path="/5D69D382/5E32D4F5" Ref="R?"  Part="1" 
AR Path="/5D67C7FD/5E32D4F5" Ref="R506"  Part="1" 
F 0 "R506" H 2570 1896 50  0000 L CNN
F 1 "10k" H 2570 1805 50  0000 L CNN
F 2 "Resistor_SMD:R_0402_1005Metric" V 2430 1850 50  0001 C CNN
F 3 "~" H 2500 1850 50  0001 C CNN
F 4 "Delta Electronics/Cyntec" H 2500 1850 50  0001 C CNN "Manufacturer"
F 5 "PFR05S-103-FNH" H 2500 1850 50  0001 C CNN "PartNumber"
F 6 "3000-0000000131" H 2500 1850 50  0001 C CNN "PartSpecification"
	1    2500 1850
	1    0    0    -1  
$EndComp
$Comp
L Device:R R?
U 1 1 5E33319B
P 2000 1850
AR Path="/5D69D382/5E33319B" Ref="R?"  Part="1" 
AR Path="/5D67C7FD/5E33319B" Ref="R505"  Part="1" 
F 0 "R505" H 2070 1896 50  0000 L CNN
F 1 "10k" H 2070 1805 50  0000 L CNN
F 2 "Resistor_SMD:R_0402_1005Metric" V 1930 1850 50  0001 C CNN
F 3 "~" H 2000 1850 50  0001 C CNN
F 4 "Delta Electronics/Cyntec" H 2000 1850 50  0001 C CNN "Manufacturer"
F 5 "PFR05S-103-FNH" H 2000 1850 50  0001 C CNN "PartNumber"
F 6 "3000-0000000131" H 2000 1850 50  0001 C CNN "PartSpecification"
	1    2000 1850
	1    0    0    -1  
$EndComp
$Comp
L Device:R R?
U 1 1 5E338DD5
P 1500 1850
AR Path="/5D69D382/5E338DD5" Ref="R?"  Part="1" 
AR Path="/5D67C7FD/5E338DD5" Ref="R504"  Part="1" 
F 0 "R504" H 1570 1896 50  0000 L CNN
F 1 "10k" H 1570 1805 50  0000 L CNN
F 2 "Resistor_SMD:R_0402_1005Metric" V 1430 1850 50  0001 C CNN
F 3 "~" H 1500 1850 50  0001 C CNN
F 4 "Delta Electronics/Cyntec" H 1500 1850 50  0001 C CNN "Manufacturer"
F 5 "PFR05S-103-FNH" H 1500 1850 50  0001 C CNN "PartNumber"
F 6 "3000-0000000131" H 1500 1850 50  0001 C CNN "PartSpecification"
	1    1500 1850
	1    0    0    -1  
$EndComp
$Comp
L Device:R R?
U 1 1 5E33E9B8
P 1000 1850
AR Path="/5D69D382/5E33E9B8" Ref="R?"  Part="1" 
AR Path="/5D67C7FD/5E33E9B8" Ref="R503"  Part="1" 
F 0 "R503" H 1070 1896 50  0000 L CNN
F 1 "10k" H 1070 1805 50  0000 L CNN
F 2 "Resistor_SMD:R_0402_1005Metric" V 930 1850 50  0001 C CNN
F 3 "~" H 1000 1850 50  0001 C CNN
F 4 "Delta Electronics/Cyntec" H 1000 1850 50  0001 C CNN "Manufacturer"
F 5 "PFR05S-103-FNH" H 1000 1850 50  0001 C CNN "PartNumber"
F 6 "3000-0000000131" H 1000 1850 50  0001 C CNN "PartSpecification"
	1    1000 1850
	1    0    0    -1  
$EndComp
Wire Wire Line
	1000 1500 1000 1700
Wire Wire Line
	1500 1700 1500 1500
Wire Wire Line
	2000 1500 2000 1700
Wire Wire Line
	2500 1700 2500 1500
$Comp
L power:GND #PWR?
U 1 1 5E394F33
P 2500 2100
F 0 "#PWR?" H 2500 1850 50  0001 C CNN
F 1 "GND" H 2505 1927 50  0000 C CNN
F 2 "" H 2500 2100 50  0001 C CNN
F 3 "" H 2500 2100 50  0001 C CNN
	1    2500 2100
	1    0    0    -1  
$EndComp
Wire Wire Line
	2500 2100 2500 2050
$Comp
L power:+3.3V #PWR?
U 1 1 5E3B166D
P 1000 1000
F 0 "#PWR?" H 1000 850 50  0001 C CNN
F 1 "+3.3V" H 1015 1173 50  0000 C CNN
F 2 "" H 1000 1000 50  0001 C CNN
F 3 "" H 1000 1000 50  0001 C CNN
	1    1000 1000
	1    0    0    -1  
$EndComp
Wire Wire Line
	1000 1100 1000 1050
Wire Wire Line
	1000 1050 1500 1050
Wire Wire Line
	2500 1050 2500 1100
Connection ~ 1000 1050
Wire Wire Line
	1000 1050 1000 1000
Wire Wire Line
	2000 1100 2000 1050
Connection ~ 2000 1050
Wire Wire Line
	2000 1050 2500 1050
Wire Wire Line
	1500 1050 1500 1100
Connection ~ 1500 1050
Wire Wire Line
	1500 1050 2000 1050
Wire Wire Line
	1000 2050 1000 2000
Wire Wire Line
	1500 2050 1500 2000
Connection ~ 1500 2050
Wire Wire Line
	1500 2050 1000 2050
Wire Wire Line
	2000 2000 2000 2050
Connection ~ 2000 2050
Wire Wire Line
	2000 2050 1500 2050
Wire Wire Line
	2000 2050 2500 2050
Connection ~ 2500 2050
Wire Wire Line
	2500 2050 2500 2000
$Comp
L Device:R R?
U 1 1 5E3F9222
P 3950 2400
AR Path="/5D69D382/5E3F9222" Ref="R?"  Part="1" 
AR Path="/5D67C7FD/5E3F9222" Ref="R513"  Part="1" 
F 0 "R513" V 3743 2400 50  0000 C CNN
F 1 "10" V 3834 2400 50  0000 C CNN
F 2 "Resistor_SMD:R_0402_1005Metric" V 3880 2400 50  0001 C CNN
F 3 "~" H 3950 2400 50  0001 C CNN
F 4 "Delta Electronics/Cyntec" H 3950 2400 50  0001 C CNN "Manufacturer"
F 5 "PFR05S-100-FNH" H 3950 2400 50  0001 C CNN "PartNumber"
F 6 "3000-0000000146" H 3950 2400 50  0001 C CNN "PartSpecification"
	1    3950 2400
	0    1    1    0   
$EndComp
$Comp
L Device:R R?
U 1 1 5E400A13
P 3650 2300
AR Path="/5D69D382/5E400A13" Ref="R?"  Part="1" 
AR Path="/5D67C7FD/5E400A13" Ref="R511"  Part="1" 
F 0 "R511" V 3443 2300 50  0000 C CNN
F 1 "10" V 3534 2300 50  0000 C CNN
F 2 "Resistor_SMD:R_0402_1005Metric" V 3580 2300 50  0001 C CNN
F 3 "~" H 3650 2300 50  0001 C CNN
F 4 "Delta Electronics/Cyntec" H 3650 2300 50  0001 C CNN "Manufacturer"
F 5 "PFR05S-100-FNH" H 3650 2300 50  0001 C CNN "PartNumber"
F 6 "3000-0000000146" H 3650 2300 50  0001 C CNN "PartSpecification"
	1    3650 2300
	0    1    1    0   
$EndComp
$Comp
L Device:R R?
U 1 1 5E40813A
P 3350 2200
AR Path="/5D69D382/5E40813A" Ref="R?"  Part="1" 
AR Path="/5D67C7FD/5E40813A" Ref="R509"  Part="1" 
F 0 "R509" V 3143 2200 50  0000 C CNN
F 1 "10" V 3234 2200 50  0000 C CNN
F 2 "Resistor_SMD:R_0402_1005Metric" V 3280 2200 50  0001 C CNN
F 3 "~" H 3350 2200 50  0001 C CNN
F 4 "Delta Electronics/Cyntec" H 3350 2200 50  0001 C CNN "Manufacturer"
F 5 "PFR05S-100-FNH" H 3350 2200 50  0001 C CNN "PartNumber"
F 6 "3000-0000000146" H 3350 2200 50  0001 C CNN "PartSpecification"
	1    3350 2200
	0    1    1    0   
$EndComp
$Comp
L Device:R R?
U 1 1 5E40FB45
P 3050 2100
AR Path="/5D69D382/5E40FB45" Ref="R?"  Part="1" 
AR Path="/5D67C7FD/5E40FB45" Ref="R507"  Part="1" 
F 0 "R507" V 2843 2100 50  0000 C CNN
F 1 "10" V 2934 2100 50  0000 C CNN
F 2 "Resistor_SMD:R_0402_1005Metric" V 2980 2100 50  0001 C CNN
F 3 "~" H 3050 2100 50  0001 C CNN
F 4 "Delta Electronics/Cyntec" H 3050 2100 50  0001 C CNN "Manufacturer"
F 5 "PFR05S-100-FNH" H 3050 2100 50  0001 C CNN "PartNumber"
F 6 "3000-0000000146" H 3050 2100 50  0001 C CNN "PartSpecification"
	1    3050 2100
	0    1    1    0   
$EndComp
Wire Wire Line
	4100 2400 4450 2400
Wire Wire Line
	4450 2300 3800 2300
Wire Wire Line
	3500 2200 4450 2200
Wire Wire Line
	4450 2100 3200 2100
Text Label 4150 2100 0    50   ~ 0
PB2
Text Label 4150 2200 0    50   ~ 0
PB3
Text Label 4150 2300 0    50   ~ 0
PB4
Text Label 4150 2400 0    50   ~ 0
PB5
Text Label 2700 2100 0    50   ~ 0
PB2_
Wire Wire Line
	2700 2100 2900 2100
Wire Wire Line
	2700 2200 3200 2200
Wire Wire Line
	2700 2300 3500 2300
Wire Wire Line
	2700 2400 3800 2400
Text Label 2700 2200 0    50   ~ 0
PB3_
Text Label 2700 2300 0    50   ~ 0
PB4_
Text Label 2700 2400 0    50   ~ 0
PB5_
Text Label 1000 1650 0    50   ~ 0
PB2_
Text Label 1500 1650 0    50   ~ 0
PB3_
Text Label 2000 1650 0    50   ~ 0
PB4_
Text Label 2500 1650 0    50   ~ 0
PB5_
$Comp
L Device:R R514
U 1 1 5E4B4E36
P 4200 3000
F 0 "R514" V 4280 3000 50  0000 C CNN
F 1 "66.5" V 4200 3000 50  0000 C CNN
F 2 "Resistor_SMD:R_0402_1005Metric" V 4130 3000 50  0001 C CNN
F 3 "~" H 4200 3000 50  0001 C CNN
F 4 "3000-0000000242" H 4200 3000 50  0001 C CNN "PartSpecification"
	1    4200 3000
	0    1    1    0   
$EndComp
Wire Wire Line
	4350 3000 4450 3000
$Comp
L Device:R R512
U 1 1 5E4C150E
P 3900 3100
F 0 "R512" V 3980 3100 50  0000 C CNN
F 1 "66.5" V 3900 3100 50  0000 C CNN
F 2 "Resistor_SMD:R_0402_1005Metric" V 3830 3100 50  0001 C CNN
F 3 "~" H 3900 3100 50  0001 C CNN
F 4 "3000-0000000242" H 3900 3100 50  0001 C CNN "PartSpecification"
	1    3900 3100
	0    1    1    0   
$EndComp
$Comp
L Device:R R510
U 1 1 5E4C9FEA
P 3600 3200
F 0 "R510" V 3680 3200 50  0000 C CNN
F 1 "66.5" V 3600 3200 50  0000 C CNN
F 2 "Resistor_SMD:R_0402_1005Metric" V 3530 3200 50  0001 C CNN
F 3 "~" H 3600 3200 50  0001 C CNN
F 4 "3000-0000000242" H 3600 3200 50  0001 C CNN "PartSpecification"
	1    3600 3200
	0    1    1    0   
$EndComp
$Comp
L Device:R R508
U 1 1 5E4D2D59
P 3300 3300
F 0 "R508" V 3380 3300 50  0000 C CNN
F 1 "10" V 3300 3300 50  0000 C CNN
F 2 "Resistor_SMD:R_0402_1005Metric" V 3230 3300 50  0001 C CNN
F 3 "~" H 3300 3300 50  0001 C CNN
F 4 "3000-0000000146" H 3300 3300 50  0001 C CNN "PartSpecification"
	1    3300 3300
	0    1    1    0   
$EndComp
Wire Wire Line
	4050 3100 4450 3100
Wire Wire Line
	3750 3200 4450 3200
Wire Wire Line
	3450 3300 4450 3300
$Comp
L Device:LED D504
U 1 1 5E5132B9
P 3150 4150
F 0 "D504" H 3150 4250 50  0000 C CNN
F 1 "BLUE LED" H 3150 4050 50  0000 C CNN
F 2 "LED_SMD:LED_0805_2012Metric_Castellated" H 3150 4150 50  0001 C CNN
F 3 "~" H 3150 4150 50  0001 C CNN
F 4 "3000-0000000220" H 3150 4150 50  0001 C CNN "PartSpecification"
	1    3150 4150
	0    -1   -1   0   
$EndComp
Wire Wire Line
	3550 4000 4450 4000
$Comp
L Device:LED D503
U 1 1 5E522A7D
P 3000 3850
F 0 "D503" H 3000 3950 50  0000 C CNN
F 1 "YELLOW LED" H 3000 3750 50  0000 C CNN
F 2 "LED_SMD:LED_0805_2012Metric_Castellated" H 3000 3850 50  0001 C CNN
F 3 "~" H 3000 3850 50  0001 C CNN
F 4 "3000-0000000217" H 3000 3850 50  0001 C CNN "PartSpecification"
	1    3000 3850
	0    -1   -1   0   
$EndComp
$Comp
L Device:LED D502
U 1 1 5E5231CA
P 2850 4150
F 0 "D502" H 2850 4250 50  0000 C CNN
F 1 "RED LED" H 2850 4050 50  0000 C CNN
F 2 "LED_SMD:LED_0805_2012Metric_Castellated" H 2850 4150 50  0001 C CNN
F 3 "~" H 2850 4150 50  0001 C CNN
F 4 "3000-0000000214" H 2850 4150 50  0001 C CNN "PartSpecification"
	1    2850 4150
	0    -1   -1   0   
$EndComp
$Comp
L Device:LED D501
U 1 1 5E523790
P 2700 3900
F 0 "D501" H 2700 4000 50  0000 C CNN
F 1 "GREEN LED" H 2700 3800 50  0000 C CNN
F 2 "LED_SMD:LED_0805_2012Metric_Castellated" H 2700 3900 50  0001 C CNN
F 3 "~" H 2700 3900 50  0001 C CNN
F 4 "3000-0000000211" H 2700 3900 50  0001 C CNN "PartSpecification"
	1    2700 3900
	0    -1   -1   0   
$EndComp
Wire Wire Line
	3150 4000 3150 3300
Wire Wire Line
	3000 3700 3000 3200
Wire Wire Line
	3000 3200 3450 3200
Wire Wire Line
	2850 3100 3750 3100
Wire Wire Line
	2400 2600 2400 2900
Wire Wire Line
	2500 2700 2500 2800
Wire Wire Line
	2700 3750 2700 3000
Wire Wire Line
	2700 3000 4050 3000
$Comp
L power:GND #PWR?
U 1 1 5E5B376C
P 3150 4400
F 0 "#PWR?" H 3150 4150 50  0001 C CNN
F 1 "GND" H 3155 4227 50  0000 C CNN
F 2 "" H 3150 4400 50  0001 C CNN
F 3 "" H 3150 4400 50  0001 C CNN
	1    3150 4400
	1    0    0    -1  
$EndComp
$Comp
L power:GND #PWR?
U 1 1 5E5B3D2B
P 3000 4400
F 0 "#PWR?" H 3000 4150 50  0001 C CNN
F 1 "GND" H 3005 4227 50  0000 C CNN
F 2 "" H 3000 4400 50  0001 C CNN
F 3 "" H 3000 4400 50  0001 C CNN
	1    3000 4400
	1    0    0    -1  
$EndComp
$Comp
L power:GND #PWR?
U 1 1 5E5B423C
P 2850 4400
F 0 "#PWR?" H 2850 4150 50  0001 C CNN
F 1 "GND" H 2855 4227 50  0000 C CNN
F 2 "" H 2850 4400 50  0001 C CNN
F 3 "" H 2850 4400 50  0001 C CNN
	1    2850 4400
	1    0    0    -1  
$EndComp
$Comp
L power:GND #PWR?
U 1 1 5E5B474B
P 2700 4400
F 0 "#PWR?" H 2700 4150 50  0001 C CNN
F 1 "GND" H 2705 4227 50  0000 C CNN
F 2 "" H 2700 4400 50  0001 C CNN
F 3 "" H 2700 4400 50  0001 C CNN
	1    2700 4400
	1    0    0    -1  
$EndComp
Wire Wire Line
	2700 4400 2700 4050
Wire Wire Line
	2850 4300 2850 4400
Wire Wire Line
	2850 3100 2850 4000
Wire Wire Line
	3000 4000 3000 4400
Wire Wire Line
	3150 4400 3150 4300
Text HLabel 4000 4200 0    50   Input ~ 0
ADC4
Text Label 3200 3000 0    50   ~ 0
L0_C
Text Label 3200 3100 0    50   ~ 0
L1_C
Text Label 3200 3200 0    50   ~ 0
L2_C
Text Label 3150 3500 1    50   ~ 0
L3_C
Text Label 9700 5550 0    50   ~ 0
WP_B
Text Label 9250 5750 0    50   ~ 0
HOLD_B
Text Label 4350 3000 0    50   ~ 0
L0
Text Label 4350 3100 0    50   ~ 0
L1
Text Label 4350 3200 0    50   ~ 0
L2
Text Label 4350 3300 0    50   ~ 0
L3
Wire Bus Line
	11000 1850 11000 4500
Wire Bus Line
	7750 2050 7750 4500
$EndSCHEMATC
