EESchema Schematic File Version 4
EELAYER 30 0
EELAYER END
$Descr A4 11693 8268
encoding utf-8
Sheet 27 39
Title ""
Date ""
Rev ""
Comp ""
Comment1 ""
Comment2 ""
Comment3 ""
Comment4 ""
$EndDescr
$Comp
L POWDER_Digital:10M50DAF256 U2201
U 4 1 5F9A835F
P 4750 3100
F 0 "U2201" H 4750 3250 50  0000 C CNN
F 1 "‎10M08DAF256C8G" H 4750 3100 50  0000 C CNN
F 2 "Package_BGA:BGA-256_17.0x17.0mm_Layout16x16_P1.0mm_Ball0.5mm_Pad0.4mm_NSMD" H 4750 3100 50  0001 C CNN
F 3 "" H 4750 3100 50  0001 C CNN
F 4 "3000-0000001300" H 4750 3100 50  0001 C CNN "PartSpecification"
	4    4750 3100
	1    0    0    -1  
$EndComp
$Comp
L 000_PreferredParts:C_1nF C?
U 1 1 5FBBBB90
P 5000 2000
AR Path="/5F8E5420/5F971A6D/5FBBBB90" Ref="C?"  Part="1" 
AR Path="/5F8E5420/5F998CB2/5FBBBB90" Ref="C702"  Part="1" 
AR Path="/605746B5/5F8E5420/5F998CB2/5FBBBB90" Ref="C2702"  Part="1" 
F 0 "C2702" H 5025 2100 50  0000 L CNN
F 1 "C_1nF" H 5025 1900 50  0000 L CNN
F 2 "Capacitor_SMD:C_0402_1005Metric" H 5038 1850 50  0001 C CNN
F 3 "~" H 5000 2000 50  0001 C CNN
F 4 "3000-0000000128" H 5000 2000 50  0001 C CNN "PartSpecification"
	1    5000 2000
	1    0    0    -1  
$EndComp
$Comp
L 000_PreferredParts:C_1nF C?
U 1 1 5FBBBB97
P 4400 2000
AR Path="/5F8E5420/5F971A6D/5FBBBB97" Ref="C?"  Part="1" 
AR Path="/5F8E5420/5F998CB2/5FBBBB97" Ref="C701"  Part="1" 
AR Path="/605746B5/5F8E5420/5F998CB2/5FBBBB97" Ref="C2701"  Part="1" 
F 0 "C2701" H 4425 2100 50  0000 L CNN
F 1 "C_1nF" H 4425 1900 50  0000 L CNN
F 2 "Capacitor_SMD:C_0402_1005Metric" H 4438 1850 50  0001 C CNN
F 3 "~" H 4400 2000 50  0001 C CNN
F 4 "3000-0000000128" H 4400 2000 50  0001 C CNN "PartSpecification"
	1    4400 2000
	1    0    0    -1  
$EndComp
$Comp
L 000_PreferredParts:C_0_1uF C?
U 1 1 5FBBBBA0
P 5350 2000
AR Path="/5F8E5420/5F971A6D/5FBBBBA0" Ref="C?"  Part="1" 
AR Path="/5F8E5420/5F998CB2/5FBBBBA0" Ref="C703"  Part="1" 
AR Path="/605746B5/5F8E5420/5F998CB2/5FBBBBA0" Ref="C2703"  Part="1" 
F 0 "C2703" H 5375 2100 50  0000 L CNN
F 1 "C_0_1uF" H 5375 1900 50  0001 L CNN
F 2 "Capacitor_SMD:C_0402_1005Metric" H 5388 1850 50  0001 C CNN
F 3 "~" H 5350 2000 50  0001 C CNN
F 4 "0.1uF" H 5500 1900 50  0000 C CNN "DisplayValue"
F 5 "3000-0000000125" H 5350 2000 50  0001 C CNN "PartSpecification"
F 6 "100V" H 5350 2000 50  0001 C CNN "Voltage"
	1    5350 2000
	1    0    0    -1  
$EndComp
$Comp
L power:GND #PWR?
U 1 1 5FBBBBAC
P 5700 2200
AR Path="/5F8E5420/5F971A6D/5FBBBBAC" Ref="#PWR?"  Part="1" 
AR Path="/5F8E5420/5F998CB2/5FBBBBAC" Ref="#PWR?"  Part="1" 
AR Path="/605746B5/5F8E5420/5F998CB2/5FBBBBAC" Ref="#PWR?"  Part="1" 
F 0 "#PWR?" H 5700 1950 50  0001 C CNN
F 1 "GND" H 5700 2050 50  0000 C CNN
F 2 "" H 5700 2200 50  0001 C CNN
F 3 "" H 5700 2200 50  0001 C CNN
	1    5700 2200
	1    0    0    -1  
$EndComp
Wire Wire Line
	5000 2150 5000 2200
Wire Wire Line
	5000 2200 5350 2200
Wire Wire Line
	5350 2200 5350 2150
Connection ~ 5350 2200
Wire Wire Line
	5350 2200 5700 2200
Wire Wire Line
	4800 2350 4800 1750
Wire Wire Line
	4800 1750 5000 1750
Wire Wire Line
	5350 1850 5350 1750
Wire Wire Line
	5000 1850 5000 1750
Connection ~ 5000 1750
Wire Wire Line
	5000 1750 5350 1750
$Comp
L power:GND #PWR?
U 1 1 5FBBBBC2
P 4400 2200
AR Path="/5F8E5420/5F971A6D/5FBBBBC2" Ref="#PWR?"  Part="1" 
AR Path="/5F8E5420/5F998CB2/5FBBBBC2" Ref="#PWR?"  Part="1" 
AR Path="/605746B5/5F8E5420/5F998CB2/5FBBBBC2" Ref="#PWR?"  Part="1" 
F 0 "#PWR?" H 4400 1950 50  0001 C CNN
F 1 "GND" H 4400 2050 50  0000 C CNN
F 2 "" H 4400 2200 50  0001 C CNN
F 3 "" H 4400 2200 50  0001 C CNN
	1    4400 2200
	1    0    0    -1  
$EndComp
Wire Wire Line
	4400 2200 4400 2150
Wire Wire Line
	4400 1850 4400 1750
Wire Wire Line
	4400 1750 4700 1750
Wire Wire Line
	4700 1750 4700 2350
Wire Wire Line
	4700 1750 4700 1650
Wire Wire Line
	4700 1650 4750 1650
Wire Wire Line
	4800 1650 4800 1750
Connection ~ 4700 1750
Connection ~ 4800 1750
Wire Wire Line
	4750 1500 4750 1650
Connection ~ 4750 1650
Wire Wire Line
	4750 1650 4800 1650
NoConn ~ 3450 3350
Text HLabel 2000 2500 0    50   BiDi ~ 0
MCU_IO[28..35]
Entry Wire Line
	7000 2850 6900 2950
Entry Wire Line
	2500 3050 2600 3150
Text Label 2650 3150 0    50   ~ 0
MCU_IO29
Text Label 6100 2950 0    50   ~ 0
MCU_IO32
Text Label 2650 2950 0    50   ~ 0
MCU_IO34
Text Label 2650 3450 0    50   ~ 0
MCU_IO35
Entry Wire Line
	2500 2850 2600 2950
Entry Wire Line
	2500 3350 2600 3450
Wire Wire Line
	3450 2950 2600 2950
Wire Wire Line
	3450 3450 2600 3450
NoConn ~ 6050 3250
NoConn ~ 6050 3350
$Comp
L power:+3.3V #PWR?
U 1 1 613BF0E7
P 4750 1500
F 0 "#PWR?" H 4750 1350 50  0001 C CNN
F 1 "+3.3V" H 4765 1673 50  0000 C CNN
F 2 "" H 4750 1500 50  0001 C CNN
F 3 "" H 4750 1500 50  0001 C CNN
	1    4750 1500
	1    0    0    -1  
$EndComp
Wire Wire Line
	6050 2950 6900 2950
NoConn ~ 3450 3250
Wire Bus Line
	2500 4000 7000 4000
Text Label 6100 3050 0    50   ~ 0
MCU_IO33
Text Label 2650 3050 0    50   ~ 0
MCU_IO31
Text Label 2650 2850 0    50   ~ 0
MCU_IO30
Text Label 6100 3150 0    50   ~ 0
MCU_IO28
Wire Wire Line
	2600 2850 3450 2850
Wire Wire Line
	3450 3050 2600 3050
Wire Wire Line
	6050 3050 6900 3050
Entry Wire Line
	7000 3050 6900 3150
Entry Wire Line
	2500 2750 2600 2850
Entry Wire Line
	2500 2950 2600 3050
Entry Wire Line
	7000 2950 6900 3050
Wire Bus Line
	2000 2500 2500 2500
Wire Wire Line
	6050 3150 6900 3150
Wire Wire Line
	2600 3150 3450 3150
Wire Bus Line
	7000 2850 7000 4000
Wire Bus Line
	2500 2500 2500 4000
$EndSCHEMATC
