EESchema Schematic File Version 4
LIBS:power_supply-cache
EELAYER 29 0
EELAYER END
$Descr A4 11693 8268
encoding utf-8
Sheet 4 5
Title ""
Date ""
Rev ""
Comp ""
Comment1 ""
Comment2 ""
Comment3 ""
Comment4 ""
$EndDescr
$Comp
L POWDER_Power:TPS54561-Q1 U?
U 1 1 5C6D4B31
P 5650 3200
AR Path="/5C6D4B31" Ref="U?"  Part="1" 
AR Path="/5C66EB2D/5C6D4B31" Ref="U?"  Part="1" 
AR Path="/5C67E09D/5C6D4B31" Ref="U?"  Part="1" 
AR Path="/5C6D4194/5C6D4B31" Ref="U403"  Part="1" 
F 0 "U403" H 5650 3815 50  0000 C CNN
F 1 "TPS54561-Q1" H 5650 3724 50  0000 C CNN
F 2 "POWDER_Power:TPS54561-Q1" H 5650 2500 50  0001 C CNN
F 3 "" H 5300 3700 50  0001 C CNN
F 4 "Texas Instruments" H 5650 3200 50  0001 C CNN "Manufacturer"
F 5 "TPS54561QDPRTQ1" H 5650 3200 50  0001 C CNN "PartNumber"
	1    5650 3200
	1    0    0    -1  
$EndComp
$Comp
L Device:C C?
U 1 1 5C6D4B38
P 4850 3900
AR Path="/5C6D4B38" Ref="C?"  Part="1" 
AR Path="/5C66EB2D/5C6D4B38" Ref="C?"  Part="1" 
AR Path="/5C67E09D/5C6D4B38" Ref="C?"  Part="1" 
AR Path="/5C6D4194/5C6D4B38" Ref="C408"  Part="1" 
F 0 "C408" H 4965 3946 50  0000 L CNN
F 1 "27pF" H 4965 3855 50  0000 L CNN
F 2 "Capacitor_SMD:C_0402_1005Metric" H 4888 3750 50  0001 C CNN
F 3 "~" H 4850 3900 50  0001 C CNN
F 4 "C0402C270J5GACTU" H 4850 3900 50  0001 C CNN "PartNumber"
F 5 "KEMET" H 4850 3900 50  0001 C CNN "Manufacturer"
	1    4850 3900
	1    0    0    -1  
$EndComp
$Comp
L Device:C C?
U 1 1 5C6D4B3F
P 4450 4150
AR Path="/5C6D4B3F" Ref="C?"  Part="1" 
AR Path="/5C66EB2D/5C6D4B3F" Ref="C?"  Part="1" 
AR Path="/5C67E09D/5C6D4B3F" Ref="C?"  Part="1" 
AR Path="/5C6D4194/5C6D4B3F" Ref="C407"  Part="1" 
F 0 "C407" H 4565 4196 50  0000 L CNN
F 1 "4.7nF" H 4565 4105 50  0000 L CNN
F 2 "Capacitor_SMD:C_0402_1005Metric" H 4488 4000 50  0001 C CNN
F 3 "~" H 4450 4150 50  0001 C CNN
F 4 "Murata Electronics North America" H 4450 4150 50  0001 C CNN "Manufacturer"
F 5 "GCM155R71H472KA37D" H 4450 4150 50  0001 C CNN "PartNumber"
	1    4450 4150
	1    0    0    -1  
$EndComp
$Comp
L Device:R R?
U 1 1 5C6D4B46
P 4450 3800
AR Path="/5C6D4B46" Ref="R?"  Part="1" 
AR Path="/5C66EB2D/5C6D4B46" Ref="R?"  Part="1" 
AR Path="/5C67E09D/5C6D4B46" Ref="R?"  Part="1" 
AR Path="/5C6D4194/5C6D4B46" Ref="R406"  Part="1" 
F 0 "R406" H 4520 3846 50  0000 L CNN
F 1 "29.4k" H 4520 3755 50  0000 L CNN
F 2 "Resistor_SMD:R_0402_1005Metric" V 4380 3800 50  0001 C CNN
F 3 "~" H 4450 3800 50  0001 C CNN
F 4 "RMCF0402FT29K4" H 4450 3800 50  0001 C CNN "PartNumber"
F 5 "Stackpole Electronics Inc" H 4450 3800 50  0001 C CNN "Manufacturer"
	1    4450 3800
	1    0    0    -1  
$EndComp
Wire Wire Line
	4450 3650 4450 3550
Wire Wire Line
	4450 3550 4850 3550
Wire Wire Line
	4850 3750 4850 3550
Connection ~ 4850 3550
Wire Wire Line
	4850 3550 5150 3550
Wire Wire Line
	4450 3950 4450 4000
$Comp
L Device:C C?
U 1 1 5C6D4B53
P 4050 3800
AR Path="/5C6D4B53" Ref="C?"  Part="1" 
AR Path="/5C66EB2D/5C6D4B53" Ref="C?"  Part="1" 
AR Path="/5C67E09D/5C6D4B53" Ref="C?"  Part="1" 
AR Path="/5C6D4194/5C6D4B53" Ref="C406"  Part="1" 
F 0 "C406" H 4165 3846 50  0000 L CNN
F 1 "2.7nF" H 4165 3755 50  0000 L CNN
F 2 "Capacitor_SMD:C_0402_1005Metric" H 4088 3650 50  0001 C CNN
F 3 "~" H 4050 3800 50  0001 C CNN
F 4 "Samsung Electro-Mechanics" H 4050 3800 50  0001 C CNN "Manufacturer"
F 5 "CL05B272KB5NNNC" H 4050 3800 50  0001 C CNN "PartNumber"
	1    4050 3800
	1    0    0    -1  
$EndComp
Wire Wire Line
	4050 3650 4050 3350
Wire Wire Line
	4050 3350 5150 3350
$Comp
L Device:R R?
U 1 1 5C6D4B5C
P 3600 3800
AR Path="/5C6D4B5C" Ref="R?"  Part="1" 
AR Path="/5C66EB2D/5C6D4B5C" Ref="R?"  Part="1" 
AR Path="/5C67E09D/5C6D4B5C" Ref="R?"  Part="1" 
AR Path="/5C6D4194/5C6D4B5C" Ref="R405"  Part="1" 
F 0 "R405" H 3670 3846 50  0000 L CNN
F 1 "243k" H 3670 3755 50  0000 L CNN
F 2 "Resistor_SMD:R_0402_1005Metric" V 3530 3800 50  0001 C CNN
F 3 "~" H 3600 3800 50  0001 C CNN
F 4 "RMCF0402FT243K" H 3600 3800 50  0001 C CNN "PartNumber"
F 5 "Stackpole Electronics Inc" H 3600 3800 50  0001 C CNN "Manufacturer"
	1    3600 3800
	1    0    0    -1  
$EndComp
Wire Wire Line
	3600 3650 3600 3250
Wire Wire Line
	3600 3250 5150 3250
$Comp
L Device:R R?
U 1 1 5C6D4B65
P 3300 2850
AR Path="/5C6D4B65" Ref="R?"  Part="1" 
AR Path="/5C66EB2D/5C6D4B65" Ref="R?"  Part="1" 
AR Path="/5C67E09D/5C6D4B65" Ref="R?"  Part="1" 
AR Path="/5C6D4194/5C6D4B65" Ref="R403"  Part="1" 
F 0 "R403" H 3370 2896 50  0000 L CNN
F 1 "4.42M" H 3370 2805 50  0000 L CNN
F 2 "Resistor_SMD:R_0402_1005Metric" V 3230 2850 50  0001 C CNN
F 3 "~" H 3300 2850 50  0001 C CNN
F 4 "A" H 3300 2850 50  0001 C CNN "Manufacturer"
F 5 "A" H 3300 2850 50  0001 C CNN "PartNumber"
	1    3300 2850
	1    0    0    -1  
$EndComp
$Comp
L Device:R R?
U 1 1 5C6D4B6C
P 3300 3450
AR Path="/5C6D4B6C" Ref="R?"  Part="1" 
AR Path="/5C66EB2D/5C6D4B6C" Ref="R?"  Part="1" 
AR Path="/5C67E09D/5C6D4B6C" Ref="R?"  Part="1" 
AR Path="/5C6D4194/5C6D4B6C" Ref="R404"  Part="1" 
F 0 "R404" H 3370 3496 50  0000 L CNN
F 1 "121k" H 3370 3405 50  0000 L CNN
F 2 "Resistor_SMD:R_0402_1005Metric" V 3230 3450 50  0001 C CNN
F 3 "~" H 3300 3450 50  0001 C CNN
F 4 "3000-0000000404" H 3300 3450 50  0001 C CNN "PartSpecification"
	1    3300 3450
	1    0    0    -1  
$EndComp
Wire Wire Line
	3300 3300 3300 3050
Wire Wire Line
	5150 3050 3300 3050
Connection ~ 3300 3050
Wire Wire Line
	3300 3050 3300 3000
Wire Wire Line
	5150 2850 4600 2850
Wire Wire Line
	4600 2850 4600 2200
$Comp
L power:GND #PWR?
U 1 1 5C6D4B79
P 4850 4550
AR Path="/5C6D4B79" Ref="#PWR?"  Part="1" 
AR Path="/5C66EB2D/5C6D4B79" Ref="#PWR?"  Part="1" 
AR Path="/5C67E09D/5C6D4B79" Ref="#PWR?"  Part="1" 
AR Path="/5C6D4194/5C6D4B79" Ref="#PWR?"  Part="1" 
F 0 "#PWR?" H 4850 4300 50  0001 C CNN
F 1 "GND" H 4855 4377 50  0000 C CNN
F 2 "" H 4850 4550 50  0001 C CNN
F 3 "" H 4850 4550 50  0001 C CNN
	1    4850 4550
	1    0    0    -1  
$EndComp
Wire Wire Line
	4850 4550 4850 4450
Wire Wire Line
	4450 4300 4450 4450
Wire Wire Line
	4450 4450 4850 4450
Connection ~ 4850 4450
Wire Wire Line
	4850 4450 4850 4050
Wire Wire Line
	4050 3950 4050 4450
Wire Wire Line
	4050 4450 4450 4450
Connection ~ 4450 4450
Wire Wire Line
	3600 3950 3600 4450
Wire Wire Line
	3600 4450 4050 4450
Connection ~ 4050 4450
Wire Wire Line
	3300 3600 3300 4450
Wire Wire Line
	3300 4450 3600 4450
Connection ~ 3600 4450
$Comp
L Device:C C?
U 1 1 5C6D4B8F
P 1300 2550
AR Path="/5C6D4B8F" Ref="C?"  Part="1" 
AR Path="/5C66EB2D/5C6D4B8F" Ref="C?"  Part="1" 
AR Path="/5C67E09D/5C6D4B8F" Ref="C?"  Part="1" 
AR Path="/5C6D4194/5C6D4B8F" Ref="C402"  Part="1" 
F 0 "C402" H 1415 2596 50  0000 L CNN
F 1 "2.2uF" H 1415 2505 50  0000 L CNN
F 2 "Capacitor_SMD:C_1206_3216Metric" H 1338 2400 50  0001 C CNN
F 3 "~" H 1300 2550 50  0001 C CNN
F 4 "TDK" H 1300 2550 50  0001 C CNN "Manufacturer"
F 5 "CGA5L3X7S2A225M160AB" H 1300 2550 50  0001 C CNN "PartNumber"
	1    1300 2550
	1    0    0    -1  
$EndComp
Wire Wire Line
	2550 2200 2550 2400
Wire Wire Line
	2550 2700 2550 2950
Wire Wire Line
	2550 2950 2100 2950
Wire Wire Line
	1900 2950 1900 3050
Wire Wire Line
	2100 2950 2100 2700
Connection ~ 2100 2950
Wire Wire Line
	2100 2950 1900 2950
Wire Wire Line
	2550 2200 2100 2200
Wire Wire Line
	2100 2200 2100 2400
Connection ~ 2550 2200
Wire Wire Line
	1700 2400 1700 2200
Wire Wire Line
	1700 2200 2100 2200
Connection ~ 2100 2200
Wire Wire Line
	1300 2400 1300 2200
Wire Wire Line
	1300 2200 1700 2200
Connection ~ 1700 2200
Wire Wire Line
	1700 2700 1700 2950
Wire Wire Line
	1700 2950 1900 2950
Connection ~ 1900 2950
Wire Wire Line
	1300 2700 1300 2950
Wire Wire Line
	1300 2950 1700 2950
Connection ~ 1700 2950
$Comp
L power:GND #PWR?
U 1 1 5C6D4BAC
P 1900 3050
AR Path="/5C6D4BAC" Ref="#PWR?"  Part="1" 
AR Path="/5C66EB2D/5C6D4BAC" Ref="#PWR?"  Part="1" 
AR Path="/5C67E09D/5C6D4BAC" Ref="#PWR?"  Part="1" 
AR Path="/5C6D4194/5C6D4BAC" Ref="#PWR?"  Part="1" 
F 0 "#PWR?" H 1900 2800 50  0001 C CNN
F 1 "GND" H 1905 2877 50  0000 C CNN
F 2 "" H 1900 3050 50  0001 C CNN
F 3 "" H 1900 3050 50  0001 C CNN
	1    1900 3050
	1    0    0    -1  
$EndComp
$Comp
L power:VDD #PWR?
U 1 1 5C6D4BB2
P 1700 1950
AR Path="/5C6D4BB2" Ref="#PWR?"  Part="1" 
AR Path="/5C66EB2D/5C6D4BB2" Ref="#PWR?"  Part="1" 
AR Path="/5C67E09D/5C6D4BB2" Ref="#PWR?"  Part="1" 
AR Path="/5C6D4194/5C6D4BB2" Ref="#PWR?"  Part="1" 
F 0 "#PWR?" H 1700 1800 50  0001 C CNN
F 1 "VDD" H 1717 2123 50  0000 C CNN
F 2 "" H 1700 1950 50  0001 C CNN
F 3 "" H 1700 1950 50  0001 C CNN
	1    1700 1950
	1    0    0    -1  
$EndComp
Wire Wire Line
	1700 1950 1700 2200
$Comp
L Device:C C?
U 1 1 5C6D4BBB
P 1700 2550
AR Path="/5C6D4BBB" Ref="C?"  Part="1" 
AR Path="/5C66EB2D/5C6D4BBB" Ref="C?"  Part="1" 
AR Path="/5C67E09D/5C6D4BBB" Ref="C?"  Part="1" 
AR Path="/5C6D4194/5C6D4BBB" Ref="C403"  Part="1" 
F 0 "C403" H 1815 2596 50  0000 L CNN
F 1 "2.2uF" H 1815 2505 50  0000 L CNN
F 2 "Capacitor_SMD:C_1206_3216Metric" H 1738 2400 50  0001 C CNN
F 3 "~" H 1700 2550 50  0001 C CNN
F 4 "TDK" H 1700 2550 50  0001 C CNN "Manufacturer"
F 5 "CGA5L3X7S2A225M160AB" H 1700 2550 50  0001 C CNN "PartNumber"
	1    1700 2550
	1    0    0    -1  
$EndComp
$Comp
L Device:C C?
U 1 1 5C6D4BC4
P 2100 2550
AR Path="/5C6D4BC4" Ref="C?"  Part="1" 
AR Path="/5C66EB2D/5C6D4BC4" Ref="C?"  Part="1" 
AR Path="/5C67E09D/5C6D4BC4" Ref="C?"  Part="1" 
AR Path="/5C6D4194/5C6D4BC4" Ref="C404"  Part="1" 
F 0 "C404" H 2215 2596 50  0000 L CNN
F 1 "2.2uF" H 2215 2505 50  0000 L CNN
F 2 "Capacitor_SMD:C_1206_3216Metric" H 2138 2400 50  0001 C CNN
F 3 "~" H 2100 2550 50  0001 C CNN
F 4 "TDK" H 2100 2550 50  0001 C CNN "Manufacturer"
F 5 "CGA5L3X7S2A225M160AB" H 2100 2550 50  0001 C CNN "PartNumber"
	1    2100 2550
	1    0    0    -1  
$EndComp
$Comp
L Device:C C?
U 1 1 5C6D4BCD
P 2550 2550
AR Path="/5C6D4BCD" Ref="C?"  Part="1" 
AR Path="/5C66EB2D/5C6D4BCD" Ref="C?"  Part="1" 
AR Path="/5C67E09D/5C6D4BCD" Ref="C?"  Part="1" 
AR Path="/5C6D4194/5C6D4BCD" Ref="C405"  Part="1" 
F 0 "C405" H 2665 2596 50  0000 L CNN
F 1 "2.2uF" H 2665 2505 50  0000 L CNN
F 2 "Capacitor_SMD:C_1206_3216Metric" H 2588 2400 50  0001 C CNN
F 3 "~" H 2550 2550 50  0001 C CNN
F 4 "TDK" H 2550 2550 50  0001 C CNN "Manufacturer"
F 5 "CGA5L3X7S2A225M160AB" H 2550 2550 50  0001 C CNN "PartNumber"
	1    2550 2550
	1    0    0    -1  
$EndComp
$Comp
L Device:C C?
U 1 1 5C6D4BD4
P 6500 3050
AR Path="/5C6D4BD4" Ref="C?"  Part="1" 
AR Path="/5C66EB2D/5C6D4BD4" Ref="C?"  Part="1" 
AR Path="/5C67E09D/5C6D4BD4" Ref="C?"  Part="1" 
AR Path="/5C6D4194/5C6D4BD4" Ref="C409"  Part="1" 
F 0 "C409" V 6248 3050 50  0000 C CNN
F 1 "0.1uF" V 6339 3050 50  0000 C CNN
F 2 "Capacitor_SMD:C_0402_1005Metric" H 6538 2900 50  0001 C CNN
F 3 "~" H 6500 3050 50  0001 C CNN
F 4 "Samsung Electro-Mechanics" V 6500 3050 50  0001 C CNN "Manufacturer"
F 5 "CL05F104ZO5NNNC" V 6500 3050 50  0001 C CNN "PartNumber"
	1    6500 3050
	0    1    1    0   
$EndComp
Wire Wire Line
	6350 3050 6150 3050
$Comp
L Device:R R?
U 1 1 5C6D4BDC
P 6350 2400
AR Path="/5C6D4BDC" Ref="R?"  Part="1" 
AR Path="/5C66EB2D/5C6D4BDC" Ref="R?"  Part="1" 
AR Path="/5C67E09D/5C6D4BDC" Ref="R?"  Part="1" 
AR Path="/5C6D4194/5C6D4BDC" Ref="R407"  Part="1" 
F 0 "R407" H 6420 2446 50  0000 L CNN
F 1 "1k" H 6420 2355 50  0000 L CNN
F 2 "Resistor_SMD:R_0402_1005Metric" V 6280 2400 50  0001 C CNN
F 3 "~" H 6350 2400 50  0001 C CNN
F 4 "3000-0000000156" H 6350 2400 50  0001 C CNN "PartSpecification"
	1    6350 2400
	1    0    0    -1  
$EndComp
Wire Wire Line
	6350 2550 6350 2700
Wire Wire Line
	6350 2850 6150 2850
Wire Wire Line
	6350 2250 6350 2050
Wire Wire Line
	6150 3250 6900 3250
Wire Wire Line
	6900 3250 6900 3050
Wire Wire Line
	6900 3050 6650 3050
$Comp
L power:GND #PWR?
U 1 1 5C6D4BE9
P 6350 3900
AR Path="/5C6D4BE9" Ref="#PWR?"  Part="1" 
AR Path="/5C66EB2D/5C6D4BE9" Ref="#PWR?"  Part="1" 
AR Path="/5C67E09D/5C6D4BE9" Ref="#PWR?"  Part="1" 
AR Path="/5C6D4194/5C6D4BE9" Ref="#PWR?"  Part="1" 
F 0 "#PWR?" H 6350 3650 50  0001 C CNN
F 1 "GND" H 6355 3727 50  0000 C CNN
F 2 "" H 6350 3900 50  0001 C CNN
F 3 "" H 6350 3900 50  0001 C CNN
	1    6350 3900
	1    0    0    -1  
$EndComp
Wire Wire Line
	6350 3900 6350 3750
Wire Wire Line
	6350 3750 6150 3750
Wire Wire Line
	6150 3650 6350 3650
Wire Wire Line
	6350 3650 6350 3750
Connection ~ 6350 3750
$Comp
L Device:D_Schottky_AAK D?
U 1 1 5C6D4BF6
P 7200 3300
AR Path="/5C6D4BF6" Ref="D?"  Part="1" 
AR Path="/5C66EB2D/5C6D4BF6" Ref="D?"  Part="1" 
AR Path="/5C67E09D/5C6D4BF6" Ref="D?"  Part="1" 
AR Path="/5C6D4194/5C6D4BF6" Ref="D401"  Part="1" 
F 0 "D401" V 7179 3441 50  0000 L CNN
F 1 "D_Schottky_AAK" V 7270 3441 50  0000 L CNN
F 2 "Package_TO_SOT_SMD:TO-277B" H 7200 3300 50  0001 C CNN
F 3 "~" H 7200 3300 50  0001 C CNN
F 4 "ON Semiconductor" V 7200 3300 50  0001 C CNN "Manufacturer"
F 5 "FSV8100V" V 7200 3300 50  0001 C CNN "PartNumber"
	1    7200 3300
	0    1    1    0   
$EndComp
$Comp
L power:GND #PWR?
U 1 1 5C6D4BFD
P 7200 3700
AR Path="/5C6D4BFD" Ref="#PWR?"  Part="1" 
AR Path="/5C66EB2D/5C6D4BFD" Ref="#PWR?"  Part="1" 
AR Path="/5C67E09D/5C6D4BFD" Ref="#PWR?"  Part="1" 
AR Path="/5C6D4194/5C6D4BFD" Ref="#PWR?"  Part="1" 
F 0 "#PWR?" H 7200 3450 50  0001 C CNN
F 1 "GND" H 7205 3527 50  0000 C CNN
F 2 "" H 7200 3700 50  0001 C CNN
F 3 "" H 7200 3700 50  0001 C CNN
	1    7200 3700
	1    0    0    -1  
$EndComp
Wire Wire Line
	7200 3700 7200 3600
Wire Wire Line
	7200 3600 7300 3600
Wire Wire Line
	7300 3600 7300 3500
Connection ~ 7200 3600
Wire Wire Line
	7200 3600 7200 3500
Wire Wire Line
	7200 3150 7200 3050
Wire Wire Line
	7200 3050 6900 3050
Connection ~ 6900 3050
$Comp
L Device:L L?
U 1 1 5C6D4C0D
P 7550 3050
AR Path="/5C6D4C0D" Ref="L?"  Part="1" 
AR Path="/5C66EB2D/5C6D4C0D" Ref="L?"  Part="1" 
AR Path="/5C67E09D/5C6D4C0D" Ref="L?"  Part="1" 
AR Path="/5C6D4194/5C6D4C0D" Ref="L401"  Part="1" 
F 0 "L401" V 7740 3050 50  0000 C CNN
F 1 "22uH" V 7649 3050 50  0000 C CNN
F 2 "Inductor_SMD:L_Bourns_SRP1245A" H 7550 3050 50  0001 C CNN
F 3 "~" H 7550 3050 50  0001 C CNN
F 4 "Bourns" V 7550 3050 50  0001 C CNN "Manufacturer"
F 5 "SRP1265A-220M" V 7550 3050 50  0001 C CNN "PartNumber"
	1    7550 3050
	0    -1   -1   0   
$EndComp
Wire Wire Line
	7400 3050 7200 3050
Connection ~ 7200 3050
$Comp
L Device:C C?
U 1 1 5C6D4C19
P 8350 3400
AR Path="/5C6D4C19" Ref="C?"  Part="1" 
AR Path="/5C66EB2D/5C6D4C19" Ref="C?"  Part="1" 
AR Path="/5C67E09D/5C6D4C19" Ref="C?"  Part="1" 
AR Path="/5C6D4194/5C6D4C19" Ref="C410"  Part="1" 
F 0 "C410" H 8465 3446 50  0000 L CNN
F 1 "22uF" H 8465 3355 50  0000 L CNN
F 2 "Capacitor_SMD:C_0805_2012Metric" H 8388 3250 50  0001 C CNN
F 3 "~" H 8350 3400 50  0001 C CNN
F 4 "Murata" H 8350 3400 50  0001 C CNN "Manufacturer"
F 5 "GRM21BR61E226ME44K" H 8350 3400 50  0001 C CNN "PartNumber"
F 6 "2m" H 8350 3400 50  0001 C CNN "ESR"
	1    8350 3400
	1    0    0    -1  
$EndComp
$Comp
L Device:C C?
U 1 1 5C6D4C22
P 850 2550
AR Path="/5C6D4C22" Ref="C?"  Part="1" 
AR Path="/5C66EB2D/5C6D4C22" Ref="C?"  Part="1" 
AR Path="/5C67E09D/5C6D4C22" Ref="C?"  Part="1" 
AR Path="/5C6D4194/5C6D4C22" Ref="C401"  Part="1" 
F 0 "C401" H 965 2596 50  0000 L CNN
F 1 "2.2uF" H 965 2505 50  0000 L CNN
F 2 "Capacitor_SMD:C_1206_3216Metric" H 888 2400 50  0001 C CNN
F 3 "~" H 850 2550 50  0001 C CNN
F 4 "TDK" H 850 2550 50  0001 C CNN "Manufacturer"
F 5 "CGA5L3X7S2A225M160AB" H 850 2550 50  0001 C CNN "PartNumber"
	1    850  2550
	1    0    0    -1  
$EndComp
Wire Wire Line
	850  2700 850  2950
Wire Wire Line
	850  2950 1300 2950
Connection ~ 1300 2950
Wire Wire Line
	850  2400 850  2200
Wire Wire Line
	850  2200 1300 2200
Connection ~ 1300 2200
Wire Wire Line
	8350 3250 8350 3050
Wire Wire Line
	8350 3050 7900 3050
$Comp
L power:GND #PWR?
U 1 1 5C6D4C31
P 8350 3700
AR Path="/5C6D4C31" Ref="#PWR?"  Part="1" 
AR Path="/5C66EB2D/5C6D4C31" Ref="#PWR?"  Part="1" 
AR Path="/5C67E09D/5C6D4C31" Ref="#PWR?"  Part="1" 
AR Path="/5C6D4194/5C6D4C31" Ref="#PWR?"  Part="1" 
F 0 "#PWR?" H 8350 3450 50  0001 C CNN
F 1 "GND" H 8355 3527 50  0000 C CNN
F 2 "" H 8350 3700 50  0001 C CNN
F 3 "" H 8350 3700 50  0001 C CNN
	1    8350 3700
	1    0    0    -1  
$EndComp
$Comp
L power:GND #PWR?
U 1 1 5C6D4C37
P 8750 3700
AR Path="/5C6D4C37" Ref="#PWR?"  Part="1" 
AR Path="/5C66EB2D/5C6D4C37" Ref="#PWR?"  Part="1" 
AR Path="/5C67E09D/5C6D4C37" Ref="#PWR?"  Part="1" 
AR Path="/5C6D4194/5C6D4C37" Ref="#PWR?"  Part="1" 
F 0 "#PWR?" H 8750 3450 50  0001 C CNN
F 1 "GND" H 8755 3527 50  0000 C CNN
F 2 "" H 8750 3700 50  0001 C CNN
F 3 "" H 8750 3700 50  0001 C CNN
	1    8750 3700
	1    0    0    -1  
$EndComp
$Comp
L power:GND #PWR?
U 1 1 5C6D4C3D
P 9150 3700
AR Path="/5C6D4C3D" Ref="#PWR?"  Part="1" 
AR Path="/5C66EB2D/5C6D4C3D" Ref="#PWR?"  Part="1" 
AR Path="/5C67E09D/5C6D4C3D" Ref="#PWR?"  Part="1" 
AR Path="/5C6D4194/5C6D4C3D" Ref="#PWR?"  Part="1" 
F 0 "#PWR?" H 9150 3450 50  0001 C CNN
F 1 "GND" H 9155 3527 50  0000 C CNN
F 2 "" H 9150 3700 50  0001 C CNN
F 3 "" H 9150 3700 50  0001 C CNN
	1    9150 3700
	1    0    0    -1  
$EndComp
Wire Wire Line
	8350 3700 8350 3550
Wire Wire Line
	8750 3550 8750 3700
Wire Wire Line
	9150 3700 9150 3550
Connection ~ 8350 3050
Wire Wire Line
	8750 3050 8750 3250
Connection ~ 8750 3050
Wire Wire Line
	8750 3050 8350 3050
Wire Wire Line
	9150 3050 9150 3250
Wire Wire Line
	9150 3050 8750 3050
Text Notes 8750 2900 0    50   ~ 0
C=30 uF
$Comp
L Device:R R?
U 1 1 5C6D4C4D
P 7900 3350
AR Path="/5C6D4C4D" Ref="R?"  Part="1" 
AR Path="/5C66EB2D/5C6D4C4D" Ref="R?"  Part="1" 
AR Path="/5C67E09D/5C6D4C4D" Ref="R?"  Part="1" 
AR Path="/5C6D4194/5C6D4C4D" Ref="R408"  Part="1" 
F 0 "R408" H 7970 3396 50  0000 L CNN
F 1 "232k" H 7970 3305 50  0000 L CNN
F 2 "Resistor_SMD:R_0402_1005Metric" V 7830 3350 50  0001 C CNN
F 3 "~" H 7900 3350 50  0001 C CNN
F 4 "RMCF0402FT232K" H 7900 3350 50  0001 C CNN "PartNumber"
F 5 "Stackpole Electronics Inc" H 7900 3350 50  0001 C CNN "Manufacturer"
	1    7900 3350
	1    0    0    -1  
$EndComp
Wire Wire Line
	7900 3200 7900 3050
Connection ~ 7900 3050
Wire Wire Line
	7900 3050 7700 3050
$Comp
L Device:R R?
U 1 1 5C6D4C57
P 7900 4200
AR Path="/5C6D4C57" Ref="R?"  Part="1" 
AR Path="/5C66EB2D/5C6D4C57" Ref="R?"  Part="1" 
AR Path="/5C67E09D/5C6D4C57" Ref="R?"  Part="1" 
AR Path="/5C6D4194/5C6D4C57" Ref="R409"  Part="1" 
F 0 "R409" H 7970 4246 50  0000 L CNN
F 1 "10k" H 7970 4155 50  0000 L CNN
F 2 "Resistor_SMD:R_0402_1005Metric" V 7830 4200 50  0001 C CNN
F 3 "~" H 7900 4200 50  0001 C CNN
F 4 "RMCF0402FT10K0" H 7900 4200 50  0001 C CNN "PartNumber"
F 5 "Stackpole Electronics Inc" H 7900 4200 50  0001 C CNN "Manufacturer"
	1    7900 4200
	1    0    0    -1  
$EndComp
Wire Wire Line
	7900 4050 7900 3950
$Comp
L power:GND #PWR?
U 1 1 5C6D4C5F
P 7900 4500
AR Path="/5C6D4C5F" Ref="#PWR?"  Part="1" 
AR Path="/5C66EB2D/5C6D4C5F" Ref="#PWR?"  Part="1" 
AR Path="/5C67E09D/5C6D4C5F" Ref="#PWR?"  Part="1" 
AR Path="/5C6D4194/5C6D4C5F" Ref="#PWR?"  Part="1" 
F 0 "#PWR?" H 7900 4250 50  0001 C CNN
F 1 "GND" H 7905 4327 50  0000 C CNN
F 2 "" H 7900 4500 50  0001 C CNN
F 3 "" H 7900 4500 50  0001 C CNN
	1    7900 4500
	1    0    0    -1  
$EndComp
Wire Wire Line
	7900 4500 7900 4350
Wire Wire Line
	6600 3950 6600 3450
Wire Wire Line
	6150 3450 6600 3450
Connection ~ 7900 3950
Wire Wire Line
	7900 3950 7900 3500
$Comp
L Device:C C?
U 1 1 5C6D4C6C
P 8750 3400
AR Path="/5C6D4C6C" Ref="C?"  Part="1" 
AR Path="/5C66EB2D/5C6D4C6C" Ref="C?"  Part="1" 
AR Path="/5C67E09D/5C6D4C6C" Ref="C?"  Part="1" 
AR Path="/5C6D4194/5C6D4C6C" Ref="C411"  Part="1" 
F 0 "C411" H 8865 3446 50  0000 L CNN
F 1 "22uF" H 8865 3355 50  0000 L CNN
F 2 "Capacitor_SMD:C_0805_2012Metric" H 8788 3250 50  0001 C CNN
F 3 "~" H 8750 3400 50  0001 C CNN
F 4 "Murata" H 8750 3400 50  0001 C CNN "Manufacturer"
F 5 "GRM21BR61E226ME44K" H 8750 3400 50  0001 C CNN "PartNumber"
	1    8750 3400
	1    0    0    -1  
$EndComp
$Comp
L Device:C C?
U 1 1 5C6D4C75
P 9150 3400
AR Path="/5C6D4C75" Ref="C?"  Part="1" 
AR Path="/5C66EB2D/5C6D4C75" Ref="C?"  Part="1" 
AR Path="/5C67E09D/5C6D4C75" Ref="C?"  Part="1" 
AR Path="/5C6D4194/5C6D4C75" Ref="C412"  Part="1" 
F 0 "C412" H 9265 3446 50  0000 L CNN
F 1 "22uF" H 9265 3355 50  0000 L CNN
F 2 "Capacitor_SMD:C_0805_2012Metric" H 9188 3250 50  0001 C CNN
F 3 "~" H 9150 3400 50  0001 C CNN
F 4 "Murata" H 9150 3400 50  0001 C CNN "Manufacturer"
F 5 "GRM21BR61E226ME44K" H 9150 3400 50  0001 C CNN "PartNumber"
	1    9150 3400
	1    0    0    -1  
$EndComp
Text Notes 4050 1750 0    50   ~ 0
36V UVLO stop voltage\n45V start voltage
Text Label 4050 3050 0    50   ~ 0
EN_Control
Text Label 4200 3250 0    50   ~ 0
RT_Control
Text Label 4400 3350 0    50   ~ 0
SS_Control
Text Label 4600 3550 0    50   ~ 0
COMP_Control
Text Label 4450 4000 0    50   ~ 0
COMP_RC_Control
Text Label 7500 3950 0    50   ~ 0
FB_Control
Text Label 6800 3050 0    50   ~ 0
SW_Control
Text Label 6350 2700 0    50   ~ 0
PWRGD_Control
Text Label 6250 3050 0    50   ~ 0
BOOT_Control
Text Label 8200 3050 0    50   ~ 0
VOUT_Control
Text HLabel 7000 2700 2    100  Output ~ 0
PWRGD
Wire Wire Line
	7000 2700 6350 2700
Connection ~ 6350 2700
Wire Wire Line
	6350 2700 6350 2850
Wire Wire Line
	2550 2200 3300 2200
$Comp
L POWDER_Power:EL3H7-G U?
U 1 1 5C6D4C8C
P 3100 2450
AR Path="/5C67E09D/5C6D4C8C" Ref="U?"  Part="1" 
AR Path="/5C6D4194/5C6D4C8C" Ref="U402"  Part="1" 
F 0 "U402" H 3100 2725 50  0000 C CNN
F 1 "EL3H7-G" H 3100 2634 50  0000 C CNN
F 2 "POWDER_Power:EL3H7-G" H 3100 2150 50  0001 C CNN
F 3 "" H 3100 2450 50  0001 C CNN
F 4 "Everlight Electronics Co Ltd" H 3100 2450 50  0001 C CNN "Manufacturer"
F 5 "EL3H7(B)(TA)-VG" H 3100 2450 50  0001 C CNN "PartNumber"
	1    3100 2450
	1    0    0    -1  
$EndComp
Wire Wire Line
	7900 3950 6600 3950
Wire Wire Line
	3300 2500 3300 2700
Wire Wire Line
	3300 2400 3300 2200
Connection ~ 3300 2200
Wire Wire Line
	3300 2200 4600 2200
$Comp
L Device:R R?
U 1 1 5C6D4C98
P 2400 3350
AR Path="/5C6D4C98" Ref="R?"  Part="1" 
AR Path="/5C66EB2D/5C6D4C98" Ref="R?"  Part="1" 
AR Path="/5C67E09D/5C6D4C98" Ref="R?"  Part="1" 
AR Path="/5C6D4194/5C6D4C98" Ref="R402"  Part="1" 
F 0 "R402" V 2193 3350 50  0000 C CNN
F 1 "4k" V 2284 3350 50  0000 C CNN
F 2 "Resistor_SMD:R_0402_1005Metric" V 2330 3350 50  0001 C CNN
F 3 "~" H 2400 3350 50  0001 C CNN
F 4 "Stackpole Electronics Inc" V 2400 3350 50  0001 C CNN "Manufacturer"
F 5 "RMCF0402FT200R" V 2400 3350 50  0001 C CNN "PartNumber"
	1    2400 3350
	0    1    1    0   
$EndComp
Wire Wire Line
	2900 2400 2750 2400
Wire Wire Line
	2750 2400 2750 3350
Wire Wire Line
	2750 3350 2550 3350
Wire Wire Line
	2250 3350 2050 3350
$Comp
L power:GND #PWR?
U 1 1 5C6D4CA3
P 2900 3050
AR Path="/5C6D4CA3" Ref="#PWR?"  Part="1" 
AR Path="/5C66EB2D/5C6D4CA3" Ref="#PWR?"  Part="1" 
AR Path="/5C67E09D/5C6D4CA3" Ref="#PWR?"  Part="1" 
AR Path="/5C6D4194/5C6D4CA3" Ref="#PWR?"  Part="1" 
F 0 "#PWR?" H 2900 2800 50  0001 C CNN
F 1 "GND" H 2905 2877 50  0000 C CNN
F 2 "" H 2900 3050 50  0001 C CNN
F 3 "" H 2900 3050 50  0001 C CNN
	1    2900 3050
	1    0    0    -1  
$EndComp
Wire Wire Line
	2900 3050 2900 2500
Text HLabel 2050 3350 0    100  Input ~ 0
START
$Comp
L POWDER_Power:EL3H7-G U?
U 1 1 5C6D4CAB
P 2600 3900
AR Path="/5C67E09D/5C6D4CAB" Ref="U?"  Part="1" 
AR Path="/5C6D4194/5C6D4CAB" Ref="U401"  Part="1" 
F 0 "U401" H 2600 4175 50  0000 C CNN
F 1 "EL3H7-G" H 2600 4084 50  0000 C CNN
F 2 "POWDER_Power:EL3H7-G" H 2600 3600 50  0001 C CNN
F 3 "" H 2600 3900 50  0001 C CNN
F 4 "EL3H7(B)(TA)-VG" H 2600 3900 50  0001 C CNN "PartNumber"
F 5 "Everlight Electronics Co Ltd" H 2600 3900 50  0001 C CNN "Manufacturer"
	1    2600 3900
	1    0    0    -1  
$EndComp
Wire Wire Line
	2800 3850 3150 3850
Wire Wire Line
	3150 3850 3150 3050
Wire Wire Line
	3150 3050 3300 3050
Wire Wire Line
	2800 3950 3150 3950
Wire Wire Line
	3150 3950 3150 4450
Wire Wire Line
	3150 4450 3300 4450
Connection ~ 3300 4450
$Comp
L Device:R R?
U 1 1 5C6D4CB9
P 2100 3850
AR Path="/5C6D4CB9" Ref="R?"  Part="1" 
AR Path="/5C66EB2D/5C6D4CB9" Ref="R?"  Part="1" 
AR Path="/5C67E09D/5C6D4CB9" Ref="R?"  Part="1" 
AR Path="/5C6D4194/5C6D4CB9" Ref="R401"  Part="1" 
F 0 "R401" V 1893 3850 50  0000 C CNN
F 1 "2.0k" V 1984 3850 50  0000 C CNN
F 2 "Resistor_SMD:R_0402_1005Metric" V 2030 3850 50  0001 C CNN
F 3 "~" H 2100 3850 50  0001 C CNN
F 4 "Stackpole Electronics Inc" V 2100 3850 50  0001 C CNN "Manufacturer"
F 5 "RMCF0402FT2K00" V 2100 3850 50  0001 C CNN "PartNumber"
	1    2100 3850
	0    1    1    0   
$EndComp
$Comp
L power:GND #PWR?
U 1 1 5C6D4CC0
P 2250 4550
AR Path="/5C6D4CC0" Ref="#PWR?"  Part="1" 
AR Path="/5C66EB2D/5C6D4CC0" Ref="#PWR?"  Part="1" 
AR Path="/5C67E09D/5C6D4CC0" Ref="#PWR?"  Part="1" 
AR Path="/5C6D4194/5C6D4CC0" Ref="#PWR?"  Part="1" 
F 0 "#PWR?" H 2250 4300 50  0001 C CNN
F 1 "GND" H 2255 4377 50  0000 C CNN
F 2 "" H 2250 4550 50  0001 C CNN
F 3 "" H 2250 4550 50  0001 C CNN
	1    2250 4550
	1    0    0    -1  
$EndComp
Wire Wire Line
	2250 4550 2250 3950
Wire Wire Line
	2250 3950 2400 3950
Wire Wire Line
	2250 3850 2400 3850
Wire Wire Line
	1950 3850 1800 3850
Text HLabel 1800 3850 0    100  Input ~ 0
DISABLE
$Comp
L power:+5V #PWR?
U 1 1 5C6D4CCB
P 6350 2050
AR Path="/5C67E09D/5C6D4CCB" Ref="#PWR?"  Part="1" 
AR Path="/5C6D4194/5C6D4CCB" Ref="#PWR?"  Part="1" 
F 0 "#PWR?" H 6350 1900 50  0001 C CNN
F 1 "+5V" H 6365 2223 50  0000 C CNN
F 2 "" H 6350 2050 50  0001 C CNN
F 3 "" H 6350 2050 50  0001 C CNN
	1    6350 2050
	1    0    0    -1  
$EndComp
$Comp
L power:GND #PWR?
U 1 1 5C6D4CD1
P 9600 3700
AR Path="/5C6D4CD1" Ref="#PWR?"  Part="1" 
AR Path="/5C66EB2D/5C6D4CD1" Ref="#PWR?"  Part="1" 
AR Path="/5C67E09D/5C6D4CD1" Ref="#PWR?"  Part="1" 
AR Path="/5C6D4194/5C6D4CD1" Ref="#PWR?"  Part="1" 
F 0 "#PWR?" H 9600 3450 50  0001 C CNN
F 1 "GND" H 9605 3527 50  0000 C CNN
F 2 "" H 9600 3700 50  0001 C CNN
F 3 "" H 9600 3700 50  0001 C CNN
	1    9600 3700
	1    0    0    -1  
$EndComp
Wire Wire Line
	9600 3550 9600 3700
Wire Wire Line
	9600 3250 9600 3050
Wire Wire Line
	9600 3050 9150 3050
$Comp
L power:GND #PWR?
U 1 1 5C6D4CDA
P 10100 3700
AR Path="/5C6D4CDA" Ref="#PWR?"  Part="1" 
AR Path="/5C66EB2D/5C6D4CDA" Ref="#PWR?"  Part="1" 
AR Path="/5C67E09D/5C6D4CDA" Ref="#PWR?"  Part="1" 
AR Path="/5C6D4194/5C6D4CDA" Ref="#PWR?"  Part="1" 
F 0 "#PWR?" H 10100 3450 50  0001 C CNN
F 1 "GND" H 10105 3527 50  0000 C CNN
F 2 "" H 10100 3700 50  0001 C CNN
F 3 "" H 10100 3700 50  0001 C CNN
	1    10100 3700
	1    0    0    -1  
$EndComp
$Comp
L Connector:Screw_Terminal_01x02 J?
U 1 1 5C6D4CE0
P 10850 3050
AR Path="/5C6D4CE0" Ref="J?"  Part="1" 
AR Path="/5C66EB2D/5C6D4CE0" Ref="J?"  Part="1" 
AR Path="/5C67E09D/5C6D4CE0" Ref="J?"  Part="1" 
AR Path="/5C6D4194/5C6D4CE0" Ref="J401"  Part="1" 
F 0 "J401" H 10930 3042 50  0000 L CNN
F 1 "Screw_Terminal_01x02" H 10930 2951 50  0000 L CNN
F 2 "TerminalBlock:TerminalBlock_bornier-2_P5.08mm" H 10850 3050 50  0001 C CNN
F 3 "~" H 10850 3050 50  0001 C CNN
F 4 "Molex" H 10850 3050 50  0001 C CNN "Manufacturer"
F 5 "0398800302" H 10850 3050 50  0001 C CNN "PartNumber"
	1    10850 3050
	1    0    0    -1  
$EndComp
Wire Wire Line
	10100 3150 10100 3700
$Comp
L Device:C C?
U 1 1 5C6D4CEB
P 9600 3400
AR Path="/5C6D4CEB" Ref="C?"  Part="1" 
AR Path="/5C66EB2D/5C6D4CEB" Ref="C?"  Part="1" 
AR Path="/5C67E09D/5C6D4CEB" Ref="C?"  Part="1" 
AR Path="/5C6D4194/5C6D4CEB" Ref="C413"  Part="1" 
F 0 "C413" H 9715 3446 50  0000 L CNN
F 1 "22uF" H 9715 3355 50  0000 L CNN
F 2 "Capacitor_SMD:C_0805_2012Metric" H 9638 3250 50  0001 C CNN
F 3 "~" H 9600 3400 50  0001 C CNN
F 4 "Murata" H 9600 3400 50  0001 C CNN "Manufacturer"
F 5 "GRM21BR61E226ME44K" H 9600 3400 50  0001 C CNN "PartNumber"
	1    9600 3400
	1    0    0    -1  
$EndComp
$Comp
L Device:R R?
U 1 1 5C6D4CF2
P 9900 3050
AR Path="/5C6D4CF2" Ref="R?"  Part="1" 
AR Path="/5C66EB2D/5C6D4CF2" Ref="R?"  Part="1" 
AR Path="/5C67E09D/5C6D4CF2" Ref="R?"  Part="1" 
AR Path="/5C6D4194/5C6D4CF2" Ref="R410"  Part="1" 
F 0 "R410" V 9693 3050 50  0000 C CNN
F 1 "5m" V 9784 3050 50  0000 C CNN
F 2 "Resistor_SMD:R_0612_1632Metric" V 9830 3050 50  0001 C CNN
F 3 "~" H 9900 3050 50  0001 C CNN
F 4 "Ohmite" V 9900 3050 50  0001 C CNN "Manufacturer"
F 5 "FCSL32R005FER" V 9900 3050 50  0001 C CNN "PartNumber"
	1    9900 3050
	0    1    1    0   
$EndComp
Wire Wire Line
	9750 3050 9600 3050
Connection ~ 9600 3050
Wire Wire Line
	10050 3050 10150 3050
Text HLabel 10250 2650 2    100  Output ~ 0
RSM
Text HLabel 10250 2500 2    100  Output ~ 0
RSP
Wire Wire Line
	10250 2650 10150 2650
Wire Wire Line
	10150 2650 10150 3050
Connection ~ 10150 3050
Wire Wire Line
	10150 3050 10200 3050
Wire Wire Line
	10250 2500 9600 2500
Wire Wire Line
	9600 2500 9600 3050
Connection ~ 9150 3050
$Comp
L Device:Fuse F401
U 1 1 5C93068E
P 10350 3050
F 0 "F401" V 10153 3050 50  0000 C CNN
F 1 "Fuse" V 10244 3050 50  0000 C CNN
F 2 "Fuse:Fuseholder_Cylinder-5x20mm_Stelvio-Kontek_PTF78_Horizontal_Open" V 10280 3050 50  0001 C CNN
F 3 "~" H 10350 3050 50  0001 C CNN
	1    10350 3050
	0    1    1    0   
$EndComp
Wire Wire Line
	10500 3050 10650 3050
Wire Wire Line
	10100 3150 10650 3150
Text Label 10600 3050 1    50   ~ 0
EXP2_OUT
$EndSCHEMATC
