EESchema Schematic File Version 4
LIBS:biccmpb_main-cache
EELAYER 30 0
EELAYER END
$Descr A4 11693 8268
encoding utf-8
Sheet 15 28
Title ""
Date ""
Rev ""
Comp ""
Comment1 ""
Comment2 ""
Comment3 ""
Comment4 ""
$EndDescr
$Comp
L POWDER_Digital:LMK00334-Q1 U1501
U 1 1 5D5C2CE4
P 5050 4200
F 0 "U1501" H 5050 4250 50  0000 C CNN
F 1 "LMK00334-Q1" H 5050 4150 50  0000 C CNN
F 2 "Package_DFN_QFN:WQFN-32-1EP_5x5mm_P0.5mm_EP3.1x3.1mm" H 4900 4350 50  0001 C CNN
F 3 "" H 4900 4350 50  0001 C CNN
	1    5050 4200
	1    0    0    -1  
$EndComp
$Comp
L power:+3.3V #PWR?
U 1 1 5D5C64AD
P 4550 2900
F 0 "#PWR?" H 4550 2750 50  0001 C CNN
F 1 "+3.3V" H 4565 3073 50  0000 C CNN
F 2 "" H 4550 2900 50  0001 C CNN
F 3 "" H 4550 2900 50  0001 C CNN
	1    4550 2900
	1    0    0    -1  
$EndComp
Wire Wire Line
	4550 2900 4550 3000
Wire Wire Line
	4550 3000 4650 3000
Wire Wire Line
	5550 3000 5550 3100
Connection ~ 4550 3000
Wire Wire Line
	4550 3000 4550 3100
Wire Wire Line
	5050 3100 5050 3000
Connection ~ 5050 3000
Wire Wire Line
	4950 3000 4950 3100
Connection ~ 4950 3000
Wire Wire Line
	4950 3000 5050 3000
Wire Wire Line
	4750 3100 4750 3000
Connection ~ 4750 3000
Wire Wire Line
	4750 3000 4950 3000
Wire Wire Line
	4650 3000 4650 3100
Connection ~ 4650 3000
Wire Wire Line
	4650 3000 4750 3000
Wire Wire Line
	7550 2450 7150 2450
Wire Wire Line
	7150 2450 7150 2400
Wire Wire Line
	7550 2450 7550 2400
Wire Wire Line
	7150 2450 6750 2450
Wire Wire Line
	6750 2450 6750 2400
Connection ~ 7150 2450
Wire Wire Line
	6750 2450 6350 2450
Wire Wire Line
	6350 2450 6350 2400
Connection ~ 6750 2450
$Comp
L power:+3.3V #PWR?
U 1 1 5D5DACAE
P 6350 2000
F 0 "#PWR?" H 6350 1850 50  0001 C CNN
F 1 "+3.3V" H 6365 2173 50  0000 C CNN
F 2 "" H 6350 2000 50  0001 C CNN
F 3 "" H 6350 2000 50  0001 C CNN
	1    6350 2000
	1    0    0    -1  
$EndComp
Wire Wire Line
	6350 2000 6350 2050
Wire Wire Line
	6350 2050 6750 2050
Wire Wire Line
	6750 2050 6750 2100
Connection ~ 6350 2050
Wire Wire Line
	6350 2050 6350 2100
Wire Wire Line
	6750 2050 7150 2050
Wire Wire Line
	7150 2050 7150 2100
Connection ~ 6750 2050
Wire Wire Line
	7150 2050 7550 2050
Wire Wire Line
	7550 2050 7550 2100
Connection ~ 7150 2050
Wire Wire Line
	7550 2450 7950 2450
Wire Wire Line
	7950 2450 7950 2400
Connection ~ 7550 2450
Wire Wire Line
	7550 2050 7950 2050
Wire Wire Line
	7950 2050 7950 2100
Connection ~ 7550 2050
Wire Wire Line
	7950 2450 8350 2450
Wire Wire Line
	8350 2450 8350 2400
Connection ~ 7950 2450
Wire Wire Line
	7950 2050 8350 2050
Wire Wire Line
	8350 2050 8350 2100
Connection ~ 7950 2050
Wire Wire Line
	8350 2050 8750 2050
Wire Wire Line
	8750 2050 8750 2100
Connection ~ 8350 2050
Wire Wire Line
	8750 2050 9150 2050
Wire Wire Line
	9150 2050 9150 2100
Connection ~ 8750 2050
Wire Wire Line
	8350 2450 8750 2450
Wire Wire Line
	8750 2450 8750 2400
Connection ~ 8350 2450
Wire Wire Line
	8750 2450 9150 2450
Wire Wire Line
	9150 2450 9150 2400
Connection ~ 8750 2450
$Comp
L power:GND #PWR?
U 1 1 5D5F8E1D
P 9150 2500
F 0 "#PWR?" H 9150 2250 50  0001 C CNN
F 1 "GND" H 9155 2327 50  0000 C CNN
F 2 "" H 9150 2500 50  0001 C CNN
F 3 "" H 9150 2500 50  0001 C CNN
	1    9150 2500
	1    0    0    -1  
$EndComp
Wire Wire Line
	9150 2450 9150 2500
Connection ~ 9150 2450
$Comp
L Switch:SW_DIP_x02 SW1501
U 1 1 5D617517
P 2600 2950
F 0 "SW1501" H 2600 3317 50  0000 C CNN
F 1 "SW_DIP_x02" H 2600 3226 50  0000 C CNN
F 2 "Package_DIP:SMDIP-4_W7.62mm" H 2600 2950 50  0001 C CNN
F 3 "~" H 2600 2950 50  0001 C CNN
	1    2600 2950
	1    0    0    -1  
$EndComp
Wire Wire Line
	5050 3000 5550 3000
NoConn ~ 6000 4250
NoConn ~ 6000 4350
NoConn ~ 6000 4450
NoConn ~ 6000 4550
$Comp
L Device:R_Small R1513
U 1 1 5D63330A
P 7100 4350
F 0 "R1513" V 7200 4350 50  0000 C CNN
F 1 "50" V 7100 4350 39  0000 C CNN
F 2 "Resistor_SMD:R_0201_0603Metric" H 7100 4350 50  0001 C CNN
F 3 "~" H 7100 4350 50  0001 C CNN
	1    7100 4350
	1    0    0    -1  
$EndComp
$Comp
L power:GND #PWR?
U 1 1 5D63331A
P 7100 4500
F 0 "#PWR?" H 7100 4250 50  0001 C CNN
F 1 "GND" H 7105 4327 50  0000 C CNN
F 2 "" H 7100 4500 50  0001 C CNN
F 3 "" H 7100 4500 50  0001 C CNN
	1    7100 4500
	1    0    0    -1  
$EndComp
Wire Wire Line
	7100 4500 7100 4450
Wire Wire Line
	6900 4450 6900 4500
$Comp
L power:GND #PWR?
U 1 1 5D62D4B0
P 6900 4500
F 0 "#PWR?" H 6900 4250 50  0001 C CNN
F 1 "GND" H 6905 4327 50  0000 C CNN
F 2 "" H 6900 4500 50  0001 C CNN
F 3 "" H 6900 4500 50  0001 C CNN
	1    6900 4500
	1    0    0    -1  
$EndComp
Wire Wire Line
	6700 4500 6700 4450
$Comp
L power:GND #PWR?
U 1 1 5D62ADC5
P 6700 4500
F 0 "#PWR?" H 6700 4250 50  0001 C CNN
F 1 "GND" H 6705 4327 50  0000 C CNN
F 2 "" H 6700 4500 50  0001 C CNN
F 3 "" H 6700 4500 50  0001 C CNN
	1    6700 4500
	1    0    0    -1  
$EndComp
Wire Wire Line
	6700 4150 6700 4250
$Comp
L Device:R_Small R1511
U 1 1 5D627168
P 6900 4350
F 0 "R1511" V 7000 4350 50  0000 C CNN
F 1 "50" V 6900 4350 39  0000 C CNN
F 2 "Resistor_SMD:R_0201_0603Metric" H 6900 4350 50  0001 C CNN
F 3 "~" H 6900 4350 50  0001 C CNN
	1    6900 4350
	1    0    0    -1  
$EndComp
$Comp
L Device:R_Small R1509
U 1 1 5D625F2D
P 6700 4350
F 0 "R1509" V 6800 4350 50  0000 C CNN
F 1 "50" V 6700 4350 39  0000 C CNN
F 2 "Resistor_SMD:R_0201_0603Metric" H 6700 4350 50  0001 C CNN
F 3 "~" H 6700 4350 50  0001 C CNN
	1    6700 4350
	1    0    0    -1  
$EndComp
$Comp
L Device:R_Small R1505
U 1 1 5D61D003
P 6500 3450
F 0 "R1505" V 6400 3450 50  0000 C CNN
F 1 "0" V 6500 3450 39  0000 C CNN
F 2 "Resistor_SMD:R_0201_0603Metric" H 6500 3450 50  0001 C CNN
F 3 "~" H 6500 3450 50  0001 C CNN
	1    6500 3450
	0    1    1    0   
$EndComp
$Comp
L Device:R_Small R1506
U 1 1 5D622C87
P 6500 3650
F 0 "R1506" V 6400 3650 50  0000 C CNN
F 1 "0" V 6500 3650 39  0000 C CNN
F 2 "Resistor_SMD:R_0201_0603Metric" H 6500 3650 50  0001 C CNN
F 3 "~" H 6500 3650 50  0001 C CNN
	1    6500 3650
	0    1    1    0   
$EndComp
$Comp
L Device:R_Small R1507
U 1 1 5D657980
P 6500 3950
F 0 "R1507" V 6400 3950 50  0000 C CNN
F 1 "0" V 6500 3950 39  0000 C CNN
F 2 "Resistor_SMD:R_0201_0603Metric" H 6500 3950 50  0001 C CNN
F 3 "~" H 6500 3950 50  0001 C CNN
	1    6500 3950
	0    1    1    0   
$EndComp
$Comp
L Device:R_Small R1508
U 1 1 5D6588FF
P 6500 4150
F 0 "R1508" V 6400 4150 50  0000 C CNN
F 1 "0" V 6500 4150 39  0000 C CNN
F 2 "Resistor_SMD:R_0201_0603Metric" H 6500 4150 50  0001 C CNN
F 3 "~" H 6500 4150 50  0001 C CNN
	1    6500 4150
	0    1    1    0   
$EndComp
Wire Wire Line
	6400 3650 6300 3650
Wire Wire Line
	6300 3650 6300 3750
Wire Wire Line
	6300 3750 6000 3750
Wire Wire Line
	6000 3650 6200 3650
Wire Wire Line
	6200 3650 6200 3450
Wire Wire Line
	6200 3450 6400 3450
Wire Wire Line
	6000 3850 6300 3850
Wire Wire Line
	6300 3850 6300 3950
Wire Wire Line
	6300 3950 6400 3950
Wire Wire Line
	6000 3950 6200 3950
Wire Wire Line
	6200 3950 6200 4150
Wire Wire Line
	6200 4150 6400 4150
Wire Wire Line
	6600 4150 6700 4150
Wire Wire Line
	6900 3950 6600 3950
Wire Wire Line
	6900 3950 6900 4250
Wire Wire Line
	7100 3650 6600 3650
Wire Wire Line
	7100 3650 7100 4250
$Comp
L Device:R_Small R1514
U 1 1 5D6743FF
P 7300 4350
F 0 "R1514" V 7400 4350 50  0000 C CNN
F 1 "50" V 7300 4350 39  0000 C CNN
F 2 "Resistor_SMD:R_0201_0603Metric" H 7300 4350 50  0001 C CNN
F 3 "~" H 7300 4350 50  0001 C CNN
	1    7300 4350
	1    0    0    -1  
$EndComp
$Comp
L power:GND #PWR?
U 1 1 5D674405
P 7300 4500
F 0 "#PWR?" H 7300 4250 50  0001 C CNN
F 1 "GND" H 7305 4327 50  0000 C CNN
F 2 "" H 7300 4500 50  0001 C CNN
F 3 "" H 7300 4500 50  0001 C CNN
	1    7300 4500
	1    0    0    -1  
$EndComp
Wire Wire Line
	7300 4500 7300 4450
Wire Wire Line
	7300 4250 7300 3450
Wire Wire Line
	7300 3450 6600 3450
$Comp
L power:GND #PWR?
U 1 1 5D6B1A44
P 5150 5500
F 0 "#PWR?" H 5150 5250 50  0001 C CNN
F 1 "GND" H 5155 5327 50  0000 C CNN
F 2 "" H 5150 5500 50  0001 C CNN
F 3 "" H 5150 5500 50  0001 C CNN
	1    5150 5500
	1    0    0    -1  
$EndComp
Wire Wire Line
	4650 5300 4650 5400
Wire Wire Line
	4650 5400 4750 5400
Wire Wire Line
	5150 5400 5150 5500
Wire Wire Line
	5150 5300 5150 5400
Connection ~ 5150 5400
Wire Wire Line
	4950 5300 4950 5400
Connection ~ 4950 5400
Wire Wire Line
	4950 5400 5150 5400
Wire Wire Line
	4850 5300 4850 5400
Connection ~ 4850 5400
Wire Wire Line
	4850 5400 4950 5400
Wire Wire Line
	4750 5300 4750 5400
Connection ~ 4750 5400
Wire Wire Line
	4750 5400 4850 5400
$Comp
L power:GND #PWR?
U 1 1 5D6CCD1B
P 3300 4500
F 0 "#PWR?" H 3300 4250 50  0001 C CNN
F 1 "GND" H 3305 4327 50  0000 C CNN
F 2 "" H 3300 4500 50  0001 C CNN
F 3 "" H 3300 4500 50  0001 C CNN
	1    3300 4500
	1    0    0    -1  
$EndComp
$Comp
L Device:R_Small R1503
U 1 1 5D6D7E36
P 2950 4350
F 0 "R1503" H 3009 4396 50  0000 L CNN
F 1 "1k" H 3009 4305 50  0000 L CNN
F 2 "Resistor_SMD:R_0402_1005Metric" H 2950 4350 50  0001 C CNN
F 3 "~" H 2950 4350 50  0001 C CNN
	1    2950 4350
	1    0    0    -1  
$EndComp
$Comp
L Device:R_Small R1502
U 1 1 5D6D80E4
P 2950 3850
F 0 "R1502" H 2891 3804 50  0000 R CNN
F 1 "3k" H 2891 3895 50  0000 R CNN
F 2 "Resistor_SMD:R_0402_1005Metric" H 2950 3850 50  0001 C CNN
F 3 "~" H 2950 3850 50  0001 C CNN
	1    2950 3850
	-1   0    0    1   
$EndComp
Wire Wire Line
	2950 4150 2950 4250
Wire Wire Line
	2950 3950 2950 4150
$Comp
L power:+3.3V #PWR?
U 1 1 5D6E82BD
P 2950 3700
F 0 "#PWR?" H 2950 3550 50  0001 C CNN
F 1 "+3.3V" H 2965 3873 50  0000 C CNN
F 2 "" H 2950 3700 50  0001 C CNN
F 3 "" H 2950 3700 50  0001 C CNN
	1    2950 3700
	1    0    0    -1  
$EndComp
Wire Wire Line
	2950 3700 2950 3750
$Comp
L power:GND #PWR?
U 1 1 5D6EB6B3
P 2950 4500
F 0 "#PWR?" H 2950 4250 50  0001 C CNN
F 1 "GND" H 2955 4327 50  0000 C CNN
F 2 "" H 2950 4500 50  0001 C CNN
F 3 "" H 2950 4500 50  0001 C CNN
	1    2950 4500
	1    0    0    -1  
$EndComp
Wire Wire Line
	2950 4450 2950 4500
$Comp
L Device:R_Small R1504
U 1 1 5D6F333E
P 3700 4350
F 0 "R1504" H 3759 4396 50  0000 L CNN
F 1 "50" H 3759 4305 50  0000 L CNN
F 2 "Resistor_SMD:R_0201_0603Metric" H 3700 4350 50  0001 C CNN
F 3 "~" H 3700 4350 50  0001 C CNN
	1    3700 4350
	1    0    0    -1  
$EndComp
Connection ~ 2950 4150
Wire Wire Line
	3700 4250 3700 4050
Connection ~ 3700 4050
Wire Wire Line
	3700 4050 2550 4050
Wire Wire Line
	3700 4450 3700 4500
$Comp
L power:GND #PWR?
U 1 1 5D70394E
P 3700 4500
F 0 "#PWR?" H 3700 4250 50  0001 C CNN
F 1 "GND" H 3705 4327 50  0000 C CNN
F 2 "" H 3700 4500 50  0001 C CNN
F 3 "" H 3700 4500 50  0001 C CNN
	1    3700 4500
	1    0    0    -1  
$EndComp
$Comp
L Device:R_Small R1501
U 1 1 5D7040B5
P 2450 4050
F 0 "R1501" V 2254 4050 50  0000 C CNN
F 1 "50" V 2345 4050 50  0000 C CNN
F 2 "Resistor_SMD:R_0201_0603Metric" H 2450 4050 50  0001 C CNN
F 3 "~" H 2450 4050 50  0001 C CNN
	1    2450 4050
	0    1    1    0   
$EndComp
Wire Wire Line
	2350 4050 2100 4050
NoConn ~ 4100 4650
NoConn ~ 4100 3750
NoConn ~ 4100 3850
Text Notes 3350 3900 0    50   ~ 0
these pins have\nInternal Pulldown\nresistors
Wire Wire Line
	3700 4050 4100 4050
Text Label 3600 3550 0    50   ~ 0
CLKout_EN
Wire Wire Line
	3600 3550 4100 3550
Text Label 3500 4850 0    50   ~ 0
REFout_EN
$Comp
L power:+3.3V #PWR?
U 1 1 5D72DD5D
P 2100 2650
F 0 "#PWR?" H 2100 2500 50  0001 C CNN
F 1 "+3.3V" H 2115 2823 50  0000 C CNN
F 2 "" H 2100 2650 50  0001 C CNN
F 3 "" H 2100 2650 50  0001 C CNN
	1    2100 2650
	1    0    0    -1  
$EndComp
Wire Wire Line
	2100 2650 2100 2850
Wire Wire Line
	2100 2950 2300 2950
Wire Wire Line
	2100 2850 2300 2850
Connection ~ 2100 2850
Wire Wire Line
	2100 2850 2100 2950
Text Label 3400 2950 2    50   ~ 0
CLKout_EN
Text Label 3400 2850 2    50   ~ 0
REFout_EN
Wire Wire Line
	2900 2950 3400 2950
Wire Wire Line
	2900 2850 3400 2850
$Comp
L Connector:Conn_Coaxial J1501
U 1 1 5D7450C4
P 7750 4850
F 0 "J1501" H 7850 4825 50  0000 L CNN
F 1 "Conn_Coaxial" H 7850 4734 50  0000 L CNN
F 2 "Connector_Coaxial:SMA_Amphenol_132134-10_Vertical" H 7750 4850 50  0001 C CNN
F 3 " ~" H 7750 4850 50  0001 C CNN
	1    7750 4850
	1    0    0    -1  
$EndComp
$Comp
L power:GND #PWR?
U 1 1 5D74AE9B
P 7750 5200
F 0 "#PWR?" H 7750 4950 50  0001 C CNN
F 1 "GND" H 7755 5027 50  0000 C CNN
F 2 "" H 7750 5200 50  0001 C CNN
F 3 "" H 7750 5200 50  0001 C CNN
	1    7750 5200
	1    0    0    -1  
$EndComp
Wire Wire Line
	3500 4850 4100 4850
Wire Wire Line
	4100 4250 4000 4250
Wire Wire Line
	4000 4250 4000 4350
$Comp
L power:GND #PWR?
U 1 1 5D75A8AB
P 4000 5500
F 0 "#PWR?" H 4000 5250 50  0001 C CNN
F 1 "GND" H 4005 5327 50  0000 C CNN
F 2 "" H 4000 5500 50  0001 C CNN
F 3 "" H 4000 5500 50  0001 C CNN
	1    4000 5500
	1    0    0    -1  
$EndComp
Wire Wire Line
	4100 4550 4000 4550
Connection ~ 4000 4550
Wire Wire Line
	4000 4550 4000 5500
Wire Wire Line
	4100 4350 4000 4350
Connection ~ 4000 4350
Wire Wire Line
	4000 4350 4000 4550
$Comp
L power:GND #PWR?
U 1 1 5D763F6F
P 6050 3100
F 0 "#PWR?" H 6050 2850 50  0001 C CNN
F 1 "GND" H 6055 2927 50  0000 C CNN
F 2 "" H 6050 3100 50  0001 C CNN
F 3 "" H 6050 3100 50  0001 C CNN
	1    6050 3100
	1    0    0    -1  
$EndComp
Wire Wire Line
	5250 3100 5250 2900
Wire Wire Line
	5250 2900 5350 2900
Wire Wire Line
	6050 2900 6050 3100
Wire Wire Line
	5350 3100 5350 2900
Connection ~ 5350 2900
Wire Wire Line
	5350 2900 6050 2900
Text HLabel 2100 4050 0    50   Input ~ 0
CLK_In
Text Notes 8450 1950 0    50   ~ 0
the two missing caps are unneccessary if not using output b
Text Notes 5300 2800 0    50   ~ 0
note output b grounded as it is unused
Wire Wire Line
	6000 4850 6600 4850
Text Label 7450 4850 2    50   ~ 0
REFout
Text Notes 1100 4500 0    50   ~ 0
See: Figure 16. Single-Ended LVCMOS Input,\nDC Coupling With Common Mode Biasing\nFrom datasheet
Wire Wire Line
	6900 5200 6900 5150
$Comp
L power:GND #PWR?
U 1 1 5E2AA822
P 6900 5200
F 0 "#PWR?" H 6900 4950 50  0001 C CNN
F 1 "GND" H 6905 5027 50  0000 C CNN
F 2 "" H 6900 5200 50  0001 C CNN
F 3 "" H 6900 5200 50  0001 C CNN
	1    6900 5200
	1    0    0    -1  
$EndComp
$Comp
L Device:R_Small R1512
U 1 1 5E2AA828
P 6900 5050
F 0 "R1512" V 7000 5050 50  0000 C CNN
F 1 "50" V 6900 5050 39  0000 C CNN
F 2 "Resistor_SMD:R_0201_0603Metric" H 6900 5050 50  0001 C CNN
F 3 "~" H 6900 5050 50  0001 C CNN
	1    6900 5050
	1    0    0    -1  
$EndComp
Wire Wire Line
	6900 4950 6900 4850
$Comp
L Device:R_Small R1510
U 1 1 5E2B9070
P 6700 4850
F 0 "R1510" V 6600 4850 50  0000 C CNN
F 1 "0" V 6700 4850 39  0000 C CNN
F 2 "Resistor_SMD:R_0201_0603Metric" H 6700 4850 50  0001 C CNN
F 3 "~" H 6700 4850 50  0001 C CNN
	1    6700 4850
	0    1    1    0   
$EndComp
Wire Wire Line
	6800 4850 6900 4850
Wire Wire Line
	7550 4850 6900 4850
Connection ~ 6900 4850
Wire Wire Line
	7750 5050 7750 5200
$Comp
L 000_PreferredParts:C_0_1uF C1501
U 1 1 5F7C7747
P 3300 4300
F 0 "C1501" H 3325 4400 50  0000 L CNN
F 1 "C_0_1uF" H 3325 4200 50  0001 L CNN
F 2 "Capacitor_SMD:C_0402_1005Metric" H 3338 4150 50  0001 C CNN
F 3 "~" H 3300 4300 50  0001 C CNN
F 4 "0.1uF" H 3450 4200 50  0000 C CNN "DisplayValue"
F 5 "3000-0000000125" H 3300 4300 50  0001 C CNN "PartSpecification"
F 6 "100V" H 3300 4300 50  0001 C CNN "Voltage"
	1    3300 4300
	1    0    0    -1  
$EndComp
Wire Wire Line
	2950 4150 3300 4150
Connection ~ 3300 4150
Wire Wire Line
	3300 4150 4100 4150
Wire Wire Line
	3300 4450 3300 4500
$Comp
L 000_PreferredParts:C_0_1uF C1502
U 1 1 5F7D1ECA
P 6350 2250
F 0 "C1502" H 6375 2350 50  0000 L CNN
F 1 "C_0_1uF" H 6375 2150 50  0001 L CNN
F 2 "Capacitor_SMD:C_0402_1005Metric" H 6388 2100 50  0001 C CNN
F 3 "~" H 6350 2250 50  0001 C CNN
F 4 "0.1uF" H 6500 2150 50  0000 C CNN "DisplayValue"
F 5 "3000-0000000125" H 6350 2250 50  0001 C CNN "PartSpecification"
F 6 "100V" H 6350 2250 50  0001 C CNN "Voltage"
	1    6350 2250
	1    0    0    -1  
$EndComp
$Comp
L 000_PreferredParts:C_0_1uF C1503
U 1 1 5F7DD568
P 6750 2250
F 0 "C1503" H 6775 2350 50  0000 L CNN
F 1 "C_0_1uF" H 6775 2150 50  0001 L CNN
F 2 "Capacitor_SMD:C_0402_1005Metric" H 6788 2100 50  0001 C CNN
F 3 "~" H 6750 2250 50  0001 C CNN
F 4 "0.1uF" H 6900 2150 50  0000 C CNN "DisplayValue"
F 5 "3000-0000000125" H 6750 2250 50  0001 C CNN "PartSpecification"
F 6 "100V" H 6750 2250 50  0001 C CNN "Voltage"
	1    6750 2250
	1    0    0    -1  
$EndComp
$Comp
L 000_PreferredParts:C_0_1uF C1504
U 1 1 5F7DD9B5
P 7150 2250
F 0 "C1504" H 7175 2350 50  0000 L CNN
F 1 "C_0_1uF" H 7175 2150 50  0001 L CNN
F 2 "Capacitor_SMD:C_0402_1005Metric" H 7188 2100 50  0001 C CNN
F 3 "~" H 7150 2250 50  0001 C CNN
F 4 "0.1uF" H 7300 2150 50  0000 C CNN "DisplayValue"
F 5 "3000-0000000125" H 7150 2250 50  0001 C CNN "PartSpecification"
F 6 "100V" H 7150 2250 50  0001 C CNN "Voltage"
	1    7150 2250
	1    0    0    -1  
$EndComp
$Comp
L 000_PreferredParts:C_0_1uF C1505
U 1 1 5F7DDDB0
P 7550 2250
F 0 "C1505" H 7575 2350 50  0000 L CNN
F 1 "C_0_1uF" H 7575 2150 50  0001 L CNN
F 2 "Capacitor_SMD:C_0402_1005Metric" H 7588 2100 50  0001 C CNN
F 3 "~" H 7550 2250 50  0001 C CNN
F 4 "0.1uF" H 7700 2150 50  0000 C CNN "DisplayValue"
F 5 "3000-0000000125" H 7550 2250 50  0001 C CNN "PartSpecification"
F 6 "100V" H 7550 2250 50  0001 C CNN "Voltage"
	1    7550 2250
	1    0    0    -1  
$EndComp
$Comp
L 000_PreferredParts:C_0_1uF C1506
U 1 1 5F7DE255
P 7950 2250
F 0 "C1506" H 7975 2350 50  0000 L CNN
F 1 "C_0_1uF" H 7975 2150 50  0001 L CNN
F 2 "Capacitor_SMD:C_0402_1005Metric" H 7988 2100 50  0001 C CNN
F 3 "~" H 7950 2250 50  0001 C CNN
F 4 "0.1uF" H 8100 2150 50  0000 C CNN "DisplayValue"
F 5 "3000-0000000125" H 7950 2250 50  0001 C CNN "PartSpecification"
F 6 "100V" H 7950 2250 50  0001 C CNN "Voltage"
	1    7950 2250
	1    0    0    -1  
$EndComp
$Comp
L 000_PreferredParts:C_0_1uF C1507
U 1 1 5F7DE718
P 8350 2250
F 0 "C1507" H 8375 2350 50  0000 L CNN
F 1 "C_0_1uF" H 8375 2150 50  0001 L CNN
F 2 "Capacitor_SMD:C_0402_1005Metric" H 8388 2100 50  0001 C CNN
F 3 "~" H 8350 2250 50  0001 C CNN
F 4 "0.1uF" H 8500 2150 50  0000 C CNN "DisplayValue"
F 5 "3000-0000000125" H 8350 2250 50  0001 C CNN "PartSpecification"
F 6 "100V" H 8350 2250 50  0001 C CNN "Voltage"
	1    8350 2250
	1    0    0    -1  
$EndComp
$Comp
L 000_PreferredParts:C_0_1uF C1508
U 1 1 5F7E03F3
P 8750 2250
F 0 "C1508" H 8775 2350 50  0000 L CNN
F 1 "C_0_1uF" H 8775 2150 50  0001 L CNN
F 2 "Capacitor_SMD:C_0402_1005Metric" H 8788 2100 50  0001 C CNN
F 3 "~" H 8750 2250 50  0001 C CNN
F 4 "0.1uF" H 8900 2150 50  0000 C CNN "DisplayValue"
F 5 "3000-0000000125" H 8750 2250 50  0001 C CNN "PartSpecification"
F 6 "100V" H 8750 2250 50  0001 C CNN "Voltage"
	1    8750 2250
	1    0    0    -1  
$EndComp
$Comp
L 000_PreferredParts:C_0_1uF C1509
U 1 1 5F7E0840
P 9150 2250
F 0 "C1509" H 9175 2350 50  0000 L CNN
F 1 "C_0_1uF" H 9175 2150 50  0001 L CNN
F 2 "Capacitor_SMD:C_0402_1005Metric" H 9188 2100 50  0001 C CNN
F 3 "~" H 9150 2250 50  0001 C CNN
F 4 "0.1uF" H 9300 2150 50  0000 C CNN "DisplayValue"
F 5 "3000-0000000125" H 9150 2250 50  0001 C CNN "PartSpecification"
F 6 "100V" H 9150 2250 50  0001 C CNN "Voltage"
	1    9150 2250
	1    0    0    -1  
$EndComp
Connection ~ 6700 4150
Connection ~ 6900 3950
Connection ~ 7100 3650
Connection ~ 7300 3450
Text Label 7950 3450 2    50   ~ 0
IRIS_1_P
Text Label 7950 3650 2    50   ~ 0
IRIS_1_N
Text Label 7950 3950 2    50   ~ 0
IRIS_2_P
Text Label 7950 4150 2    50   ~ 0
IRIS_2_N
Wire Wire Line
	6700 4150 8000 4150
Wire Wire Line
	6900 3950 8350 3950
Wire Wire Line
	7100 3650 8700 3650
Wire Wire Line
	7300 3450 9050 3450
$Comp
L power:GND #PWR?
U 1 1 5D6A2D9B
P 9250 4500
F 0 "#PWR?" H 9250 4250 50  0001 C CNN
F 1 "GND" H 9255 4327 50  0000 C CNN
F 2 "" H 9250 4500 50  0001 C CNN
F 3 "" H 9250 4500 50  0001 C CNN
	1    9250 4500
	1    0    0    -1  
$EndComp
Wire Wire Line
	9250 3650 9250 4500
$Comp
L power:GND #PWR?
U 1 1 5D69FAE4
P 8900 4500
F 0 "#PWR?" H 8900 4250 50  0001 C CNN
F 1 "GND" H 8905 4327 50  0000 C CNN
F 2 "" H 8900 4500 50  0001 C CNN
F 3 "" H 8900 4500 50  0001 C CNN
	1    8900 4500
	1    0    0    -1  
$EndComp
Wire Wire Line
	8900 3850 8900 4500
Wire Wire Line
	8550 4150 8550 4500
Wire Wire Line
	8200 4350 8200 4500
$Comp
L power:GND #PWR?
U 1 1 5D69671C
P 8550 4500
F 0 "#PWR?" H 8550 4250 50  0001 C CNN
F 1 "GND" H 8555 4327 50  0000 C CNN
F 2 "" H 8550 4500 50  0001 C CNN
F 3 "" H 8550 4500 50  0001 C CNN
	1    8550 4500
	1    0    0    -1  
$EndComp
$Comp
L power:GND #PWR?
U 1 1 5D694868
P 8200 4500
F 0 "#PWR?" H 8200 4250 50  0001 C CNN
F 1 "GND" H 8205 4327 50  0000 C CNN
F 2 "" H 8200 4500 50  0001 C CNN
F 3 "" H 8200 4500 50  0001 C CNN
	1    8200 4500
	1    0    0    -1  
$EndComp
$Comp
L Connector:Conn_Coaxial J1502
U 1 1 5D68F67C
P 8200 4150
F 0 "J1502" H 8300 4125 50  0000 L CNN
F 1 "SMA" H 8300 4034 50  0000 L CNN
F 2 "Connector_Coaxial:SMA_Amphenol_132134-10_Vertical" H 8200 4150 50  0001 C CNN
F 3 " ~" H 8200 4150 50  0001 C CNN
	1    8200 4150
	1    0    0    -1  
$EndComp
$Comp
L Connector:Conn_Coaxial J1503
U 1 1 5D68DA6D
P 8550 3950
F 0 "J1503" H 8650 3925 50  0000 L CNN
F 1 "SMA" H 8650 3834 50  0000 L CNN
F 2 "Connector_Coaxial:SMA_Amphenol_132134-10_Vertical" H 8550 3950 50  0001 C CNN
F 3 " ~" H 8550 3950 50  0001 C CNN
	1    8550 3950
	1    0    0    -1  
$EndComp
$Comp
L Connector:Conn_Coaxial J1504
U 1 1 5D68C369
P 8900 3650
F 0 "J1504" H 9000 3625 50  0000 L CNN
F 1 "SMA" H 9000 3534 50  0000 L CNN
F 2 "Connector_Coaxial:SMA_Amphenol_132134-10_Vertical" H 8900 3650 50  0001 C CNN
F 3 " ~" H 8900 3650 50  0001 C CNN
	1    8900 3650
	1    0    0    -1  
$EndComp
$Comp
L Connector:Conn_Coaxial J1505
U 1 1 5D689072
P 9250 3450
F 0 "J1505" H 9350 3425 50  0000 L CNN
F 1 "SMA" H 9350 3334 50  0000 L CNN
F 2 "Connector_Coaxial:SMA_Amphenol_132134-10_Vertical" H 9250 3450 50  0001 C CNN
F 3 " ~" H 9250 3450 50  0001 C CNN
	1    9250 3450
	1    0    0    -1  
$EndComp
Text Label 3300 4050 0    50   ~ 0
clk_in_0
Text Label 3300 4150 0    50   ~ 0
clk_in_1
Text Label 6150 4850 0    50   ~ 0
ref_out_ic
Text Label 6100 3650 0    50   ~ 0
clk_out_a0_P
Text Label 6100 3750 0    50   ~ 0
clk_out_a0_N
Text Label 6100 3850 0    50   ~ 0
clk_out_a1_P
Text Label 6100 3950 0    50   ~ 0
clk_out_a1_N
$EndSCHEMATC
