EESchema Schematic File Version 4
LIBS:fdd_frontend_ue-cache
EELAYER 26 0
EELAYER END
$Descr A4 11693 8268
encoding utf-8
Sheet 4 4
Title ""
Date ""
Rev ""
Comp ""
Comment1 ""
Comment2 ""
Comment3 ""
Comment4 ""
$EndDescr
$Comp
L POWDER_Power:TPS63070RNM U?
U 1 1 5D56AE7E
P 5500 3750
AR Path="/5D562501/5D56AE7E" Ref="U?"  Part="1" 
AR Path="/5D587C46/5D56AE7E" Ref="U?"  Part="1" 
AR Path="/5D591ABD/5D56AE7E" Ref="U?"  Part="1" 
F 0 "U?" H 5850 4350 60  0000 C CNN
F 1 "TPS63070RNM" H 5500 3950 60  0000 C CNN
F 2 "POWDER_Power:TPS63070RNMR" H 5500 3690 60  0001 C CNN
F 3 "" H 5500 3750 60  0000 C CNN
	1    5500 3750
	1    0    0    -1  
$EndComp
Text HLabel 4600 3950 0    50   Input ~ 0
EN
Text HLabel 4600 4050 0    50   Input ~ 0
PS_SYNC
Text HLabel 4600 4150 0    50   Input ~ 0
VSEL
Text HLabel 6200 4050 2    50   Output ~ 0
PG
Wire Wire Line
	6200 4050 6100 4050
Wire Wire Line
	4600 3950 4900 3950
Wire Wire Line
	4900 4050 4600 4050
Wire Wire Line
	4600 4150 4900 4150
$Comp
L power:GND #PWR?
U 1 1 5D56C9B4
P 5400 4600
AR Path="/5D562501/5D56C9B4" Ref="#PWR?"  Part="1" 
AR Path="/5D587C46/5D56C9B4" Ref="#PWR?"  Part="1" 
AR Path="/5D591ABD/5D56C9B4" Ref="#PWR?"  Part="1" 
F 0 "#PWR?" H 5400 4350 50  0001 C CNN
F 1 "GND" H 5405 4427 50  0000 C CNN
F 2 "" H 5400 4600 50  0001 C CNN
F 3 "" H 5400 4600 50  0001 C CNN
	1    5400 4600
	1    0    0    -1  
$EndComp
$Comp
L power:GND #PWR?
U 1 1 5D56C9C9
P 5600 4600
AR Path="/5D562501/5D56C9C9" Ref="#PWR?"  Part="1" 
AR Path="/5D587C46/5D56C9C9" Ref="#PWR?"  Part="1" 
AR Path="/5D591ABD/5D56C9C9" Ref="#PWR?"  Part="1" 
F 0 "#PWR?" H 5600 4350 50  0001 C CNN
F 1 "GND" H 5605 4427 50  0000 C CNN
F 2 "" H 5600 4600 50  0001 C CNN
F 3 "" H 5600 4600 50  0001 C CNN
	1    5600 4600
	1    0    0    -1  
$EndComp
Wire Wire Line
	5600 4600 5600 4450
Wire Wire Line
	5400 4450 5400 4600
$Comp
L Device:C C?
U 1 1 5D56CA4A
P 3800 4000
AR Path="/5D562501/5D56CA4A" Ref="C?"  Part="1" 
AR Path="/5D587C46/5D56CA4A" Ref="C?"  Part="1" 
AR Path="/5D591ABD/5D56CA4A" Ref="C?"  Part="1" 
F 0 "C?" H 3915 4046 50  0000 L CNN
F 1 "100nF" H 3915 3955 50  0000 L CNN
F 2 "Capacitor_SMD:C_0402_1005Metric" H 3838 3850 50  0001 C CNN
F 3 "~" H 3800 4000 50  0001 C CNN
	1    3800 4000
	1    0    0    -1  
$EndComp
Wire Wire Line
	3800 3850 3800 3700
Wire Wire Line
	3800 3700 4900 3700
$Comp
L power:GND #PWR?
U 1 1 5D56CAC8
P 3800 4300
AR Path="/5D562501/5D56CAC8" Ref="#PWR?"  Part="1" 
AR Path="/5D587C46/5D56CAC8" Ref="#PWR?"  Part="1" 
AR Path="/5D591ABD/5D56CAC8" Ref="#PWR?"  Part="1" 
F 0 "#PWR?" H 3800 4050 50  0001 C CNN
F 1 "GND" H 3805 4127 50  0000 C CNN
F 2 "" H 3800 4300 50  0001 C CNN
F 3 "" H 3800 4300 50  0001 C CNN
	1    3800 4300
	1    0    0    -1  
$EndComp
Wire Wire Line
	3800 4300 3800 4150
$Comp
L Device:C C?
U 1 1 5D56CB56
P 3400 3800
AR Path="/5D562501/5D56CB56" Ref="C?"  Part="1" 
AR Path="/5D587C46/5D56CB56" Ref="C?"  Part="1" 
AR Path="/5D591ABD/5D56CB56" Ref="C?"  Part="1" 
F 0 "C?" H 3515 3846 50  0000 L CNN
F 1 "10uF" H 3515 3755 50  0000 L CNN
F 2 "Capacitor_SMD:C_0603_1608Metric" H 3438 3650 50  0001 C CNN
F 3 "~" H 3400 3800 50  0001 C CNN
	1    3400 3800
	1    0    0    -1  
$EndComp
$Comp
L Device:C C?
U 1 1 5D56CBDC
P 2950 3800
AR Path="/5D562501/5D56CBDC" Ref="C?"  Part="1" 
AR Path="/5D587C46/5D56CBDC" Ref="C?"  Part="1" 
AR Path="/5D591ABD/5D56CBDC" Ref="C?"  Part="1" 
F 0 "C?" H 3065 3846 50  0000 L CNN
F 1 "10uF" H 3065 3755 50  0000 L CNN
F 2 "Capacitor_SMD:C_0805_2012Metric" H 2988 3650 50  0001 C CNN
F 3 "~" H 2950 3800 50  0001 C CNN
	1    2950 3800
	1    0    0    -1  
$EndComp
$Comp
L Device:C C?
U 1 1 5D56CC27
P 2500 3800
AR Path="/5D562501/5D56CC27" Ref="C?"  Part="1" 
AR Path="/5D587C46/5D56CC27" Ref="C?"  Part="1" 
AR Path="/5D591ABD/5D56CC27" Ref="C?"  Part="1" 
F 0 "C?" H 2615 3846 50  0000 L CNN
F 1 "10uF" H 2615 3755 50  0000 L CNN
F 2 "Capacitor_SMD:C_0805_2012Metric" H 2538 3650 50  0001 C CNN
F 3 "~" H 2500 3800 50  0001 C CNN
	1    2500 3800
	1    0    0    -1  
$EndComp
$Comp
L power:GND #PWR?
U 1 1 5D56CC55
P 3400 4050
AR Path="/5D562501/5D56CC55" Ref="#PWR?"  Part="1" 
AR Path="/5D587C46/5D56CC55" Ref="#PWR?"  Part="1" 
AR Path="/5D591ABD/5D56CC55" Ref="#PWR?"  Part="1" 
F 0 "#PWR?" H 3400 3800 50  0001 C CNN
F 1 "GND" H 3405 3877 50  0000 C CNN
F 2 "" H 3400 4050 50  0001 C CNN
F 3 "" H 3400 4050 50  0001 C CNN
	1    3400 4050
	1    0    0    -1  
$EndComp
$Comp
L power:GND #PWR?
U 1 1 5D56CC6A
P 2950 4050
AR Path="/5D562501/5D56CC6A" Ref="#PWR?"  Part="1" 
AR Path="/5D587C46/5D56CC6A" Ref="#PWR?"  Part="1" 
AR Path="/5D591ABD/5D56CC6A" Ref="#PWR?"  Part="1" 
F 0 "#PWR?" H 2950 3800 50  0001 C CNN
F 1 "GND" H 2955 3877 50  0000 C CNN
F 2 "" H 2950 4050 50  0001 C CNN
F 3 "" H 2950 4050 50  0001 C CNN
	1    2950 4050
	1    0    0    -1  
$EndComp
$Comp
L power:GND #PWR?
U 1 1 5D56CC7F
P 2500 4050
AR Path="/5D562501/5D56CC7F" Ref="#PWR?"  Part="1" 
AR Path="/5D587C46/5D56CC7F" Ref="#PWR?"  Part="1" 
AR Path="/5D591ABD/5D56CC7F" Ref="#PWR?"  Part="1" 
F 0 "#PWR?" H 2500 3800 50  0001 C CNN
F 1 "GND" H 2505 3877 50  0000 C CNN
F 2 "" H 2500 4050 50  0001 C CNN
F 3 "" H 2500 4050 50  0001 C CNN
	1    2500 4050
	1    0    0    -1  
$EndComp
Wire Wire Line
	2500 4050 2500 3950
Wire Wire Line
	2950 4050 2950 3950
Wire Wire Line
	3400 4050 3400 3950
Wire Wire Line
	4900 3450 4700 3450
Wire Wire Line
	3400 3450 3400 3650
Wire Wire Line
	3400 3450 2950 3450
Wire Wire Line
	2950 3450 2950 3650
Connection ~ 3400 3450
Wire Wire Line
	2950 3450 2500 3450
Wire Wire Line
	2500 3450 2500 3650
Connection ~ 2950 3450
Wire Wire Line
	4900 3350 4700 3350
Wire Wire Line
	4700 3350 4700 3450
Connection ~ 4700 3450
Wire Wire Line
	4700 3450 3400 3450
Wire Wire Line
	2500 3450 2150 3450
Connection ~ 2500 3450
Text HLabel 2150 3450 0    50   Input ~ 0
V_12
$Comp
L Device:L L?
U 1 1 5D56D68E
P 5500 2950
AR Path="/5D562501/5D56D68E" Ref="L?"  Part="1" 
AR Path="/5D587C46/5D56D68E" Ref="L?"  Part="1" 
AR Path="/5D591ABD/5D56D68E" Ref="L?"  Part="1" 
F 0 "L?" V 5690 2950 50  0000 C CNN
F 1 "1.5uH" V 5599 2950 50  0000 C CNN
F 2 "Inductor_SMD:L_Taiyo-Yuden_MD-4040" H 5500 2950 50  0001 C CNN
F 3 "~" H 5500 2950 50  0001 C CNN
	1    5500 2950
	0    -1   -1   0   
$EndComp
Wire Wire Line
	5350 2950 5300 2950
Wire Wire Line
	5300 2950 5300 3100
Wire Wire Line
	5650 2950 5700 2950
Wire Wire Line
	5700 2950 5700 3100
$Comp
L Device:C C?
U 1 1 5D56E1EA
P 7350 3650
AR Path="/5D562501/5D56E1EA" Ref="C?"  Part="1" 
AR Path="/5D587C46/5D56E1EA" Ref="C?"  Part="1" 
AR Path="/5D591ABD/5D56E1EA" Ref="C?"  Part="1" 
F 0 "C?" H 7465 3696 50  0000 L CNN
F 1 "10uF" H 7465 3605 50  0000 L CNN
F 2 "Capacitor_SMD:C_0603_1608Metric" H 7388 3500 50  0001 C CNN
F 3 "~" H 7350 3650 50  0001 C CNN
	1    7350 3650
	1    0    0    -1  
$EndComp
$Comp
L Device:R R?
U 1 1 5D56E2A0
P 6900 3650
AR Path="/5D562501/5D56E2A0" Ref="R?"  Part="1" 
AR Path="/5D587C46/5D56E2A0" Ref="R?"  Part="1" 
AR Path="/5D591ABD/5D56E2A0" Ref="R?"  Part="1" 
F 0 "R?" H 6970 3696 50  0000 L CNN
F 1 "R" H 6970 3605 50  0000 L CNN
F 2 "Resistor_SMD:R_0402_1005Metric" V 6830 3650 50  0001 C CNN
F 3 "~" H 6900 3650 50  0001 C CNN
	1    6900 3650
	1    0    0    -1  
$EndComp
Wire Wire Line
	6100 3450 6900 3450
Wire Wire Line
	6900 3500 6900 3450
Connection ~ 6900 3450
$Comp
L Device:R R?
U 1 1 5D56E990
P 6900 4050
AR Path="/5D562501/5D56E990" Ref="R?"  Part="1" 
AR Path="/5D587C46/5D56E990" Ref="R?"  Part="1" 
AR Path="/5D591ABD/5D56E990" Ref="R?"  Part="1" 
F 0 "R?" H 6970 4096 50  0000 L CNN
F 1 "R" H 6970 4005 50  0000 L CNN
F 2 "Resistor_SMD:R_0402_1005Metric" V 6830 4050 50  0001 C CNN
F 3 "~" H 6900 4050 50  0001 C CNN
	1    6900 4050
	1    0    0    -1  
$EndComp
$Comp
L Device:R R?
U 1 1 5D56E9EF
P 6650 4050
AR Path="/5D562501/5D56E9EF" Ref="R?"  Part="1" 
AR Path="/5D587C46/5D56E9EF" Ref="R?"  Part="1" 
AR Path="/5D591ABD/5D56E9EF" Ref="R?"  Part="1" 
F 0 "R?" H 6720 4096 50  0000 L CNN
F 1 "R" H 6720 4005 50  0000 L CNN
F 2 "Resistor_SMD:R_0402_1005Metric" V 6580 4050 50  0001 C CNN
F 3 "~" H 6650 4050 50  0001 C CNN
	1    6650 4050
	1    0    0    -1  
$EndComp
Wire Wire Line
	6900 3800 6900 3850
Wire Wire Line
	6100 3700 6650 3700
Connection ~ 6900 3850
Wire Wire Line
	6900 3850 6900 3900
Wire Wire Line
	6650 3900 6650 3850
Connection ~ 6650 3850
Wire Wire Line
	6650 3850 6650 3700
Wire Wire Line
	6650 3850 6900 3850
$Comp
L power:GND #PWR?
U 1 1 5D56FB1A
P 6900 4300
AR Path="/5D562501/5D56FB1A" Ref="#PWR?"  Part="1" 
AR Path="/5D587C46/5D56FB1A" Ref="#PWR?"  Part="1" 
AR Path="/5D591ABD/5D56FB1A" Ref="#PWR?"  Part="1" 
F 0 "#PWR?" H 6900 4050 50  0001 C CNN
F 1 "GND" H 6905 4127 50  0000 C CNN
F 2 "" H 6900 4300 50  0001 C CNN
F 3 "" H 6900 4300 50  0001 C CNN
	1    6900 4300
	1    0    0    -1  
$EndComp
Wire Wire Line
	6900 4300 6900 4200
Wire Wire Line
	6650 4300 6650 4200
Wire Wire Line
	6100 3800 6500 3800
Wire Wire Line
	6500 3800 6500 4300
Wire Wire Line
	6500 4300 6650 4300
Wire Wire Line
	7350 3500 7350 3450
Wire Wire Line
	6900 3450 7350 3450
$Comp
L power:GND #PWR?
U 1 1 5D57210C
P 7350 3900
AR Path="/5D562501/5D57210C" Ref="#PWR?"  Part="1" 
AR Path="/5D587C46/5D57210C" Ref="#PWR?"  Part="1" 
AR Path="/5D591ABD/5D57210C" Ref="#PWR?"  Part="1" 
F 0 "#PWR?" H 7350 3650 50  0001 C CNN
F 1 "GND" H 7355 3727 50  0000 C CNN
F 2 "" H 7350 3900 50  0001 C CNN
F 3 "" H 7350 3900 50  0001 C CNN
	1    7350 3900
	1    0    0    -1  
$EndComp
Wire Wire Line
	7350 3900 7350 3800
$Comp
L Device:C C?
U 1 1 5D57275E
P 7800 3650
AR Path="/5D562501/5D57275E" Ref="C?"  Part="1" 
AR Path="/5D587C46/5D57275E" Ref="C?"  Part="1" 
AR Path="/5D591ABD/5D57275E" Ref="C?"  Part="1" 
F 0 "C?" H 7915 3696 50  0000 L CNN
F 1 "22uF" H 7915 3605 50  0000 L CNN
F 2 "Capacitor_SMD:C_0805_2012Metric" H 7838 3500 50  0001 C CNN
F 3 "~" H 7800 3650 50  0001 C CNN
	1    7800 3650
	1    0    0    -1  
$EndComp
$Comp
L power:GND #PWR?
U 1 1 5D572792
P 7800 3900
AR Path="/5D562501/5D572792" Ref="#PWR?"  Part="1" 
AR Path="/5D587C46/5D572792" Ref="#PWR?"  Part="1" 
AR Path="/5D591ABD/5D572792" Ref="#PWR?"  Part="1" 
F 0 "#PWR?" H 7800 3650 50  0001 C CNN
F 1 "GND" H 7805 3727 50  0000 C CNN
F 2 "" H 7800 3900 50  0001 C CNN
F 3 "" H 7800 3900 50  0001 C CNN
	1    7800 3900
	1    0    0    -1  
$EndComp
Wire Wire Line
	7800 3900 7800 3800
Wire Wire Line
	7800 3500 7800 3450
Wire Wire Line
	7800 3450 7350 3450
Connection ~ 7350 3450
$Comp
L Device:C C?
U 1 1 5D573E2E
P 8200 3650
AR Path="/5D562501/5D573E2E" Ref="C?"  Part="1" 
AR Path="/5D587C46/5D573E2E" Ref="C?"  Part="1" 
AR Path="/5D591ABD/5D573E2E" Ref="C?"  Part="1" 
F 0 "C?" H 8315 3696 50  0000 L CNN
F 1 "22uF" H 8315 3605 50  0000 L CNN
F 2 "Capacitor_SMD:C_0805_2012Metric" H 8238 3500 50  0001 C CNN
F 3 "~" H 8200 3650 50  0001 C CNN
	1    8200 3650
	1    0    0    -1  
$EndComp
$Comp
L power:GND #PWR?
U 1 1 5D573E34
P 8200 3900
AR Path="/5D562501/5D573E34" Ref="#PWR?"  Part="1" 
AR Path="/5D587C46/5D573E34" Ref="#PWR?"  Part="1" 
AR Path="/5D591ABD/5D573E34" Ref="#PWR?"  Part="1" 
F 0 "#PWR?" H 8200 3650 50  0001 C CNN
F 1 "GND" H 8205 3727 50  0000 C CNN
F 2 "" H 8200 3900 50  0001 C CNN
F 3 "" H 8200 3900 50  0001 C CNN
	1    8200 3900
	1    0    0    -1  
$EndComp
Wire Wire Line
	8200 3900 8200 3800
Wire Wire Line
	8200 3500 8200 3450
$Comp
L Device:C C?
U 1 1 5D5745F9
P 8600 3650
AR Path="/5D562501/5D5745F9" Ref="C?"  Part="1" 
AR Path="/5D587C46/5D5745F9" Ref="C?"  Part="1" 
AR Path="/5D591ABD/5D5745F9" Ref="C?"  Part="1" 
F 0 "C?" H 8715 3696 50  0000 L CNN
F 1 "22uF" H 8715 3605 50  0000 L CNN
F 2 "Capacitor_SMD:C_0805_2012Metric" H 8638 3500 50  0001 C CNN
F 3 "~" H 8600 3650 50  0001 C CNN
	1    8600 3650
	1    0    0    -1  
$EndComp
$Comp
L power:GND #PWR?
U 1 1 5D5745FF
P 8600 3900
AR Path="/5D562501/5D5745FF" Ref="#PWR?"  Part="1" 
AR Path="/5D587C46/5D5745FF" Ref="#PWR?"  Part="1" 
AR Path="/5D591ABD/5D5745FF" Ref="#PWR?"  Part="1" 
F 0 "#PWR?" H 8600 3650 50  0001 C CNN
F 1 "GND" H 8605 3727 50  0000 C CNN
F 2 "" H 8600 3900 50  0001 C CNN
F 3 "" H 8600 3900 50  0001 C CNN
	1    8600 3900
	1    0    0    -1  
$EndComp
Wire Wire Line
	8600 3900 8600 3800
Wire Wire Line
	8600 3500 8600 3450
Wire Wire Line
	7800 3450 8200 3450
Connection ~ 7800 3450
Connection ~ 8200 3450
Wire Wire Line
	8200 3450 8600 3450
Connection ~ 8600 3450
Wire Wire Line
	8600 3450 8950 3450
Text HLabel 8950 3450 2    50   Output ~ 0
V_OUT
Text Label 4050 3700 0    50   ~ 0
V_AUX
Text Label 6300 3700 0    50   ~ 0
FB
Text Label 6300 3800 0    50   ~ 0
FB2
Text Label 5300 2950 0    50   ~ 0
L1
Text Label 5700 2950 0    50   ~ 0
L2
$EndSCHEMATC
