EESchema Schematic File Version 4
EELAYER 30 0
EELAYER END
$Descr A4 11693 8268
encoding utf-8
Sheet 21 27
Title ""
Date ""
Rev ""
Comp ""
Comment1 ""
Comment2 ""
Comment3 ""
Comment4 ""
$EndDescr
$Comp
L POWDER_MCU:MSP432E401YTPDTR U2002
U 3 1 5E21E18D
P 5200 2600
F 0 "U2002" H 5200 2300 60  0000 C CNN
F 1 "MSP432E401YTPDTR" H 5200 2850 60  0000 C CNN
F 2 "POWDER_MCU:MSP432E401YTPDTR" H 5200 2140 60  0001 C CNN
F 3 "" H 5200 2200 60  0000 C CNN
F 4 "Texas Instruments" H 5200 2600 50  0001 C CNN "Manufacturer"
F 5 "MSP432E401YTPDTR" H 5200 2600 50  0001 C CNN "PartNumber"
F 6 "3000-0000000080" H 5200 2600 50  0001 C CNN "PartSpecification"
	3    5200 2600
	1    0    0    -1  
$EndComp
$Comp
L POWDER_Connector:RJ45_WIZnet_RB1-125BAG1A J2101
U 1 1 5E2B5E20
P 5750 5450
F 0 "J2101" H 6500 6150 50  0000 R CNN
F 1 "RJ45_WIZnet_RB1-125BAG1A" H 5000 6150 50  0000 L CNN
F 2 "Connector_RJ:RJ45_Amphenol_RJMG1BD3B8K1ANR" H 5750 6250 50  0001 C CNN
F 3 "https://www.amphenolcanada.com/ProductSearch/Drawings/AC/RJMG1BD3B8K1ANR.PDF" H 5750 6350 50  0001 C CNN
F 4 "WIZnet" H 5750 5450 50  0001 C CNN "Manufacturer"
F 5 "RB1-125BAG1A" H 5750 5450 50  0001 C CNN "PartNumber"
F 6 "3000-0000000169" H 5750 5450 50  0001 C CNN "PartSpecification"
	1    5750 5450
	1    0    0    -1  
$EndComp
$Comp
L power:GND #PWR?
U 1 1 5E2B8BE4
P 5750 6300
F 0 "#PWR?" H 5750 6050 50  0001 C CNN
F 1 "GND" H 5750 6150 50  0000 C CNN
F 2 "" H 5750 6300 50  0001 C CNN
F 3 "" H 5750 6300 50  0001 C CNN
	1    5750 6300
	1    0    0    -1  
$EndComp
Wire Wire Line
	5750 6300 5750 6150
$Comp
L power:GND #PWR?
U 1 1 5E2B9514
P 4700 6500
F 0 "#PWR?" H 4700 6250 50  0001 C CNN
F 1 "GND" H 4700 6350 50  0000 C CNN
F 2 "" H 4700 6500 50  0001 C CNN
F 3 "" H 4700 6500 50  0001 C CNN
	1    4700 6500
	1    0    0    -1  
$EndComp
$Comp
L Device:R R2109
U 1 1 5E2B9A58
P 4700 6250
F 0 "R2109" V 4780 6250 50  0000 C CNN
F 1 "R" V 4700 6250 50  0000 C CNN
F 2 "Resistor_SMD:R_0402_1005Metric" V 4630 6250 50  0001 C CNN
F 3 "~" H 4700 6250 50  0001 C CNN
	1    4700 6250
	1    0    0    -1  
$EndComp
Wire Wire Line
	4850 5950 4700 5950
Wire Wire Line
	4700 5950 4700 6100
Wire Wire Line
	4700 6400 4700 6500
$Comp
L power:GND #PWR?
U 1 1 5E2BBC85
P 4350 6500
F 0 "#PWR?" H 4350 6250 50  0001 C CNN
F 1 "GND" H 4350 6350 50  0000 C CNN
F 2 "" H 4350 6500 50  0001 C CNN
F 3 "" H 4350 6500 50  0001 C CNN
	1    4350 6500
	1    0    0    -1  
$EndComp
$Comp
L Device:R R2108
U 1 1 5E2BBC8B
P 4350 6250
F 0 "R2108" V 4430 6250 50  0000 C CNN
F 1 "R" V 4350 6250 50  0000 C CNN
F 2 "Resistor_SMD:R_0402_1005Metric" V 4280 6250 50  0001 C CNN
F 3 "~" H 4350 6250 50  0001 C CNN
	1    4350 6250
	1    0    0    -1  
$EndComp
Wire Wire Line
	4350 5750 4350 6100
Wire Wire Line
	4350 6400 4350 6500
Wire Wire Line
	4350 5750 4850 5750
Text HLabel 4700 5850 0    50   Input ~ 0
Y_LED
Text HLabel 4700 5650 0    50   Input ~ 0
G_LED
Wire Wire Line
	4700 5650 4850 5650
Wire Wire Line
	4850 5850 4700 5850
$Comp
L 000_PreferredParts:C_0_1uF C2102
U 1 1 5E2BE30F
P 4050 5950
F 0 "C2102" H 4075 6050 50  0000 L CNN
F 1 "C_0_1uF" H 4075 5850 50  0001 L CNN
F 2 "Capacitor_SMD:C_0402_1005Metric" H 4088 5800 50  0001 C CNN
F 3 "~" H 4050 5950 50  0001 C CNN
F 4 "0.1uF" H 4200 5850 50  0000 C CNN "DisplayValue"
F 5 "3000-0000000125" H 4050 5950 50  0001 C CNN "PartSpecification"
	1    4050 5950
	1    0    0    -1  
$EndComp
$Comp
L power:GND #PWR?
U 1 1 5E2BED13
P 4050 6200
F 0 "#PWR?" H 4050 5950 50  0001 C CNN
F 1 "GND" H 4050 6050 50  0000 C CNN
F 2 "" H 4050 6200 50  0001 C CNN
F 3 "" H 4050 6200 50  0001 C CNN
	1    4050 6200
	1    0    0    -1  
$EndComp
Wire Wire Line
	4050 6200 4050 6100
Wire Wire Line
	4850 5150 4050 5150
Wire Wire Line
	4050 5150 4050 5800
Wire Wire Line
	4850 5250 4150 5250
Wire Wire Line
	3400 2550 4400 2550
Wire Wire Line
	4850 5450 4350 5450
Wire Wire Line
	3300 5450 3300 3400
Wire Wire Line
	3300 2450 4400 2450
Wire Wire Line
	4400 2850 3500 2850
Wire Wire Line
	3500 2850 3500 5050
Wire Wire Line
	3500 5050 3950 5050
Wire Wire Line
	4850 4850 3750 4850
Wire Wire Line
	3600 2950 4400 2950
NoConn ~ 6000 2200
$Comp
L Device:R R2110
U 1 1 5E2C5AC6
P 9000 2550
F 0 "R2110" V 9080 2550 50  0000 C CNN
F 1 "4.87k" V 9000 2550 50  0000 C CNN
F 2 "Resistor_SMD:R_0402_1005Metric" V 8930 2550 50  0001 C CNN
F 3 "~" H 9000 2550 50  0001 C CNN
F 4 "3000-0000000133 " H 9000 2550 50  0001 C CNN "PartSpecification"
	1    9000 2550
	1    0    0    -1  
$EndComp
Wire Wire Line
	9000 2400 9000 2300
Wire Wire Line
	9000 2300 6000 2300
$Comp
L Device:Crystal_GND24 Y2102
U 1 1 5E2CABA0
P 6950 3200
F 0 "Y2102" V 6700 3350 50  0000 L CNN
F 1 "Crystal_GND24" V 6800 3350 50  0000 L CNN
F 2 "Crystal:Crystal_SMD_3225-4Pin_3.2x2.5mm" H 6950 3200 50  0001 C CNN
F 3 "~" H 6950 3200 50  0001 C CNN
F 4 "3000-0000000155" H 6950 3200 50  0001 C CNN "PartSpecification"
	1    6950 3200
	0    1    1    0   
$EndComp
$Comp
L Device:C C2106
U 1 1 5E2CC26E
P 6250 3600
F 0 "C2106" H 6275 3700 50  0000 L CNN
F 1 "C" H 6275 3500 50  0000 L CNN
F 2 "Capacitor_SMD:C_0402_1005Metric" H 6288 3450 50  0001 C CNN
F 3 "~" H 6250 3600 50  0001 C CNN
	1    6250 3600
	1    0    0    -1  
$EndComp
$Comp
L Device:C C2107
U 1 1 5E2CC6F9
P 6500 3600
F 0 "C2107" H 6525 3700 50  0000 L CNN
F 1 "C" H 6525 3500 50  0000 L CNN
F 2 "Capacitor_SMD:C_0402_1005Metric" H 6538 3450 50  0001 C CNN
F 3 "~" H 6500 3600 50  0001 C CNN
	1    6500 3600
	1    0    0    -1  
$EndComp
Wire Wire Line
	6250 3450 6250 3350
Wire Wire Line
	6500 3450 6500 3050
Wire Wire Line
	6950 3350 6250 3350
Connection ~ 6250 3350
Wire Wire Line
	6500 3050 6950 3050
Connection ~ 6500 3050
$Comp
L power:GND #PWR?
U 1 1 5E2CED7D
P 6250 3850
F 0 "#PWR?" H 6250 3600 50  0001 C CNN
F 1 "GND" H 6250 3700 50  0000 C CNN
F 2 "" H 6250 3850 50  0001 C CNN
F 3 "" H 6250 3850 50  0001 C CNN
	1    6250 3850
	1    0    0    -1  
$EndComp
$Comp
L power:GND #PWR?
U 1 1 5E2CF10D
P 6500 3850
F 0 "#PWR?" H 6500 3600 50  0001 C CNN
F 1 "GND" H 6500 3700 50  0000 C CNN
F 2 "" H 6500 3850 50  0001 C CNN
F 3 "" H 6500 3850 50  0001 C CNN
	1    6500 3850
	1    0    0    -1  
$EndComp
Wire Wire Line
	6500 3850 6500 3750
Wire Wire Line
	6250 3750 6250 3850
$Comp
L power:GND #PWR?
U 1 1 5E2D196F
P 6750 3450
F 0 "#PWR?" H 6750 3200 50  0001 C CNN
F 1 "GND" H 6750 3300 50  0000 C CNN
F 2 "" H 6750 3450 50  0001 C CNN
F 3 "" H 6750 3450 50  0001 C CNN
	1    6750 3450
	1    0    0    -1  
$EndComp
$Comp
L power:GND #PWR?
U 1 1 5E2D4025
P 7150 3450
F 0 "#PWR?" H 7150 3200 50  0001 C CNN
F 1 "GND" H 7150 3300 50  0000 C CNN
F 2 "" H 7150 3450 50  0001 C CNN
F 3 "" H 7150 3450 50  0001 C CNN
	1    7150 3450
	1    0    0    -1  
$EndComp
Wire Wire Line
	7150 3450 7150 3200
Wire Wire Line
	6750 3200 6750 3450
$Comp
L Device:Crystal Y2101
U 1 1 5E2D5AB7
P 6250 2700
F 0 "Y2101" H 6250 2850 50  0000 C CNN
F 1 "Crystal" H 6250 2550 50  0000 C CNN
F 2 "Crystal:Crystal_SMD_3215-2Pin_3.2x1.5mm" H 6250 2700 50  0001 C CNN
F 3 "~" H 6250 2700 50  0001 C CNN
F 4 "3000-0000000140" H 6250 2700 50  0001 C CNN "PartSpecification"
	1    6250 2700
	0    1    1    0   
$EndComp
Wire Wire Line
	6250 2550 6000 2550
Wire Wire Line
	6000 2850 6250 2850
$Comp
L Device:C C2108
U 1 1 5E2DB522
P 7750 3100
F 0 "C2108" H 7775 3200 50  0000 L CNN
F 1 "C" H 7775 3000 50  0000 L CNN
F 2 "Capacitor_SMD:C_0402_1005Metric" H 7788 2950 50  0001 C CNN
F 3 "~" H 7750 3100 50  0001 C CNN
	1    7750 3100
	1    0    0    -1  
$EndComp
$Comp
L Device:C C2109
U 1 1 5E2DB528
P 8000 3100
F 0 "C2109" H 8025 3200 50  0000 L CNN
F 1 "C" H 8025 3000 50  0000 L CNN
F 2 "Capacitor_SMD:C_0402_1005Metric" H 8038 2950 50  0001 C CNN
F 3 "~" H 8000 3100 50  0001 C CNN
	1    8000 3100
	1    0    0    -1  
$EndComp
Wire Wire Line
	7750 2950 7750 2850
Wire Wire Line
	8000 2950 8000 2550
$Comp
L power:GND #PWR?
U 1 1 5E2DB530
P 7750 3350
F 0 "#PWR?" H 7750 3100 50  0001 C CNN
F 1 "GND" H 7750 3200 50  0000 C CNN
F 2 "" H 7750 3350 50  0001 C CNN
F 3 "" H 7750 3350 50  0001 C CNN
	1    7750 3350
	1    0    0    -1  
$EndComp
$Comp
L power:GND #PWR?
U 1 1 5E2DB536
P 8000 3350
F 0 "#PWR?" H 8000 3100 50  0001 C CNN
F 1 "GND" H 8000 3200 50  0000 C CNN
F 2 "" H 8000 3350 50  0001 C CNN
F 3 "" H 8000 3350 50  0001 C CNN
	1    8000 3350
	1    0    0    -1  
$EndComp
Wire Wire Line
	8000 3350 8000 3250
Wire Wire Line
	7750 3250 7750 3350
Wire Wire Line
	7750 2850 6250 2850
Connection ~ 6250 2850
Wire Wire Line
	6250 2550 8000 2550
Connection ~ 6250 2550
$Comp
L power:GND #PWR?
U 1 1 5E2E1299
P 9000 2800
F 0 "#PWR?" H 9000 2550 50  0001 C CNN
F 1 "GND" H 9000 2650 50  0000 C CNN
F 2 "" H 9000 2800 50  0001 C CNN
F 3 "" H 9000 2800 50  0001 C CNN
	1    9000 2800
	1    0    0    -1  
$EndComp
Wire Wire Line
	9000 2800 9000 2700
$Comp
L Device:R R2104
U 1 1 5E2E24AD
P 3750 4250
F 0 "R2104" V 3830 4250 50  0000 C CNN
F 1 "49.9" V 3750 4250 50  0000 C CNN
F 2 "Resistor_SMD:R_0402_1005Metric" V 3680 4250 50  0001 C CNN
F 3 "~" H 3750 4250 50  0001 C CNN
F 4 "3000-0000000577" H 3750 4250 50  0001 C CNN "PartSpecification"
	1    3750 4250
	1    0    0    -1  
$EndComp
$Comp
L power:+3.3V #PWR?
U 1 1 5E2E4350
P 3750 4000
F 0 "#PWR?" H 3750 3850 50  0001 C CNN
F 1 "+3.3V" H 3750 4140 50  0000 C CNN
F 2 "" H 3750 4000 50  0001 C CNN
F 3 "" H 3750 4000 50  0001 C CNN
	1    3750 4000
	1    0    0    -1  
$EndComp
Wire Wire Line
	3750 4000 3750 4050
$Comp
L Device:R R2105
U 1 1 5E2E5DF4
P 3950 4250
F 0 "R2105" V 4030 4250 50  0000 C CNN
F 1 "49.9" V 3950 4250 50  0000 C CNN
F 2 "Resistor_SMD:R_0402_1005Metric" V 3880 4250 50  0001 C CNN
F 3 "~" H 3950 4250 50  0001 C CNN
F 4 "3000-0000000577" H 3950 4250 50  0001 C CNN "PartSpecification"
	1    3950 4250
	1    0    0    -1  
$EndComp
$Comp
L Device:R R2106
U 1 1 5E2E623A
P 4150 4250
F 0 "R2106" V 4230 4250 50  0000 C CNN
F 1 "49.9" V 4150 4250 50  0000 C CNN
F 2 "Resistor_SMD:R_0402_1005Metric" V 4080 4250 50  0001 C CNN
F 3 "~" H 4150 4250 50  0001 C CNN
F 4 "3000-0000000577" H 4150 4250 50  0001 C CNN "PartSpecification"
	1    4150 4250
	1    0    0    -1  
$EndComp
$Comp
L Device:R R2107
U 1 1 5E2E6570
P 4350 4250
F 0 "R2107" V 4430 4250 50  0000 C CNN
F 1 "49.9" V 4350 4250 50  0000 C CNN
F 2 "Resistor_SMD:R_0402_1005Metric" V 4280 4250 50  0001 C CNN
F 3 "~" H 4350 4250 50  0001 C CNN
F 4 "3000-0000000577" H 4350 4250 50  0001 C CNN "PartSpecification"
	1    4350 4250
	1    0    0    -1  
$EndComp
Wire Wire Line
	3750 4400 3750 4850
Connection ~ 3750 4850
Wire Wire Line
	3750 4850 3600 4850
Wire Wire Line
	3950 4400 3950 5050
Connection ~ 3950 5050
Wire Wire Line
	3950 5050 4850 5050
Wire Wire Line
	4150 4400 4150 5250
Connection ~ 4150 5250
Wire Wire Line
	4150 5250 3400 5250
Wire Wire Line
	4350 4400 4350 5450
Connection ~ 4350 5450
Wire Wire Line
	4350 5450 3300 5450
Wire Wire Line
	3750 4050 3950 4050
Wire Wire Line
	4350 4050 4350 4100
Connection ~ 3750 4050
Wire Wire Line
	3750 4050 3750 4100
Wire Wire Line
	4150 4100 4150 4050
Connection ~ 4150 4050
Wire Wire Line
	4150 4050 4350 4050
Wire Wire Line
	3950 4100 3950 4050
Connection ~ 3950 4050
Wire Wire Line
	3950 4050 4150 4050
$Comp
L 000_PreferredParts:C_0_1uF C2103
U 1 1 5E2F3C78
P 4600 4300
F 0 "C2103" H 4625 4400 50  0000 L CNN
F 1 "C_0_1uF" H 4625 4200 50  0001 L CNN
F 2 "Capacitor_SMD:C_0402_1005Metric" H 4638 4150 50  0001 C CNN
F 3 "~" H 4600 4300 50  0001 C CNN
F 4 "0.1uF" H 4750 4200 50  0000 C CNN "DisplayValue"
F 5 "3000-0000000125" H 4600 4300 50  0001 C CNN "PartSpecification"
	1    4600 4300
	1    0    0    -1  
$EndComp
$Comp
L power:GND #PWR?
U 1 1 5E2F3C7E
P 4600 4550
F 0 "#PWR?" H 4600 4300 50  0001 C CNN
F 1 "GND" H 4600 4400 50  0000 C CNN
F 2 "" H 4600 4550 50  0001 C CNN
F 3 "" H 4600 4550 50  0001 C CNN
	1    4600 4550
	1    0    0    -1  
$EndComp
Wire Wire Line
	4600 4550 4600 4450
$Comp
L 000_PreferredParts:C_0_1uF C2104
U 1 1 5E2F516B
P 4900 4300
F 0 "C2104" H 4925 4400 50  0000 L CNN
F 1 "C_0_1uF" H 4925 4200 50  0001 L CNN
F 2 "Capacitor_SMD:C_0402_1005Metric" H 4938 4150 50  0001 C CNN
F 3 "~" H 4900 4300 50  0001 C CNN
F 4 "0.1uF" H 5050 4200 50  0000 C CNN "DisplayValue"
F 5 "3000-0000000125" H 4900 4300 50  0001 C CNN "PartSpecification"
	1    4900 4300
	1    0    0    -1  
$EndComp
$Comp
L power:GND #PWR?
U 1 1 5E2F5171
P 4900 4550
F 0 "#PWR?" H 4900 4300 50  0001 C CNN
F 1 "GND" H 4900 4400 50  0000 C CNN
F 2 "" H 4900 4550 50  0001 C CNN
F 3 "" H 4900 4550 50  0001 C CNN
	1    4900 4550
	1    0    0    -1  
$EndComp
Wire Wire Line
	4900 4550 4900 4450
$Comp
L 000_PreferredParts:C_0_1uF C2105
U 1 1 5E2F664D
P 5200 4300
F 0 "C2105" H 5225 4400 50  0000 L CNN
F 1 "C_0_1uF" H 5225 4200 50  0001 L CNN
F 2 "Capacitor_SMD:C_0402_1005Metric" H 5238 4150 50  0001 C CNN
F 3 "~" H 5200 4300 50  0001 C CNN
F 4 "0.1uF" H 5350 4200 50  0000 C CNN "DisplayValue"
F 5 "3000-0000000125" H 5200 4300 50  0001 C CNN "PartSpecification"
	1    5200 4300
	1    0    0    -1  
$EndComp
$Comp
L power:GND #PWR?
U 1 1 5E2F6653
P 5200 4550
F 0 "#PWR?" H 5200 4300 50  0001 C CNN
F 1 "GND" H 5200 4400 50  0000 C CNN
F 2 "" H 5200 4550 50  0001 C CNN
F 3 "" H 5200 4550 50  0001 C CNN
	1    5200 4550
	1    0    0    -1  
$EndComp
Wire Wire Line
	5200 4550 5200 4450
Wire Wire Line
	5200 4150 5200 4050
Wire Wire Line
	5200 4050 4900 4050
Wire Wire Line
	4600 4150 4600 4050
Connection ~ 4600 4050
Wire Wire Line
	4600 4050 4350 4050
Wire Wire Line
	4900 4150 4900 4050
Connection ~ 4900 4050
Wire Wire Line
	4900 4050 4600 4050
Connection ~ 4350 4050
$Comp
L power:+3.3V #PWR?
U 1 1 5E301AA8
P 4050 4800
F 0 "#PWR?" H 4050 4650 50  0001 C CNN
F 1 "+3.3V" H 4050 4940 50  0000 C CNN
F 2 "" H 4050 4800 50  0001 C CNN
F 3 "" H 4050 4800 50  0001 C CNN
	1    4050 4800
	1    0    0    -1  
$EndComp
Wire Wire Line
	4050 4800 4050 5150
Connection ~ 4050 5150
$Comp
L POWDER_ESD:RClamp2502L U2101
U 1 1 5E31C0E9
P 2350 3900
F 0 "U2101" H 2900 4550 50  0000 C CNN
F 1 "RClamp2502L" H 2350 4550 50  0000 C CNN
F 2 "Package_SO:SOIC-8_3.9x4.9mm_P1.27mm" H 2300 4800 50  0001 C CNN
F 3 "" H 2300 4800 50  0001 C CNN
F 4 "Semtech Corporation" H 2350 3900 50  0001 C CNN "Manufacturer"
F 5 "RCLAMP2502L.TBT" H 2350 3900 50  0001 C CNN "PartNumber"
F 6 "3000-0000000083" H 2350 3900 50  0001 C CNN "PartSpecification"
	1    2350 3900
	1    0    0    -1  
$EndComp
Text Label 4000 2450 0    50   ~ 0
RX_IN_N
Text Label 4000 2550 0    50   ~ 0
RX_IN_P
Text Label 4000 2850 0    50   ~ 0
TX_OUT_N
Text Label 4000 2950 0    50   ~ 0
TX_OUT_P
Text Label 4500 5150 0    50   ~ 0
CT
Text Label 4450 5750 0    50   ~ 0
G_LED_C
Text Label 4700 6050 0    50   ~ 0
Y_LED_C
Text Label 6550 2300 0    50   ~ 0
R_BIAS
Text Label 6550 2550 0    50   ~ 0
OSC_32_0
Text Label 6550 2850 0    50   ~ 0
OSC_32_1
Text Label 6100 3050 0    50   ~ 0
OSC_24_0
Text Label 6100 3350 0    50   ~ 0
OSC_24_1
Wire Wire Line
	6000 3350 6250 3350
Wire Wire Line
	6000 3050 6500 3050
Wire Wire Line
	3100 3400 3300 3400
Wire Wire Line
	3100 3400 3100 3150
Wire Wire Line
	3100 3150 1600 3150
Wire Wire Line
	1600 3150 1600 3400
Connection ~ 3100 3400
Wire Wire Line
	1600 4400 1600 4600
Wire Wire Line
	1600 4600 3100 4600
Wire Wire Line
	3100 4600 3100 4400
Wire Wire Line
	3100 4400 3400 4400
Connection ~ 3100 4400
Wire Wire Line
	3100 4850 3100 4650
Wire Wire Line
	3100 4650 1600 4650
Wire Wire Line
	1600 4650 1600 4850
Wire Wire Line
	1600 6050 3100 6050
Wire Wire Line
	3100 6050 3100 5850
Wire Wire Line
	1600 5850 1600 6050
Wire Wire Line
	3100 4850 3600 4850
Connection ~ 3100 4850
Wire Wire Line
	3500 5050 3100 5050
Wire Wire Line
	3100 5050 3100 5850
Connection ~ 3100 5850
$Comp
L 000_PreferredParts:C_0_1uF C2101
U 1 1 5E37BFEB
P 3000 2450
F 0 "C2101" H 3025 2550 50  0000 L CNN
F 1 "C_0_1uF" H 3025 2350 50  0001 L CNN
F 2 "Capacitor_SMD:C_0402_1005Metric" H 3038 2300 50  0001 C CNN
F 3 "~" H 3000 2450 50  0001 C CNN
F 4 "0.1uF" H 3150 2350 50  0000 C CNN "DisplayValue"
F 5 "3000-0000000125" H 3000 2450 50  0001 C CNN "PartSpecification"
	1    3000 2450
	1    0    0    -1  
$EndComp
$Comp
L power:GND #PWR?
U 1 1 5E37BFF1
P 3000 2800
F 0 "#PWR?" H 3000 2550 50  0001 C CNN
F 1 "GND" H 3000 2650 50  0000 C CNN
F 2 "" H 3000 2800 50  0001 C CNN
F 3 "" H 3000 2800 50  0001 C CNN
	1    3000 2800
	1    0    0    -1  
$EndComp
Wire Wire Line
	3000 2800 3000 2600
Connection ~ 3600 4850
Wire Wire Line
	3600 2950 3600 4850
Connection ~ 3500 5050
Connection ~ 3300 3400
Connection ~ 3400 4400
Wire Wire Line
	3400 4400 3400 5250
Wire Wire Line
	3400 2550 3400 4400
Wire Wire Line
	3300 2450 3300 3400
Wire Wire Line
	3000 2200 3000 2300
Connection ~ 3000 2200
$Comp
L Device:R R2101
U 1 1 5E3C2708
P 2700 2200
F 0 "R2101" V 2780 2200 50  0000 C CNN
F 1 "10" V 2700 2200 50  0000 C CNN
F 2 "Resistor_SMD:R_0402_1005Metric" V 2630 2200 50  0001 C CNN
F 3 "~" H 2700 2200 50  0001 C CNN
F 4 "3000-0000000146" H 2700 2200 50  0001 C CNN "PartSpecification"
	1    2700 2200
	0    1    1    0   
$EndComp
Wire Wire Line
	2850 2200 3000 2200
$Comp
L Switch:SW_Push SW2101
U 1 1 5E3C5E93
P 2450 2500
F 0 "SW2101" H 2500 2600 50  0000 L CNN
F 1 "SW_Push" H 2450 2440 50  0000 C CNN
F 2 "Button_Switch_SMD:SW_SPST_PTS645" H 2450 2700 50  0001 C CNN
F 3 "~" H 2450 2700 50  0001 C CNN
F 4 "3000-0000000176" H 2450 2500 50  0001 C CNN "PartSpecification"
	1    2450 2500
	0    1    1    0   
$EndComp
Wire Wire Line
	2450 2300 2450 2200
Wire Wire Line
	2450 2200 2550 2200
$Comp
L power:GND #PWR?
U 1 1 5E3C99F8
P 2450 2800
F 0 "#PWR?" H 2450 2550 50  0001 C CNN
F 1 "GND" H 2450 2650 50  0000 C CNN
F 2 "" H 2450 2800 50  0001 C CNN
F 3 "" H 2450 2800 50  0001 C CNN
	1    2450 2800
	1    0    0    -1  
$EndComp
Wire Wire Line
	2450 2800 2450 2700
$Comp
L Device:R R2103
U 1 1 5E3D4C12
P 3500 1850
F 0 "R2103" V 3580 1850 50  0000 C CNN
F 1 "1M" V 3500 1850 50  0000 C CNN
F 2 "Resistor_SMD:R_0402_1005Metric" V 3430 1850 50  0001 C CNN
F 3 "~" H 3500 1850 50  0001 C CNN
F 4 "3000-0000000139" H 3500 1850 50  0001 C CNN "PartSpecification"
	1    3500 1850
	1    0    0    -1  
$EndComp
Wire Wire Line
	3500 2000 3500 2100
Wire Wire Line
	3500 2100 4400 2100
$Comp
L power:+3.3V #PWR?
U 1 1 5E3D8853
P 3500 1600
F 0 "#PWR?" H 3500 1450 50  0001 C CNN
F 1 "+3.3V" H 3500 1740 50  0000 C CNN
F 2 "" H 3500 1600 50  0001 C CNN
F 3 "" H 3500 1600 50  0001 C CNN
	1    3500 1600
	1    0    0    -1  
$EndComp
Wire Wire Line
	3500 1700 3500 1600
Text Label 4000 2200 0    50   ~ 0
RST_N
Text Label 4000 2100 0    50   ~ 0
WAKE_N
Text HLabel 3500 2300 0    50   Input ~ 0
RST_N
Wire Wire Line
	3500 2300 3500 2200
Connection ~ 3500 2200
Wire Wire Line
	3500 2200 4400 2200
$Comp
L POWDER_ESD:RClamp2502L U2102
U 1 1 5E319FCB
P 2350 5350
F 0 "U2102" H 2900 6000 50  0000 C CNN
F 1 "RClamp2502L" H 2350 6000 50  0000 C CNN
F 2 "Package_SO:SOIC-8_3.9x4.9mm_P1.27mm" H 2300 6250 50  0001 C CNN
F 3 "" H 2300 6250 50  0001 C CNN
F 4 "Semtech Corporation" H 2350 5350 50  0001 C CNN "Manufacturer"
F 5 "RCLAMP2502L.TBT" H 2350 5350 50  0001 C CNN "PartNumber"
F 6 "3000-0000000083" H 2350 5350 50  0001 C CNN "PartSpecification"
	1    2350 5350
	1    0    0    -1  
$EndComp
Text Label 2450 2200 2    50   ~ 0
rst_sw
Text HLabel 2850 1700 0    50   Input ~ 0
pg_3_3
Wire Wire Line
	2850 1700 3000 1700
Wire Wire Line
	3000 2200 3500 2200
$Comp
L Device:R R2102
U 1 1 5F038A48
P 3000 1950
F 0 "R2102" V 3080 1950 50  0000 C CNN
F 1 "10k" V 3000 1950 50  0000 C CNN
F 2 "Resistor_SMD:R_0402_1005Metric" V 2930 1950 50  0001 C CNN
F 3 "~" H 3000 1950 50  0001 C CNN
F 4 "3000-0000000131" H 3000 1950 50  0001 C CNN "PartSpecification"
	1    3000 1950
	-1   0    0    1   
$EndComp
Wire Wire Line
	3000 2100 3000 2200
Wire Wire Line
	3000 1800 3000 1700
$EndSCHEMATC
