EESchema Schematic File Version 4
EELAYER 30 0
EELAYER END
$Descr A4 11693 8268
encoding utf-8
Sheet 38 39
Title ""
Date ""
Rev ""
Comp ""
Comment1 ""
Comment2 ""
Comment3 ""
Comment4 ""
$EndDescr
Text HLabel 900  2500 0    50   Input ~ 0
EN
Text HLabel 900  2600 0    50   Input ~ 0
PS_SYNC
Text HLabel 900  2700 0    50   Input ~ 0
VSEL_1
Text HLabel 6650 1900 2    50   Output ~ 0
DCDC_PG
Wire Wire Line
	6650 1900 6500 1900
$Comp
L power:GND #PWR?
U 1 1 6053CDE1
P 5800 2450
AR Path="/5D562501/6053CDE1" Ref="#PWR?"  Part="1" 
AR Path="/5D587C46/6053CDE1" Ref="#PWR?"  Part="1" 
AR Path="/5D591ABD/6053CDE1" Ref="#PWR?"  Part="1" 
AR Path="/60664CFF/6053CDE1" Ref="#PWR?"  Part="1" 
F 0 "#PWR?" H 5800 2200 50  0001 C CNN
F 1 "GND" H 5805 2277 50  0000 C CNN
F 2 "" H 5800 2450 50  0001 C CNN
F 3 "" H 5800 2450 50  0001 C CNN
	1    5800 2450
	1    0    0    -1  
$EndComp
$Comp
L power:GND #PWR?
U 1 1 6053CDE2
P 6000 2450
AR Path="/5D562501/6053CDE2" Ref="#PWR?"  Part="1" 
AR Path="/5D587C46/6053CDE2" Ref="#PWR?"  Part="1" 
AR Path="/5D591ABD/6053CDE2" Ref="#PWR?"  Part="1" 
AR Path="/60664CFF/6053CDE2" Ref="#PWR?"  Part="1" 
F 0 "#PWR?" H 6000 2200 50  0001 C CNN
F 1 "GND" H 6005 2277 50  0000 C CNN
F 2 "" H 6000 2450 50  0001 C CNN
F 3 "" H 6000 2450 50  0001 C CNN
	1    6000 2450
	1    0    0    -1  
$EndComp
Wire Wire Line
	6000 2450 6000 2300
Wire Wire Line
	5800 2300 5800 2450
$Comp
L 000_PreferredParts:C_100nF C204
U 1 1 6053CDE3
P 2550 1850
AR Path="/5D562501/6053CDE3" Ref="C204"  Part="1" 
AR Path="/5D587C46/6053CDE3" Ref="C304"  Part="1" 
AR Path="/5D591ABD/6053CDE3" Ref="C?"  Part="1" 
AR Path="/60664CFF/6053CDE3" Ref="C3708"  Part="1" 
F 0 "C3708" H 2665 1896 50  0000 L CNN
F 1 "C_100nF" H 2575 1750 50  0001 L CNN
F 2 "Capacitor_SMD:C_0402_1005Metric" H 2588 1700 50  0001 C CNN
F 3 "~" H 2550 1850 50  0001 C CNN
F 4 "Murata Electronics" H 2550 1850 50  0001 C CNN "Manufacturer"
F 5 "GRM155R62A104KE14D" H 2550 1850 50  0001 C CNN "PartNumber"
F 6 "100nF" H 2700 1750 50  0000 C CNN "DisplayValue"
F 7 "3000-0000000125" H 2550 1850 50  0001 C CNN "PartSpecification"
	1    2550 1850
	1    0    0    -1  
$EndComp
Wire Wire Line
	2550 1700 2550 1550
$Comp
L power:GND #PWR?
U 1 1 6053CDE4
P 2550 2150
AR Path="/5D562501/6053CDE4" Ref="#PWR?"  Part="1" 
AR Path="/5D587C46/6053CDE4" Ref="#PWR?"  Part="1" 
AR Path="/5D591ABD/6053CDE4" Ref="#PWR?"  Part="1" 
AR Path="/60664CFF/6053CDE4" Ref="#PWR?"  Part="1" 
F 0 "#PWR?" H 2550 1900 50  0001 C CNN
F 1 "GND" H 2555 1977 50  0000 C CNN
F 2 "" H 2550 2150 50  0001 C CNN
F 3 "" H 2550 2150 50  0001 C CNN
	1    2550 2150
	1    0    0    -1  
$EndComp
Wire Wire Line
	2550 2150 2550 2000
$Comp
L Device:C C203
U 1 1 60577FCD
P 2150 1650
AR Path="/5D562501/60577FCD" Ref="C203"  Part="1" 
AR Path="/5D587C46/60577FCD" Ref="C303"  Part="1" 
AR Path="/5D591ABD/60577FCD" Ref="C?"  Part="1" 
AR Path="/60664CFF/60577FCD" Ref="C3707"  Part="1" 
F 0 "C3707" H 2265 1696 50  0000 L CNN
F 1 "10uF" H 2265 1605 50  0000 L CNN
F 2 "Capacitor_SMD:C_0603_1608Metric" H 2188 1500 50  0001 C CNN
F 3 "~" H 2150 1650 50  0001 C CNN
F 4 "Murata Electronics" H 2150 1650 50  0001 C CNN "Manufacturer"
F 5 "GRM188R6YA106MA73D" H 2150 1650 50  0001 C CNN "PartNumber"
F 6 "3000-0000000135" H 2150 1650 50  0001 C CNN "PartSpecification"
	1    2150 1650
	1    0    0    -1  
$EndComp
$Comp
L Device:C C202
U 1 1 6053CDE5
P 1700 1650
AR Path="/5D562501/6053CDE5" Ref="C202"  Part="1" 
AR Path="/5D587C46/6053CDE5" Ref="C302"  Part="1" 
AR Path="/5D591ABD/6053CDE5" Ref="C?"  Part="1" 
AR Path="/60664CFF/6053CDE5" Ref="C3706"  Part="1" 
F 0 "C3706" H 1815 1696 50  0000 L CNN
F 1 "10uF" H 1815 1605 50  0000 L CNN
F 2 "Capacitor_SMD:C_0805_2012Metric" H 1738 1500 50  0001 C CNN
F 3 "~" H 1700 1650 50  0001 C CNN
F 4 "Murata Electronics" H 1700 1650 50  0001 C CNN "Manufacturer"
F 5 "GRM21BC8YA106ME11L" H 1700 1650 50  0001 C CNN "PartNumber"
F 6 "3000-0000000134" H 1700 1650 50  0001 C CNN "PartSpecification"
	1    1700 1650
	1    0    0    -1  
$EndComp
$Comp
L Device:C C201
U 1 1 60577FC4
P 1250 1650
AR Path="/5D562501/60577FC4" Ref="C201"  Part="1" 
AR Path="/5D587C46/60577FC4" Ref="C301"  Part="1" 
AR Path="/5D591ABD/60577FC4" Ref="C?"  Part="1" 
AR Path="/60664CFF/60577FC4" Ref="C3705"  Part="1" 
F 0 "C3705" H 1365 1696 50  0000 L CNN
F 1 "10uF" H 1365 1605 50  0000 L CNN
F 2 "Capacitor_SMD:C_0805_2012Metric" H 1288 1500 50  0001 C CNN
F 3 "~" H 1250 1650 50  0001 C CNN
F 4 "Murata Electronics" H 1250 1650 50  0001 C CNN "Manufacturer"
F 5 "GRM21BC8YA106ME11L" H 1250 1650 50  0001 C CNN "PartNumber"
F 6 "3000-0000000134" H 1250 1650 50  0001 C CNN "PartSpecification"
	1    1250 1650
	1    0    0    -1  
$EndComp
$Comp
L power:GND #PWR?
U 1 1 60577FC5
P 2150 1900
AR Path="/5D562501/60577FC5" Ref="#PWR?"  Part="1" 
AR Path="/5D587C46/60577FC5" Ref="#PWR?"  Part="1" 
AR Path="/5D591ABD/60577FC5" Ref="#PWR?"  Part="1" 
AR Path="/60664CFF/60577FC5" Ref="#PWR?"  Part="1" 
F 0 "#PWR?" H 2150 1650 50  0001 C CNN
F 1 "GND" H 2155 1727 50  0000 C CNN
F 2 "" H 2150 1900 50  0001 C CNN
F 3 "" H 2150 1900 50  0001 C CNN
	1    2150 1900
	1    0    0    -1  
$EndComp
$Comp
L power:GND #PWR?
U 1 1 60577FC8
P 1700 1900
AR Path="/5D562501/60577FC8" Ref="#PWR?"  Part="1" 
AR Path="/5D587C46/60577FC8" Ref="#PWR?"  Part="1" 
AR Path="/5D591ABD/60577FC8" Ref="#PWR?"  Part="1" 
AR Path="/60664CFF/60577FC8" Ref="#PWR?"  Part="1" 
F 0 "#PWR?" H 1700 1650 50  0001 C CNN
F 1 "GND" H 1705 1727 50  0000 C CNN
F 2 "" H 1700 1900 50  0001 C CNN
F 3 "" H 1700 1900 50  0001 C CNN
	1    1700 1900
	1    0    0    -1  
$EndComp
$Comp
L power:GND #PWR?
U 1 1 6053CDEC
P 1250 1900
AR Path="/5D562501/6053CDEC" Ref="#PWR?"  Part="1" 
AR Path="/5D587C46/6053CDEC" Ref="#PWR?"  Part="1" 
AR Path="/5D591ABD/6053CDEC" Ref="#PWR?"  Part="1" 
AR Path="/60664CFF/6053CDEC" Ref="#PWR?"  Part="1" 
F 0 "#PWR?" H 1250 1650 50  0001 C CNN
F 1 "GND" H 1255 1727 50  0000 C CNN
F 2 "" H 1250 1900 50  0001 C CNN
F 3 "" H 1250 1900 50  0001 C CNN
	1    1250 1900
	1    0    0    -1  
$EndComp
Wire Wire Line
	1250 1900 1250 1800
Wire Wire Line
	1700 1900 1700 1800
Wire Wire Line
	2150 1900 2150 1800
Wire Wire Line
	5300 1300 5100 1300
Wire Wire Line
	2150 1300 2150 1500
Wire Wire Line
	2150 1300 1700 1300
Wire Wire Line
	1700 1300 1700 1500
Connection ~ 2150 1300
Wire Wire Line
	1700 1300 1250 1300
Wire Wire Line
	1250 1300 1250 1500
Connection ~ 1700 1300
Wire Wire Line
	5300 1200 5100 1200
Wire Wire Line
	5100 1200 5100 1300
Connection ~ 5100 1300
Wire Wire Line
	1250 1300 900  1300
Connection ~ 1250 1300
Text HLabel 900  1300 0    50   Input ~ 0
V_12
$Comp
L Device:L L201
U 1 1 60577FCF
P 5900 800
AR Path="/5D562501/60577FCF" Ref="L201"  Part="1" 
AR Path="/5D587C46/60577FCF" Ref="L301"  Part="1" 
AR Path="/5D591ABD/60577FCF" Ref="L?"  Part="1" 
AR Path="/60664CFF/60577FCF" Ref="L3701"  Part="1" 
F 0 "L3701" V 6090 800 50  0000 C CNN
F 1 "1.5uH" V 5999 800 50  0000 C CNN
F 2 "Inductor_SMD:L_Taiyo-Yuden_MD-4040" H 5900 800 50  0001 C CNN
F 3 "~" H 5900 800 50  0001 C CNN
F 4 "ABRACON" H 5900 800 50  0001 C CNN "Manufacturer"
F 5 "ASPI-4030S-1R5N-T" H 5900 800 50  0001 C CNN "PartNumber"
F 6 "3000-0000000076" V 5900 800 50  0001 C CNN "PartSpecification"
	1    5900 800 
	0    -1   -1   0   
$EndComp
Wire Wire Line
	5750 800  5700 800 
Wire Wire Line
	5700 800  5700 950 
Wire Wire Line
	6050 800  6100 800 
Wire Wire Line
	6100 800  6100 950 
$Comp
L Device:C C205
U 1 1 60577FD1
P 8050 1500
AR Path="/5D562501/60577FD1" Ref="C205"  Part="1" 
AR Path="/5D587C46/60577FD1" Ref="C305"  Part="1" 
AR Path="/5D591ABD/60577FD1" Ref="C?"  Part="1" 
AR Path="/60664CFF/60577FD1" Ref="C3701"  Part="1" 
F 0 "C3701" H 8165 1546 50  0000 L CNN
F 1 "10uF" H 8165 1455 50  0000 L CNN
F 2 "Capacitor_SMD:C_0603_1608Metric" H 8088 1350 50  0001 C CNN
F 3 "~" H 8050 1500 50  0001 C CNN
F 4 "Murata Electronics" H 8050 1500 50  0001 C CNN "Manufacturer"
F 5 "GRM188R6YA106MA73D" H 8050 1500 50  0001 C CNN "PartNumber"
F 6 "3000-0000000135" H 8050 1500 50  0001 C CNN "PartSpecification"
	1    8050 1500
	1    0    0    -1  
$EndComp
$Comp
L Device:R R202
U 1 1 60577FD4
P 7600 1500
AR Path="/5D562501/60577FD4" Ref="R202"  Part="1" 
AR Path="/5D587C46/60577FD4" Ref="R302"  Part="1" 
AR Path="/5D591ABD/60577FD4" Ref="R?"  Part="1" 
AR Path="/60664CFF/60577FD4" Ref="R3701"  Part="1" 
F 0 "R3701" H 7670 1546 50  0000 L CNN
F 1 "604k" H 7670 1455 50  0000 L CNN
F 2 "Resistor_SMD:R_0402_1005Metric" V 7530 1500 50  0001 C CNN
F 3 "~" H 7600 1500 50  0001 C CNN
F 4 "" H 7600 1500 50  0001 C CNN "Manufacturer"
F 5 "" H 7600 1500 50  0001 C CNN "PartNumber"
F 6 "3000-0000000201" H 7600 1500 50  0001 C CNN "PartSpecification"
	1    7600 1500
	1    0    0    -1  
$EndComp
Wire Wire Line
	6500 1300 6700 1300
Wire Wire Line
	7600 1350 7600 1300
Connection ~ 7600 1300
$Comp
L Device:R R203
U 1 1 60577FD5
P 7600 1900
AR Path="/5D562501/60577FD5" Ref="R203"  Part="1" 
AR Path="/5D587C46/60577FD5" Ref="R303"  Part="1" 
AR Path="/5D591ABD/60577FD5" Ref="R?"  Part="1" 
AR Path="/60664CFF/60577FD5" Ref="R3703"  Part="1" 
F 0 "R3703" H 7670 1946 50  0000 L CNN
F 1 "150k" H 7670 1855 50  0000 L CNN
F 2 "Resistor_SMD:R_0402_1005Metric" V 7530 1900 50  0001 C CNN
F 3 "~" H 7600 1900 50  0001 C CNN
F 4 "Stackpole Electronics Inc" H 7600 1900 50  0001 C CNN "Manufacturer"
F 5 "" H 7600 1900 50  0001 C CNN "PartNumber"
F 6 "3000-0000000579" H 7600 1900 50  0001 C CNN "PartSpecification"
	1    7600 1900
	1    0    0    -1  
$EndComp
$Comp
L Device:R R201
U 1 1 60577FD7
P 7250 1900
AR Path="/5D562501/60577FD7" Ref="R201"  Part="1" 
AR Path="/5D587C46/60577FD7" Ref="R301"  Part="1" 
AR Path="/5D591ABD/60577FD7" Ref="R?"  Part="1" 
AR Path="/60664CFF/60577FD7" Ref="R3702"  Part="1" 
F 0 "R3702" H 7320 1946 50  0000 L CNN
F 1 "365k" H 7320 1855 50  0000 L CNN
F 2 "Resistor_SMD:R_0402_1005Metric" V 7180 1900 50  0001 C CNN
F 3 "~" H 7250 1900 50  0001 C CNN
F 4 "" H 7250 1900 50  0001 C CNN "Manufacturer"
F 5 "" H 7250 1900 50  0001 C CNN "PartNumber"
F 6 "3000-0000000233" H 7250 1900 50  0001 C CNN "PartSpecification"
	1    7250 1900
	1    0    0    -1  
$EndComp
Wire Wire Line
	7600 1650 7600 1700
Wire Wire Line
	6500 1550 7250 1550
Connection ~ 7600 1700
Wire Wire Line
	7600 1700 7600 1750
Wire Wire Line
	7250 1750 7250 1700
Connection ~ 7250 1700
Wire Wire Line
	7250 1700 7250 1550
Wire Wire Line
	7250 1700 7600 1700
$Comp
L power:GND #PWR?
U 1 1 60577FD8
P 7600 2150
AR Path="/5D562501/60577FD8" Ref="#PWR?"  Part="1" 
AR Path="/5D587C46/60577FD8" Ref="#PWR?"  Part="1" 
AR Path="/5D591ABD/60577FD8" Ref="#PWR?"  Part="1" 
AR Path="/60664CFF/60577FD8" Ref="#PWR?"  Part="1" 
F 0 "#PWR?" H 7600 1900 50  0001 C CNN
F 1 "GND" H 7605 1977 50  0000 C CNN
F 2 "" H 7600 2150 50  0001 C CNN
F 3 "" H 7600 2150 50  0001 C CNN
	1    7600 2150
	1    0    0    -1  
$EndComp
Wire Wire Line
	7600 2150 7600 2050
Wire Wire Line
	7250 2150 7250 2050
Wire Wire Line
	6500 1650 7100 1650
Wire Wire Line
	7100 1650 7100 2150
Wire Wire Line
	7100 2150 7250 2150
Wire Wire Line
	8050 1350 8050 1300
Wire Wire Line
	7600 1300 8050 1300
$Comp
L power:GND #PWR?
U 1 1 60577FDB
P 8050 1750
AR Path="/5D562501/60577FDB" Ref="#PWR?"  Part="1" 
AR Path="/5D587C46/60577FDB" Ref="#PWR?"  Part="1" 
AR Path="/5D591ABD/60577FDB" Ref="#PWR?"  Part="1" 
AR Path="/60664CFF/60577FDB" Ref="#PWR?"  Part="1" 
F 0 "#PWR?" H 8050 1500 50  0001 C CNN
F 1 "GND" H 8055 1577 50  0000 C CNN
F 2 "" H 8050 1750 50  0001 C CNN
F 3 "" H 8050 1750 50  0001 C CNN
	1    8050 1750
	1    0    0    -1  
$EndComp
Wire Wire Line
	8050 1750 8050 1650
$Comp
L power:GND #PWR?
U 1 1 6053CDE9
P 8550 1750
AR Path="/5D562501/6053CDE9" Ref="#PWR?"  Part="1" 
AR Path="/5D587C46/6053CDE9" Ref="#PWR?"  Part="1" 
AR Path="/5D591ABD/6053CDE9" Ref="#PWR?"  Part="1" 
AR Path="/60664CFF/6053CDE9" Ref="#PWR?"  Part="1" 
F 0 "#PWR?" H 8550 1500 50  0001 C CNN
F 1 "GND" H 8555 1577 50  0000 C CNN
F 2 "" H 8550 1750 50  0001 C CNN
F 3 "" H 8550 1750 50  0001 C CNN
	1    8550 1750
	1    0    0    -1  
$EndComp
Wire Wire Line
	8550 1750 8550 1650
Wire Wire Line
	8550 1350 8550 1300
Wire Wire Line
	8550 1300 8400 1300
Connection ~ 8050 1300
$Comp
L power:GND #PWR?
U 1 1 6053CDF3
P 9350 1750
AR Path="/5D562501/6053CDF3" Ref="#PWR?"  Part="1" 
AR Path="/5D587C46/6053CDF3" Ref="#PWR?"  Part="1" 
AR Path="/5D591ABD/6053CDF3" Ref="#PWR?"  Part="1" 
AR Path="/60664CFF/6053CDF3" Ref="#PWR?"  Part="1" 
F 0 "#PWR?" H 9350 1500 50  0001 C CNN
F 1 "GND" H 9355 1577 50  0000 C CNN
F 2 "" H 9350 1750 50  0001 C CNN
F 3 "" H 9350 1750 50  0001 C CNN
	1    9350 1750
	1    0    0    -1  
$EndComp
Wire Wire Line
	9350 1750 9350 1650
Wire Wire Line
	9350 1350 9350 1300
$Comp
L power:GND #PWR?
U 1 1 60577FDE
P 10150 1750
AR Path="/5D562501/60577FDE" Ref="#PWR?"  Part="1" 
AR Path="/5D587C46/60577FDE" Ref="#PWR?"  Part="1" 
AR Path="/5D591ABD/60577FDE" Ref="#PWR?"  Part="1" 
AR Path="/60664CFF/60577FDE" Ref="#PWR?"  Part="1" 
F 0 "#PWR?" H 10150 1500 50  0001 C CNN
F 1 "GND" H 10155 1577 50  0000 C CNN
F 2 "" H 10150 1750 50  0001 C CNN
F 3 "" H 10150 1750 50  0001 C CNN
	1    10150 1750
	1    0    0    -1  
$EndComp
Wire Wire Line
	10150 1750 10150 1650
Wire Wire Line
	10150 1350 10150 1300
Wire Wire Line
	8550 1300 9350 1300
Connection ~ 8550 1300
Connection ~ 9350 1300
Wire Wire Line
	9350 1300 10150 1300
Text HLabel 9600 7050 2    50   Output ~ 0
V_OUT
Text Label 2650 1550 0    50   ~ 0
V_AUX
Text Label 6700 1550 0    50   ~ 0
FB
Text Label 6700 1650 0    50   ~ 0
FB2
Text Label 5700 800  0    50   ~ 0
L1
Text Label 6100 800  0    50   ~ 0
L2
$Comp
L 000_PreferredParts:C_10uF_0805 C206
U 1 1 6053CDF5
P 8550 1500
AR Path="/5D562501/6053CDF5" Ref="C206"  Part="1" 
AR Path="/5D587C46/6053CDF5" Ref="C306"  Part="1" 
AR Path="/60664CFF/6053CDF5" Ref="C3702"  Part="1" 
F 0 "C3702" H 8665 1546 50  0000 L CNN
F 1 "C_10uF_0805" H 8665 1455 50  0000 L CNN
F 2 "Capacitor_SMD:C_0805_2012Metric" H 8588 1350 50  0001 C CNN
F 3 "~" H 8550 1500 50  0001 C CNN
F 4 "Murata Electronics" H 8550 1500 50  0001 C CNN "Manufacturer"
F 5 "GRM21BC8YA106ME11L" H 8550 1500 50  0001 C CNN "PartNumber"
F 6 "3000-0000000134" H 8550 1500 50  0001 C CNN "PartSpecification"
	1    8550 1500
	1    0    0    -1  
$EndComp
$Comp
L 000_PreferredParts:C_10uF_0805 C208
U 1 1 60577FE0
P 9350 1500
AR Path="/5D562501/60577FE0" Ref="C208"  Part="1" 
AR Path="/5D587C46/60577FE0" Ref="C308"  Part="1" 
AR Path="/60664CFF/60577FE0" Ref="C3703"  Part="1" 
F 0 "C3703" H 9465 1546 50  0000 L CNN
F 1 "C_10uF_0805" H 9465 1455 50  0000 L CNN
F 2 "Capacitor_SMD:C_0805_2012Metric" H 9388 1350 50  0001 C CNN
F 3 "~" H 9350 1500 50  0001 C CNN
F 4 "Murata Electronics" H 9350 1500 50  0001 C CNN "Manufacturer"
F 5 "GRM21BC8YA106ME11L" H 9350 1500 50  0001 C CNN "PartNumber"
F 6 "3000-0000000134" H 9350 1500 50  0001 C CNN "PartSpecification"
	1    9350 1500
	1    0    0    -1  
$EndComp
$Comp
L 000_PreferredParts:C_10uF_0805 C210
U 1 1 60577FE2
P 10150 1500
AR Path="/5D562501/60577FE2" Ref="C210"  Part="1" 
AR Path="/5D587C46/60577FE2" Ref="C310"  Part="1" 
AR Path="/60664CFF/60577FE2" Ref="C3704"  Part="1" 
F 0 "C3704" H 10265 1546 50  0000 L CNN
F 1 "C_10uF_0805" H 10265 1455 50  0000 L CNN
F 2 "Capacitor_SMD:C_0805_2012Metric" H 10188 1350 50  0001 C CNN
F 3 "~" H 10150 1500 50  0001 C CNN
F 4 "Murata Electronics" H 10150 1500 50  0001 C CNN "Manufacturer"
F 5 "GRM21BC8YA106ME11L" H 10150 1500 50  0001 C CNN "PartNumber"
F 6 "3000-0000000134" H 10150 1500 50  0001 C CNN "PartSpecification"
	1    10150 1500
	1    0    0    -1  
$EndComp
$Comp
L power:GND #PWR?
U 1 1 6053CDF8
P 8550 2500
AR Path="/5D562501/6053CDF8" Ref="#PWR?"  Part="1" 
AR Path="/5D587C46/6053CDF8" Ref="#PWR?"  Part="1" 
AR Path="/5D591ABD/6053CDF8" Ref="#PWR?"  Part="1" 
AR Path="/60664CFF/6053CDF8" Ref="#PWR?"  Part="1" 
F 0 "#PWR?" H 8550 2250 50  0001 C CNN
F 1 "GND" H 8555 2327 50  0000 C CNN
F 2 "" H 8550 2500 50  0001 C CNN
F 3 "" H 8550 2500 50  0001 C CNN
	1    8550 2500
	1    0    0    -1  
$EndComp
Wire Wire Line
	8550 2500 8550 2400
Wire Wire Line
	8550 2100 8550 2050
Wire Wire Line
	8550 2050 8400 2050
$Comp
L power:GND #PWR?
U 1 1 6053CDF9
P 9350 2500
AR Path="/5D562501/6053CDF9" Ref="#PWR?"  Part="1" 
AR Path="/5D587C46/6053CDF9" Ref="#PWR?"  Part="1" 
AR Path="/5D591ABD/6053CDF9" Ref="#PWR?"  Part="1" 
AR Path="/60664CFF/6053CDF9" Ref="#PWR?"  Part="1" 
F 0 "#PWR?" H 9350 2250 50  0001 C CNN
F 1 "GND" H 9355 2327 50  0000 C CNN
F 2 "" H 9350 2500 50  0001 C CNN
F 3 "" H 9350 2500 50  0001 C CNN
	1    9350 2500
	1    0    0    -1  
$EndComp
Wire Wire Line
	9350 2500 9350 2400
Wire Wire Line
	9350 2100 9350 2050
$Comp
L power:GND #PWR?
U 1 1 6053CDFA
P 10150 2500
AR Path="/5D562501/6053CDFA" Ref="#PWR?"  Part="1" 
AR Path="/5D587C46/6053CDFA" Ref="#PWR?"  Part="1" 
AR Path="/5D591ABD/6053CDFA" Ref="#PWR?"  Part="1" 
AR Path="/60664CFF/6053CDFA" Ref="#PWR?"  Part="1" 
F 0 "#PWR?" H 10150 2250 50  0001 C CNN
F 1 "GND" H 10155 2327 50  0000 C CNN
F 2 "" H 10150 2500 50  0001 C CNN
F 3 "" H 10150 2500 50  0001 C CNN
	1    10150 2500
	1    0    0    -1  
$EndComp
Wire Wire Line
	10150 2500 10150 2400
Wire Wire Line
	10150 2100 10150 2050
Wire Wire Line
	8550 2050 9350 2050
Connection ~ 8550 2050
Connection ~ 9350 2050
Wire Wire Line
	9350 2050 10150 2050
$Comp
L 000_PreferredParts:C_10uF_0805 C207
U 1 1 5D72DE5A
P 8550 2250
AR Path="/5D562501/5D72DE5A" Ref="C207"  Part="1" 
AR Path="/5D587C46/5D72DE5A" Ref="C307"  Part="1" 
AR Path="/60664CFF/5D72DE5A" Ref="C3709"  Part="1" 
F 0 "C3709" H 8665 2296 50  0000 L CNN
F 1 "C_10uF_0805" H 8665 2205 50  0000 L CNN
F 2 "Capacitor_SMD:C_0805_2012Metric" H 8588 2100 50  0001 C CNN
F 3 "~" H 8550 2250 50  0001 C CNN
F 4 "Murata Electronics" H 8550 2250 50  0001 C CNN "Manufacturer"
F 5 "GRM21BC8YA106ME11L" H 8550 2250 50  0001 C CNN "PartNumber"
F 6 "3000-0000000134" H 8550 2250 50  0001 C CNN "PartSpecification"
	1    8550 2250
	1    0    0    -1  
$EndComp
$Comp
L 000_PreferredParts:C_10uF_0805 C209
U 1 1 5D72DE60
P 9350 2250
AR Path="/5D562501/5D72DE60" Ref="C209"  Part="1" 
AR Path="/5D587C46/5D72DE60" Ref="C309"  Part="1" 
AR Path="/60664CFF/5D72DE60" Ref="C3710"  Part="1" 
F 0 "C3710" H 9465 2296 50  0000 L CNN
F 1 "C_10uF_0805" H 9465 2205 50  0000 L CNN
F 2 "Capacitor_SMD:C_0805_2012Metric" H 9388 2100 50  0001 C CNN
F 3 "~" H 9350 2250 50  0001 C CNN
F 4 "Murata Electronics" H 9350 2250 50  0001 C CNN "Manufacturer"
F 5 "GRM21BC8YA106ME11L" H 9350 2250 50  0001 C CNN "PartNumber"
F 6 "3000-0000000134" H 9350 2250 50  0001 C CNN "PartSpecification"
	1    9350 2250
	1    0    0    -1  
$EndComp
$Comp
L 000_PreferredParts:C_10uF_0805 C211
U 1 1 5D72DE66
P 10150 2250
AR Path="/5D562501/5D72DE66" Ref="C211"  Part="1" 
AR Path="/5D587C46/5D72DE66" Ref="C311"  Part="1" 
AR Path="/60664CFF/5D72DE66" Ref="C3711"  Part="1" 
F 0 "C3711" H 10265 2296 50  0000 L CNN
F 1 "C_10uF_0805" H 10265 2205 50  0000 L CNN
F 2 "Capacitor_SMD:C_0805_2012Metric" H 10188 2100 50  0001 C CNN
F 3 "~" H 10150 2250 50  0001 C CNN
F 4 "Murata Electronics" H 10150 2250 50  0001 C CNN "Manufacturer"
F 5 "GRM21BC8YA106ME11L" H 10150 2250 50  0001 C CNN "PartNumber"
F 6 "3000-0000000134" H 10150 2250 50  0001 C CNN "PartSpecification"
	1    10150 2250
	1    0    0    -1  
$EndComp
Wire Wire Line
	8400 1300 8400 2050
Connection ~ 8400 1300
Wire Wire Line
	8400 1300 8050 1300
Wire Wire Line
	2550 1550 5300 1550
Wire Wire Line
	4550 2600 4550 1900
Wire Wire Line
	4950 2000 4950 2700
Wire Wire Line
	4550 1900 5300 1900
Wire Wire Line
	4100 1800 5300 1800
Wire Wire Line
	6500 1200 6700 1200
Wire Wire Line
	6700 1200 6700 1300
Connection ~ 6700 1300
Wire Wire Line
	6700 1300 7600 1300
Text Label 8850 1300 0    50   ~ 0
DCDC_OUT
$Comp
L POWDER_Power:TPS7A92 U202
U 1 1 6053CDFE
P 3700 4200
AR Path="/5D562501/6053CDFE" Ref="U202"  Part="1" 
AR Path="/5D587C46/6053CDFE" Ref="U302"  Part="1" 
AR Path="/60664CFF/6053CDFE" Ref="U3703"  Part="1" 
F 0 "U3703" H 4100 4650 50  0000 C CNN
F 1 "TPS7A92" H 3700 4450 50  0000 C CNN
F 2 "POWDER_Power:R-PWSON-N10" H 4450 3150 50  0001 C CNN
F 3 "" H 3700 4200 50  0001 C CNN
F 4 "3000-0000000193" H 3700 4200 50  0001 C CNN "PartSpecification"
	1    3700 4200
	1    0    0    -1  
$EndComp
Wire Wire Line
	3100 4100 2800 4100
Wire Wire Line
	2800 4100 2800 4000
Wire Wire Line
	2800 4000 3100 4000
Connection ~ 2800 4000
Text Label 2150 4000 0    50   ~ 0
DCDC_OUT
$Comp
L power:GND #PWR?
U 1 1 6053CDFF
P 3750 4850
AR Path="/5D562501/6053CDFF" Ref="#PWR?"  Part="1" 
AR Path="/5D587C46/6053CDFF" Ref="#PWR?"  Part="1" 
AR Path="/5D591ABD/6053CDFF" Ref="#PWR?"  Part="1" 
AR Path="/60664CFF/6053CDFF" Ref="#PWR?"  Part="1" 
F 0 "#PWR?" H 3750 4600 50  0001 C CNN
F 1 "GND" H 3755 4677 50  0000 C CNN
F 2 "" H 3750 4850 50  0001 C CNN
F 3 "" H 3750 4850 50  0001 C CNN
	1    3750 4850
	1    0    0    -1  
$EndComp
Wire Wire Line
	3750 4850 3750 4700
$Comp
L power:GND #PWR?
U 1 1 60577FEF
P 3650 4850
AR Path="/5D562501/60577FEF" Ref="#PWR?"  Part="1" 
AR Path="/5D587C46/60577FEF" Ref="#PWR?"  Part="1" 
AR Path="/5D591ABD/60577FEF" Ref="#PWR?"  Part="1" 
AR Path="/60664CFF/60577FEF" Ref="#PWR?"  Part="1" 
F 0 "#PWR?" H 3650 4600 50  0001 C CNN
F 1 "GND" H 3655 4677 50  0000 C CNN
F 2 "" H 3650 4850 50  0001 C CNN
F 3 "" H 3650 4850 50  0001 C CNN
	1    3650 4850
	1    0    0    -1  
$EndComp
Wire Wire Line
	3650 4850 3650 4700
Wire Wire Line
	1000 2500 1000 4300
Wire Wire Line
	1000 4300 3100 4300
Connection ~ 1000 2500
Wire Wire Line
	1000 2500 900  2500
Text HLabel 4600 4400 2    50   Output ~ 0
LDO_PG
$Comp
L 000_PreferredParts:C_1uF C213
U 1 1 60577FF2
P 2300 4600
AR Path="/5D562501/60577FF2" Ref="C213"  Part="1" 
AR Path="/5D587C46/60577FF2" Ref="C313"  Part="1" 
AR Path="/60664CFF/60577FF2" Ref="C3720"  Part="1" 
F 0 "C3720" H 2325 4700 50  0000 L CNN
F 1 "C_1uF" H 2325 4500 50  0000 L CNN
F 2 "Capacitor_SMD:C_0603_1608Metric" H 2338 4450 50  0001 C CNN
F 3 "~" H 2300 4600 50  0001 C CNN
F 4 "3000-0000000136" H 2300 4600 50  0001 C CNN "PartSpecification"
	1    2300 4600
	1    0    0    -1  
$EndComp
Wire Wire Line
	2300 4450 2300 4200
Wire Wire Line
	2300 4200 3100 4200
$Comp
L power:GND #PWR?
U 1 1 6053CE02
P 2300 4900
AR Path="/5D562501/6053CE02" Ref="#PWR?"  Part="1" 
AR Path="/5D587C46/6053CE02" Ref="#PWR?"  Part="1" 
AR Path="/5D591ABD/6053CE02" Ref="#PWR?"  Part="1" 
AR Path="/60664CFF/6053CE02" Ref="#PWR?"  Part="1" 
F 0 "#PWR?" H 2300 4650 50  0001 C CNN
F 1 "GND" H 2305 4727 50  0000 C CNN
F 2 "" H 2300 4900 50  0001 C CNN
F 3 "" H 2300 4900 50  0001 C CNN
	1    2300 4900
	1    0    0    -1  
$EndComp
Wire Wire Line
	2300 4900 2300 4750
$Comp
L power:GND #PWR?
U 1 1 6053CE03
P 2950 4800
AR Path="/5D562501/6053CE03" Ref="#PWR?"  Part="1" 
AR Path="/5D587C46/6053CE03" Ref="#PWR?"  Part="1" 
AR Path="/5D591ABD/6053CE03" Ref="#PWR?"  Part="1" 
AR Path="/60664CFF/6053CE03" Ref="#PWR?"  Part="1" 
F 0 "#PWR?" H 2950 4550 50  0001 C CNN
F 1 "GND" H 2955 4627 50  0000 C CNN
F 2 "" H 2950 4800 50  0001 C CNN
F 3 "" H 2950 4800 50  0001 C CNN
	1    2950 4800
	1    0    0    -1  
$EndComp
Wire Wire Line
	2950 4800 2950 4400
Wire Wire Line
	2950 4400 3100 4400
Text Notes 7000 1200 0    50   ~ 0
This voltage is 4/6V corresponding to the LDO output of 3/5V.
$Comp
L POWDER_Power:CSD13385F5 U203
U 1 1 60577FF5
P 5450 5250
AR Path="/5D562501/60577FF5" Ref="U203"  Part="1" 
AR Path="/5D587C46/60577FF5" Ref="U303"  Part="1" 
AR Path="/60664CFF/60577FF5" Ref="U3704"  Part="1" 
F 0 "U3704" H 5300 5050 50  0000 C CNN
F 1 "CSD13385F5" H 5800 5350 50  0000 C CNN
F 2 "POWDER_Power:CSD13385F5" H 5200 4950 50  0001 C CNN
F 3 "" H 5450 5250 50  0001 C CNN
F 4 "3000-0000000191" H 5450 5250 50  0001 C CNN "PartSpecification"
	1    5450 5250
	1    0    0    -1  
$EndComp
Text Label 4250 2700 0    50   ~ 0
VSEL_1
$Comp
L power:GND #PWR?
U 1 1 5E9E90CC
P 5500 5550
AR Path="/5D562501/5E9E90CC" Ref="#PWR?"  Part="1" 
AR Path="/5D587C46/5E9E90CC" Ref="#PWR?"  Part="1" 
AR Path="/5D591ABD/5E9E90CC" Ref="#PWR?"  Part="1" 
AR Path="/60664CFF/5E9E90CC" Ref="#PWR?"  Part="1" 
F 0 "#PWR?" H 5500 5300 50  0001 C CNN
F 1 "GND" H 5505 5377 50  0000 C CNN
F 2 "" H 5500 5550 50  0001 C CNN
F 3 "" H 5500 5550 50  0001 C CNN
	1    5500 5550
	1    0    0    -1  
$EndComp
Wire Wire Line
	5500 5550 5500 5450
Text Label 4950 5250 0    50   ~ 0
VSEL_1
$Comp
L 000_PreferredParts:C_10uF_0805 C212
U 1 1 60577FF9
P 1500 4550
AR Path="/5D562501/60577FF9" Ref="C212"  Part="1" 
AR Path="/5D587C46/60577FF9" Ref="C312"  Part="1" 
AR Path="/60664CFF/60577FF9" Ref="C3719"  Part="1" 
F 0 "C3719" H 1615 4596 50  0000 L CNN
F 1 "C_10uF_0805" H 1615 4505 50  0000 L CNN
F 2 "Capacitor_SMD:C_0805_2012Metric" H 1538 4400 50  0001 C CNN
F 3 "~" H 1500 4550 50  0001 C CNN
F 4 "Murata Electronics" H 1500 4550 50  0001 C CNN "Manufacturer"
F 5 "GRM21BC8YA106ME11L" H 1500 4550 50  0001 C CNN "PartNumber"
F 6 "3000-0000000134" H 1500 4550 50  0001 C CNN "PartSpecification"
	1    1500 4550
	1    0    0    -1  
$EndComp
Wire Wire Line
	1500 4400 1500 4000
Wire Wire Line
	1500 4000 2800 4000
$Comp
L power:GND #PWR?
U 1 1 60577FFC
P 1500 4900
AR Path="/5D562501/60577FFC" Ref="#PWR?"  Part="1" 
AR Path="/5D587C46/60577FFC" Ref="#PWR?"  Part="1" 
AR Path="/5D591ABD/60577FFC" Ref="#PWR?"  Part="1" 
AR Path="/60664CFF/60577FFC" Ref="#PWR?"  Part="1" 
F 0 "#PWR?" H 1500 4650 50  0001 C CNN
F 1 "GND" H 1505 4727 50  0000 C CNN
F 2 "" H 1500 4900 50  0001 C CNN
F 3 "" H 1500 4900 50  0001 C CNN
	1    1500 4900
	1    0    0    -1  
$EndComp
Wire Wire Line
	1500 4900 1500 4700
Text Notes 5850 5850 0    50   ~ 0
Voltages:\n00 - 3.1  -4.15dB\n01 - 3.7  -2.62dB\n10 - 4.4  -1.11dB\n11 - 5.0  0 dB
Text Notes 6700 2750 0    50   ~ 0
Voltages:\n00 - 4.1\n01 - 4.7\n10 - 5.4\n11 - 6.0
$Comp
L POWDER_Power:CSD13385F5 U204
U 1 1 60577FFD
P 7800 2750
AR Path="/5D562501/60577FFD" Ref="U204"  Part="1" 
AR Path="/5D587C46/60577FFD" Ref="U304"  Part="1" 
AR Path="/60664CFF/60577FFD" Ref="U3702"  Part="1" 
F 0 "U3702" H 7650 2550 50  0000 C CNN
F 1 "CSD13385F5" H 8150 2850 50  0000 C CNN
F 2 "POWDER_Power:CSD13385F5" H 7550 2450 50  0001 C CNN
F 3 "" H 7800 2750 50  0001 C CNN
F 4 "3000-0000000191" H 7800 2750 50  0001 C CNN "PartSpecification"
	1    7800 2750
	1    0    0    -1  
$EndComp
$Comp
L power:GND #PWR?
U 1 1 5EA2F6C9
P 6200 5050
AR Path="/5D562501/5EA2F6C9" Ref="#PWR?"  Part="1" 
AR Path="/5D587C46/5EA2F6C9" Ref="#PWR?"  Part="1" 
AR Path="/5D591ABD/5EA2F6C9" Ref="#PWR?"  Part="1" 
AR Path="/60664CFF/5EA2F6C9" Ref="#PWR?"  Part="1" 
F 0 "#PWR?" H 6200 4800 50  0001 C CNN
F 1 "GND" H 6205 4877 50  0000 C CNN
F 2 "" H 6200 5050 50  0001 C CNN
F 3 "" H 6200 5050 50  0001 C CNN
	1    6200 5050
	1    0    0    -1  
$EndComp
Wire Wire Line
	6200 5050 6200 4950
$Comp
L Device:R R208
U 1 1 5EA43B22
P 6200 4800
AR Path="/5D562501/5EA43B22" Ref="R208"  Part="1" 
AR Path="/5D587C46/5EA43B22" Ref="R308"  Part="1" 
AR Path="/60664CFF/5EA43B22" Ref="R3709"  Part="1" 
F 0 "R3709" V 6280 4800 50  0000 C CNN
F 1 "1.69k" V 6200 4800 50  0000 C CNN
F 2 "Resistor_SMD:R_0402_1005Metric" V 6130 4800 50  0001 C CNN
F 3 "~" H 6200 4800 50  0001 C CNN
F 4 "3000-0000000224" V 6200 4800 50  0001 C CNN "PartSpecification"
	1    6200 4800
	1    0    0    -1  
$EndComp
$Comp
L Device:R R205
U 1 1 60578002
P 5500 4800
AR Path="/5D562501/60578002" Ref="R205"  Part="1" 
AR Path="/5D587C46/60578002" Ref="R305"  Part="1" 
AR Path="/60664CFF/60578002" Ref="R3708"  Part="1" 
F 0 "R3708" V 5580 4800 50  0000 C CNN
F 1 "3.00k" V 5500 4800 50  0000 C CNN
F 2 "Resistor_SMD:R_0402_1005Metric" V 5430 4800 50  0001 C CNN
F 3 "~" H 5500 4800 50  0001 C CNN
F 4 "3000-0000000230" V 5500 4800 50  0001 C CNN "PartSpecification"
	1    5500 4800
	1    0    0    -1  
$EndComp
$Comp
L Device:R R207
U 1 1 60578003
P 6200 4300
AR Path="/5D562501/60578003" Ref="R207"  Part="1" 
AR Path="/5D587C46/60578003" Ref="R307"  Part="1" 
AR Path="/60664CFF/60578003" Ref="R3706"  Part="1" 
F 0 "R3706" V 6280 4300 50  0000 C CNN
F 1 "4.87k" V 6200 4300 50  0000 C CNN
F 2 "Resistor_SMD:R_0402_1005Metric" V 6130 4300 50  0001 C CNN
F 3 "~" H 6200 4300 50  0001 C CNN
F 4 "3000-0000000133" V 6200 4300 50  0001 C CNN "PartSpecification"
	1    6200 4300
	1    0    0    -1  
$EndComp
Wire Wire Line
	4300 4100 4800 4100
Wire Wire Line
	4300 4000 4800 4000
Wire Wire Line
	4800 4000 4800 4100
Wire Wire Line
	4800 4000 6200 4000
Connection ~ 4800 4000
Wire Wire Line
	6200 4000 6200 4150
Wire Wire Line
	6200 4650 6200 4550
Wire Wire Line
	6200 4550 5500 4550
Wire Wire Line
	5500 4550 5500 4650
Connection ~ 6200 4550
Wire Wire Line
	6200 4550 6200 4450
Wire Wire Line
	5500 5050 5500 4950
$Comp
L POWDER_Power:CSD13385F5 U205
U 1 1 5EA608F9
P 6950 5250
AR Path="/5D562501/5EA608F9" Ref="U205"  Part="1" 
AR Path="/5D587C46/5EA608F9" Ref="U305"  Part="1" 
AR Path="/60664CFF/5EA608F9" Ref="U3705"  Part="1" 
F 0 "U3705" H 6800 5050 50  0000 C CNN
F 1 "CSD13385F5" H 7300 5350 50  0000 C CNN
F 2 "POWDER_Power:CSD13385F5" H 6700 4950 50  0001 C CNN
F 3 "" H 6950 5250 50  0001 C CNN
F 4 "3000-0000000191" H 6950 5250 50  0001 C CNN "PartSpecification"
	1    6950 5250
	-1   0    0    -1  
$EndComp
$Comp
L power:GND #PWR?
U 1 1 60578006
P 6900 5550
AR Path="/5D562501/60578006" Ref="#PWR?"  Part="1" 
AR Path="/5D587C46/60578006" Ref="#PWR?"  Part="1" 
AR Path="/5D591ABD/60578006" Ref="#PWR?"  Part="1" 
AR Path="/60664CFF/60578006" Ref="#PWR?"  Part="1" 
F 0 "#PWR?" H 6900 5300 50  0001 C CNN
F 1 "GND" H 6905 5377 50  0000 C CNN
F 2 "" H 6900 5550 50  0001 C CNN
F 3 "" H 6900 5550 50  0001 C CNN
	1    6900 5550
	-1   0    0    -1  
$EndComp
Wire Wire Line
	6900 5550 6900 5450
Text Label 7450 5250 2    50   ~ 0
VSEL_2
$Comp
L Device:R R209
U 1 1 5EA60908
P 6900 4800
AR Path="/5D562501/5EA60908" Ref="R209"  Part="1" 
AR Path="/5D587C46/5EA60908" Ref="R309"  Part="1" 
AR Path="/60664CFF/5EA60908" Ref="R3710"  Part="1" 
F 0 "R3710" V 6980 4800 50  0000 C CNN
F 1 "6.49k" V 6900 4800 50  0000 C CNN
F 2 "Resistor_SMD:R_0402_1005Metric" V 6830 4800 50  0001 C CNN
F 3 "~" H 6900 4800 50  0001 C CNN
F 4 "3000-0000000227" V 6900 4800 50  0001 C CNN "PartSpecification"
	1    6900 4800
	-1   0    0    -1  
$EndComp
Wire Wire Line
	6200 4550 6900 4550
Wire Wire Line
	6900 4550 6900 4650
Wire Wire Line
	6900 5050 6900 4950
$Comp
L power:GND #PWR?
U 1 1 5EA711B9
P 7850 3050
AR Path="/5D562501/5EA711B9" Ref="#PWR?"  Part="1" 
AR Path="/5D587C46/5EA711B9" Ref="#PWR?"  Part="1" 
AR Path="/5D591ABD/5EA711B9" Ref="#PWR?"  Part="1" 
AR Path="/60664CFF/5EA711B9" Ref="#PWR?"  Part="1" 
F 0 "#PWR?" H 7850 2800 50  0001 C CNN
F 1 "GND" H 7855 2877 50  0000 C CNN
F 2 "" H 7850 3050 50  0001 C CNN
F 3 "" H 7850 3050 50  0001 C CNN
	1    7850 3050
	1    0    0    -1  
$EndComp
Wire Wire Line
	7850 3050 7850 2950
$Comp
L Device:R R206
U 1 1 5EA759AD
P 7850 2300
AR Path="/5D562501/5EA759AD" Ref="R206"  Part="1" 
AR Path="/5D587C46/5EA759AD" Ref="R306"  Part="1" 
AR Path="/5D591ABD/5EA759AD" Ref="R?"  Part="1" 
AR Path="/60664CFF/5EA759AD" Ref="R3704"  Part="1" 
F 0 "R3704" H 7920 2346 50  0000 L CNN
F 1 "806k" H 7920 2255 50  0000 L CNN
F 2 "Resistor_SMD:R_0402_1005Metric" V 7780 2300 50  0001 C CNN
F 3 "~" H 7850 2300 50  0001 C CNN
F 4 "" H 7850 2300 50  0001 C CNN "Manufacturer"
F 5 "" H 7850 2300 50  0001 C CNN "PartNumber"
F 6 "3000-0000000236" H 7850 2300 50  0001 C CNN "PartSpecification"
	1    7850 2300
	1    0    0    -1  
$EndComp
Wire Wire Line
	7850 2450 7850 2550
Wire Wire Line
	7850 2150 7850 1700
Wire Wire Line
	7850 1700 7600 1700
Wire Wire Line
	7600 2750 7400 2750
Text HLabel 900  2800 0    50   Input ~ 0
VSEL_2
Wire Wire Line
	900  2800 1350 2800
Text Label 1150 2800 0    50   ~ 0
VSEL_2
Wire Wire Line
	900  2700 4950 2700
Wire Wire Line
	4950 2000 5300 2000
$Comp
L POWDER_Power:TPS63070RNM U201
U 1 1 60577FCA
P 5900 1600
AR Path="/5D562501/60577FCA" Ref="U201"  Part="1" 
AR Path="/5D587C46/60577FCA" Ref="U301"  Part="1" 
AR Path="/5D591ABD/60577FCA" Ref="U?"  Part="1" 
AR Path="/60664CFF/60577FCA" Ref="U3701"  Part="1" 
F 0 "U3701" H 6250 2200 60  0000 C CNN
F 1 "TPS63070RNM" H 5900 1800 60  0000 C CNN
F 2 "POWDER_Power:TPS63070RNMR" H 5900 1540 60  0001 C CNN
F 3 "" H 5900 1600 60  0000 C CNN
F 4 "Texas Instruments" H 5900 1600 50  0001 C CNN "Manufacturer"
F 5 "TPS63070RNMR" H 5900 1600 50  0001 C CNN "PartNumber"
F 6 "3000-0000000079" H 5900 1600 50  0001 C CNN "PartSpecification"
	1    5900 1600
	1    0    0    -1  
$EndComp
Wire Wire Line
	2150 1300 5100 1300
Wire Wire Line
	1000 2500 4100 2500
Wire Wire Line
	4100 1800 4100 2500
Wire Wire Line
	900  2600 4550 2600
Wire Wire Line
	4300 4250 5500 4250
Wire Wire Line
	5500 4250 5500 4550
Connection ~ 5500 4550
Text Label 7500 2750 2    50   ~ 0
VSEL_2
$Comp
L Device:C C314
U 1 1 6057800A
P 6900 4250
AR Path="/5D587C46/6057800A" Ref="C314"  Part="1" 
AR Path="/5D562501/6057800A" Ref="C214"  Part="1" 
AR Path="/60664CFF/6057800A" Ref="C3712"  Part="1" 
F 0 "C3712" H 6925 4350 50  0000 L CNN
F 1 "10nF" H 6925 4150 50  0000 L CNN
F 2 "Capacitor_SMD:C_0402_1005Metric" H 6938 4100 50  0001 C CNN
F 3 "~" H 6900 4250 50  0001 C CNN
F 4 "3000-0000000203" H 6900 4250 50  0001 C CNN "PartSpecification"
	1    6900 4250
	1    0    0    -1  
$EndComp
Wire Wire Line
	6900 4100 6900 4000
Connection ~ 6200 4000
Wire Wire Line
	6900 4400 6900 4550
Connection ~ 6900 4550
$Comp
L 000_PreferredParts:C_10uF_0603 C316
U 1 1 6057800D
P 9500 4250
AR Path="/5D587C46/6057800D" Ref="C316"  Part="1" 
AR Path="/5D562501/6057800D" Ref="C216"  Part="1" 
AR Path="/60664CFF/6057800D" Ref="C3716"  Part="1" 
F 0 "C3716" H 9525 4350 50  0000 L CNN
F 1 "C_10uF_0603" H 9525 4150 50  0001 L CNN
F 2 "Capacitor_SMD:C_0603_1608Metric" H 9538 4100 50  0001 C CNN
F 3 "~" H 9500 4250 50  0001 C CNN
F 4 "10uF" H 9650 4150 50  0000 C CNN "DisplayValue"
F 5 "0603" H 9650 4050 50  0000 C CNN "DisplayFootprint"
F 6 "3000-0000000135" H 0   -450 50  0001 C CNN "PartSpecification"
	1    9500 4250
	1    0    0    -1  
$EndComp
Wire Wire Line
	9500 4100 9500 4000
Wire Wire Line
	9500 4000 9000 4000
Connection ~ 6900 4000
$Comp
L power:GND #PWR?
U 1 1 6053CE0D
P 9500 4550
AR Path="/5D562501/6053CE0D" Ref="#PWR?"  Part="1" 
AR Path="/5D587C46/6053CE0D" Ref="#PWR?"  Part="1" 
AR Path="/5D591ABD/6053CE0D" Ref="#PWR?"  Part="1" 
AR Path="/60664CFF/6053CE0D" Ref="#PWR?"  Part="1" 
F 0 "#PWR?" H 9500 4300 50  0001 C CNN
F 1 "GND" H 9505 4377 50  0000 C CNN
F 2 "" H 9500 4550 50  0001 C CNN
F 3 "" H 9500 4550 50  0001 C CNN
	1    9500 4550
	-1   0    0    -1  
$EndComp
Wire Wire Line
	9500 4550 9500 4400
$Comp
L 000_PreferredParts:C_10uF_0603 C318
U 1 1 6053CE0E
P 10000 4250
AR Path="/5D587C46/6053CE0E" Ref="C318"  Part="1" 
AR Path="/5D562501/6053CE0E" Ref="C218"  Part="1" 
AR Path="/60664CFF/6053CE0E" Ref="C3717"  Part="1" 
F 0 "C3717" H 10025 4350 50  0000 L CNN
F 1 "C_10uF_0603" H 10025 4150 50  0001 L CNN
F 2 "Capacitor_SMD:C_0603_1608Metric" H 10038 4100 50  0001 C CNN
F 3 "~" H 10000 4250 50  0001 C CNN
F 4 "10uF" H 10150 4150 50  0000 C CNN "DisplayValue"
F 5 "0603" H 10150 4050 50  0000 C CNN "DisplayFootprint"
F 6 "3000-0000000135" H 0   -450 50  0001 C CNN "PartSpecification"
	1    10000 4250
	1    0    0    -1  
$EndComp
Wire Wire Line
	10000 4100 10000 4000
Wire Wire Line
	10000 4000 9500 4000
$Comp
L power:GND #PWR?
U 1 1 6053CE0F
P 10000 4550
AR Path="/5D562501/6053CE0F" Ref="#PWR?"  Part="1" 
AR Path="/5D587C46/6053CE0F" Ref="#PWR?"  Part="1" 
AR Path="/5D591ABD/6053CE0F" Ref="#PWR?"  Part="1" 
AR Path="/60664CFF/6053CE0F" Ref="#PWR?"  Part="1" 
F 0 "#PWR?" H 10000 4300 50  0001 C CNN
F 1 "GND" H 10005 4377 50  0000 C CNN
F 2 "" H 10000 4550 50  0001 C CNN
F 3 "" H 10000 4550 50  0001 C CNN
	1    10000 4550
	-1   0    0    -1  
$EndComp
Wire Wire Line
	10000 4550 10000 4400
Connection ~ 9500 4000
$Comp
L 000_PreferredParts:C_10uF_0603 C320
U 1 1 6053CE10
P 10500 4250
AR Path="/5D587C46/6053CE10" Ref="C320"  Part="1" 
AR Path="/5D562501/6053CE10" Ref="C220"  Part="1" 
AR Path="/60664CFF/6053CE10" Ref="C3718"  Part="1" 
F 0 "C3718" H 10525 4350 50  0000 L CNN
F 1 "C_10uF_0603" H 10525 4150 50  0001 L CNN
F 2 "Capacitor_SMD:C_0603_1608Metric" H 10538 4100 50  0001 C CNN
F 3 "~" H 10500 4250 50  0001 C CNN
F 4 "10uF" H 10650 4150 50  0000 C CNN "DisplayValue"
F 5 "0603" H 10650 4050 50  0000 C CNN "DisplayFootprint"
F 6 "3000-0000000135" H 0   -450 50  0001 C CNN "PartSpecification"
	1    10500 4250
	1    0    0    -1  
$EndComp
Wire Wire Line
	10500 4100 10500 4000
Wire Wire Line
	10500 4000 10000 4000
$Comp
L power:GND #PWR?
U 1 1 6053CE11
P 10500 4550
AR Path="/5D562501/6053CE11" Ref="#PWR?"  Part="1" 
AR Path="/5D587C46/6053CE11" Ref="#PWR?"  Part="1" 
AR Path="/5D591ABD/6053CE11" Ref="#PWR?"  Part="1" 
AR Path="/60664CFF/6053CE11" Ref="#PWR?"  Part="1" 
F 0 "#PWR?" H 10500 4300 50  0001 C CNN
F 1 "GND" H 10505 4377 50  0000 C CNN
F 2 "" H 10500 4550 50  0001 C CNN
F 3 "" H 10500 4550 50  0001 C CNN
	1    10500 4550
	-1   0    0    -1  
$EndComp
Wire Wire Line
	10500 4550 10500 4400
Connection ~ 10000 4000
$Comp
L 000_PreferredParts:C_10uF_0603 C315
U 1 1 5EB6B167
P 7250 4250
AR Path="/5D587C46/5EB6B167" Ref="C315"  Part="1" 
AR Path="/5D562501/5EB6B167" Ref="C215"  Part="1" 
AR Path="/60664CFF/5EB6B167" Ref="C3713"  Part="1" 
F 0 "C3713" H 7275 4350 50  0000 L CNN
F 1 "C_10uF_0603" H 7275 4150 50  0001 L CNN
F 2 "Capacitor_SMD:C_0603_1608Metric" H 7288 4100 50  0001 C CNN
F 3 "~" H 7250 4250 50  0001 C CNN
F 4 "10uF" H 7400 4150 50  0000 C CNN "DisplayValue"
F 5 "0603" H 7400 4050 50  0000 C CNN "DisplayFootprint"
F 6 "3000-0000000135" H -2250 550 50  0001 C CNN "PartSpecification"
	1    7250 4250
	1    0    0    -1  
$EndComp
Wire Wire Line
	7250 4100 7250 4000
Wire Wire Line
	7250 4000 6900 4000
$Comp
L power:GND #PWR?
U 1 1 6053CE13
P 7250 4550
AR Path="/5D562501/6053CE13" Ref="#PWR?"  Part="1" 
AR Path="/5D587C46/6053CE13" Ref="#PWR?"  Part="1" 
AR Path="/5D591ABD/6053CE13" Ref="#PWR?"  Part="1" 
AR Path="/60664CFF/6053CE13" Ref="#PWR?"  Part="1" 
F 0 "#PWR?" H 7250 4300 50  0001 C CNN
F 1 "GND" H 7255 4377 50  0000 C CNN
F 2 "" H 7250 4550 50  0001 C CNN
F 3 "" H 7250 4550 50  0001 C CNN
	1    7250 4550
	-1   0    0    -1  
$EndComp
Wire Wire Line
	7250 4550 7250 4400
$Comp
L 000_PreferredParts:C_10uF_0603 C317
U 1 1 6053CE14
P 7750 4250
AR Path="/5D587C46/6053CE14" Ref="C317"  Part="1" 
AR Path="/5D562501/6053CE14" Ref="C217"  Part="1" 
AR Path="/60664CFF/6053CE14" Ref="C3714"  Part="1" 
F 0 "C3714" H 7775 4350 50  0000 L CNN
F 1 "C_10uF_0603" H 7775 4150 50  0001 L CNN
F 2 "Capacitor_SMD:C_0603_1608Metric" H 7788 4100 50  0001 C CNN
F 3 "~" H 7750 4250 50  0001 C CNN
F 4 "10uF" H 7900 4150 50  0000 C CNN "DisplayValue"
F 5 "0603" H 7900 4050 50  0000 C CNN "DisplayFootprint"
F 6 "3000-0000000135" H -2250 550 50  0001 C CNN "PartSpecification"
	1    7750 4250
	1    0    0    -1  
$EndComp
Wire Wire Line
	7750 4100 7750 4000
Wire Wire Line
	7750 4000 7250 4000
$Comp
L power:GND #PWR?
U 1 1 6053CE15
P 7750 4550
AR Path="/5D562501/6053CE15" Ref="#PWR?"  Part="1" 
AR Path="/5D587C46/6053CE15" Ref="#PWR?"  Part="1" 
AR Path="/5D591ABD/6053CE15" Ref="#PWR?"  Part="1" 
AR Path="/60664CFF/6053CE15" Ref="#PWR?"  Part="1" 
F 0 "#PWR?" H 7750 4300 50  0001 C CNN
F 1 "GND" H 7755 4377 50  0000 C CNN
F 2 "" H 7750 4550 50  0001 C CNN
F 3 "" H 7750 4550 50  0001 C CNN
	1    7750 4550
	-1   0    0    -1  
$EndComp
Wire Wire Line
	7750 4550 7750 4400
Connection ~ 7250 4000
$Comp
L 000_PreferredParts:C_10uF_0603 C319
U 1 1 6053CE16
P 9000 4250
AR Path="/5D587C46/6053CE16" Ref="C319"  Part="1" 
AR Path="/5D562501/6053CE16" Ref="C219"  Part="1" 
AR Path="/60664CFF/6053CE16" Ref="C3715"  Part="1" 
F 0 "C3715" H 9025 4350 50  0000 L CNN
F 1 "C_10uF_0603" H 9025 4150 50  0001 L CNN
F 2 "Capacitor_SMD:C_0603_1608Metric" H 9038 4100 50  0001 C CNN
F 3 "~" H 9000 4250 50  0001 C CNN
F 4 "10uF" H 9150 4150 50  0000 C CNN "DisplayValue"
F 5 "0603" H 9150 4050 50  0000 C CNN "DisplayFootprint"
F 6 "3000-0000000135" H -1500 550 50  0001 C CNN "PartSpecification"
	1    9000 4250
	1    0    0    -1  
$EndComp
Wire Wire Line
	9000 4100 9000 4000
$Comp
L power:GND #PWR?
U 1 1 6053CE17
P 9000 4550
AR Path="/5D562501/6053CE17" Ref="#PWR?"  Part="1" 
AR Path="/5D587C46/6053CE17" Ref="#PWR?"  Part="1" 
AR Path="/5D591ABD/6053CE17" Ref="#PWR?"  Part="1" 
AR Path="/60664CFF/6053CE17" Ref="#PWR?"  Part="1" 
F 0 "#PWR?" H 9000 4300 50  0001 C CNN
F 1 "GND" H 9005 4377 50  0000 C CNN
F 2 "" H 9000 4550 50  0001 C CNN
F 3 "" H 9000 4550 50  0001 C CNN
	1    9000 4550
	-1   0    0    -1  
$EndComp
Wire Wire Line
	9000 4550 9000 4400
Wire Wire Line
	10900 4000 10800 4000
Connection ~ 10500 4000
Text Label 6600 4550 0    50   ~ 0
LDO_FB
Text Label 2650 4200 0    50   ~ 0
NR_SS
Text Label 5500 5000 0    50   ~ 0
LDO_FB_PD_1
Text Label 6900 5000 0    50   ~ 0
LDO_FB_PD_2
Text Label 7850 2500 0    50   ~ 0
DCDC_FB_PD_2
Wire Wire Line
	8400 2050 8400 3500
Wire Wire Line
	8400 3500 2800 3500
Wire Wire Line
	2800 3500 2800 4000
Connection ~ 8400 2050
$Comp
L Device:R R?
U 1 1 606A08C7
P 8500 4000
AR Path="/606A08C7" Ref="R?"  Part="1" 
AR Path="/5E073A72/606A08C7" Ref="R?"  Part="1" 
AR Path="/60664CFF/606A08C7" Ref="R3705"  Part="1" 
F 0 "R3705" H 8430 3954 50  0000 R CNN
F 1 "51m" H 8430 4045 50  0000 R CNN
F 2 "POWDER_Power:R_0508_1220Metric" V 8430 4000 50  0001 C CNN
F 3 "~" H 8500 4000 50  0001 C CNN
F 4 "" H 8500 4000 50  0001 C CNN "Manufacturer"
F 5 "" H 8500 4000 50  0001 C CNN "PartNumber"
F 6 "3000-0000000587" H 8500 4000 50  0001 C CNN "PartSpecification"
	1    8500 4000
	0    -1   -1   0   
$EndComp
$Comp
L Connector:TestPoint TP?
U 1 1 606A08CD
P 7750 3850
AR Path="/606A08CD" Ref="TP?"  Part="1" 
AR Path="/5E073A72/606A08CD" Ref="TP?"  Part="1" 
AR Path="/60664CFF/606A08CD" Ref="TP3701"  Part="1" 
F 0 "TP3701" H 7808 3968 50  0000 L CNN
F 1 "TestPoint" H 7808 3877 50  0000 L CNN
F 2 "TestPoint:TestPoint_Pad_D1.0mm" H 7950 3850 50  0001 C CNN
F 3 "~" H 7950 3850 50  0001 C CNN
	1    7750 3850
	1    0    0    -1  
$EndComp
$Comp
L POWDER_Power:INA180-Q1 U?
U 1 1 606A08D8
P 8000 5950
AR Path="/606A08D8" Ref="U?"  Part="1" 
AR Path="/60664CFF/606A08D8" Ref="U3706"  Part="1" 
F 0 "U3706" H 8150 6250 50  0000 L CNN
F 1 "INA180-Q1" H 8150 5700 50  0000 L CNN
F 2 "Package_TO_SOT_SMD:SOT-23-5" H 8150 6600 100 0001 C CNN
F 3 "" H 8250 6300 100 0001 C CNN
F 4 "3000-0000000197" H 8000 5950 50  0001 C CNN "PartSpecification"
	1    8000 5950
	-1   0    0    -1  
$EndComp
$Comp
L power:GND #PWR?
U 1 1 606A08DE
P 8000 6350
AR Path="/606A08DE" Ref="#PWR?"  Part="1" 
AR Path="/60664CFF/606A08DE" Ref="#PWR?"  Part="1" 
F 0 "#PWR?" H 8000 6100 50  0001 C CNN
F 1 "GND" H 8005 6177 50  0000 C CNN
F 2 "" H 8000 6350 50  0001 C CNN
F 3 "" H 8000 6350 50  0001 C CNN
	1    8000 6350
	1    0    0    -1  
$EndComp
Wire Wire Line
	8000 6350 8000 6250
Wire Wire Line
	7550 5950 7300 5950
$Comp
L 000_PreferredParts:C_100nF C?
U 1 1 606A08F0
P 8750 5950
AR Path="/5D949534/606A08F0" Ref="C?"  Part="1" 
AR Path="/606A08F0" Ref="C?"  Part="1" 
AR Path="/60664CFF/606A08F0" Ref="C3722"  Part="1" 
F 0 "C3722" H 8775 6050 50  0000 L CNN
F 1 "C_100nF" H 8775 5850 50  0001 L CNN
F 2 "Capacitor_SMD:C_0402_1005Metric" H 8788 5800 50  0001 C CNN
F 3 "~" H 8750 5950 50  0001 C CNN
F 4 "100nF" H 8900 5850 50  0000 C CNN "DisplayValue"
F 5 "3000-0000000125" H 4450 3250 50  0001 C CNN "PartSpecification"
	1    8750 5950
	-1   0    0    1   
$EndComp
$Comp
L Device:R R?
U 1 1 606A08F9
P 9000 6100
AR Path="/5D69D382/606A08F9" Ref="R?"  Part="1" 
AR Path="/606A08F9" Ref="R?"  Part="1" 
AR Path="/5D949534/606A08F9" Ref="R?"  Part="1" 
AR Path="/60664CFF/606A08F9" Ref="R3714"  Part="1" 
F 0 "R3714" H 9070 6146 50  0000 L CNN
F 1 "100" H 9070 6055 50  0000 L CNN
F 2 "Resistor_SMD:R_0402_1005Metric" V 8930 6100 50  0001 C CNN
F 3 "~" H 9000 6100 50  0001 C CNN
F 4 "" H 9000 6100 50  0001 C CNN "Manufacturer"
F 5 "" H 9000 6100 50  0001 C CNN "PartNumber"
F 6 "3000-0000000149" H 9000 6100 50  0001 C CNN "PartSpecification"
	1    9000 6100
	0    1    1    0   
$EndComp
$Comp
L Device:R R?
U 1 1 606A0904
P 9000 5800
AR Path="/5D69D382/606A0904" Ref="R?"  Part="1" 
AR Path="/606A0904" Ref="R?"  Part="1" 
AR Path="/5D949534/606A0904" Ref="R?"  Part="1" 
AR Path="/60664CFF/606A0904" Ref="R3713"  Part="1" 
F 0 "R3713" H 9070 5846 50  0000 L CNN
F 1 "100" H 9070 5755 50  0000 L CNN
F 2 "Resistor_SMD:R_0402_1005Metric" V 8930 5800 50  0001 C CNN
F 3 "~" H 9000 5800 50  0001 C CNN
F 4 "" H 9000 5800 50  0001 C CNN "Manufacturer"
F 5 "" H 9000 5800 50  0001 C CNN "PartNumber"
F 6 "3000-0000000149" H 9000 5800 50  0001 C CNN "PartSpecification"
	1    9000 5800
	0    1    1    0   
$EndComp
Wire Wire Line
	8750 5800 8550 5800
Wire Wire Line
	8750 6100 8500 6100
Wire Wire Line
	8850 6100 8750 6100
Connection ~ 8750 6100
Wire Wire Line
	8850 5800 8750 5800
Connection ~ 8750 5800
Text Label 8550 5800 0    50   ~ 0
LNA_M_F
Text Label 8500 6050 3    50   ~ 0
LNA_P_F
$Comp
L 000_PreferredParts:C_0_1uF C?
U 1 1 606A0923
P 8250 5250
AR Path="/606A0923" Ref="C?"  Part="1" 
AR Path="/60664CFF/606A0923" Ref="C3721"  Part="1" 
F 0 "C3721" H 8275 5350 50  0000 L CNN
F 1 "C_0_1uF" H 8275 5150 50  0001 L CNN
F 2 "Capacitor_SMD:C_0402_1005Metric" H 8288 5100 50  0001 C CNN
F 3 "~" H 8250 5250 50  0001 C CNN
F 4 "0.1uF" H 8400 5150 50  0000 C CNN "DisplayValue"
F 5 "3000-0000000125" H 8250 5250 50  0001 C CNN "PartSpecification"
	1    8250 5250
	1    0    0    -1  
$EndComp
$Comp
L power:GND #PWR?
U 1 1 606A0929
P 8250 5450
AR Path="/606A0929" Ref="#PWR?"  Part="1" 
AR Path="/60664CFF/606A0929" Ref="#PWR?"  Part="1" 
F 0 "#PWR?" H 8250 5200 50  0001 C CNN
F 1 "GND" H 8255 5277 50  0000 C CNN
F 2 "" H 8250 5450 50  0001 C CNN
F 3 "" H 8250 5450 50  0001 C CNN
	1    8250 5450
	1    0    0    -1  
$EndComp
Wire Wire Line
	6200 4000 6900 4000
Wire Wire Line
	5250 5250 4950 5250
Wire Wire Line
	7150 5250 7450 5250
Wire Wire Line
	7750 3850 7750 4000
Connection ~ 7750 4000
Wire Wire Line
	8000 5050 8000 5600
Wire Wire Line
	8250 5450 8250 5400
Wire Wire Line
	8250 5100 8250 5050
Wire Wire Line
	8250 5050 8000 5050
Wire Wire Line
	8000 5000 8000 5050
Connection ~ 8000 5050
Wire Wire Line
	8350 4000 8250 4000
Connection ~ 9000 4000
Wire Wire Line
	8650 4000 8750 4000
Wire Wire Line
	8750 4000 8750 5250
Wire Wire Line
	8750 5250 9300 5250
Wire Wire Line
	9300 5250 9300 6100
Wire Wire Line
	9300 6100 9150 6100
Connection ~ 8750 4000
Wire Wire Line
	8750 4000 9000 4000
Wire Wire Line
	8250 4000 8250 4500
Wire Wire Line
	8250 4500 8650 4500
Wire Wire Line
	8650 4500 8650 5350
Wire Wire Line
	8650 5350 9200 5350
Wire Wire Line
	9200 5350 9200 5800
Wire Wire Line
	9200 5800 9150 5800
Connection ~ 8250 4000
Wire Wire Line
	8250 4000 7750 4000
Text HLabel 10900 4000 2    50   Output ~ 0
V_OUT
Text HLabel 7300 5950 0    50   Output ~ 0
I_MEAS
Text Label 6300 4000 0    50   ~ 0
VDD_LNA_REG
$Comp
L POWDER_PowerGlobals:+2V5_A #PWR?
U 1 1 60555E8B
P 8000 5000
AR Path="/5D949534/60555E8B" Ref="#PWR?"  Part="1" 
AR Path="/60664CFF/60555E8B" Ref="#PWR?"  Part="1" 
F 0 "#PWR?" H 8000 4850 50  0001 C CNN
F 1 "+2V5_A" H 8015 5173 50  0000 C CNN
F 2 "" H 8000 5000 50  0001 C CNN
F 3 "" H 8000 5000 50  0001 C CNN
	1    8000 5000
	1    0    0    -1  
$EndComp
$Comp
L Device:R R3711
U 1 1 60708593
P 10800 4800
F 0 "R3711" V 10880 4800 50  0000 C CNN
F 1 "10k" V 10800 4800 50  0000 C CNN
F 2 "Resistor_SMD:R_0402_1005Metric" V 10730 4800 50  0001 C CNN
F 3 "~" H 10800 4800 50  0001 C CNN
F 4 "3000-0000000131" V 10800 4800 50  0001 C CNN "PartSpecification"
	1    10800 4800
	-1   0    0    -1  
$EndComp
$Comp
L Device:R R3712
U 1 1 6070859A
P 10800 5200
F 0 "R3712" V 10880 5200 50  0000 C CNN
F 1 "4.87k" V 10800 5200 50  0000 C CNN
F 2 "Resistor_SMD:R_0402_1005Metric" V 10730 5200 50  0001 C CNN
F 3 "~" H 10800 5200 50  0001 C CNN
F 4 "3000-0000000133" V 10800 5200 50  0001 C CNN "PartSpecification"
	1    10800 5200
	-1   0    0    -1  
$EndComp
$Comp
L power:GND #PWR?
U 1 1 607085A0
P 10800 5450
F 0 "#PWR?" H 10800 5200 50  0001 C CNN
F 1 "GND" H 10805 5277 50  0000 C CNN
F 2 "" H 10800 5450 50  0001 C CNN
F 3 "" H 10800 5450 50  0001 C CNN
	1    10800 5450
	-1   0    0    -1  
$EndComp
Wire Wire Line
	10800 5350 10800 5450
Wire Wire Line
	10800 5050 10800 5000
Wire Wire Line
	10800 5000 10500 5000
Connection ~ 10800 5000
Wire Wire Line
	10800 5000 10800 4950
Connection ~ 10800 4000
Wire Wire Line
	10800 4000 10500 4000
Wire Wire Line
	10800 4000 10800 4650
Text HLabel 10500 5000 0    50   Output ~ 0
VSENSE_OUT
Wire Wire Line
	4300 4400 4600 4400
Wire Wire Line
	8500 5900 8450 5900
Wire Wire Line
	8500 5900 8500 6100
Wire Wire Line
	8550 6000 8450 6000
Wire Wire Line
	8550 5800 8550 6000
$Comp
L Device:R R?
U 1 1 60A0D69C
P 1000 4750
AR Path="/605746B5/5F853053/60A0D69C" Ref="R?"  Part="1" 
AR Path="/605746B5/61256AAD/60A0D69C" Ref="R?"  Part="1" 
AR Path="/60664CFF/60A0D69C" Ref="R3801"  Part="1" 
F 0 "R3801" V 1080 4750 50  0000 C CNN
F 1 "10k" V 1000 4750 50  0000 C CNN
F 2 "Resistor_SMD:R_0402_1005Metric" V 930 4750 50  0001 C CNN
F 3 "~" H 1000 4750 50  0001 C CNN
F 4 "3000-0000000131" H 1000 4750 50  0001 C CNN "PartSpecification"
	1    1000 4750
	1    0    0    -1  
$EndComp
$Comp
L power:GND #PWR?
U 1 1 60A0D6A2
P 1000 5000
AR Path="/605746B5/5F853053/60A0D6A2" Ref="#PWR?"  Part="1" 
AR Path="/60664CFF/60A0D6A2" Ref="#PWR?"  Part="1" 
F 0 "#PWR?" H 1000 4750 50  0001 C CNN
F 1 "GND" H 1000 4850 50  0000 C CNN
F 2 "" H 1000 5000 50  0001 C CNN
F 3 "" H 1000 5000 50  0001 C CNN
	1    1000 5000
	1    0    0    -1  
$EndComp
Wire Wire Line
	1000 5000 1000 4900
Wire Wire Line
	1000 4600 1000 4300
Connection ~ 1000 4300
$EndSCHEMATC
