(kicad_sch (version 20211123) (generator eeschema)

  (uuid 451985fb-27af-4988-a96b-5b9018357ef6)

  (paper "A4")

  (lib_symbols
    (symbol "Mechanical:Fiducial" (in_bom yes) (on_board yes)
      (property "Reference" "FID" (id 0) (at 0 5.08 0)
        (effects (font (size 1.27 1.27)))
      )
      (property "Value" "Fiducial" (id 1) (at 0 3.175 0)
        (effects (font (size 1.27 1.27)))
      )
      (property "Footprint" "" (id 2) (at 0 0 0)
        (effects (font (size 1.27 1.27)) hide)
      )
      (property "Datasheet" "~" (id 3) (at 0 0 0)
        (effects (font (size 1.27 1.27)) hide)
      )
      (property "ki_keywords" "fiducial marker" (id 4) (at 0 0 0)
        (effects (font (size 1.27 1.27)) hide)
      )
      (property "ki_description" "Fiducial Marker" (id 5) (at 0 0 0)
        (effects (font (size 1.27 1.27)) hide)
      )
      (property "ki_fp_filters" "Fiducial*" (id 6) (at 0 0 0)
        (effects (font (size 1.27 1.27)) hide)
      )
      (symbol "Fiducial_0_1"
        (circle (center 0 0) (radius 1.27)
          (stroke (width 0.508) (type default) (color 0 0 0 0))
          (fill (type background))
        )
      )
    )
    (symbol "POWDER_Misc:POWDER_Logo_fancy" (pin_names (offset 1.016)) (in_bom yes) (on_board yes)
      (property "Reference" "G" (id 0) (at 0 0 0)
        (effects (font (size 1.27 1.27)))
      )
      (property "Value" "POWDER_Logo_fancy" (id 1) (at 0 0 0)
        (effects (font (size 1.27 1.27)))
      )
      (property "Footprint" "POWDER_Specific:powder_logo_fancy" (id 2) (at 0 0 0)
        (effects (font (size 1.27 1.27)) hide)
      )
      (property "Datasheet" "" (id 3) (at 0 0 0)
        (effects (font (size 1.27 1.27)) hide)
      )
    )
  )


  (symbol (lib_id "Mechanical:Fiducial") (at 76.2 76.2 0) (unit 1)
    (in_bom yes) (on_board yes) (fields_autoplaced)
    (uuid 3c8d11cd-a0dc-49b8-a4ca-fd1eace7d58c)
    (property "Reference" "FID803" (id 0) (at 78.74 74.9299 0)
      (effects (font (size 1.27 1.27)) (justify left))
    )
    (property "Value" "Fiducial" (id 1) (at 78.74 77.4699 0)
      (effects (font (size 1.27 1.27)) (justify left))
    )
    (property "Footprint" "Fiducial:Fiducial_1mm_Mask2mm" (id 2) (at 76.2 76.2 0)
      (effects (font (size 1.27 1.27)) hide)
    )
    (property "Datasheet" "~" (id 3) (at 76.2 76.2 0)
      (effects (font (size 1.27 1.27)) hide)
    )
  )

  (symbol (lib_id "Mechanical:Fiducial") (at 50.8 76.2 0) (unit 1)
    (in_bom yes) (on_board yes) (fields_autoplaced)
    (uuid 63709db4-dd0d-4c15-beec-29c1e1cfd1e2)
    (property "Reference" "FID801" (id 0) (at 53.34 74.9299 0)
      (effects (font (size 1.27 1.27)) (justify left))
    )
    (property "Value" "Fiducial" (id 1) (at 53.34 77.4699 0)
      (effects (font (size 1.27 1.27)) (justify left))
    )
    (property "Footprint" "Fiducial:Fiducial_1mm_Mask2mm" (id 2) (at 50.8 76.2 0)
      (effects (font (size 1.27 1.27)) hide)
    )
    (property "Datasheet" "~" (id 3) (at 50.8 76.2 0)
      (effects (font (size 1.27 1.27)) hide)
    )
  )

  (symbol (lib_id "POWDER_Misc:POWDER_Logo_fancy") (at 50.8 50.8 0) (unit 1)
    (in_bom yes) (on_board yes) (fields_autoplaced)
    (uuid 9945077e-43b1-485b-b928-a29ba4917da1)
    (property "Reference" "G801" (id 0) (at 52.07 49.5299 0)
      (effects (font (size 1.27 1.27)) (justify left))
    )
    (property "Value" "POWDER_Logo_fancy" (id 1) (at 52.07 52.0699 0)
      (effects (font (size 1.27 1.27)) (justify left))
    )
    (property "Footprint" "POWDER_Specific:powder_logo_fancy" (id 2) (at 50.8 50.8 0)
      (effects (font (size 1.27 1.27)) hide)
    )
    (property "Datasheet" "" (id 3) (at 50.8 50.8 0)
      (effects (font (size 1.27 1.27)) hide)
    )
  )

  (symbol (lib_id "Mechanical:Fiducial") (at 50.8 88.9 0) (unit 1)
    (in_bom yes) (on_board yes) (fields_autoplaced)
    (uuid c94dccb6-97c1-47ce-be4c-1407a440c6d4)
    (property "Reference" "FID802" (id 0) (at 53.34 87.6299 0)
      (effects (font (size 1.27 1.27)) (justify left))
    )
    (property "Value" "Fiducial" (id 1) (at 53.34 90.1699 0)
      (effects (font (size 1.27 1.27)) (justify left))
    )
    (property "Footprint" "Fiducial:Fiducial_1mm_Mask2mm" (id 2) (at 50.8 88.9 0)
      (effects (font (size 1.27 1.27)) hide)
    )
    (property "Datasheet" "~" (id 3) (at 50.8 88.9 0)
      (effects (font (size 1.27 1.27)) hide)
    )
  )

  (symbol (lib_id "Mechanical:Fiducial") (at 76.2 88.9 0) (unit 1)
    (in_bom yes) (on_board yes) (fields_autoplaced)
    (uuid f284e88a-aad4-4098-9996-b2e93948ffd7)
    (property "Reference" "FID804" (id 0) (at 78.74 87.6299 0)
      (effects (font (size 1.27 1.27)) (justify left))
    )
    (property "Value" "Fiducial" (id 1) (at 78.74 90.1699 0)
      (effects (font (size 1.27 1.27)) (justify left))
    )
    (property "Footprint" "Fiducial:Fiducial_1mm_Mask2mm" (id 2) (at 76.2 88.9 0)
      (effects (font (size 1.27 1.27)) hide)
    )
    (property "Datasheet" "~" (id 3) (at 76.2 88.9 0)
      (effects (font (size 1.27 1.27)) hide)
    )
  )
)
