(kicad_sch (version 20211123) (generator eeschema)

  (uuid d107656e-2e89-45db-81f2-1f719a2c13d3)

  (paper "A4")

  (lib_symbols
    (symbol "000_PreferredParts:C_10nF" (pin_numbers hide) (pin_names (offset 0.254)) (in_bom yes) (on_board yes)
      (property "Reference" "C" (id 0) (at 0.635 2.54 0)
        (effects (font (size 1.27 1.27)) (justify left))
      )
      (property "Value" "C_10nF" (id 1) (at 0.635 -2.54 0)
        (effects (font (size 1.27 1.27)) (justify left) hide)
      )
      (property "Footprint" "Capacitor_SMD:C_0402_1005Metric" (id 2) (at 0.9652 -3.81 0)
        (effects (font (size 1.27 1.27)) hide)
      )
      (property "Datasheet" "~" (id 3) (at 0 0 0)
        (effects (font (size 1.27 1.27)) hide)
      )
      (property "DisplayValue" "10nF" (id 4) (at 3.81 -2.54 0)
        (effects (font (size 1.27 1.27)))
      )
      (property "PartSpecification" "3000-0000000203" (id 5) (at 0 0 0)
        (effects (font (size 1.27 1.27)) hide)
      )
      (property "Voltage" "50V" (id 6) (at 0 0 0)
        (effects (font (size 1.27 1.27)) hide)
      )
      (property "ki_keywords" "cap capacitor" (id 7) (at 0 0 0)
        (effects (font (size 1.27 1.27)) hide)
      )
      (property "ki_description" "Unpolarized capacitor" (id 8) (at 0 0 0)
        (effects (font (size 1.27 1.27)) hide)
      )
      (property "ki_fp_filters" "C_*" (id 9) (at 0 0 0)
        (effects (font (size 1.27 1.27)) hide)
      )
      (symbol "C_10nF_0_1"
        (polyline
          (pts
            (xy -2.032 -0.762)
            (xy 2.032 -0.762)
          )
          (stroke (width 0.508) (type default) (color 0 0 0 0))
          (fill (type none))
        )
        (polyline
          (pts
            (xy -2.032 0.762)
            (xy 2.032 0.762)
          )
          (stroke (width 0.508) (type default) (color 0 0 0 0))
          (fill (type none))
        )
      )
      (symbol "C_10nF_1_1"
        (pin passive line (at 0 3.81 270) (length 2.794)
          (name "~" (effects (font (size 1.27 1.27))))
          (number "1" (effects (font (size 1.27 1.27))))
        )
        (pin passive line (at 0 -3.81 90) (length 2.794)
          (name "~" (effects (font (size 1.27 1.27))))
          (number "2" (effects (font (size 1.27 1.27))))
        )
      )
    )
    (symbol "000_PreferredParts:C_1uF" (pin_numbers hide) (pin_names (offset 0.254)) (in_bom yes) (on_board yes)
      (property "Reference" "C" (id 0) (at 0.635 2.54 0)
        (effects (font (size 1.27 1.27)) (justify left))
      )
      (property "Value" "C_1uF" (id 1) (at 0.635 -2.54 0)
        (effects (font (size 1.27 1.27)) (justify left))
      )
      (property "Footprint" "Capacitor_SMD:C_0603_1608Metric" (id 2) (at 0.9652 -3.81 0)
        (effects (font (size 1.27 1.27)) hide)
      )
      (property "Datasheet" "~" (id 3) (at 0 0 0)
        (effects (font (size 1.27 1.27)) hide)
      )
      (property "PartSpecification" "3000-0000000136" (id 4) (at 0 0 0)
        (effects (font (size 1.27 1.27)) hide)
      )
      (property "ki_keywords" "cap capacitor" (id 5) (at 0 0 0)
        (effects (font (size 1.27 1.27)) hide)
      )
      (property "ki_description" "Unpolarized capacitor" (id 6) (at 0 0 0)
        (effects (font (size 1.27 1.27)) hide)
      )
      (property "ki_fp_filters" "C_*" (id 7) (at 0 0 0)
        (effects (font (size 1.27 1.27)) hide)
      )
      (symbol "C_1uF_0_1"
        (polyline
          (pts
            (xy -2.032 -0.762)
            (xy 2.032 -0.762)
          )
          (stroke (width 0.508) (type default) (color 0 0 0 0))
          (fill (type none))
        )
        (polyline
          (pts
            (xy -2.032 0.762)
            (xy 2.032 0.762)
          )
          (stroke (width 0.508) (type default) (color 0 0 0 0))
          (fill (type none))
        )
      )
      (symbol "C_1uF_1_1"
        (pin passive line (at 0 3.81 270) (length 2.794)
          (name "~" (effects (font (size 1.27 1.27))))
          (number "1" (effects (font (size 1.27 1.27))))
        )
        (pin passive line (at 0 -3.81 90) (length 2.794)
          (name "~" (effects (font (size 1.27 1.27))))
          (number "2" (effects (font (size 1.27 1.27))))
        )
      )
    )
    (symbol "Connector:Conn_Coaxial" (pin_names (offset 1.016) hide) (in_bom yes) (on_board yes)
      (property "Reference" "J" (id 0) (at 0.254 3.048 0)
        (effects (font (size 1.27 1.27)))
      )
      (property "Value" "Conn_Coaxial" (id 1) (at 2.921 0 90)
        (effects (font (size 1.27 1.27)))
      )
      (property "Footprint" "" (id 2) (at 0 0 0)
        (effects (font (size 1.27 1.27)) hide)
      )
      (property "Datasheet" " ~" (id 3) (at 0 0 0)
        (effects (font (size 1.27 1.27)) hide)
      )
      (property "ki_keywords" "BNC SMA SMB SMC LEMO coaxial connector CINCH RCA" (id 4) (at 0 0 0)
        (effects (font (size 1.27 1.27)) hide)
      )
      (property "ki_description" "coaxial connector (BNC, SMA, SMB, SMC, Cinch/RCA, LEMO, ...)" (id 5) (at 0 0 0)
        (effects (font (size 1.27 1.27)) hide)
      )
      (property "ki_fp_filters" "*BNC* *SMA* *SMB* *SMC* *Cinch* *LEMO*" (id 6) (at 0 0 0)
        (effects (font (size 1.27 1.27)) hide)
      )
      (symbol "Conn_Coaxial_0_1"
        (arc (start -1.778 -0.508) (mid 0.222 -1.808) (end 1.778 0)
          (stroke (width 0.254) (type default) (color 0 0 0 0))
          (fill (type none))
        )
        (polyline
          (pts
            (xy -2.54 0)
            (xy -0.508 0)
          )
          (stroke (width 0) (type default) (color 0 0 0 0))
          (fill (type none))
        )
        (polyline
          (pts
            (xy 0 -2.54)
            (xy 0 -1.778)
          )
          (stroke (width 0) (type default) (color 0 0 0 0))
          (fill (type none))
        )
        (circle (center 0 0) (radius 0.508)
          (stroke (width 0.2032) (type default) (color 0 0 0 0))
          (fill (type none))
        )
        (arc (start 1.778 0) (mid 0.2221 1.8083) (end -1.778 0.508)
          (stroke (width 0.254) (type default) (color 0 0 0 0))
          (fill (type none))
        )
      )
      (symbol "Conn_Coaxial_1_1"
        (pin passive line (at -5.08 0 0) (length 2.54)
          (name "In" (effects (font (size 1.27 1.27))))
          (number "1" (effects (font (size 1.27 1.27))))
        )
        (pin passive line (at 0 -5.08 90) (length 2.54)
          (name "Ext" (effects (font (size 1.27 1.27))))
          (number "2" (effects (font (size 1.27 1.27))))
        )
      )
    )
    (symbol "Connector:TestPoint" (pin_numbers hide) (pin_names (offset 0.762) hide) (in_bom yes) (on_board yes)
      (property "Reference" "TP" (id 0) (at 0 6.858 0)
        (effects (font (size 1.27 1.27)))
      )
      (property "Value" "TestPoint" (id 1) (at 0 5.08 0)
        (effects (font (size 1.27 1.27)))
      )
      (property "Footprint" "" (id 2) (at 5.08 0 0)
        (effects (font (size 1.27 1.27)) hide)
      )
      (property "Datasheet" "~" (id 3) (at 5.08 0 0)
        (effects (font (size 1.27 1.27)) hide)
      )
      (property "ki_keywords" "test point tp" (id 4) (at 0 0 0)
        (effects (font (size 1.27 1.27)) hide)
      )
      (property "ki_description" "test point" (id 5) (at 0 0 0)
        (effects (font (size 1.27 1.27)) hide)
      )
      (property "ki_fp_filters" "Pin* Test*" (id 6) (at 0 0 0)
        (effects (font (size 1.27 1.27)) hide)
      )
      (symbol "TestPoint_0_1"
        (circle (center 0 3.302) (radius 0.762)
          (stroke (width 0) (type default) (color 0 0 0 0))
          (fill (type none))
        )
      )
      (symbol "TestPoint_1_1"
        (pin passive line (at 0 0 90) (length 2.54)
          (name "1" (effects (font (size 1.27 1.27))))
          (number "1" (effects (font (size 1.27 1.27))))
        )
      )
    )
    (symbol "Connector_Generic:Conn_01x03" (pin_names (offset 1.016) hide) (in_bom yes) (on_board yes)
      (property "Reference" "J" (id 0) (at 0 5.08 0)
        (effects (font (size 1.27 1.27)))
      )
      (property "Value" "Conn_01x03" (id 1) (at 0 -5.08 0)
        (effects (font (size 1.27 1.27)))
      )
      (property "Footprint" "" (id 2) (at 0 0 0)
        (effects (font (size 1.27 1.27)) hide)
      )
      (property "Datasheet" "~" (id 3) (at 0 0 0)
        (effects (font (size 1.27 1.27)) hide)
      )
      (property "ki_keywords" "connector" (id 4) (at 0 0 0)
        (effects (font (size 1.27 1.27)) hide)
      )
      (property "ki_description" "Generic connector, single row, 01x03, script generated (kicad-library-utils/schlib/autogen/connector/)" (id 5) (at 0 0 0)
        (effects (font (size 1.27 1.27)) hide)
      )
      (property "ki_fp_filters" "Connector*:*_1x??_*" (id 6) (at 0 0 0)
        (effects (font (size 1.27 1.27)) hide)
      )
      (symbol "Conn_01x03_1_1"
        (rectangle (start -1.27 -2.413) (end 0 -2.667)
          (stroke (width 0.1524) (type default) (color 0 0 0 0))
          (fill (type none))
        )
        (rectangle (start -1.27 0.127) (end 0 -0.127)
          (stroke (width 0.1524) (type default) (color 0 0 0 0))
          (fill (type none))
        )
        (rectangle (start -1.27 2.667) (end 0 2.413)
          (stroke (width 0.1524) (type default) (color 0 0 0 0))
          (fill (type none))
        )
        (rectangle (start -1.27 3.81) (end 1.27 -3.81)
          (stroke (width 0.254) (type default) (color 0 0 0 0))
          (fill (type background))
        )
        (pin passive line (at -5.08 2.54 0) (length 3.81)
          (name "Pin_1" (effects (font (size 1.27 1.27))))
          (number "1" (effects (font (size 1.27 1.27))))
        )
        (pin passive line (at -5.08 0 0) (length 3.81)
          (name "Pin_2" (effects (font (size 1.27 1.27))))
          (number "2" (effects (font (size 1.27 1.27))))
        )
        (pin passive line (at -5.08 -2.54 0) (length 3.81)
          (name "Pin_3" (effects (font (size 1.27 1.27))))
          (number "3" (effects (font (size 1.27 1.27))))
        )
      )
    )
    (symbol "POWDER_Digital:SN74AC14-Q1" (pin_names (offset 1.016)) (in_bom yes) (on_board yes)
      (property "Reference" "U" (id 0) (at -5.08 10.16 0)
        (effects (font (size 1.27 1.27)))
      )
      (property "Value" "SN74AC14-Q1" (id 1) (at 0 -10.16 0)
        (effects (font (size 1.27 1.27)))
      )
      (property "Footprint" "" (id 2) (at 0 -8.89 0)
        (effects (font (size 1.27 1.27)) hide)
      )
      (property "Datasheet" "" (id 3) (at 0 -8.89 0)
        (effects (font (size 1.27 1.27)) hide)
      )
      (property "ki_description" "Hex Schmitt-Trigger Inverter" (id 4) (at 0 0 0)
        (effects (font (size 1.27 1.27)) hide)
      )
      (symbol "SN74AC14-Q1_0_1"
        (rectangle (start -6.35 8.89) (end 6.35 -8.89)
          (stroke (width 0) (type default) (color 0 0 0 0))
          (fill (type background))
        )
      )
      (symbol "SN74AC14-Q1_1_1"
        (pin input line (at -8.89 7.62 0) (length 2.54)
          (name "1A" (effects (font (size 1.27 1.27))))
          (number "1" (effects (font (size 1.27 1.27))))
        )
        (pin output line (at 8.89 -2.54 180) (length 2.54)
          (name "5Y" (effects (font (size 1.27 1.27))))
          (number "10" (effects (font (size 1.27 1.27))))
        )
        (pin input line (at 8.89 0 180) (length 2.54)
          (name "5A" (effects (font (size 1.27 1.27))))
          (number "11" (effects (font (size 1.27 1.27))))
        )
        (pin output line (at 8.89 2.54 180) (length 2.54)
          (name "6Y" (effects (font (size 1.27 1.27))))
          (number "12" (effects (font (size 1.27 1.27))))
        )
        (pin input line (at 8.89 5.08 180) (length 2.54)
          (name "6A" (effects (font (size 1.27 1.27))))
          (number "13" (effects (font (size 1.27 1.27))))
        )
        (pin power_in line (at 8.89 7.62 180) (length 2.54)
          (name "VCC" (effects (font (size 1.27 1.27))))
          (number "14" (effects (font (size 1.27 1.27))))
        )
        (pin output line (at -8.89 5.08 0) (length 2.54)
          (name "1Y" (effects (font (size 1.27 1.27))))
          (number "2" (effects (font (size 1.27 1.27))))
        )
        (pin input line (at -8.89 2.54 0) (length 2.54)
          (name "2A" (effects (font (size 1.27 1.27))))
          (number "3" (effects (font (size 1.27 1.27))))
        )
        (pin output line (at -8.89 0 0) (length 2.54)
          (name "2Y" (effects (font (size 1.27 1.27))))
          (number "4" (effects (font (size 1.27 1.27))))
        )
        (pin input line (at -8.89 -2.54 0) (length 2.54)
          (name "3A" (effects (font (size 1.27 1.27))))
          (number "5" (effects (font (size 1.27 1.27))))
        )
        (pin output line (at -8.89 -5.08 0) (length 2.54)
          (name "3Y" (effects (font (size 1.27 1.27))))
          (number "6" (effects (font (size 1.27 1.27))))
        )
        (pin power_in line (at -8.89 -7.62 0) (length 2.54)
          (name "GND" (effects (font (size 1.27 1.27))))
          (number "7" (effects (font (size 1.27 1.27))))
        )
        (pin output line (at 8.89 -7.62 180) (length 2.54)
          (name "4Y" (effects (font (size 1.27 1.27))))
          (number "8" (effects (font (size 1.27 1.27))))
        )
        (pin input line (at 8.89 -5.08 180) (length 2.54)
          (name "4A" (effects (font (size 1.27 1.27))))
          (number "9" (effects (font (size 1.27 1.27))))
        )
      )
    )
    (symbol "power:+3.3V" (power) (pin_names (offset 0)) (in_bom yes) (on_board yes)
      (property "Reference" "#PWR" (id 0) (at 0 -3.81 0)
        (effects (font (size 1.27 1.27)) hide)
      )
      (property "Value" "+3.3V" (id 1) (at 0 3.556 0)
        (effects (font (size 1.27 1.27)))
      )
      (property "Footprint" "" (id 2) (at 0 0 0)
        (effects (font (size 1.27 1.27)) hide)
      )
      (property "Datasheet" "" (id 3) (at 0 0 0)
        (effects (font (size 1.27 1.27)) hide)
      )
      (property "ki_keywords" "power-flag" (id 4) (at 0 0 0)
        (effects (font (size 1.27 1.27)) hide)
      )
      (property "ki_description" "Power symbol creates a global label with name \"+3.3V\"" (id 5) (at 0 0 0)
        (effects (font (size 1.27 1.27)) hide)
      )
      (symbol "+3.3V_0_1"
        (polyline
          (pts
            (xy -0.762 1.27)
            (xy 0 2.54)
          )
          (stroke (width 0) (type default) (color 0 0 0 0))
          (fill (type none))
        )
        (polyline
          (pts
            (xy 0 0)
            (xy 0 2.54)
          )
          (stroke (width 0) (type default) (color 0 0 0 0))
          (fill (type none))
        )
        (polyline
          (pts
            (xy 0 2.54)
            (xy 0.762 1.27)
          )
          (stroke (width 0) (type default) (color 0 0 0 0))
          (fill (type none))
        )
      )
      (symbol "+3.3V_1_1"
        (pin power_in line (at 0 0 90) (length 0) hide
          (name "+3V3" (effects (font (size 1.27 1.27))))
          (number "1" (effects (font (size 1.27 1.27))))
        )
      )
    )
    (symbol "power:GND" (power) (pin_names (offset 0)) (in_bom yes) (on_board yes)
      (property "Reference" "#PWR" (id 0) (at 0 -6.35 0)
        (effects (font (size 1.27 1.27)) hide)
      )
      (property "Value" "GND" (id 1) (at 0 -3.81 0)
        (effects (font (size 1.27 1.27)))
      )
      (property "Footprint" "" (id 2) (at 0 0 0)
        (effects (font (size 1.27 1.27)) hide)
      )
      (property "Datasheet" "" (id 3) (at 0 0 0)
        (effects (font (size 1.27 1.27)) hide)
      )
      (property "ki_keywords" "power-flag" (id 4) (at 0 0 0)
        (effects (font (size 1.27 1.27)) hide)
      )
      (property "ki_description" "Power symbol creates a global label with name \"GND\" , ground" (id 5) (at 0 0 0)
        (effects (font (size 1.27 1.27)) hide)
      )
      (symbol "GND_0_1"
        (polyline
          (pts
            (xy 0 0)
            (xy 0 -1.27)
            (xy 1.27 -1.27)
            (xy 0 -2.54)
            (xy -1.27 -1.27)
            (xy 0 -1.27)
          )
          (stroke (width 0) (type default) (color 0 0 0 0))
          (fill (type none))
        )
      )
      (symbol "GND_1_1"
        (pin power_in line (at 0 0 270) (length 0) hide
          (name "GND" (effects (font (size 1.27 1.27))))
          (number "1" (effects (font (size 1.27 1.27))))
        )
      )
    )
  )

  (junction (at 99.06 104.14) (diameter 0) (color 0 0 0 0)
    (uuid 0901c3d8-b310-49a5-b712-221ee134df91)
  )
  (junction (at 73.66 109.22) (diameter 0) (color 0 0 0 0)
    (uuid 0ded4358-bd8a-4a0d-8e62-4ef6100f174d)
  )
  (junction (at 101.6 111.76) (diameter 0) (color 0 0 0 0)
    (uuid 30876d1a-3f4d-4e0d-b6b3-a15690367711)
  )
  (junction (at 73.66 104.14) (diameter 0) (color 0 0 0 0)
    (uuid 37c83353-7c70-4ef7-9ba5-59108c827c89)
  )
  (junction (at 81.28 82.55) (diameter 0) (color 0 0 0 0)
    (uuid 3c42afce-a213-456f-ad74-c7e300f381af)
  )
  (junction (at 76.2 101.6) (diameter 0) (color 0 0 0 0)
    (uuid b28b12b1-eca1-4439-a8b4-1f0179479dca)
  )
  (junction (at 76.2 106.68) (diameter 0) (color 0 0 0 0)
    (uuid b7a21637-49ff-4cf8-a75b-0d97c908211e)
  )
  (junction (at 99.06 109.22) (diameter 0) (color 0 0 0 0)
    (uuid be28bd3f-107a-40ab-a1fc-7f3037b5df70)
  )
  (junction (at 81.28 72.39) (diameter 0) (color 0 0 0 0)
    (uuid eb6d1a76-0194-4129-b222-75ea7b4eb2a1)
  )
  (junction (at 101.6 106.68) (diameter 0) (color 0 0 0 0)
    (uuid ef47b354-c4f3-4f97-b1d6-1824a82bef19)
  )

  (wire (pts (xy 96.52 104.14) (xy 99.06 104.14))
    (stroke (width 0) (type default) (color 0 0 0 0))
    (uuid 0a54456e-0af0-4580-a807-af5e31f733cf)
  )
  (wire (pts (xy 101.6 116.84) (xy 101.6 111.76))
    (stroke (width 0) (type default) (color 0 0 0 0))
    (uuid 0d7d8dc8-ae60-479a-ac03-3d34e3afec3f)
  )
  (wire (pts (xy 81.28 73.66) (xy 81.28 72.39))
    (stroke (width 0) (type default) (color 0 0 0 0))
    (uuid 1595c75e-1c37-4ca7-87dd-574462ba09b5)
  )
  (wire (pts (xy 135.89 80.01) (xy 123.19 80.01))
    (stroke (width 0) (type default) (color 0 0 0 0))
    (uuid 23190b5c-133e-4116-beea-eb620e10ca68)
  )
  (wire (pts (xy 99.06 114.3) (xy 96.52 114.3))
    (stroke (width 0) (type default) (color 0 0 0 0))
    (uuid 2bb609f2-95c6-4a53-acb7-214050ea56de)
  )
  (wire (pts (xy 76.2 101.6) (xy 76.2 106.68))
    (stroke (width 0) (type default) (color 0 0 0 0))
    (uuid 31bacfc6-f695-4f6c-b449-784f53714f98)
  )
  (wire (pts (xy 99.06 104.14) (xy 119.38 104.14))
    (stroke (width 0) (type default) (color 0 0 0 0))
    (uuid 33aa2872-55df-4e83-b9ce-c3a658657971)
  )
  (wire (pts (xy 90.17 81.28) (xy 90.17 82.55))
    (stroke (width 0) (type default) (color 0 0 0 0))
    (uuid 3d3af3b8-9ff7-4cab-a1c2-52602aeff959)
  )
  (wire (pts (xy 99.06 104.14) (xy 99.06 109.22))
    (stroke (width 0) (type default) (color 0 0 0 0))
    (uuid 3f418572-0fff-479c-bb31-98681ce0fc2e)
  )
  (wire (pts (xy 172.72 123.19) (xy 172.72 125.73))
    (stroke (width 0) (type default) (color 0 0 0 0))
    (uuid 412a27ee-249a-45fe-8e96-13b37c4d4db0)
  )
  (wire (pts (xy 167.64 118.11) (xy 152.4 118.11))
    (stroke (width 0) (type default) (color 0 0 0 0))
    (uuid 51ca8ac9-91b6-41f7-84f0-67137aafa657)
  )
  (wire (pts (xy 73.66 104.14) (xy 73.66 109.22))
    (stroke (width 0) (type default) (color 0 0 0 0))
    (uuid 5c313353-2b1a-49a1-ac80-67d390567c34)
  )
  (wire (pts (xy 81.28 142.24) (xy 83.82 142.24))
    (stroke (width 0) (type default) (color 0 0 0 0))
    (uuid 647bfd76-ed52-4fa9-8c84-4b90649641df)
  )
  (wire (pts (xy 99.06 109.22) (xy 99.06 114.3))
    (stroke (width 0) (type default) (color 0 0 0 0))
    (uuid 67ce7ba4-ce80-4d1f-9981-f5f35dc0be38)
  )
  (wire (pts (xy 76.2 111.76) (xy 78.74 111.76))
    (stroke (width 0) (type default) (color 0 0 0 0))
    (uuid 75aee69a-ca3c-4cf8-92ee-a6d6714ac6ac)
  )
  (wire (pts (xy 81.28 69.85) (xy 81.28 72.39))
    (stroke (width 0) (type default) (color 0 0 0 0))
    (uuid 7727b0b9-aadb-488c-8d03-18ebb4509621)
  )
  (wire (pts (xy 99.06 101.6) (xy 99.06 99.06))
    (stroke (width 0) (type default) (color 0 0 0 0))
    (uuid 79e319c3-0997-4907-be69-bf7e4e880a5b)
  )
  (wire (pts (xy 96.52 106.68) (xy 101.6 106.68))
    (stroke (width 0) (type default) (color 0 0 0 0))
    (uuid 7c882e3d-ee53-4029-9e57-5934df1e910d)
  )
  (wire (pts (xy 96.52 101.6) (xy 99.06 101.6))
    (stroke (width 0) (type default) (color 0 0 0 0))
    (uuid 7f55e0c8-ec73-4f65-856c-aeee5614494d)
  )
  (wire (pts (xy 99.06 109.22) (xy 96.52 109.22))
    (stroke (width 0) (type default) (color 0 0 0 0))
    (uuid 8283a862-dc67-4a74-b95e-f9b159bd5068)
  )
  (wire (pts (xy 78.74 106.68) (xy 76.2 106.68))
    (stroke (width 0) (type default) (color 0 0 0 0))
    (uuid 852cf8f8-0806-4f82-a9ac-c52040ac6c3d)
  )
  (wire (pts (xy 78.74 101.6) (xy 76.2 101.6))
    (stroke (width 0) (type default) (color 0 0 0 0))
    (uuid 85ba707b-6468-4569-a043-2f248c98acf9)
  )
  (wire (pts (xy 57.15 104.14) (xy 73.66 104.14))
    (stroke (width 0) (type default) (color 0 0 0 0))
    (uuid 8a28dde7-886c-4aa8-9de2-2ff9004cea09)
  )
  (wire (pts (xy 167.64 99.06) (xy 152.4 99.06))
    (stroke (width 0) (type default) (color 0 0 0 0))
    (uuid a4f8dc0e-5d8a-444f-900a-0e80f3dbbee0)
  )
  (wire (pts (xy 81.28 82.55) (xy 81.28 85.09))
    (stroke (width 0) (type default) (color 0 0 0 0))
    (uuid a8714058-f2bc-447b-a468-33415ef8029d)
  )
  (wire (pts (xy 101.6 106.68) (xy 101.6 111.76))
    (stroke (width 0) (type default) (color 0 0 0 0))
    (uuid ac424e2c-0af5-4c1f-9e8f-e51b83d95333)
  )
  (wire (pts (xy 73.66 109.22) (xy 78.74 109.22))
    (stroke (width 0) (type default) (color 0 0 0 0))
    (uuid ace8ce56-2348-4330-894b-a2c7930c2e73)
  )
  (wire (pts (xy 76.2 116.84) (xy 76.2 119.38))
    (stroke (width 0) (type default) (color 0 0 0 0))
    (uuid aee87199-e68d-4819-aeb6-1af74626dbf4)
  )
  (wire (pts (xy 101.6 111.76) (xy 96.52 111.76))
    (stroke (width 0) (type default) (color 0 0 0 0))
    (uuid b1c19b16-8df8-417b-9c01-962af7c33d7c)
  )
  (wire (pts (xy 78.74 104.14) (xy 73.66 104.14))
    (stroke (width 0) (type default) (color 0 0 0 0))
    (uuid b25da1ee-c3cf-406c-b43f-300b9abb8114)
  )
  (wire (pts (xy 54.61 101.6) (xy 76.2 101.6))
    (stroke (width 0) (type default) (color 0 0 0 0))
    (uuid b46bd007-a457-4afa-a97b-9407298759ed)
  )
  (wire (pts (xy 96.52 116.84) (xy 101.6 116.84))
    (stroke (width 0) (type default) (color 0 0 0 0))
    (uuid c933bb70-affe-40f0-9b07-005c04f99eaf)
  )
  (wire (pts (xy 133.35 82.55) (xy 133.35 85.09))
    (stroke (width 0) (type default) (color 0 0 0 0))
    (uuid cbcd3d49-b829-4357-8d98-85445c8371cb)
  )
  (wire (pts (xy 135.89 82.55) (xy 133.35 82.55))
    (stroke (width 0) (type default) (color 0 0 0 0))
    (uuid cc1f69eb-767e-4450-ab08-7decd2108e33)
  )
  (wire (pts (xy 73.66 114.3) (xy 78.74 114.3))
    (stroke (width 0) (type default) (color 0 0 0 0))
    (uuid cfeb6c2b-653a-4189-ade7-a9517301a31b)
  )
  (wire (pts (xy 81.28 72.39) (xy 90.17 72.39))
    (stroke (width 0) (type default) (color 0 0 0 0))
    (uuid d32918ae-e099-4625-9465-16834211523f)
  )
  (wire (pts (xy 90.17 73.66) (xy 90.17 72.39))
    (stroke (width 0) (type default) (color 0 0 0 0))
    (uuid d3b22f3b-aef5-49e4-8251-15db07139033)
  )
  (wire (pts (xy 172.72 106.68) (xy 172.72 104.14))
    (stroke (width 0) (type default) (color 0 0 0 0))
    (uuid d9f0681c-e5d5-4512-be9a-e5eb21569eb4)
  )
  (wire (pts (xy 73.66 109.22) (xy 73.66 114.3))
    (stroke (width 0) (type default) (color 0 0 0 0))
    (uuid dd5d081b-b1ac-4117-8167-6536fc20ef00)
  )
  (wire (pts (xy 76.2 106.68) (xy 76.2 111.76))
    (stroke (width 0) (type default) (color 0 0 0 0))
    (uuid de4c262e-6a1d-496d-acb7-7293be824662)
  )
  (wire (pts (xy 123.19 77.47) (xy 135.89 77.47))
    (stroke (width 0) (type default) (color 0 0 0 0))
    (uuid e550b936-76ee-47b4-b992-12fe808d9e49)
  )
  (wire (pts (xy 78.74 116.84) (xy 76.2 116.84))
    (stroke (width 0) (type default) (color 0 0 0 0))
    (uuid e904ece4-7523-4d0e-9a80-fa3bc49d9508)
  )
  (wire (pts (xy 81.28 81.28) (xy 81.28 82.55))
    (stroke (width 0) (type default) (color 0 0 0 0))
    (uuid fab67238-d3f7-41db-973d-f25b01e53962)
  )
  (wire (pts (xy 90.17 82.55) (xy 81.28 82.55))
    (stroke (width 0) (type default) (color 0 0 0 0))
    (uuid fd8e8222-9a3c-4d4e-917f-cc0c5a6c526c)
  )
  (wire (pts (xy 81.28 135.89) (xy 83.82 135.89))
    (stroke (width 0) (type default) (color 0 0 0 0))
    (uuid ff72f343-9569-41da-b4fd-4286caafdf01)
  )
  (wire (pts (xy 101.6 106.68) (xy 116.84 106.68))
    (stroke (width 0) (type default) (color 0 0 0 0))
    (uuid ff8b28a3-e672-41fb-8fee-5529facecaab)
  )

  (label "1PPS_Buffered" (at 152.4 118.11 0)
    (effects (font (size 1.27 1.27)) (justify left bottom))
    (uuid 03a636fb-975f-4c09-ad2f-d8eae277501c)
  )
  (label "1PPS_Buffered" (at 116.84 106.68 180)
    (effects (font (size 1.27 1.27)) (justify right bottom))
    (uuid 2ead0856-b1b7-4ad8-8e34-0f234bd09982)
  )
  (label "10MHz_Buffered" (at 57.15 104.14 0)
    (effects (font (size 1.27 1.27)) (justify left bottom))
    (uuid 30d74609-654a-407a-be70-9fafcab23dce)
  )
  (label "10MHz_Buffered" (at 152.4 99.06 0)
    (effects (font (size 1.27 1.27)) (justify left bottom))
    (uuid fbb59ea5-9f4c-4270-bd2b-349d0b383139)
  )

  (hierarchical_label "1PPS" (shape input) (at 119.38 104.14 0)
    (effects (font (size 1.27 1.27)) (justify left))
    (uuid 07ba1ed0-d76f-4f69-acac-9365bee6ce2e)
  )
  (hierarchical_label "10MHz" (shape input) (at 81.28 135.89 180)
    (effects (font (size 1.27 1.27)) (justify right))
    (uuid 163ff4d5-ec57-4216-bf74-a6a71dae8bb2)
  )
  (hierarchical_label "NMEA_TXD" (shape input) (at 123.19 77.47 180)
    (effects (font (size 1.27 1.27)) (justify right))
    (uuid 446ce2d5-f02e-42aa-99bd-fc6d3ec6c015)
  )
  (hierarchical_label "LOCK_OK" (shape input) (at 123.19 80.01 180)
    (effects (font (size 1.27 1.27)) (justify right))
    (uuid 9859538c-72f6-4be4-b366-028a91fde29e)
  )
  (hierarchical_label "10MHz" (shape input) (at 54.61 101.6 180)
    (effects (font (size 1.27 1.27)) (justify right))
    (uuid ea176921-9260-498a-81c2-c17fa4212d7c)
  )
  (hierarchical_label "1PPS" (shape input) (at 81.28 142.24 180)
    (effects (font (size 1.27 1.27)) (justify right))
    (uuid fec293db-d850-4aea-a9fb-40d0833ccaed)
  )

  (symbol (lib_id "power:GND") (at 172.72 106.68 0)
    (in_bom yes) (on_board yes)
    (uuid 00000000-0000-0000-0000-00005c522337)
    (property "Reference" "#PWR?" (id 0) (at 172.72 113.03 0)
      (effects (font (size 1.27 1.27)) hide)
    )
    (property "Value" "GND" (id 1) (at 172.847 111.0742 0))
    (property "Footprint" "" (id 2) (at 172.72 106.68 0)
      (effects (font (size 1.27 1.27)) hide)
    )
    (property "Datasheet" "" (id 3) (at 172.72 106.68 0)
      (effects (font (size 1.27 1.27)) hide)
    )
    (pin "1" (uuid b8cc86aa-d804-4ecd-a013-a65cbf9d2c97))
  )

  (symbol (lib_id "power:GND") (at 172.72 125.73 0)
    (in_bom yes) (on_board yes)
    (uuid 00000000-0000-0000-0000-00005c52238c)
    (property "Reference" "#PWR?" (id 0) (at 172.72 132.08 0)
      (effects (font (size 1.27 1.27)) hide)
    )
    (property "Value" "GND" (id 1) (at 172.847 130.1242 0))
    (property "Footprint" "" (id 2) (at 172.72 125.73 0)
      (effects (font (size 1.27 1.27)) hide)
    )
    (property "Datasheet" "" (id 3) (at 172.72 125.73 0)
      (effects (font (size 1.27 1.27)) hide)
    )
    (pin "1" (uuid 40ce19c7-4482-4fc7-be7b-fae5d12e5af5))
  )

  (symbol (lib_id "power:GND") (at 133.35 85.09 0)
    (in_bom yes) (on_board yes)
    (uuid 00000000-0000-0000-0000-00005c5240d3)
    (property "Reference" "#PWR?" (id 0) (at 133.35 91.44 0)
      (effects (font (size 1.27 1.27)) hide)
    )
    (property "Value" "GND" (id 1) (at 133.477 89.4842 0))
    (property "Footprint" "" (id 2) (at 133.35 85.09 0)
      (effects (font (size 1.27 1.27)) hide)
    )
    (property "Datasheet" "" (id 3) (at 133.35 85.09 0)
      (effects (font (size 1.27 1.27)) hide)
    )
    (pin "1" (uuid 2b0ed7f2-8b86-40a7-9ddc-8ac19293c03f))
  )

  (symbol (lib_id "power:+3.3V") (at 81.28 69.85 0)
    (in_bom yes) (on_board yes)
    (uuid 00000000-0000-0000-0000-00005c534d65)
    (property "Reference" "#PWR?" (id 0) (at 81.28 73.66 0)
      (effects (font (size 1.27 1.27)) hide)
    )
    (property "Value" "+3.3V" (id 1) (at 81.661 65.4558 0))
    (property "Footprint" "" (id 2) (at 81.28 69.85 0)
      (effects (font (size 1.27 1.27)) hide)
    )
    (property "Datasheet" "" (id 3) (at 81.28 69.85 0)
      (effects (font (size 1.27 1.27)) hide)
    )
    (pin "1" (uuid 2d157830-5c8b-455b-9815-a45134f75743))
  )

  (symbol (lib_id "power:GND") (at 81.28 85.09 0)
    (in_bom yes) (on_board yes)
    (uuid 00000000-0000-0000-0000-00005c534d6d)
    (property "Reference" "#PWR?" (id 0) (at 81.28 91.44 0)
      (effects (font (size 1.27 1.27)) hide)
    )
    (property "Value" "GND" (id 1) (at 81.407 89.4842 0))
    (property "Footprint" "" (id 2) (at 81.28 85.09 0)
      (effects (font (size 1.27 1.27)) hide)
    )
    (property "Datasheet" "" (id 3) (at 81.28 85.09 0)
      (effects (font (size 1.27 1.27)) hide)
    )
    (pin "1" (uuid c726d7b0-ec27-4025-9586-367321ef32f9))
  )

  (symbol (lib_id "power:GND") (at 76.2 119.38 0)
    (in_bom yes) (on_board yes)
    (uuid 00000000-0000-0000-0000-00005c534d79)
    (property "Reference" "#PWR?" (id 0) (at 76.2 125.73 0)
      (effects (font (size 1.27 1.27)) hide)
    )
    (property "Value" "GND" (id 1) (at 76.327 123.7742 0))
    (property "Footprint" "" (id 2) (at 76.2 119.38 0)
      (effects (font (size 1.27 1.27)) hide)
    )
    (property "Datasheet" "" (id 3) (at 76.2 119.38 0)
      (effects (font (size 1.27 1.27)) hide)
    )
    (pin "1" (uuid 1bc8991b-5e41-4854-b055-ba3e2035af6c))
  )

  (symbol (lib_id "power:+3.3V") (at 99.06 99.06 0)
    (in_bom yes) (on_board yes)
    (uuid 00000000-0000-0000-0000-00005c534d81)
    (property "Reference" "#PWR?" (id 0) (at 99.06 102.87 0)
      (effects (font (size 1.27 1.27)) hide)
    )
    (property "Value" "+3.3V" (id 1) (at 99.441 94.6658 0))
    (property "Footprint" "" (id 2) (at 99.06 99.06 0)
      (effects (font (size 1.27 1.27)) hide)
    )
    (property "Datasheet" "" (id 3) (at 99.06 99.06 0)
      (effects (font (size 1.27 1.27)) hide)
    )
    (pin "1" (uuid 52f7ede4-1356-49e0-bfbf-ec77b06ef0ad))
  )

  (symbol (lib_id "Connector:Conn_Coaxial") (at 172.72 99.06 0)
    (in_bom yes) (on_board yes)
    (uuid 00000000-0000-0000-0000-00005c5387f8)
    (property "Reference" "J1402" (id 0) (at 175.2346 99.6696 0)
      (effects (font (size 1.27 1.27)) (justify left))
    )
    (property "Value" "Conn_Coaxial" (id 1) (at 175.2346 101.981 0)
      (effects (font (size 1.27 1.27)) (justify left))
    )
    (property "Footprint" "POWDER_RF:SMP_RA_MSLD-PCS17T" (id 2) (at 172.72 99.06 0)
      (effects (font (size 1.27 1.27)) hide)
    )
    (property "Datasheet" " ~" (id 3) (at 172.72 99.06 0)
      (effects (font (size 1.27 1.27)) hide)
    )
    (property "Manufacturer" "Molex" (id 4) (at 0 198.12 0)
      (effects (font (size 1.27 1.27)) hide)
    )
    (property "PartNumber" "SMP-MSLD-PCS17T" (id 5) (at 0 198.12 0)
      (effects (font (size 1.27 1.27)) hide)
    )
    (property "PartSpecification" "3000-0000000485" (id 6) (at 172.72 99.06 0)
      (effects (font (size 1.27 1.27)) hide)
    )
    (pin "1" (uuid a83550ed-4799-4110-b2c4-534d0043133f))
    (pin "2" (uuid 436c4d22-1594-4d90-b173-bd3cb5f2890e))
  )

  (symbol (lib_id "Connector:Conn_Coaxial") (at 172.72 118.11 0)
    (in_bom yes) (on_board yes)
    (uuid 00000000-0000-0000-0000-00005c53884c)
    (property "Reference" "J1403" (id 0) (at 175.2346 118.7196 0)
      (effects (font (size 1.27 1.27)) (justify left))
    )
    (property "Value" "Conn_Coaxial" (id 1) (at 175.2346 121.031 0)
      (effects (font (size 1.27 1.27)) (justify left))
    )
    (property "Footprint" "POWDER_RF:SMP_RA_MSLD-PCS17T" (id 2) (at 172.72 118.11 0)
      (effects (font (size 1.27 1.27)) hide)
    )
    (property "Datasheet" " ~" (id 3) (at 172.72 118.11 0)
      (effects (font (size 1.27 1.27)) hide)
    )
    (property "Manufacturer" "Molex" (id 4) (at 0 236.22 0)
      (effects (font (size 1.27 1.27)) hide)
    )
    (property "PartNumber" "SMP-MSLD-PCS17T" (id 5) (at 0 236.22 0)
      (effects (font (size 1.27 1.27)) hide)
    )
    (property "PartSpecification" "3000-0000000485" (id 6) (at 172.72 118.11 0)
      (effects (font (size 1.27 1.27)) hide)
    )
    (pin "1" (uuid 6dc34820-12ec-4c0f-ac69-afd76011f3a7))
    (pin "2" (uuid 209320f8-9737-4dbc-b076-bcb8978f1a7c))
  )

  (symbol (lib_id "Connector_Generic:Conn_01x03") (at 140.97 80.01 0) (mirror x)
    (in_bom yes) (on_board yes)
    (uuid 00000000-0000-0000-0000-00005c538e6e)
    (property "Reference" "J1401" (id 0) (at 143.002 81.0768 0)
      (effects (font (size 1.27 1.27)) (justify left))
    )
    (property "Value" "Conn_01x03" (id 1) (at 143.002 78.7654 0)
      (effects (font (size 1.27 1.27)) (justify left))
    )
    (property "Footprint" "Connector_PinHeader_2.54mm:PinHeader_1x03_P2.54mm_Vertical" (id 2) (at 140.97 80.01 0)
      (effects (font (size 1.27 1.27)) hide)
    )
    (property "Datasheet" "~" (id 3) (at 140.97 80.01 0)
      (effects (font (size 1.27 1.27)) hide)
    )
    (property "Manufacturer" "Amphenol ICC (FCI)" (id 4) (at 0 0 0)
      (effects (font (size 1.27 1.27)) hide)
    )
    (property "PartNumber" "77311-118-03LF" (id 5) (at 0 0 0)
      (effects (font (size 1.27 1.27)) hide)
    )
    (property "PartSpecification" "3000-0000000487" (id 6) (at 140.97 80.01 0)
      (effects (font (size 1.27 1.27)) hide)
    )
    (pin "1" (uuid 5397bbb7-c002-46f1-89ee-b4abdb2b67f9))
    (pin "2" (uuid 6077abc2-0c04-498e-9052-0b801a6e75e8))
    (pin "3" (uuid 59c187bf-c0f5-4a40-85d3-a7b2c4f609f3))
  )

  (symbol (lib_id "Connector:TestPoint") (at 83.82 135.89 270)
    (in_bom yes) (on_board yes)
    (uuid 00000000-0000-0000-0000-00005d291754)
    (property "Reference" "TP1401" (id 0) (at 88.5952 134.7216 90)
      (effects (font (size 1.27 1.27)) (justify left))
    )
    (property "Value" "TestPoint" (id 1) (at 88.5952 137.033 90)
      (effects (font (size 1.27 1.27)) (justify left))
    )
    (property "Footprint" "TestPoint:TestPoint_Pad_D1.0mm" (id 2) (at 83.82 140.97 0)
      (effects (font (size 1.27 1.27)) hide)
    )
    (property "Datasheet" "~" (id 3) (at 83.82 140.97 0)
      (effects (font (size 1.27 1.27)) hide)
    )
    (pin "1" (uuid d1490437-8865-405a-90ea-07e55c3f51ae))
  )

  (symbol (lib_id "Connector:TestPoint") (at 83.82 142.24 270)
    (in_bom yes) (on_board yes)
    (uuid 00000000-0000-0000-0000-00005d2b09ae)
    (property "Reference" "TP1402" (id 0) (at 88.5952 141.0716 90)
      (effects (font (size 1.27 1.27)) (justify left))
    )
    (property "Value" "TestPoint" (id 1) (at 88.5952 143.383 90)
      (effects (font (size 1.27 1.27)) (justify left))
    )
    (property "Footprint" "TestPoint:TestPoint_Pad_D1.0mm" (id 2) (at 83.82 147.32 0)
      (effects (font (size 1.27 1.27)) hide)
    )
    (property "Datasheet" "~" (id 3) (at 83.82 147.32 0)
      (effects (font (size 1.27 1.27)) hide)
    )
    (pin "1" (uuid 3d86e206-4159-4771-ade6-2bb1053d8745))
  )

  (symbol (lib_id "POWDER_Digital:SN74AC14-Q1") (at 87.63 109.22 0)
    (in_bom yes) (on_board yes)
    (uuid 00000000-0000-0000-0000-00005e1e1b0e)
    (property "Reference" "U1401" (id 0) (at 87.63 95.885 0))
    (property "Value" "SN74AC14-Q1" (id 1) (at 87.63 98.1964 0))
    (property "Footprint" "Package_SO:TSSOP-14_4.4x5mm_P0.65mm" (id 2) (at 87.63 118.11 0)
      (effects (font (size 1.27 1.27)) hide)
    )
    (property "Datasheet" "" (id 3) (at 87.63 118.11 0)
      (effects (font (size 1.27 1.27)) hide)
    )
    (property "PartSpecification" "3000-0000000523" (id 4) (at 87.63 109.22 0)
      (effects (font (size 1.27 1.27)) hide)
    )
    (pin "1" (uuid e6d06a68-ebfb-45d2-bed0-9d900b3bdc91))
    (pin "10" (uuid fd16720f-e703-4951-ba6d-9005e11d7a29))
    (pin "11" (uuid 9e478365-4f80-4b16-9c84-c8347a108748))
    (pin "12" (uuid c702b0f8-7ef8-46a6-9d70-7b9834d2c557))
    (pin "13" (uuid 4cb7fc4c-d370-44a7-8438-180a6d108aa7))
    (pin "14" (uuid 886f7dca-25fe-4231-b7d5-6e34ec28d396))
    (pin "2" (uuid d2bc6205-b08d-43d3-951d-0fd0bf7fddc6))
    (pin "3" (uuid dee617c9-f0be-4247-8b22-d63ed39a1869))
    (pin "4" (uuid 78b4eeec-7a5e-42ac-97c2-90af55b0fb99))
    (pin "5" (uuid f78e2151-5a3a-40fb-8d28-8f0a5275d27b))
    (pin "6" (uuid 2ffa5ee6-01e6-4016-94eb-f5df685033ad))
    (pin "7" (uuid 17997fbf-3106-4ee6-96cc-b7057ed726d6))
    (pin "8" (uuid 890826dd-df00-4020-9370-1e0062111fe4))
    (pin "9" (uuid 82d75054-96b3-4f97-9c22-280108c682ed))
  )

  (symbol (lib_id "000_PreferredParts:C_1uF") (at 81.28 77.47 0)
    (in_bom yes) (on_board yes)
    (uuid 00000000-0000-0000-0000-00005f87945f)
    (property "Reference" "C1401" (id 0) (at 81.915 74.93 0)
      (effects (font (size 1.27 1.27)) (justify left))
    )
    (property "Value" "C_1uF" (id 1) (at 81.915 80.01 0)
      (effects (font (size 1.27 1.27)) (justify left))
    )
    (property "Footprint" "Capacitor_SMD:C_0603_1608Metric" (id 2) (at 82.2452 81.28 0)
      (effects (font (size 1.27 1.27)) hide)
    )
    (property "Datasheet" "~" (id 3) (at 81.28 77.47 0)
      (effects (font (size 1.27 1.27)) hide)
    )
    (property "PartSpecification" "3000-0000000136" (id 4) (at 81.28 77.47 0)
      (effects (font (size 1.27 1.27)) hide)
    )
    (pin "1" (uuid 052fecd3-51ba-48c4-b4d2-54e9f364fd38))
    (pin "2" (uuid 70aa9b40-7706-4236-858b-96a08e335fcd))
  )

  (symbol (lib_id "000_PreferredParts:C_10nF") (at 90.17 77.47 0)
    (in_bom yes) (on_board yes)
    (uuid 00000000-0000-0000-0000-00005f879f5b)
    (property "Reference" "C1402" (id 0) (at 90.805 74.93 0)
      (effects (font (size 1.27 1.27)) (justify left))
    )
    (property "Value" "C_10nF" (id 1) (at 90.805 80.01 0)
      (effects (font (size 1.27 1.27)) (justify left) hide)
    )
    (property "Footprint" "Capacitor_SMD:C_0402_1005Metric" (id 2) (at 91.1352 81.28 0)
      (effects (font (size 1.27 1.27)) hide)
    )
    (property "Datasheet" "~" (id 3) (at 90.17 77.47 0)
      (effects (font (size 1.27 1.27)) hide)
    )
    (property "DisplayValue" "10nF" (id 4) (at 93.98 80.01 0))
    (property "PartSpecification" "3000-0000000203" (id 5) (at 90.17 77.47 0)
      (effects (font (size 1.27 1.27)) hide)
    )
    (property "Voltage" "50V" (id 6) (at 90.17 77.47 0)
      (effects (font (size 1.27 1.27)) hide)
    )
    (pin "1" (uuid 8f82332e-4597-46c8-9e4a-f90d38f39614))
    (pin "2" (uuid 8788ebfe-a0f8-4ff5-97a2-c9ca6b7014b1))
  )
)
