EESchema Schematic File Version 4
EELAYER 30 0
EELAYER END
$Descr A4 11693 8268
encoding utf-8
Sheet 9 14
Title ""
Date ""
Rev ""
Comp ""
Comment1 ""
Comment2 ""
Comment3 ""
Comment4 ""
$EndDescr
$Comp
L POWDER_RF:SKY66297-11 U?
U 1 1 5DB10C99
P 5400 5200
AR Path="/5DB10C99" Ref="U?"  Part="1" 
AR Path="/5D96ADB0/5DB10C99" Ref="U901"  Part="1" 
F 0 "U901" H 4900 5800 50  0000 R CNN
F 1 "SKY66297-11" H 4900 4700 50  0000 R CNN
F 2 "POWDER_RF:SKY66288-11" H 5400 4300 50  0001 C CNN
F 3 "" H 5300 5200 50  0001 C CNN
F 4 "Skyworks Solutions Inc." H 5400 5200 50  0001 C CNN "Manufacturer"
F 5 "SKY66297-11" H 5400 5200 50  0001 C CNN "PartNumber"
F 6 "3000-0000000081" H 5400 5200 50  0001 C CNN "PartSpecification"
	1    5400 5200
	-1   0    0    -1  
$EndComp
$Comp
L power:GND #PWR?
U 1 1 5DB10C9F
P 4950 5850
AR Path="/5DB10C9F" Ref="#PWR?"  Part="1" 
AR Path="/5D96ADB0/5DB10C9F" Ref="#PWR?"  Part="1" 
F 0 "#PWR?" H 4950 5600 50  0001 C CNN
F 1 "GND" H 4955 5677 50  0000 C CNN
F 2 "" H 4950 5850 50  0001 C CNN
F 3 "" H 4950 5850 50  0001 C CNN
	1    4950 5850
	1    0    0    -1  
$EndComp
$Comp
L power:GND #PWR?
U 1 1 5DB10CA5
P 5050 5850
AR Path="/5DB10CA5" Ref="#PWR?"  Part="1" 
AR Path="/5D96ADB0/5DB10CA5" Ref="#PWR?"  Part="1" 
F 0 "#PWR?" H 5050 5600 50  0001 C CNN
F 1 "GND" H 5055 5677 50  0000 C CNN
F 2 "" H 5050 5850 50  0001 C CNN
F 3 "" H 5050 5850 50  0001 C CNN
	1    5050 5850
	1    0    0    -1  
$EndComp
$Comp
L power:GND #PWR?
U 1 1 5DB10CAB
P 5150 5850
AR Path="/5DB10CAB" Ref="#PWR?"  Part="1" 
AR Path="/5D96ADB0/5DB10CAB" Ref="#PWR?"  Part="1" 
F 0 "#PWR?" H 5150 5600 50  0001 C CNN
F 1 "GND" H 5155 5677 50  0000 C CNN
F 2 "" H 5150 5850 50  0001 C CNN
F 3 "" H 5150 5850 50  0001 C CNN
	1    5150 5850
	1    0    0    -1  
$EndComp
$Comp
L power:GND #PWR?
U 1 1 5DB10CB1
P 5250 5850
AR Path="/5DB10CB1" Ref="#PWR?"  Part="1" 
AR Path="/5D96ADB0/5DB10CB1" Ref="#PWR?"  Part="1" 
F 0 "#PWR?" H 5250 5600 50  0001 C CNN
F 1 "GND" H 5255 5677 50  0000 C CNN
F 2 "" H 5250 5850 50  0001 C CNN
F 3 "" H 5250 5850 50  0001 C CNN
	1    5250 5850
	1    0    0    -1  
$EndComp
$Comp
L power:GND #PWR?
U 1 1 5DB10CB7
P 5350 5850
AR Path="/5DB10CB7" Ref="#PWR?"  Part="1" 
AR Path="/5D96ADB0/5DB10CB7" Ref="#PWR?"  Part="1" 
F 0 "#PWR?" H 5350 5600 50  0001 C CNN
F 1 "GND" H 5355 5677 50  0000 C CNN
F 2 "" H 5350 5850 50  0001 C CNN
F 3 "" H 5350 5850 50  0001 C CNN
	1    5350 5850
	1    0    0    -1  
$EndComp
$Comp
L power:GND #PWR?
U 1 1 5DB10CBD
P 5450 5850
AR Path="/5DB10CBD" Ref="#PWR?"  Part="1" 
AR Path="/5D96ADB0/5DB10CBD" Ref="#PWR?"  Part="1" 
F 0 "#PWR?" H 5450 5600 50  0001 C CNN
F 1 "GND" H 5455 5677 50  0000 C CNN
F 2 "" H 5450 5850 50  0001 C CNN
F 3 "" H 5450 5850 50  0001 C CNN
	1    5450 5850
	1    0    0    -1  
$EndComp
$Comp
L power:GND #PWR?
U 1 1 5DB10CC3
P 5550 5850
AR Path="/5DB10CC3" Ref="#PWR?"  Part="1" 
AR Path="/5D96ADB0/5DB10CC3" Ref="#PWR?"  Part="1" 
F 0 "#PWR?" H 5550 5600 50  0001 C CNN
F 1 "GND" H 5555 5677 50  0000 C CNN
F 2 "" H 5550 5850 50  0001 C CNN
F 3 "" H 5550 5850 50  0001 C CNN
	1    5550 5850
	1    0    0    -1  
$EndComp
$Comp
L power:GND #PWR?
U 1 1 5DB10CC9
P 5650 5850
AR Path="/5DB10CC9" Ref="#PWR?"  Part="1" 
AR Path="/5D96ADB0/5DB10CC9" Ref="#PWR?"  Part="1" 
F 0 "#PWR?" H 5650 5600 50  0001 C CNN
F 1 "GND" H 5655 5677 50  0000 C CNN
F 2 "" H 5650 5850 50  0001 C CNN
F 3 "" H 5650 5850 50  0001 C CNN
	1    5650 5850
	1    0    0    -1  
$EndComp
$Comp
L power:GND #PWR?
U 1 1 5DB10CCF
P 5750 5850
AR Path="/5DB10CCF" Ref="#PWR?"  Part="1" 
AR Path="/5D96ADB0/5DB10CCF" Ref="#PWR?"  Part="1" 
F 0 "#PWR?" H 5750 5600 50  0001 C CNN
F 1 "GND" H 5755 5677 50  0000 C CNN
F 2 "" H 5750 5850 50  0001 C CNN
F 3 "" H 5750 5850 50  0001 C CNN
	1    5750 5850
	1    0    0    -1  
$EndComp
$Comp
L power:GND #PWR?
U 1 1 5DB10CD5
P 5850 5850
AR Path="/5DB10CD5" Ref="#PWR?"  Part="1" 
AR Path="/5D96ADB0/5DB10CD5" Ref="#PWR?"  Part="1" 
F 0 "#PWR?" H 5850 5600 50  0001 C CNN
F 1 "GND" H 5855 5677 50  0000 C CNN
F 2 "" H 5850 5850 50  0001 C CNN
F 3 "" H 5850 5850 50  0001 C CNN
	1    5850 5850
	1    0    0    -1  
$EndComp
Wire Wire Line
	4950 5750 4950 5850
Wire Wire Line
	5050 5850 5050 5750
Wire Wire Line
	5150 5750 5150 5850
Wire Wire Line
	5250 5850 5250 5750
Wire Wire Line
	5350 5750 5350 5850
Wire Wire Line
	5450 5850 5450 5750
Wire Wire Line
	5550 5750 5550 5850
Wire Wire Line
	5650 5750 5650 5850
Wire Wire Line
	5750 5850 5750 5750
Wire Wire Line
	5850 5750 5850 5850
Wire Wire Line
	5250 2350 5600 2350
$Comp
L power:GND #PWR?
U 1 1 5DB10CE6
P 5600 3100
AR Path="/5DB10CE6" Ref="#PWR?"  Part="1" 
AR Path="/5D96ADB0/5DB10CE6" Ref="#PWR?"  Part="1" 
F 0 "#PWR?" H 5600 2850 50  0001 C CNN
F 1 "GND" H 5605 2927 50  0000 C CNN
F 2 "" H 5600 3100 50  0001 C CNN
F 3 "" H 5600 3100 50  0001 C CNN
	1    5600 3100
	1    0    0    -1  
$EndComp
Wire Wire Line
	5250 2350 5250 4550
Wire Wire Line
	5600 3100 5600 3000
Wire Wire Line
	5600 2700 5600 2350
$Comp
L 000_PreferredParts:C_0_1uF C?
U 1 1 5DB10CF1
P 3700 3500
AR Path="/5DB10CF1" Ref="C?"  Part="1" 
AR Path="/5D96ADB0/5DB10CF1" Ref="C902"  Part="1" 
F 0 "C902" H 3815 3546 50  0000 L CNN
F 1 "0.1u" H 3815 3455 50  0000 L CNN
F 2 "Capacitor_SMD:C_0402_1005Metric" H 3738 3350 50  0001 C CNN
F 3 "~" H 3700 3500 50  0001 C CNN
F 4 "Murata Electronics" H 3700 3500 50  0001 C CNN "Manufacturer"
F 5 "GRM155R62A104KE14D" H 3700 3500 50  0001 C CNN "PartNumber"
F 6 "0.1uF" H 3700 3500 50  0001 C CNN "DisplayValue"
F 7 "3000-0000000125" H 3700 3500 50  0001 C CNN "PartSpecification"
	1    3700 3500
	1    0    0    -1  
$EndComp
$Comp
L power:GND #PWR?
U 1 1 5DB10CF7
P 3700 3800
AR Path="/5DB10CF7" Ref="#PWR?"  Part="1" 
AR Path="/5D96ADB0/5DB10CF7" Ref="#PWR?"  Part="1" 
F 0 "#PWR?" H 3700 3550 50  0001 C CNN
F 1 "GND" H 3705 3627 50  0000 C CNN
F 2 "" H 3700 3800 50  0001 C CNN
F 3 "" H 3700 3800 50  0001 C CNN
	1    3700 3800
	1    0    0    -1  
$EndComp
Wire Wire Line
	3700 3650 3700 3800
$Comp
L power:GND #PWR?
U 1 1 5DB10CFE
P 4100 3800
AR Path="/5DB10CFE" Ref="#PWR?"  Part="1" 
AR Path="/5D96ADB0/5DB10CFE" Ref="#PWR?"  Part="1" 
F 0 "#PWR?" H 4100 3550 50  0001 C CNN
F 1 "GND" H 4105 3627 50  0000 C CNN
F 2 "" H 4100 3800 50  0001 C CNN
F 3 "" H 4100 3800 50  0001 C CNN
	1    4100 3800
	1    0    0    -1  
$EndComp
Wire Wire Line
	4100 3650 4100 3800
Wire Wire Line
	4100 3200 4100 3350
$Comp
L 000_PreferredParts:C_10pF C?
U 1 1 5DB10D08
P 4600 3500
AR Path="/5DB10D08" Ref="C?"  Part="1" 
AR Path="/5D96ADB0/5DB10D08" Ref="C904"  Part="1" 
F 0 "C904" H 4715 3546 50  0000 L CNN
F 1 "C_10pF" H 4625 3400 50  0000 L CNN
F 2 "Capacitor_SMD:C_0402_1005Metric" H 4638 3350 50  0001 C CNN
F 3 "~" H 4600 3500 50  0001 C CNN
F 4 "Murata Electronics" H 4600 3500 50  0001 C CNN "Manufacturer"
F 5 "GJM0336C1E100GB01D" H 4600 3500 50  0001 C CNN "PartNumber"
F 6 "3000-0000000582" H 4600 3500 50  0001 C CNN "PartSpecification"
	1    4600 3500
	1    0    0    -1  
$EndComp
$Comp
L power:GND #PWR?
U 1 1 5DB10D0E
P 4600 3800
AR Path="/5DB10D0E" Ref="#PWR?"  Part="1" 
AR Path="/5D96ADB0/5DB10D0E" Ref="#PWR?"  Part="1" 
F 0 "#PWR?" H 4600 3550 50  0001 C CNN
F 1 "GND" H 4605 3627 50  0000 C CNN
F 2 "" H 4600 3800 50  0001 C CNN
F 3 "" H 4600 3800 50  0001 C CNN
	1    4600 3800
	1    0    0    -1  
$EndComp
Wire Wire Line
	4600 3650 4600 3800
Wire Wire Line
	4600 3200 4600 3350
Wire Wire Line
	4600 3200 4100 3200
Connection ~ 4100 3200
Wire Wire Line
	4600 3200 5050 3200
Wire Wire Line
	5050 3200 5050 4550
Connection ~ 4600 3200
Wire Wire Line
	3700 3200 4100 3200
$Comp
L 000_PreferredParts:C_10uF_0603 C?
U 1 1 5DB10D1E
P 3300 3500
AR Path="/5DB10D1E" Ref="C?"  Part="1" 
AR Path="/5D96ADB0/5DB10D1E" Ref="C901"  Part="1" 
F 0 "C901" H 3415 3546 50  0000 L CNN
F 1 "10u" H 3415 3455 50  0001 L CNN
F 2 "Capacitor_SMD:C_0603_1608Metric" H 3338 3350 50  0001 C CNN
F 3 "~" H 3300 3500 50  0001 C CNN
F 4 "Murata Electronics" H 3300 3500 50  0001 C CNN "Manufacturer"
F 5 "GRM188R6YA106MA73D" H 3300 3500 50  0001 C CNN "PartNumber"
F 6 "3000-0000000135" H 3300 3500 50  0001 C CNN "PartSpecification"
F 7 "0603" H 3450 3300 50  0000 C CNN "DisplayFootprint"
F 8 "10uF" H 3450 3400 50  0000 C CNN "DisplayValue"
	1    3300 3500
	1    0    0    -1  
$EndComp
$Comp
L power:GND #PWR?
U 1 1 5DB10D24
P 3300 3800
AR Path="/5DB10D24" Ref="#PWR?"  Part="1" 
AR Path="/5D96ADB0/5DB10D24" Ref="#PWR?"  Part="1" 
F 0 "#PWR?" H 3300 3550 50  0001 C CNN
F 1 "GND" H 3305 3627 50  0000 C CNN
F 2 "" H 3300 3800 50  0001 C CNN
F 3 "" H 3300 3800 50  0001 C CNN
	1    3300 3800
	1    0    0    -1  
$EndComp
Wire Wire Line
	3300 3650 3300 3800
Wire Wire Line
	3300 3350 3300 3200
Wire Wire Line
	3300 3200 3700 3200
Wire Wire Line
	3700 3350 3700 3200
Connection ~ 3700 3200
$Comp
L 000_PreferredParts:C_0_1uF C?
U 1 1 5DB10D31
P 7200 4300
AR Path="/5DB10D31" Ref="C?"  Part="1" 
AR Path="/5D96ADB0/5DB10D31" Ref="C911"  Part="1" 
F 0 "C911" H 7315 4346 50  0000 L CNN
F 1 "C_0_1uF" H 7225 4200 50  0001 L CNN
F 2 "Capacitor_SMD:C_0402_1005Metric" H 7238 4150 50  0001 C CNN
F 3 "~" H 7200 4300 50  0001 C CNN
F 4 "Murata Electronics" H 7200 4300 50  0001 C CNN "Manufacturer"
F 5 "GRM155R62A104KE14D" H 7200 4300 50  0001 C CNN "PartNumber"
F 6 "0.1uF" H 7350 4200 50  0000 C CNN "DisplayValue"
F 7 "3000-0000000125" H 7200 4300 50  0001 C CNN "PartSpecification"
	1    7200 4300
	1    0    0    -1  
$EndComp
$Comp
L power:GND #PWR?
U 1 1 5DB10D37
P 7200 4600
AR Path="/5DB10D37" Ref="#PWR?"  Part="1" 
AR Path="/5D96ADB0/5DB10D37" Ref="#PWR?"  Part="1" 
F 0 "#PWR?" H 7200 4350 50  0001 C CNN
F 1 "GND" H 7205 4427 50  0000 C CNN
F 2 "" H 7200 4600 50  0001 C CNN
F 3 "" H 7200 4600 50  0001 C CNN
	1    7200 4600
	1    0    0    -1  
$EndComp
Wire Wire Line
	7200 4450 7200 4600
$Comp
L power:GND #PWR?
U 1 1 5DB10D3E
P 6750 4600
AR Path="/5DB10D3E" Ref="#PWR?"  Part="1" 
AR Path="/5D96ADB0/5DB10D3E" Ref="#PWR?"  Part="1" 
F 0 "#PWR?" H 6750 4350 50  0001 C CNN
F 1 "GND" H 6755 4427 50  0000 C CNN
F 2 "" H 6750 4600 50  0001 C CNN
F 3 "" H 6750 4600 50  0001 C CNN
	1    6750 4600
	1    0    0    -1  
$EndComp
Wire Wire Line
	6750 4450 6750 4600
Wire Wire Line
	6750 4000 6750 4150
$Comp
L 000_PreferredParts:C_10pF C?
U 1 1 5DB10D48
P 6350 4300
AR Path="/5DB10D48" Ref="C?"  Part="1" 
AR Path="/5D96ADB0/5DB10D48" Ref="C917"  Part="1" 
F 0 "C917" H 6465 4346 50  0000 L CNN
F 1 "C_10pF" H 6375 4200 50  0000 L CNN
F 2 "Capacitor_SMD:C_0402_1005Metric" H 6388 4150 50  0001 C CNN
F 3 "~" H 6350 4300 50  0001 C CNN
F 4 "Murata Electronics" H 6350 4300 50  0001 C CNN "Manufacturer"
F 5 "GJM0336C1E100GB01D" H 6350 4300 50  0001 C CNN "PartNumber"
F 6 "3000-0000000582" H 6350 4300 50  0001 C CNN "PartSpecification"
	1    6350 4300
	1    0    0    -1  
$EndComp
$Comp
L power:GND #PWR?
U 1 1 5DB10D4E
P 6350 4600
AR Path="/5DB10D4E" Ref="#PWR?"  Part="1" 
AR Path="/5D96ADB0/5DB10D4E" Ref="#PWR?"  Part="1" 
F 0 "#PWR?" H 6350 4350 50  0001 C CNN
F 1 "GND" H 6355 4427 50  0000 C CNN
F 2 "" H 6350 4600 50  0001 C CNN
F 3 "" H 6350 4600 50  0001 C CNN
	1    6350 4600
	1    0    0    -1  
$EndComp
Wire Wire Line
	6350 4450 6350 4600
Wire Wire Line
	6350 4000 6350 4150
$Comp
L 000_PreferredParts:C_10uF_0603 C?
U 1 1 5DB10D5B
P 7600 4300
AR Path="/5DB10D5B" Ref="C?"  Part="1" 
AR Path="/5D96ADB0/5DB10D5B" Ref="C908"  Part="1" 
F 0 "C908" H 7715 4346 50  0000 L CNN
F 1 "C_10uF_0603" H 7625 4200 50  0001 L CNN
F 2 "Capacitor_SMD:C_0603_1608Metric" H 7638 4150 50  0001 C CNN
F 3 "~" H 7600 4300 50  0001 C CNN
F 4 "Murata Electronics" H 7600 4300 50  0001 C CNN "Manufacturer"
F 5 "GRM188R6YA106MA73D" H 7600 4300 50  0001 C CNN "PartNumber"
F 6 "3000-0000000135" H 7600 4300 50  0001 C CNN "PartSpecification"
F 7 "0603" H 7750 4100 50  0000 C CNN "DisplayFootprint"
F 8 "10uF" H 7750 4200 50  0000 C CNN "DisplayValue"
	1    7600 4300
	1    0    0    -1  
$EndComp
$Comp
L power:GND #PWR?
U 1 1 5DB10D61
P 7600 4600
AR Path="/5DB10D61" Ref="#PWR?"  Part="1" 
AR Path="/5D96ADB0/5DB10D61" Ref="#PWR?"  Part="1" 
F 0 "#PWR?" H 7600 4350 50  0001 C CNN
F 1 "GND" H 7605 4427 50  0000 C CNN
F 2 "" H 7600 4600 50  0001 C CNN
F 3 "" H 7600 4600 50  0001 C CNN
	1    7600 4600
	1    0    0    -1  
$EndComp
Wire Wire Line
	7600 4450 7600 4600
Wire Wire Line
	7600 4150 7600 4000
Wire Wire Line
	7200 4150 7200 4000
$Comp
L 000_PreferredParts:C_0_1uF C?
U 1 1 5DB10D6E
P 7800 3300
AR Path="/5DB10D6E" Ref="C?"  Part="1" 
AR Path="/5D96ADB0/5DB10D6E" Ref="C913"  Part="1" 
F 0 "C913" H 7915 3346 50  0000 L CNN
F 1 "C_0_1uF" H 7825 3200 50  0001 L CNN
F 2 "Capacitor_SMD:C_0402_1005Metric" H 7838 3150 50  0001 C CNN
F 3 "~" H 7800 3300 50  0001 C CNN
F 4 "Murata Electronics" H 7800 3300 50  0001 C CNN "Manufacturer"
F 5 "GRM155R62A104KE14D" H 7800 3300 50  0001 C CNN "PartNumber"
F 6 "0.1uF" H 7950 3200 50  0000 C CNN "DisplayValue"
F 7 "3000-0000000125" H 7800 3300 50  0001 C CNN "PartSpecification"
	1    7800 3300
	1    0    0    -1  
$EndComp
$Comp
L power:GND #PWR?
U 1 1 5DB10D74
P 7800 3600
AR Path="/5DB10D74" Ref="#PWR?"  Part="1" 
AR Path="/5D96ADB0/5DB10D74" Ref="#PWR?"  Part="1" 
F 0 "#PWR?" H 7800 3350 50  0001 C CNN
F 1 "GND" H 7805 3427 50  0000 C CNN
F 2 "" H 7800 3600 50  0001 C CNN
F 3 "" H 7800 3600 50  0001 C CNN
	1    7800 3600
	1    0    0    -1  
$EndComp
Wire Wire Line
	7800 3450 7800 3600
$Comp
L power:GND #PWR?
U 1 1 5DB10D7B
P 7350 3600
AR Path="/5DB10D7B" Ref="#PWR?"  Part="1" 
AR Path="/5D96ADB0/5DB10D7B" Ref="#PWR?"  Part="1" 
F 0 "#PWR?" H 7350 3350 50  0001 C CNN
F 1 "GND" H 7355 3427 50  0000 C CNN
F 2 "" H 7350 3600 50  0001 C CNN
F 3 "" H 7350 3600 50  0001 C CNN
	1    7350 3600
	1    0    0    -1  
$EndComp
Wire Wire Line
	7350 3450 7350 3600
Wire Wire Line
	7350 3000 7350 3150
$Comp
L 000_PreferredParts:C_10pF C?
U 1 1 5DB10D85
P 6950 3300
AR Path="/5DB10D85" Ref="C?"  Part="1" 
AR Path="/5D96ADB0/5DB10D85" Ref="C919"  Part="1" 
F 0 "C919" H 7065 3346 50  0000 L CNN
F 1 "C_10pF" H 6975 3200 50  0000 L CNN
F 2 "Capacitor_SMD:C_0402_1005Metric" H 6988 3150 50  0001 C CNN
F 3 "~" H 6950 3300 50  0001 C CNN
F 4 "Murata Electronics" H 6950 3300 50  0001 C CNN "Manufacturer"
F 5 "GJM0336C1E100GB01D" H 6950 3300 50  0001 C CNN "PartNumber"
F 6 "3000-0000000582" H 6950 3300 50  0001 C CNN "PartSpecification"
	1    6950 3300
	1    0    0    -1  
$EndComp
$Comp
L power:GND #PWR?
U 1 1 5DB10D8B
P 6950 3600
AR Path="/5DB10D8B" Ref="#PWR?"  Part="1" 
AR Path="/5D96ADB0/5DB10D8B" Ref="#PWR?"  Part="1" 
F 0 "#PWR?" H 6950 3350 50  0001 C CNN
F 1 "GND" H 6955 3427 50  0000 C CNN
F 2 "" H 6950 3600 50  0001 C CNN
F 3 "" H 6950 3600 50  0001 C CNN
	1    6950 3600
	1    0    0    -1  
$EndComp
Wire Wire Line
	6950 3450 6950 3600
Wire Wire Line
	6950 3000 6950 3150
$Comp
L 000_PreferredParts:C_10uF_0603 C?
U 1 1 5DB10D98
P 8200 3300
AR Path="/5DB10D98" Ref="C?"  Part="1" 
AR Path="/5D96ADB0/5DB10D98" Ref="C910"  Part="1" 
F 0 "C910" H 8315 3346 50  0000 L CNN
F 1 "C_10uF_0603" H 8225 3200 50  0001 L CNN
F 2 "Capacitor_SMD:C_0603_1608Metric" H 8238 3150 50  0001 C CNN
F 3 "~" H 8200 3300 50  0001 C CNN
F 4 "Murata Electronics" H 8200 3300 50  0001 C CNN "Manufacturer"
F 5 "GRM188R6YA106MA73D" H 8200 3300 50  0001 C CNN "PartNumber"
F 6 "3000-0000000135" H 8200 3300 50  0001 C CNN "PartSpecification"
F 7 "0603" H 8350 3100 50  0000 C CNN "DisplayFootprint"
F 8 "10uF" H 8350 3200 50  0000 C CNN "DisplayValue"
	1    8200 3300
	1    0    0    -1  
$EndComp
$Comp
L power:GND #PWR?
U 1 1 5DB10D9E
P 8200 3600
AR Path="/5DB10D9E" Ref="#PWR?"  Part="1" 
AR Path="/5D96ADB0/5DB10D9E" Ref="#PWR?"  Part="1" 
F 0 "#PWR?" H 8200 3350 50  0001 C CNN
F 1 "GND" H 8205 3427 50  0000 C CNN
F 2 "" H 8200 3600 50  0001 C CNN
F 3 "" H 8200 3600 50  0001 C CNN
	1    8200 3600
	1    0    0    -1  
$EndComp
Wire Wire Line
	8200 3450 8200 3600
Wire Wire Line
	8200 3150 8200 3000
Wire Wire Line
	7800 3150 7800 3000
Wire Wire Line
	5750 4550 5750 4000
Wire Wire Line
	5650 4550 5650 3700
Wire Wire Line
	6800 3700 6800 3000
Text Label 4700 3200 0    50   ~ 0
pa_vcc3
Text Label 6100 4000 0    50   ~ 0
pa_vcc1
Text Label 6450 3700 0    50   ~ 0
pa_vcc2
Text Label 5300 2350 0    50   ~ 0
pa_en
Wire Wire Line
	5450 4550 5450 3450
$Comp
L Device:C C?
U 1 1 5DB10DB5
P 7350 2000
AR Path="/5DB10DB5" Ref="C?"  Part="1" 
AR Path="/5D96ADB0/5DB10DB5" Ref="C912"  Part="1" 
F 0 "C912" H 7465 2046 50  0000 L CNN
F 1 "DNP" H 7465 1955 50  0000 L CNN
F 2 "Capacitor_SMD:C_0402_1005Metric" H 7388 1850 50  0001 C CNN
F 3 "~" H 7350 2000 50  0001 C CNN
	1    7350 2000
	1    0    0    -1  
$EndComp
$Comp
L Device:C C?
U 1 1 5DB10DBB
P 7750 2000
AR Path="/5DB10DBB" Ref="C?"  Part="1" 
AR Path="/5D96ADB0/5DB10DBB" Ref="C915"  Part="1" 
F 0 "C915" H 7865 2046 50  0000 L CNN
F 1 "DNP" H 7865 1955 50  0000 L CNN
F 2 "Capacitor_SMD:C_0402_1005Metric" H 7788 1850 50  0001 C CNN
F 3 "~" H 7750 2000 50  0001 C CNN
	1    7750 2000
	1    0    0    -1  
$EndComp
$Comp
L power:GND #PWR?
U 1 1 5DB10DC1
P 7350 2300
AR Path="/5DB10DC1" Ref="#PWR?"  Part="1" 
AR Path="/5D96ADB0/5DB10DC1" Ref="#PWR?"  Part="1" 
F 0 "#PWR?" H 7350 2050 50  0001 C CNN
F 1 "GND" H 7355 2127 50  0000 C CNN
F 2 "" H 7350 2300 50  0001 C CNN
F 3 "" H 7350 2300 50  0001 C CNN
	1    7350 2300
	1    0    0    -1  
$EndComp
Wire Wire Line
	7350 2150 7350 2300
$Comp
L power:GND #PWR?
U 1 1 5DB10DC8
P 7750 2300
AR Path="/5DB10DC8" Ref="#PWR?"  Part="1" 
AR Path="/5D96ADB0/5DB10DC8" Ref="#PWR?"  Part="1" 
F 0 "#PWR?" H 7750 2050 50  0001 C CNN
F 1 "GND" H 7755 2127 50  0000 C CNN
F 2 "" H 7750 2300 50  0001 C CNN
F 3 "" H 7750 2300 50  0001 C CNN
	1    7750 2300
	1    0    0    -1  
$EndComp
Wire Wire Line
	7750 2150 7750 2300
Wire Wire Line
	7750 1700 7750 1850
$Comp
L Device:C C?
U 1 1 5DB10DD0
P 8100 2000
AR Path="/5DB10DD0" Ref="C?"  Part="1" 
AR Path="/5D96ADB0/5DB10DD0" Ref="C918"  Part="1" 
F 0 "C918" H 8215 2046 50  0000 L CNN
F 1 "DNP" H 8215 1955 50  0000 L CNN
F 2 "Capacitor_SMD:C_0402_1005Metric" H 8138 1850 50  0001 C CNN
F 3 "~" H 8100 2000 50  0001 C CNN
	1    8100 2000
	1    0    0    -1  
$EndComp
$Comp
L power:GND #PWR?
U 1 1 5DB10DD6
P 8100 2300
AR Path="/5DB10DD6" Ref="#PWR?"  Part="1" 
AR Path="/5D96ADB0/5DB10DD6" Ref="#PWR?"  Part="1" 
F 0 "#PWR?" H 8100 2050 50  0001 C CNN
F 1 "GND" H 8105 2127 50  0000 C CNN
F 2 "" H 8100 2300 50  0001 C CNN
F 3 "" H 8100 2300 50  0001 C CNN
	1    8100 2300
	1    0    0    -1  
$EndComp
Wire Wire Line
	8100 2150 8100 2300
Wire Wire Line
	8100 1700 8100 1850
Wire Wire Line
	8100 1700 7750 1700
Connection ~ 7750 1700
Wire Wire Line
	7350 1700 7750 1700
$Comp
L Device:C C?
U 1 1 5DB10DE3
P 6950 2000
AR Path="/5DB10DE3" Ref="C?"  Part="1" 
AR Path="/5D96ADB0/5DB10DE3" Ref="C909"  Part="1" 
F 0 "C909" H 7065 2046 50  0000 L CNN
F 1 "1u" H 7065 1955 50  0000 L CNN
F 2 "Capacitor_SMD:C_0402_1005Metric" H 6988 1850 50  0001 C CNN
F 3 "~" H 6950 2000 50  0001 C CNN
F 4 "TDK Corporation" H 6950 2000 50  0001 C CNN "Manufacturer"
F 5 "C1005X5R1V105K050BE" H 6950 2000 50  0001 C CNN "PartNumber"
F 6 "3000-0000000153" H 6950 2000 50  0001 C CNN "PartSpecification"
	1    6950 2000
	1    0    0    -1  
$EndComp
$Comp
L power:GND #PWR?
U 1 1 5DB10DE9
P 6950 2300
AR Path="/5DB10DE9" Ref="#PWR?"  Part="1" 
AR Path="/5D96ADB0/5DB10DE9" Ref="#PWR?"  Part="1" 
F 0 "#PWR?" H 6950 2050 50  0001 C CNN
F 1 "GND" H 6955 2127 50  0000 C CNN
F 2 "" H 6950 2300 50  0001 C CNN
F 3 "" H 6950 2300 50  0001 C CNN
	1    6950 2300
	1    0    0    -1  
$EndComp
Wire Wire Line
	6950 2150 6950 2300
Wire Wire Line
	6950 1850 6950 1700
Wire Wire Line
	6950 1700 7350 1700
Wire Wire Line
	7350 1850 7350 1700
Connection ~ 7350 1700
Connection ~ 6950 1700
Wire Wire Line
	6700 1700 6700 3450
Wire Wire Line
	6700 1700 6950 1700
Text Label 6350 3450 0    50   ~ 0
pa_vbias
Wire Wire Line
	6700 1700 6600 1700
Wire Wire Line
	8800 3000 8700 3000
Wire Wire Line
	8850 4000 8750 4000
$Comp
L Device:L L?
U 1 1 5DB10E02
P 8600 4000
AR Path="/5DB10E02" Ref="L?"  Part="1" 
AR Path="/5D96ADB0/5DB10E02" Ref="L904"  Part="1" 
F 0 "L904" V 8790 4000 50  0000 C CNN
F 1 "BEAD" V 8699 4000 50  0000 C CNN
F 2 "Inductor_SMD:L_0603_1608Metric" H 8600 4000 50  0001 C CNN
F 3 "~" H 8600 4000 50  0001 C CNN
F 4 "BLM18EG221SZ1" V 8600 4000 50  0001 C CNN "PartNumber"
F 5 "Murata Electronics" H 8600 4000 50  0001 C CNN "Manufacturer"
F 6 "3000-0000000091" H 8600 4000 50  0001 C CNN "PartSpecification"
	1    8600 4000
	0    -1   -1   0   
$EndComp
$Comp
L Device:L L?
U 1 1 5DB10E0A
P 8550 3000
AR Path="/5DB10E0A" Ref="L?"  Part="1" 
AR Path="/5D96ADB0/5DB10E0A" Ref="L903"  Part="1" 
F 0 "L903" V 8740 3000 50  0000 C CNN
F 1 "BEAD" V 8649 3000 50  0000 C CNN
F 2 "Inductor_SMD:L_0603_1608Metric" H 8550 3000 50  0001 C CNN
F 3 "~" H 8550 3000 50  0001 C CNN
F 4 "BLM18EG221SZ1" V 8550 3000 50  0001 C CNN "PartNumber"
F 5 "Murata Electronics" H 8550 3000 50  0001 C CNN "Manufacturer"
F 6 "3000-0000000091" H 8550 3000 50  0001 C CNN "PartSpecification"
	1    8550 3000
	0    -1   -1   0   
$EndComp
$Comp
L Device:L L?
U 1 1 5DB10E1A
P 6450 1700
AR Path="/5DB10E1A" Ref="L?"  Part="1" 
AR Path="/5D96ADB0/5DB10E1A" Ref="L901"  Part="1" 
F 0 "L901" V 6640 1700 50  0000 C CNN
F 1 "BEAD" V 6549 1700 50  0000 C CNN
F 2 "Inductor_SMD:L_0603_1608Metric" H 6450 1700 50  0001 C CNN
F 3 "~" H 6450 1700 50  0001 C CNN
F 4 "BLM18EG221SZ1" V 6450 1700 50  0001 C CNN "PartNumber"
F 5 "Murata Electronics" H 6450 1700 50  0001 C CNN "Manufacturer"
F 6 "3000-0000000091" H 6450 1700 50  0001 C CNN "PartSpecification"
	1    6450 1700
	0    -1   -1   0   
$EndComp
Wire Wire Line
	5450 3450 6700 3450
$Comp
L 000_PreferredParts:C_1nF C?
U 1 1 5DB10E24
P 5600 2850
AR Path="/5DB10E24" Ref="C?"  Part="1" 
AR Path="/5D96ADB0/5DB10E24" Ref="C905"  Part="1" 
F 0 "C905" H 5715 2896 50  0000 L CNN
F 1 "C_1nF" H 5715 2805 50  0000 L CNN
F 2 "Capacitor_SMD:C_0402_1005Metric" H 5638 2700 50  0001 C CNN
F 3 "~" H 5600 2850 50  0001 C CNN
F 4 "Wurth Electronics Inc." H 5600 2850 50  0001 C CNN "Manufacturer"
F 5 "885012205061" H 5600 2850 50  0001 C CNN "PartNumber"
F 6 "3000-0000000128" H 0   0   50  0001 C CNN "PartSpecification"
	1    5600 2850
	1    0    0    -1  
$EndComp
$Comp
L 000_PreferredParts:C_1nF C?
U 1 1 5DB10E2C
P 6000 2600
AR Path="/5DB10E2C" Ref="C?"  Part="1" 
AR Path="/5D96ADB0/5DB10E2C" Ref="C906"  Part="1" 
F 0 "C906" H 6115 2646 50  0000 L CNN
F 1 "C_1nF" H 6115 2555 50  0000 L CNN
F 2 "Capacitor_SMD:C_0402_1005Metric" H 6038 2450 50  0001 C CNN
F 3 "~" H 6000 2600 50  0001 C CNN
F 4 "Wurth Electronics Inc." H 6000 2600 50  0001 C CNN "Manufacturer"
F 5 "885012205061" H 6000 2600 50  0001 C CNN "PartNumber"
F 6 "3000-0000000128" H 0   0   50  0001 C CNN "PartSpecification"
	1    6000 2600
	1    0    0    -1  
$EndComp
$Comp
L 000_PreferredParts:C_1nF C?
U 1 1 5DB10E34
P 6350 2850
AR Path="/5DB10E34" Ref="C?"  Part="1" 
AR Path="/5D96ADB0/5DB10E34" Ref="C907"  Part="1" 
F 0 "C907" H 6465 2896 50  0000 L CNN
F 1 "C_1nF" H 6465 2805 50  0000 L CNN
F 2 "Capacitor_SMD:C_0402_1005Metric" H 6388 2700 50  0001 C CNN
F 3 "~" H 6350 2850 50  0001 C CNN
F 4 "Wurth Electronics Inc." H 6350 2850 50  0001 C CNN "Manufacturer"
F 5 "885012205061" H 6350 2850 50  0001 C CNN "PartNumber"
F 6 "3000-0000000128" H 0   0   50  0001 C CNN "PartSpecification"
	1    6350 2850
	1    0    0    -1  
$EndComp
Wire Wire Line
	5650 3700 6800 3700
Wire Wire Line
	6350 2700 6350 2350
Wire Wire Line
	6350 2350 6000 2350
Connection ~ 5600 2350
Wire Wire Line
	6000 2350 6000 2450
Connection ~ 6000 2350
Wire Wire Line
	6000 2350 5600 2350
$Comp
L power:GND #PWR?
U 1 1 5DB10E41
P 6000 3100
AR Path="/5DB10E41" Ref="#PWR?"  Part="1" 
AR Path="/5D96ADB0/5DB10E41" Ref="#PWR?"  Part="1" 
F 0 "#PWR?" H 6000 2850 50  0001 C CNN
F 1 "GND" H 6005 2927 50  0000 C CNN
F 2 "" H 6000 3100 50  0001 C CNN
F 3 "" H 6000 3100 50  0001 C CNN
	1    6000 3100
	1    0    0    -1  
$EndComp
Wire Wire Line
	6000 2750 6000 3100
$Comp
L power:GND #PWR?
U 1 1 5DB10E48
P 6350 3100
AR Path="/5DB10E48" Ref="#PWR?"  Part="1" 
AR Path="/5D96ADB0/5DB10E48" Ref="#PWR?"  Part="1" 
F 0 "#PWR?" H 6350 2850 50  0001 C CNN
F 1 "GND" H 6355 2927 50  0000 C CNN
F 2 "" H 6350 3100 50  0001 C CNN
F 3 "" H 6350 3100 50  0001 C CNN
	1    6350 3100
	1    0    0    -1  
$EndComp
Wire Wire Line
	6350 3100 6350 3000
$Comp
L 000_PreferredParts:C_1nF C?
U 1 1 5DB10E51
P 7350 3300
AR Path="/5DB10E51" Ref="C?"  Part="1" 
AR Path="/5D96ADB0/5DB10E51" Ref="C916"  Part="1" 
F 0 "C916" H 7465 3346 50  0000 L CNN
F 1 "C_1nF" H 7465 3255 50  0000 L CNN
F 2 "Capacitor_SMD:C_0402_1005Metric" H 7388 3150 50  0001 C CNN
F 3 "~" H 7350 3300 50  0001 C CNN
F 4 "Wurth Electronics Inc." H 7350 3300 50  0001 C CNN "Manufacturer"
F 5 "885012205061" H 7350 3300 50  0001 C CNN "PartNumber"
F 6 "3000-0000000128" H 0   0   50  0001 C CNN "PartSpecification"
	1    7350 3300
	1    0    0    -1  
$EndComp
$Comp
L 000_PreferredParts:C_1nF C?
U 1 1 5DB10E59
P 6750 4300
AR Path="/5DB10E59" Ref="C?"  Part="1" 
AR Path="/5D96ADB0/5DB10E59" Ref="C914"  Part="1" 
F 0 "C914" H 6865 4346 50  0000 L CNN
F 1 "C_1nF" H 6865 4255 50  0000 L CNN
F 2 "Capacitor_SMD:C_0402_1005Metric" H 6788 4150 50  0001 C CNN
F 3 "~" H 6750 4300 50  0001 C CNN
F 4 "Wurth Electronics Inc." H 6750 4300 50  0001 C CNN "Manufacturer"
F 5 "885012205061" H 6750 4300 50  0001 C CNN "PartNumber"
F 6 "3000-0000000128" H 0   0   50  0001 C CNN "PartSpecification"
	1    6750 4300
	1    0    0    -1  
$EndComp
$Comp
L 000_PreferredParts:C_1nF C?
U 1 1 5DB10E61
P 4100 3500
AR Path="/5DB10E61" Ref="C?"  Part="1" 
AR Path="/5D96ADB0/5DB10E61" Ref="C903"  Part="1" 
F 0 "C903" H 4215 3546 50  0000 L CNN
F 1 "C_1nF" H 4215 3455 50  0000 L CNN
F 2 "Capacitor_SMD:C_0402_1005Metric" H 4138 3350 50  0001 C CNN
F 3 "~" H 4100 3500 50  0001 C CNN
F 4 "Wurth Electronics Inc." H 4100 3500 50  0001 C CNN "Manufacturer"
F 5 "885012205061" H 4100 3500 50  0001 C CNN "PartNumber"
F 6 "3000-0000000128" H 0   0   50  0001 C CNN "PartSpecification"
	1    4100 3500
	1    0    0    -1  
$EndComp
Wire Wire Line
	8400 3000 8200 3000
Wire Wire Line
	8450 4000 7600 4000
Wire Wire Line
	6300 1700 6100 1700
Text HLabel 6100 1700 0    50   Input ~ 0
VBIAS
Text HLabel 8800 3000 2    50   Input ~ 0
VCC2
Text HLabel 8850 4000 2    50   Input ~ 0
VCC1
Text HLabel 6500 5200 2    50   Input ~ 0
RF_IN
Wire Wire Line
	6500 5200 6100 5200
Wire Wire Line
	4700 5200 4500 5200
Text HLabel 4500 5200 0    50   Output ~ 0
RF_OUT
Wire Wire Line
	6800 3000 6950 3000
Connection ~ 6950 3000
Wire Wire Line
	6950 3000 7350 3000
Connection ~ 7350 3000
Wire Wire Line
	7350 3000 7800 3000
Connection ~ 7800 3000
Wire Wire Line
	7800 3000 8200 3000
Wire Wire Line
	5750 4000 6350 4000
Connection ~ 6350 4000
Wire Wire Line
	6350 4000 6750 4000
Connection ~ 6750 4000
Wire Wire Line
	6750 4000 7200 4000
Connection ~ 7200 4000
Wire Wire Line
	7200 4000 7600 4000
Connection ~ 7600 4000
Connection ~ 8200 3000
Text HLabel 2700 3200 0    50   Input ~ 0
VCC3
Wire Wire Line
	2900 3200 2700 3200
$Comp
L Device:L L?
U 1 1 5DB10E12
P 3050 3200
AR Path="/5DB10E12" Ref="L?"  Part="1" 
AR Path="/5D96ADB0/5DB10E12" Ref="L902"  Part="1" 
F 0 "L902" V 3240 3200 50  0000 C CNN
F 1 "BEAD" V 3149 3200 50  0000 C CNN
F 2 "Inductor_SMD:L_0603_1608Metric" H 3050 3200 50  0001 C CNN
F 3 "~" H 3050 3200 50  0001 C CNN
F 4 "BLM18EG221SZ1" V 3050 3200 50  0001 C CNN "PartNumber"
F 5 "Murata Electronics" H 3050 3200 50  0001 C CNN "Manufacturer"
F 6 "3000-0000000091" H 3050 3200 50  0001 C CNN "PartSpecification"
	1    3050 3200
	0    -1   -1   0   
$EndComp
Wire Wire Line
	3300 3200 3200 3200
Connection ~ 3300 3200
Connection ~ 6700 1700
$Comp
L Mechanical:Heatsink HS901
U 1 1 5EC085E9
P 5500 6500
F 0 "HS901" H 5500 6700 50  0000 C CNN
F 1 "Heatsink" H 5500 6450 50  0000 C CNN
F 2 "POWDER_Heatsink:ATS-CPX040040035-186-C2-R0" H 5512 6500 50  0001 C CNN
F 3 "~" H 5512 6500 50  0001 C CNN
F 4 "3000-0000000204" H 5500 6500 50  0001 C CNN "PartSpecification"
	1    5500 6500
	1    0    0    -1  
$EndComp
Text HLabel 5000 2350 0    50   Input ~ 0
PA_EN
Wire Wire Line
	5000 2350 5250 2350
Connection ~ 5250 2350
$EndSCHEMATC
