EESchema Schematic File Version 4
LIBS:updated_gpsdo_buffer-cache
EELAYER 29 0
EELAYER END
$Descr A4 11693 8268
encoding utf-8
Sheet 6 8
Title ""
Date ""
Rev ""
Comp ""
Comment1 ""
Comment2 ""
Comment3 ""
Comment4 ""
$EndDescr
$Comp
L updated_gpsdo_buffer-rescue:TPS63070RNM-POWDER_Power U101
U 1 1 58C04494
P 6650 3750
F 0 "U101" H 6650 3850 60  0000 C CNN
F 1 "TPS63070RNM" H 6650 3750 60  0000 C CNN
F 2 "POWDER_Power:TPS63070RNMR" H 6650 3690 60  0001 C CNN
F 3 "" H 6650 3750 60  0000 C CNN
F 4 "TPS63070RNM" H 6650 3750 60  0001 C CNN "PartNumber"
F 5 "https://store.ti.com/TPS630701RNMR.aspx" H 6650 3750 60  0001 C CNN "kicost:TI_store:link"
F 6 "1:$2.88; 10:$2.59; 25:$2.36" H 6650 3750 60  0001 C CNN "kicost:TI_store:pricing"
F 7 "Texas Instruments" H 0   0   50  0001 C CNN "Manufacturer"
	1    6650 3750
	1    0    0    -1  
$EndComp
$Comp
L Device:C C103
U 1 1 58C045D6
P 3700 3550
F 0 "C103" H 3725 3650 50  0000 L CNN
F 1 "10uF" H 3725 3450 50  0000 L CNN
F 2 "Capacitors_SMD:C_0603" H 3738 3400 50  0000 C CNN
F 3 "" H 3700 3550 50  0000 C CNN
F 4 "ZRB18AR61E106ME01L" H 3700 3550 60  0001 C CNN "PartNumber"
F 5 "Murata Electronics North America" H 0   0   50  0001 C CNN "Manufacturer"
	1    3700 3550
	1    0    0    -1  
$EndComp
$Comp
L Device:C C102
U 1 1 58C04951
P 2700 3550
F 0 "C102" H 2725 3650 50  0000 L CNN
F 1 "10uF" H 2725 3450 50  0000 L CNN
F 2 "Capacitors_SMD:C_0805" H 2750 3300 50  0000 C CNN
F 3 "" H 2700 3550 50  0000 C CNN
F 4 "CL21A106KAFN3NE" H 2700 3550 60  0001 C CNN "PartNumber"
F 5 "Samsung Electro-Mechanics" H 0   0   50  0001 C CNN "Manufacturer"
	1    2700 3550
	1    0    0    -1  
$EndComp
$Comp
L Device:C C101
U 1 1 58C0497C
P 2200 3550
F 0 "C101" H 2225 3650 50  0000 L CNN
F 1 "10uF" H 2225 3450 50  0000 L CNN
F 2 "Capacitors_SMD:C_0805" H 2238 3400 50  0000 C CNN
F 3 "" H 2200 3550 50  0000 C CNN
F 4 "CL21A106KAFN3NE" H 2200 3550 60  0001 C CNN "PartNumber"
F 5 "Samsung Electro-Mechanics" H 0   0   50  0001 C CNN "Manufacturer"
	1    2200 3550
	1    0    0    -1  
$EndComp
$Comp
L power:GND #PWR?
U 1 1 58C04A0C
P 3700 3900
F 0 "#PWR?" H 3700 3650 50  0001 C CNN
F 1 "GND" H 3700 3750 50  0000 C CNN
F 2 "" H 3700 3900 50  0000 C CNN
F 3 "" H 3700 3900 50  0000 C CNN
	1    3700 3900
	1    0    0    -1  
$EndComp
Wire Wire Line
	1450 3250 2200 3250
Wire Wire Line
	3700 3250 3700 3400
Wire Wire Line
	2700 3250 2700 3400
Connection ~ 3700 3250
Wire Wire Line
	2200 3250 2200 3400
Connection ~ 2700 3250
Wire Wire Line
	3700 3700 3700 3900
$Comp
L power:GND #PWR?
U 1 1 58C04A4C
P 2700 3900
F 0 "#PWR?" H 2700 3650 50  0001 C CNN
F 1 "GND" H 2700 3750 50  0000 C CNN
F 2 "" H 2700 3900 50  0000 C CNN
F 3 "" H 2700 3900 50  0000 C CNN
	1    2700 3900
	1    0    0    -1  
$EndComp
$Comp
L power:GND #PWR?
U 1 1 58C04A68
P 2200 3900
F 0 "#PWR?" H 2200 3650 50  0001 C CNN
F 1 "GND" H 2200 3750 50  0000 C CNN
F 2 "" H 2200 3900 50  0000 C CNN
F 3 "" H 2200 3900 50  0000 C CNN
	1    2200 3900
	1    0    0    -1  
$EndComp
Wire Wire Line
	2200 3900 2200 3700
Wire Wire Line
	2700 3700 2700 3900
$Comp
L Device:L L101
U 1 1 58C04B37
P 6600 2400
F 0 "L101" V 6550 2400 50  0000 C CNN
F 1 "1.5uH" V 6700 2400 50  0000 C CNN
F 2 "Inductors:Inductor_Taiyo-Yuden_MD-4040" V 6800 2400 50  0000 C CNN
F 3 "" H 6600 2400 50  0000 C CNN
F 4 "ASPI-4030S-1R5N-T" V 6600 2400 60  0001 C CNN "PartNumber"
F 5 "ABRACON" V 6600 2400 60  0001 C CNN "Manufacturer"
	1    6600 2400
	0    -1   -1   0   
$EndComp
Wire Wire Line
	5850 2400 5850 2950
Wire Wire Line
	7450 2950 7450 2400
$Comp
L Connector_Generic:Conn_01x02 P101
U 1 1 58C057CD
P 1250 3250
F 0 "P101" H 1250 3400 50  0000 C CNN
F 1 "CONN_01X02" V 1350 3250 50  0000 C CNN
F 2 "GPSDO:TerminalBlock_5.08_2.54" H 1000 3550 50  0000 C CNN
F 3 "" H 1250 3250 50  0000 C CNN
F 4 "Molex" H 0   0   50  0001 C CNN "Manufacturer"
F 5 "0398800302" H 0   0   50  0001 C CNN "PartNumber"
	1    1250 3250
	-1   0    0    -1  
$EndComp
$Comp
L power:GND #PWR?
U 1 1 58C05962
P 1450 3900
F 0 "#PWR?" H 1450 3650 50  0001 C CNN
F 1 "GND" H 1450 3750 50  0000 C CNN
F 2 "" H 1450 3900 50  0000 C CNN
F 3 "" H 1450 3900 50  0000 C CNN
	1    1450 3900
	1    0    0    -1  
$EndComp
Connection ~ 2200 3250
$Comp
L Device:C C105
U 1 1 58C05A91
P 8800 3550
F 0 "C105" H 8825 3650 50  0000 L CNN
F 1 "10uF" H 8825 3450 50  0000 L CNN
F 2 "Capacitors_SMD:C_0603" H 8838 3400 50  0000 C CNN
F 3 "" H 8800 3550 50  0000 C CNN
F 4 "C1608X5R0J106M080AB" H 8800 3550 60  0001 C CNN "PartNumber"
F 5 "TDK Corporation" H 0   0   50  0001 C CNN "Manufacturer"
	1    8800 3550
	1    0    0    -1  
$EndComp
$Comp
L Device:R R102
U 1 1 58C05C21
P 8000 3550
F 0 "R102" V 8080 3550 50  0000 C CNN
F 1 "470k" V 8000 3550 50  0000 C CNN
F 2 "Resistors_SMD:R_0603" V 7850 3550 50  0000 C CNN
F 3 "" H 8000 3550 50  0000 C CNN
F 4 "RC0603FR-07470KL" V 8000 3550 60  0001 C CNN "PartNumber"
F 5 "Yageo" H 0   0   50  0001 C CNN "Manufacturer"
	1    8000 3550
	1    0    0    -1  
$EndComp
$Comp
L Device:R R103
U 1 1 58C05C8D
P 8000 4050
F 0 "R103" V 8080 4050 50  0000 C CNN
F 1 "150k" V 8000 4050 50  0000 C CNN
F 2 "Resistors_SMD:R_0603" V 7930 4050 50  0000 C CNN
F 3 "" H 8000 4050 50  0000 C CNN
F 4 "RC0603FR-07150KL" V 8000 4050 60  0001 C CNN "PartNumber"
F 5 "Yageo" H 0   0   50  0001 C CNN "Manufacturer"
	1    8000 4050
	1    0    0    -1  
$EndComp
$Comp
L power:GND #PWR?
U 1 1 58C05CCB
P 7600 4700
F 0 "#PWR?" H 7600 4450 50  0001 C CNN
F 1 "GND" H 7600 4550 50  0000 C CNN
F 2 "" H 7600 4700 50  0000 C CNN
F 3 "" H 7600 4700 50  0000 C CNN
	1    7600 4700
	1    0    0    -1  
$EndComp
Wire Wire Line
	7600 3850 7600 4350
Wire Wire Line
	7600 4550 7450 4550
Wire Wire Line
	7450 4350 7600 4350
Connection ~ 7600 4550
$Comp
L power:GND #PWR?
U 1 1 58C05D2F
P 8000 4350
F 0 "#PWR?" H 8000 4100 50  0001 C CNN
F 1 "GND" H 8000 4200 50  0000 C CNN
F 2 "" H 8000 4350 50  0000 C CNN
F 3 "" H 8000 4350 50  0000 C CNN
	1    8000 4350
	1    0    0    -1  
$EndComp
Wire Wire Line
	8000 4350 8000 4200
Wire Wire Line
	8000 3700 8000 3800
Wire Wire Line
	8000 3800 7700 3800
Wire Wire Line
	7700 3800 7700 3650
Wire Wire Line
	7700 3650 7450 3650
Connection ~ 8000 3800
Wire Wire Line
	8000 3250 8000 3400
Wire Wire Line
	7450 3150 7600 3150
Wire Wire Line
	7600 3150 7600 3250
Connection ~ 7600 3250
Wire Wire Line
	5850 3150 5650 3150
Wire Wire Line
	5650 3150 5650 3250
Connection ~ 5650 3250
Wire Wire Line
	8800 3250 8800 3400
Connection ~ 8000 3250
$Comp
L power:GND #PWR?
U 1 1 58C05E6B
P 8800 3900
F 0 "#PWR?" H 8800 3650 50  0001 C CNN
F 1 "GND" H 8800 3750 50  0000 C CNN
F 2 "" H 8800 3900 50  0000 C CNN
F 3 "" H 8800 3900 50  0000 C CNN
	1    8800 3900
	1    0    0    -1  
$EndComp
Wire Wire Line
	8800 3900 8800 3700
$Comp
L Device:C C106
U 1 1 58C05ECF
P 9350 3550
F 0 "C106" H 9375 3650 50  0000 L CNN
F 1 "22uF" H 9375 3450 50  0000 L CNN
F 2 "Capacitors_SMD:C_0805" H 9350 3300 50  0000 C CNN
F 3 "" H 9350 3550 50  0000 C CNN
F 4 "GRM21BR61A226ME51L" H 9350 3550 60  0001 C CNN "PartNumber"
F 5 "Murata Electronics North America" H 0   0   50  0001 C CNN "Manufacturer"
	1    9350 3550
	1    0    0    -1  
$EndComp
$Comp
L Device:C C107
U 1 1 58C05FD0
P 9800 3550
F 0 "C107" H 9825 3650 50  0000 L CNN
F 1 "22uF" H 9825 3450 50  0000 L CNN
F 2 "Capacitors_SMD:C_0805" H 9838 3400 50  0000 C CNN
F 3 "" H 9800 3550 50  0000 C CNN
F 4 "GRM21BR61A226ME51L" H 9800 3550 60  0001 C CNN "PartNumber"
F 5 "Murata Electronics North America" H 0   0   50  0001 C CNN "Manufacturer"
	1    9800 3550
	1    0    0    -1  
$EndComp
$Comp
L power:GND #PWR?
U 1 1 58C06028
P 9350 3900
F 0 "#PWR?" H 9350 3650 50  0001 C CNN
F 1 "GND" H 9350 3750 50  0000 C CNN
F 2 "" H 9350 3900 50  0000 C CNN
F 3 "" H 9350 3900 50  0000 C CNN
	1    9350 3900
	1    0    0    -1  
$EndComp
Wire Wire Line
	9350 3900 9350 3700
$Comp
L power:GND #PWR?
U 1 1 58C0608A
P 9800 3900
F 0 "#PWR?" H 9800 3650 50  0001 C CNN
F 1 "GND" H 9800 3750 50  0000 C CNN
F 2 "" H 9800 3900 50  0000 C CNN
F 3 "" H 9800 3900 50  0000 C CNN
	1    9800 3900
	1    0    0    -1  
$EndComp
Wire Wire Line
	9800 3900 9800 3700
Wire Wire Line
	9800 3250 9800 3400
Connection ~ 8800 3250
Wire Wire Line
	9350 3400 9350 3250
Connection ~ 9350 3250
$Comp
L Device:C C108
U 1 1 58C06564
P 10300 3550
F 0 "C108" H 10325 3650 50  0000 L CNN
F 1 "22uF" H 10325 3450 50  0000 L CNN
F 2 "Capacitors_SMD:C_0805" H 10300 3300 50  0000 C CNN
F 3 "" H 10300 3550 50  0000 C CNN
F 4 "GRM21BR61A226ME51L" H 10300 3550 60  0001 C CNN "PartNumber"
F 5 "Murata Electronics North America" H 0   0   50  0001 C CNN "Manufacturer"
	1    10300 3550
	1    0    0    -1  
$EndComp
$Comp
L power:GND #PWR?
U 1 1 58C0656A
P 10300 3900
F 0 "#PWR?" H 10300 3650 50  0001 C CNN
F 1 "GND" H 10300 3750 50  0000 C CNN
F 2 "" H 10300 3900 50  0000 C CNN
F 3 "" H 10300 3900 50  0000 C CNN
	1    10300 3900
	1    0    0    -1  
$EndComp
Wire Wire Line
	10300 3900 10300 3700
Wire Wire Line
	10300 3250 10300 3400
Connection ~ 9800 3250
Wire Wire Line
	7450 3250 7600 3250
$Comp
L Device:R R104
U 1 1 58C068A1
P 8300 3650
F 0 "R104" V 8380 3650 50  0000 C CNN
F 1 "100k" V 8300 3650 50  0000 C CNN
F 2 "Resistors_SMD:R_0603" V 8230 3650 50  0000 C CNN
F 3 "" H 8300 3650 50  0000 C CNN
F 4 "RC0603FR-07100KL" V 8300 3650 60  0001 C CNN "PartNumber"
F 5 "Yageo" H 0   0   50  0001 C CNN "Manufacturer"
	1    8300 3650
	1    0    0    -1  
$EndComp
Wire Wire Line
	8300 3800 8300 4250
Wire Wire Line
	8300 4250 7750 4250
Wire Wire Line
	7750 4250 7750 4050
Wire Wire Line
	7750 4050 7450 4050
Wire Wire Line
	8300 3500 8300 3250
Connection ~ 8300 3250
Wire Wire Line
	7450 3850 7600 3850
Connection ~ 7600 4350
Wire Wire Line
	5850 4050 5500 4050
Wire Wire Line
	5500 4050 5500 3450
Wire Wire Line
	5300 3450 5500 3450
$Comp
L Device:R R101
U 1 1 58C0735B
P 5150 3450
F 0 "R101" V 5230 3450 50  0000 C CNN
F 1 "10k" V 5150 3450 50  0000 C CNN
F 2 "Resistors_SMD:R_0603" V 5080 3450 50  0000 C CNN
F 3 "" H 5150 3450 50  0000 C CNN
F 4 "RC0603FR-0710KL" V 5150 3450 60  0001 C CNN "PartNumber"
F 5 "Yageo" H 0   0   50  0001 C CNN "Manufacturer"
	1    5150 3450
	0    1    1    0   
$EndComp
Connection ~ 5500 3450
Wire Wire Line
	4600 3450 5000 3450
Wire Wire Line
	4600 3450 4600 3250
Connection ~ 4600 3250
$Comp
L power:GND #PWR?
U 1 1 58C07543
P 5800 4700
F 0 "#PWR?" H 5800 4450 50  0001 C CNN
F 1 "GND" H 5800 4550 50  0000 C CNN
F 2 "" H 5800 4700 50  0000 C CNN
F 3 "" H 5800 4700 50  0000 C CNN
	1    5800 4700
	1    0    0    -1  
$EndComp
$Comp
L Device:C C104
U 1 1 58C0757B
P 5800 4450
F 0 "C104" H 5825 4550 50  0000 L CNN
F 1 "100nF" H 5825 4350 50  0000 L CNN
F 2 "Capacitors_SMD:C_0603" H 5838 4300 50  0000 C CNN
F 3 "" H 5800 4450 50  0000 C CNN
F 4 "CL10B104KB8NNNC" H 5800 4450 60  0001 C CNN "PartNumber"
F 5 "Samsung Electro-Mechanics" H 0   0   50  0001 C CNN "Manufacturer"
	1    5800 4450
	1    0    0    -1  
$EndComp
Wire Wire Line
	5800 4700 5800 4600
Wire Wire Line
	5800 4300 5800 3850
Wire Wire Line
	5800 3850 5850 3850
$Comp
L power:GND #PWR?
U 1 1 58C076FC
P 5650 3800
F 0 "#PWR?" H 5650 3550 50  0001 C CNN
F 1 "GND" H 5650 3650 50  0000 C CNN
F 2 "" H 5650 3800 50  0000 C CNN
F 3 "" H 5650 3800 50  0000 C CNN
	1    5650 3800
	1    0    0    -1  
$EndComp
Wire Wire Line
	5650 3800 5650 3650
Wire Wire Line
	5650 3650 5850 3650
Connection ~ 10300 3250
Text Label 3900 3250 0    60   ~ 0
VIN
Text Label 8450 3250 0    60   ~ 0
VOUT
Text Label 7500 3650 0    60   ~ 0
FB
Text Label 5950 2400 0    60   ~ 0
L_1
Text Label 7200 2400 0    60   ~ 0
L_2
Wire Wire Line
	3700 3250 4600 3250
Wire Wire Line
	2700 3250 3700 3250
Wire Wire Line
	2200 3250 2700 3250
Wire Wire Line
	7600 4550 7600 4700
Wire Wire Line
	8000 3800 8000 3900
Wire Wire Line
	7600 3250 8000 3250
Wire Wire Line
	5650 3250 5850 3250
Wire Wire Line
	8000 3250 8300 3250
Wire Wire Line
	8800 3250 9350 3250
Wire Wire Line
	9350 3250 9800 3250
Wire Wire Line
	9800 3250 10300 3250
Wire Wire Line
	8300 3250 8800 3250
Wire Wire Line
	7600 4350 7600 4550
Wire Wire Line
	5500 3450 5850 3450
Wire Wire Line
	4600 3250 5650 3250
Wire Wire Line
	10300 3250 10800 3250
Wire Wire Line
	5850 2400 6450 2400
Wire Wire Line
	6750 2400 7450 2400
Wire Wire Line
	1450 3350 1450 3900
$Comp
L power:+3.3V #PWR?
U 1 1 5C5F669E
P 10800 3050
F 0 "#PWR?" H 10800 2900 50  0001 C CNN
F 1 "+3.3V" H 10815 3223 50  0000 C CNN
F 2 "" H 10800 3050 50  0001 C CNN
F 3 "" H 10800 3050 50  0001 C CNN
	1    10800 3050
	1    0    0    -1  
$EndComp
Wire Wire Line
	10800 3050 10800 3250
$EndSCHEMATC
