EESchema Schematic File Version 4
EELAYER 30 0
EELAYER END
$Descr A4 11693 8268
encoding utf-8
Sheet 29 39
Title ""
Date ""
Rev ""
Comp ""
Comment1 ""
Comment2 ""
Comment3 ""
Comment4 ""
$EndDescr
$Comp
L POWDER_Digital:10M50DAF256 U2201
U 9 1 5F9EBB5A
P 5150 3050
F 0 "U2201" H 5150 3200 50  0000 C CNN
F 1 "‎10M08DAF256C8G" H 5150 3050 50  0000 C CNN
F 2 "Package_BGA:BGA-256_17.0x17.0mm_Layout16x16_P1.0mm_Ball0.5mm_Pad0.4mm_NSMD" H 5150 3050 50  0001 C CNN
F 3 "" H 5150 3050 50  0001 C CNN
F 4 "3000-0000001300" H 5150 3050 50  0001 C CNN "PartSpecification"
	9    5150 3050
	1    0    0    -1  
$EndComp
$Comp
L power:+1V2 #PWR?
U 1 1 5FA425B0
P 4700 2000
F 0 "#PWR?" H 4700 1850 50  0001 C CNN
F 1 "+1V2" H 4700 2140 50  0000 C CNN
F 2 "" H 4700 2000 50  0001 C CNN
F 3 "" H 4700 2000 50  0001 C CNN
	1    4700 2000
	1    0    0    -1  
$EndComp
Wire Wire Line
	5600 2250 5600 2350
Wire Wire Line
	5500 2250 5500 2350
Wire Wire Line
	5400 2250 5400 2350
Wire Wire Line
	5300 2250 5300 2350
Wire Wire Line
	5200 2250 5200 2350
Wire Wire Line
	5100 2250 5100 2350
Wire Wire Line
	5000 2250 5000 2350
Wire Wire Line
	4900 2250 4900 2350
Wire Wire Line
	4800 2250 4800 2350
Wire Wire Line
	4700 2000 4700 2250
Wire Wire Line
	4700 2250 4800 2250
Connection ~ 4700 2250
Wire Wire Line
	4700 2250 4700 2350
Connection ~ 4800 2250
Wire Wire Line
	4800 2250 4900 2250
Connection ~ 4900 2250
Wire Wire Line
	4900 2250 5000 2250
Connection ~ 5000 2250
Wire Wire Line
	5000 2250 5100 2250
Connection ~ 5100 2250
Wire Wire Line
	5100 2250 5200 2250
Connection ~ 5200 2250
Wire Wire Line
	5200 2250 5300 2250
Connection ~ 5300 2250
Wire Wire Line
	5300 2250 5400 2250
Connection ~ 5400 2250
Wire Wire Line
	5400 2250 5500 2250
Connection ~ 5500 2250
Wire Wire Line
	5500 2250 5600 2250
$Comp
L power:GND #PWR?
U 1 1 5FB69032
P 5150 3800
F 0 "#PWR?" H 5150 3550 50  0001 C CNN
F 1 "GND" H 5150 3650 50  0000 C CNN
F 2 "" H 5150 3800 50  0001 C CNN
F 3 "" H 5150 3800 50  0001 C CNN
	1    5150 3800
	1    0    0    -1  
$EndComp
Wire Wire Line
	3600 3600 3600 3700
Wire Wire Line
	3600 3700 3700 3700
Wire Wire Line
	6700 3700 6700 3600
Wire Wire Line
	5150 3700 5150 3800
Connection ~ 5150 3700
Wire Wire Line
	5150 3700 5200 3700
Wire Wire Line
	3700 3600 3700 3700
Wire Wire Line
	3800 3600 3800 3700
Wire Wire Line
	3900 3600 3900 3700
Wire Wire Line
	4000 3600 4000 3700
Wire Wire Line
	4100 3600 4100 3700
Wire Wire Line
	4200 3600 4200 3700
Wire Wire Line
	4300 3600 4300 3700
Wire Wire Line
	4400 3600 4400 3700
Wire Wire Line
	4500 3600 4500 3700
Wire Wire Line
	4600 3600 4600 3700
Wire Wire Line
	4700 3600 4700 3700
Wire Wire Line
	4800 3600 4800 3700
Wire Wire Line
	4900 3600 4900 3700
Wire Wire Line
	5000 3600 5000 3700
Wire Wire Line
	5100 3600 5100 3700
Wire Wire Line
	5200 3600 5200 3700
Wire Wire Line
	5300 3600 5300 3700
Wire Wire Line
	5400 3600 5400 3700
Wire Wire Line
	5500 3600 5500 3700
Wire Wire Line
	5600 3600 5600 3700
Wire Wire Line
	5700 3600 5700 3700
Wire Wire Line
	5800 3600 5800 3700
Wire Wire Line
	5900 3600 5900 3700
Wire Wire Line
	6000 3600 6000 3700
Wire Wire Line
	6100 3600 6100 3700
Wire Wire Line
	6200 3600 6200 3700
Wire Wire Line
	6300 3600 6300 3700
Wire Wire Line
	6400 3600 6400 3700
Wire Wire Line
	6500 3600 6500 3700
Wire Wire Line
	6600 3600 6600 3700
Connection ~ 6600 3700
Wire Wire Line
	6600 3700 6700 3700
Connection ~ 3700 3700
Wire Wire Line
	3700 3700 3800 3700
Connection ~ 3800 3700
Wire Wire Line
	3800 3700 3900 3700
Connection ~ 3900 3700
Wire Wire Line
	3900 3700 4000 3700
Connection ~ 4000 3700
Wire Wire Line
	4000 3700 4100 3700
Connection ~ 4100 3700
Wire Wire Line
	4100 3700 4200 3700
Connection ~ 4200 3700
Wire Wire Line
	4200 3700 4300 3700
Connection ~ 4300 3700
Wire Wire Line
	4300 3700 4400 3700
Connection ~ 4400 3700
Wire Wire Line
	4400 3700 4500 3700
Connection ~ 4500 3700
Wire Wire Line
	4500 3700 4600 3700
Connection ~ 4600 3700
Wire Wire Line
	4600 3700 4700 3700
Connection ~ 4700 3700
Wire Wire Line
	4700 3700 4800 3700
Connection ~ 4800 3700
Wire Wire Line
	4800 3700 4900 3700
Connection ~ 4900 3700
Wire Wire Line
	4900 3700 5000 3700
Connection ~ 5000 3700
Wire Wire Line
	5000 3700 5100 3700
Connection ~ 5100 3700
Wire Wire Line
	5100 3700 5150 3700
Connection ~ 5200 3700
Wire Wire Line
	5200 3700 5300 3700
Connection ~ 5300 3700
Wire Wire Line
	5300 3700 5400 3700
Connection ~ 5400 3700
Wire Wire Line
	5400 3700 5500 3700
Connection ~ 5500 3700
Wire Wire Line
	5500 3700 5600 3700
Connection ~ 5600 3700
Wire Wire Line
	5600 3700 5700 3700
Connection ~ 5700 3700
Wire Wire Line
	5700 3700 5800 3700
Connection ~ 5800 3700
Wire Wire Line
	5800 3700 5900 3700
Connection ~ 5900 3700
Wire Wire Line
	5900 3700 6000 3700
Connection ~ 6000 3700
Wire Wire Line
	6000 3700 6100 3700
Connection ~ 6100 3700
Wire Wire Line
	6100 3700 6200 3700
Connection ~ 6200 3700
Wire Wire Line
	6200 3700 6300 3700
Connection ~ 6300 3700
Wire Wire Line
	6300 3700 6400 3700
Connection ~ 6400 3700
Wire Wire Line
	6400 3700 6500 3700
Connection ~ 6500 3700
Wire Wire Line
	6500 3700 6600 3700
Text Notes 6000 1000 0    50   ~ 0
Get decoupling from stupid Excel tool.
$Comp
L Device:C C3008
U 1 1 60AAF8E1
P 7500 2750
F 0 "C3008" H 7525 2850 50  0000 L CNN
F 1 "0.47uF" H 7525 2650 50  0000 L CNN
F 2 "Capacitor_SMD:C_0603_1608Metric" H 7538 2600 50  0001 C CNN
F 3 "~" H 7500 2750 50  0001 C CNN
F 4 "3000-0000001263" H 7500 2750 50  0001 C CNN "PartSpecification"
	1    7500 2750
	1    0    0    -1  
$EndComp
$Comp
L power:+1V2 #PWR?
U 1 1 60AAF8E7
P 7500 2500
F 0 "#PWR?" H 7500 2350 50  0001 C CNN
F 1 "+1V2" H 7500 2640 50  0000 C CNN
F 2 "" H 7500 2500 50  0001 C CNN
F 3 "" H 7500 2500 50  0001 C CNN
	1    7500 2500
	1    0    0    -1  
$EndComp
$Comp
L power:GND #PWR?
U 1 1 60AAF8ED
P 7500 3000
F 0 "#PWR?" H 7500 2750 50  0001 C CNN
F 1 "GND" H 7500 2850 50  0000 C CNN
F 2 "" H 7500 3000 50  0001 C CNN
F 3 "" H 7500 3000 50  0001 C CNN
	1    7500 3000
	1    0    0    -1  
$EndComp
Wire Wire Line
	7500 3000 7500 2900
Wire Wire Line
	7500 2500 7500 2600
$Comp
L Device:C C3009
U 1 1 60AB3BC0
P 8000 2750
F 0 "C3009" H 8025 2850 50  0000 L CNN
F 1 "0.47uF" H 8025 2650 50  0000 L CNN
F 2 "Capacitor_SMD:C_0603_1608Metric" H 8038 2600 50  0001 C CNN
F 3 "~" H 8000 2750 50  0001 C CNN
F 4 "3000-0000001263" H 8000 2750 50  0001 C CNN "PartSpecification"
	1    8000 2750
	1    0    0    -1  
$EndComp
$Comp
L power:+1V2 #PWR?
U 1 1 60AB3BC6
P 8000 2500
F 0 "#PWR?" H 8000 2350 50  0001 C CNN
F 1 "+1V2" H 8000 2640 50  0000 C CNN
F 2 "" H 8000 2500 50  0001 C CNN
F 3 "" H 8000 2500 50  0001 C CNN
	1    8000 2500
	1    0    0    -1  
$EndComp
$Comp
L power:GND #PWR?
U 1 1 60AB3BCC
P 8000 3000
F 0 "#PWR?" H 8000 2750 50  0001 C CNN
F 1 "GND" H 8000 2850 50  0000 C CNN
F 2 "" H 8000 3000 50  0001 C CNN
F 3 "" H 8000 3000 50  0001 C CNN
	1    8000 3000
	1    0    0    -1  
$EndComp
Wire Wire Line
	8000 3000 8000 2900
Wire Wire Line
	8000 2500 8000 2600
$Comp
L Device:C C3010
U 1 1 60AB6C13
P 8500 2750
F 0 "C3010" H 8525 2850 50  0000 L CNN
F 1 "0.47uF" H 8525 2650 50  0000 L CNN
F 2 "Capacitor_SMD:C_0603_1608Metric" H 8538 2600 50  0001 C CNN
F 3 "~" H 8500 2750 50  0001 C CNN
F 4 "3000-0000001263" H 8500 2750 50  0001 C CNN "PartSpecification"
	1    8500 2750
	1    0    0    -1  
$EndComp
$Comp
L power:+1V2 #PWR?
U 1 1 60AB6C19
P 8500 2500
F 0 "#PWR?" H 8500 2350 50  0001 C CNN
F 1 "+1V2" H 8500 2640 50  0000 C CNN
F 2 "" H 8500 2500 50  0001 C CNN
F 3 "" H 8500 2500 50  0001 C CNN
	1    8500 2500
	1    0    0    -1  
$EndComp
$Comp
L power:GND #PWR?
U 1 1 60AB6C1F
P 8500 3000
F 0 "#PWR?" H 8500 2750 50  0001 C CNN
F 1 "GND" H 8500 2850 50  0000 C CNN
F 2 "" H 8500 3000 50  0001 C CNN
F 3 "" H 8500 3000 50  0001 C CNN
	1    8500 3000
	1    0    0    -1  
$EndComp
Wire Wire Line
	8500 3000 8500 2900
Wire Wire Line
	8500 2500 8500 2600
$Comp
L Device:C C3011
U 1 1 60AB9D74
P 9000 2750
F 0 "C3011" H 9025 2850 50  0000 L CNN
F 1 "0.47uF" H 9025 2650 50  0000 L CNN
F 2 "Capacitor_SMD:C_0603_1608Metric" H 9038 2600 50  0001 C CNN
F 3 "~" H 9000 2750 50  0001 C CNN
F 4 "3000-0000001263" H 9000 2750 50  0001 C CNN "PartSpecification"
	1    9000 2750
	1    0    0    -1  
$EndComp
$Comp
L power:+1V2 #PWR?
U 1 1 60AB9D7A
P 9000 2500
F 0 "#PWR?" H 9000 2350 50  0001 C CNN
F 1 "+1V2" H 9000 2640 50  0000 C CNN
F 2 "" H 9000 2500 50  0001 C CNN
F 3 "" H 9000 2500 50  0001 C CNN
	1    9000 2500
	1    0    0    -1  
$EndComp
$Comp
L power:GND #PWR?
U 1 1 60AB9D80
P 9000 3000
F 0 "#PWR?" H 9000 2750 50  0001 C CNN
F 1 "GND" H 9000 2850 50  0000 C CNN
F 2 "" H 9000 3000 50  0001 C CNN
F 3 "" H 9000 3000 50  0001 C CNN
	1    9000 3000
	1    0    0    -1  
$EndComp
Wire Wire Line
	9000 3000 9000 2900
Wire Wire Line
	9000 2500 9000 2600
$Comp
L Device:C C3012
U 1 1 60ABCCBD
P 9500 2750
F 0 "C3012" H 9525 2850 50  0000 L CNN
F 1 "0.47uF" H 9525 2650 50  0000 L CNN
F 2 "Capacitor_SMD:C_0603_1608Metric" H 9538 2600 50  0001 C CNN
F 3 "~" H 9500 2750 50  0001 C CNN
F 4 "3000-0000001263" H 9500 2750 50  0001 C CNN "PartSpecification"
	1    9500 2750
	1    0    0    -1  
$EndComp
$Comp
L power:+1V2 #PWR?
U 1 1 60ABCCC3
P 9500 2500
F 0 "#PWR?" H 9500 2350 50  0001 C CNN
F 1 "+1V2" H 9500 2640 50  0000 C CNN
F 2 "" H 9500 2500 50  0001 C CNN
F 3 "" H 9500 2500 50  0001 C CNN
	1    9500 2500
	1    0    0    -1  
$EndComp
$Comp
L power:GND #PWR?
U 1 1 60ABCCC9
P 9500 3000
F 0 "#PWR?" H 9500 2750 50  0001 C CNN
F 1 "GND" H 9500 2850 50  0000 C CNN
F 2 "" H 9500 3000 50  0001 C CNN
F 3 "" H 9500 3000 50  0001 C CNN
	1    9500 3000
	1    0    0    -1  
$EndComp
Wire Wire Line
	9500 3000 9500 2900
Wire Wire Line
	9500 2500 9500 2600
$Comp
L Device:C C3013
U 1 1 60ABFDBC
P 10000 2750
F 0 "C3013" H 10025 2850 50  0000 L CNN
F 1 "0.47uF" H 10025 2650 50  0000 L CNN
F 2 "Capacitor_SMD:C_0603_1608Metric" H 10038 2600 50  0001 C CNN
F 3 "~" H 10000 2750 50  0001 C CNN
F 4 "3000-0000001263" H 10000 2750 50  0001 C CNN "PartSpecification"
	1    10000 2750
	1    0    0    -1  
$EndComp
$Comp
L power:+1V2 #PWR?
U 1 1 60ABFDC2
P 10000 2500
F 0 "#PWR?" H 10000 2350 50  0001 C CNN
F 1 "+1V2" H 10000 2640 50  0000 C CNN
F 2 "" H 10000 2500 50  0001 C CNN
F 3 "" H 10000 2500 50  0001 C CNN
	1    10000 2500
	1    0    0    -1  
$EndComp
$Comp
L power:GND #PWR?
U 1 1 60ABFDC8
P 10000 3000
F 0 "#PWR?" H 10000 2750 50  0001 C CNN
F 1 "GND" H 10000 2850 50  0000 C CNN
F 2 "" H 10000 3000 50  0001 C CNN
F 3 "" H 10000 3000 50  0001 C CNN
	1    10000 3000
	1    0    0    -1  
$EndComp
Wire Wire Line
	10000 3000 10000 2900
Wire Wire Line
	10000 2500 10000 2600
$Comp
L Device:C C3014
U 1 1 60AC41F7
P 10500 2750
F 0 "C3014" H 10525 2850 50  0000 L CNN
F 1 "0.47uF" H 10525 2650 50  0000 L CNN
F 2 "Capacitor_SMD:C_0603_1608Metric" H 10538 2600 50  0001 C CNN
F 3 "~" H 10500 2750 50  0001 C CNN
F 4 "3000-0000001263" H 10500 2750 50  0001 C CNN "PartSpecification"
	1    10500 2750
	1    0    0    -1  
$EndComp
$Comp
L power:+1V2 #PWR?
U 1 1 60AC41FD
P 10500 2500
F 0 "#PWR?" H 10500 2350 50  0001 C CNN
F 1 "+1V2" H 10500 2640 50  0000 C CNN
F 2 "" H 10500 2500 50  0001 C CNN
F 3 "" H 10500 2500 50  0001 C CNN
	1    10500 2500
	1    0    0    -1  
$EndComp
$Comp
L power:GND #PWR?
U 1 1 60AC4203
P 10500 3000
F 0 "#PWR?" H 10500 2750 50  0001 C CNN
F 1 "GND" H 10500 2850 50  0000 C CNN
F 2 "" H 10500 3000 50  0001 C CNN
F 3 "" H 10500 3000 50  0001 C CNN
	1    10500 3000
	1    0    0    -1  
$EndComp
Wire Wire Line
	10500 3000 10500 2900
Wire Wire Line
	10500 2500 10500 2600
$Comp
L Device:C C3015
U 1 1 60AC72DA
P 11000 2750
F 0 "C3015" H 11025 2850 50  0000 L CNN
F 1 "0.47uF" H 11025 2650 50  0000 L CNN
F 2 "Capacitor_SMD:C_0603_1608Metric" H 11038 2600 50  0001 C CNN
F 3 "~" H 11000 2750 50  0001 C CNN
F 4 "3000-0000001263" H 11000 2750 50  0001 C CNN "PartSpecification"
	1    11000 2750
	1    0    0    -1  
$EndComp
$Comp
L power:+1V2 #PWR?
U 1 1 60AC72E0
P 11000 2500
F 0 "#PWR?" H 11000 2350 50  0001 C CNN
F 1 "+1V2" H 11000 2640 50  0000 C CNN
F 2 "" H 11000 2500 50  0001 C CNN
F 3 "" H 11000 2500 50  0001 C CNN
	1    11000 2500
	1    0    0    -1  
$EndComp
$Comp
L power:GND #PWR?
U 1 1 60AC72E6
P 11000 3000
F 0 "#PWR?" H 11000 2750 50  0001 C CNN
F 1 "GND" H 11000 2850 50  0000 C CNN
F 2 "" H 11000 3000 50  0001 C CNN
F 3 "" H 11000 3000 50  0001 C CNN
	1    11000 3000
	1    0    0    -1  
$EndComp
Wire Wire Line
	11000 3000 11000 2900
Wire Wire Line
	11000 2500 11000 2600
$Comp
L Device:C C3007
U 1 1 60ACBFC3
P 7000 2750
F 0 "C3007" H 7025 2850 50  0000 L CNN
F 1 "0.47uF" H 7025 2650 50  0000 L CNN
F 2 "Capacitor_SMD:C_0603_1608Metric" H 7038 2600 50  0001 C CNN
F 3 "~" H 7000 2750 50  0001 C CNN
F 4 "3000-0000001263" H 7000 2750 50  0001 C CNN "PartSpecification"
	1    7000 2750
	1    0    0    -1  
$EndComp
$Comp
L power:+1V2 #PWR?
U 1 1 60ACBFC9
P 7000 2500
F 0 "#PWR?" H 7000 2350 50  0001 C CNN
F 1 "+1V2" H 7000 2640 50  0000 C CNN
F 2 "" H 7000 2500 50  0001 C CNN
F 3 "" H 7000 2500 50  0001 C CNN
	1    7000 2500
	1    0    0    -1  
$EndComp
$Comp
L power:GND #PWR?
U 1 1 60ACBFCF
P 7000 3000
F 0 "#PWR?" H 7000 2750 50  0001 C CNN
F 1 "GND" H 7000 2850 50  0000 C CNN
F 2 "" H 7000 3000 50  0001 C CNN
F 3 "" H 7000 3000 50  0001 C CNN
	1    7000 3000
	1    0    0    -1  
$EndComp
Wire Wire Line
	7000 3000 7000 2900
Wire Wire Line
	7000 2500 7000 2600
$Comp
L Device:C C3017
U 1 1 60AD2FF2
P 7500 3750
F 0 "C3017" H 7525 3850 50  0000 L CNN
F 1 "4.7uF" H 7525 3650 50  0000 L CNN
F 2 "Capacitor_SMD:C_0805_2012Metric" H 7538 3600 50  0001 C CNN
F 3 "~" H 7500 3750 50  0001 C CNN
F 4 "3000-0000001265" H 7500 3750 50  0001 C CNN "PartSpecification"
	1    7500 3750
	1    0    0    -1  
$EndComp
$Comp
L power:+1V2 #PWR?
U 1 1 60AD2FF8
P 7500 3500
F 0 "#PWR?" H 7500 3350 50  0001 C CNN
F 1 "+1V2" H 7500 3640 50  0000 C CNN
F 2 "" H 7500 3500 50  0001 C CNN
F 3 "" H 7500 3500 50  0001 C CNN
	1    7500 3500
	1    0    0    -1  
$EndComp
$Comp
L power:GND #PWR?
U 1 1 60AD2FFE
P 7500 4000
F 0 "#PWR?" H 7500 3750 50  0001 C CNN
F 1 "GND" H 7500 3850 50  0000 C CNN
F 2 "" H 7500 4000 50  0001 C CNN
F 3 "" H 7500 4000 50  0001 C CNN
	1    7500 4000
	1    0    0    -1  
$EndComp
Wire Wire Line
	7500 4000 7500 3900
Wire Wire Line
	7500 3500 7500 3600
$Comp
L Device:C C3016
U 1 1 60AD3006
P 7000 3750
F 0 "C3016" H 7025 3850 50  0000 L CNN
F 1 "4.7uF" H 7025 3650 50  0000 L CNN
F 2 "Capacitor_SMD:C_0805_2012Metric" H 7038 3600 50  0001 C CNN
F 3 "~" H 7000 3750 50  0001 C CNN
F 4 "3000-0000001265" H 7000 3750 50  0001 C CNN "PartSpecification"
	1    7000 3750
	1    0    0    -1  
$EndComp
$Comp
L power:+1V2 #PWR?
U 1 1 60AD300C
P 7000 3500
F 0 "#PWR?" H 7000 3350 50  0001 C CNN
F 1 "+1V2" H 7000 3640 50  0000 C CNN
F 2 "" H 7000 3500 50  0001 C CNN
F 3 "" H 7000 3500 50  0001 C CNN
	1    7000 3500
	1    0    0    -1  
$EndComp
$Comp
L power:GND #PWR?
U 1 1 60AD3012
P 7000 4000
F 0 "#PWR?" H 7000 3750 50  0001 C CNN
F 1 "GND" H 7000 3850 50  0000 C CNN
F 2 "" H 7000 4000 50  0001 C CNN
F 3 "" H 7000 4000 50  0001 C CNN
	1    7000 4000
	1    0    0    -1  
$EndComp
Wire Wire Line
	7000 4000 7000 3900
Wire Wire Line
	7000 3500 7000 3600
$Comp
L Device:C C3019
U 1 1 60ADFC71
P 8500 3750
F 0 "C3019" H 8525 3850 50  0000 L CNN
F 1 "4.7uF" H 8525 3650 50  0000 L CNN
F 2 "Capacitor_SMD:C_0805_2012Metric" H 8538 3600 50  0001 C CNN
F 3 "~" H 8500 3750 50  0001 C CNN
F 4 "3000-0000001265" H 8500 3750 50  0001 C CNN "PartSpecification"
	1    8500 3750
	1    0    0    -1  
$EndComp
$Comp
L power:+1V2 #PWR?
U 1 1 60ADFC77
P 8500 3500
F 0 "#PWR?" H 8500 3350 50  0001 C CNN
F 1 "+1V2" H 8500 3640 50  0000 C CNN
F 2 "" H 8500 3500 50  0001 C CNN
F 3 "" H 8500 3500 50  0001 C CNN
	1    8500 3500
	1    0    0    -1  
$EndComp
$Comp
L power:GND #PWR?
U 1 1 60ADFC7D
P 8500 4000
F 0 "#PWR?" H 8500 3750 50  0001 C CNN
F 1 "GND" H 8500 3850 50  0000 C CNN
F 2 "" H 8500 4000 50  0001 C CNN
F 3 "" H 8500 4000 50  0001 C CNN
	1    8500 4000
	1    0    0    -1  
$EndComp
Wire Wire Line
	8500 4000 8500 3900
Wire Wire Line
	8500 3500 8500 3600
$Comp
L Device:C C3018
U 1 1 60ADFC85
P 8000 3750
F 0 "C3018" H 8025 3850 50  0000 L CNN
F 1 "4.7uF" H 8025 3650 50  0000 L CNN
F 2 "Capacitor_SMD:C_0805_2012Metric" H 8038 3600 50  0001 C CNN
F 3 "~" H 8000 3750 50  0001 C CNN
F 4 "3000-0000001265" H 8000 3750 50  0001 C CNN "PartSpecification"
	1    8000 3750
	1    0    0    -1  
$EndComp
$Comp
L power:+1V2 #PWR?
U 1 1 60ADFC8B
P 8000 3500
F 0 "#PWR?" H 8000 3350 50  0001 C CNN
F 1 "+1V2" H 8000 3640 50  0000 C CNN
F 2 "" H 8000 3500 50  0001 C CNN
F 3 "" H 8000 3500 50  0001 C CNN
	1    8000 3500
	1    0    0    -1  
$EndComp
$Comp
L power:GND #PWR?
U 1 1 60ADFC91
P 8000 4000
F 0 "#PWR?" H 8000 3750 50  0001 C CNN
F 1 "GND" H 8000 3850 50  0000 C CNN
F 2 "" H 8000 4000 50  0001 C CNN
F 3 "" H 8000 4000 50  0001 C CNN
	1    8000 4000
	1    0    0    -1  
$EndComp
Wire Wire Line
	8000 4000 8000 3900
Wire Wire Line
	8000 3500 8000 3600
$Comp
L Device:C C3020
U 1 1 60AE4398
P 9000 3750
F 0 "C3020" H 9025 3850 50  0000 L CNN
F 1 "4.7uF" H 9025 3650 50  0000 L CNN
F 2 "Capacitor_SMD:C_0805_2012Metric" H 9038 3600 50  0001 C CNN
F 3 "~" H 9000 3750 50  0001 C CNN
F 4 "3000-0000001265" H 9000 3750 50  0001 C CNN "PartSpecification"
	1    9000 3750
	1    0    0    -1  
$EndComp
$Comp
L power:+1V2 #PWR?
U 1 1 60AE439E
P 9000 3500
F 0 "#PWR?" H 9000 3350 50  0001 C CNN
F 1 "+1V2" H 9000 3640 50  0000 C CNN
F 2 "" H 9000 3500 50  0001 C CNN
F 3 "" H 9000 3500 50  0001 C CNN
	1    9000 3500
	1    0    0    -1  
$EndComp
$Comp
L power:GND #PWR?
U 1 1 60AE43A4
P 9000 4000
F 0 "#PWR?" H 9000 3750 50  0001 C CNN
F 1 "GND" H 9000 3850 50  0000 C CNN
F 2 "" H 9000 4000 50  0001 C CNN
F 3 "" H 9000 4000 50  0001 C CNN
	1    9000 4000
	1    0    0    -1  
$EndComp
Wire Wire Line
	9000 4000 9000 3900
Wire Wire Line
	9000 3500 9000 3600
$Comp
L Device:C C3021
U 1 1 60AF5F45
P 7000 4750
F 0 "C3021" H 7025 4850 50  0000 L CNN
F 1 "330uF" H 7025 4650 50  0000 L CNN
F 2 "Capacitor_SMD:C_Elec_8x10.2" H 7038 4600 50  0001 C CNN
F 3 "~" H 7000 4750 50  0001 C CNN
F 4 "3000-0000001267" H 7000 4750 50  0001 C CNN "PartSpecification"
	1    7000 4750
	1    0    0    -1  
$EndComp
$Comp
L power:+1V2 #PWR?
U 1 1 60AF5F4B
P 7000 4500
F 0 "#PWR?" H 7000 4350 50  0001 C CNN
F 1 "+1V2" H 7000 4640 50  0000 C CNN
F 2 "" H 7000 4500 50  0001 C CNN
F 3 "" H 7000 4500 50  0001 C CNN
	1    7000 4500
	1    0    0    -1  
$EndComp
$Comp
L power:GND #PWR?
U 1 1 60AF5F51
P 7000 5000
F 0 "#PWR?" H 7000 4750 50  0001 C CNN
F 1 "GND" H 7000 4850 50  0000 C CNN
F 2 "" H 7000 5000 50  0001 C CNN
F 3 "" H 7000 5000 50  0001 C CNN
	1    7000 5000
	1    0    0    -1  
$EndComp
Wire Wire Line
	7000 5000 7000 4900
Wire Wire Line
	7000 4500 7000 4600
$Comp
L Device:C C3022
U 1 1 60AFDBA3
P 7500 4750
F 0 "C3022" H 7525 4850 50  0000 L CNN
F 1 "330uF" H 7525 4650 50  0000 L CNN
F 2 "Capacitor_SMD:C_Elec_8x10.2" H 7538 4600 50  0001 C CNN
F 3 "~" H 7500 4750 50  0001 C CNN
F 4 "3000-0000001267" H 7500 4750 50  0001 C CNN "PartSpecification"
	1    7500 4750
	1    0    0    -1  
$EndComp
$Comp
L power:+1V2 #PWR?
U 1 1 60AFDBA9
P 7500 4500
F 0 "#PWR?" H 7500 4350 50  0001 C CNN
F 1 "+1V2" H 7500 4640 50  0000 C CNN
F 2 "" H 7500 4500 50  0001 C CNN
F 3 "" H 7500 4500 50  0001 C CNN
	1    7500 4500
	1    0    0    -1  
$EndComp
$Comp
L power:GND #PWR?
U 1 1 60AFDBAF
P 7500 5000
F 0 "#PWR?" H 7500 4750 50  0001 C CNN
F 1 "GND" H 7500 4850 50  0000 C CNN
F 2 "" H 7500 5000 50  0001 C CNN
F 3 "" H 7500 5000 50  0001 C CNN
	1    7500 5000
	1    0    0    -1  
$EndComp
Wire Wire Line
	7500 5000 7500 4900
Wire Wire Line
	7500 4500 7500 4600
$Comp
L Device:C C3023
U 1 1 60B026C0
P 8000 4750
F 0 "C3023" H 8025 4850 50  0000 L CNN
F 1 "330uF" H 8025 4650 50  0000 L CNN
F 2 "Capacitor_SMD:C_Elec_8x10.2" H 8038 4600 50  0001 C CNN
F 3 "~" H 8000 4750 50  0001 C CNN
F 4 "3000-0000001267" H 8000 4750 50  0001 C CNN "PartSpecification"
	1    8000 4750
	1    0    0    -1  
$EndComp
$Comp
L power:+1V2 #PWR?
U 1 1 60B026C6
P 8000 4500
F 0 "#PWR?" H 8000 4350 50  0001 C CNN
F 1 "+1V2" H 8000 4640 50  0000 C CNN
F 2 "" H 8000 4500 50  0001 C CNN
F 3 "" H 8000 4500 50  0001 C CNN
	1    8000 4500
	1    0    0    -1  
$EndComp
$Comp
L power:GND #PWR?
U 1 1 60B026CC
P 8000 5000
F 0 "#PWR?" H 8000 4750 50  0001 C CNN
F 1 "GND" H 8000 4850 50  0000 C CNN
F 2 "" H 8000 5000 50  0001 C CNN
F 3 "" H 8000 5000 50  0001 C CNN
	1    8000 5000
	1    0    0    -1  
$EndComp
Wire Wire Line
	8000 5000 8000 4900
Wire Wire Line
	8000 4500 8000 4600
$Comp
L Device:C C3024
U 1 1 60B07415
P 8500 4750
F 0 "C3024" H 8525 4850 50  0000 L CNN
F 1 "330uF" H 8525 4650 50  0000 L CNN
F 2 "Capacitor_SMD:C_Elec_8x10.2" H 8538 4600 50  0001 C CNN
F 3 "~" H 8500 4750 50  0001 C CNN
F 4 "3000-0000001267" H 8500 4750 50  0001 C CNN "PartSpecification"
	1    8500 4750
	1    0    0    -1  
$EndComp
$Comp
L power:+1V2 #PWR?
U 1 1 60B0741B
P 8500 4500
F 0 "#PWR?" H 8500 4350 50  0001 C CNN
F 1 "+1V2" H 8500 4640 50  0000 C CNN
F 2 "" H 8500 4500 50  0001 C CNN
F 3 "" H 8500 4500 50  0001 C CNN
	1    8500 4500
	1    0    0    -1  
$EndComp
$Comp
L power:GND #PWR?
U 1 1 60B07421
P 8500 5000
F 0 "#PWR?" H 8500 4750 50  0001 C CNN
F 1 "GND" H 8500 4850 50  0000 C CNN
F 2 "" H 8500 5000 50  0001 C CNN
F 3 "" H 8500 5000 50  0001 C CNN
	1    8500 5000
	1    0    0    -1  
$EndComp
Wire Wire Line
	8500 5000 8500 4900
Wire Wire Line
	8500 4500 8500 4600
$Comp
L Device:C C3025
U 1 1 60B0C2ED
P 9000 4750
F 0 "C3025" H 9025 4850 50  0000 L CNN
F 1 "330uF" H 9025 4650 50  0000 L CNN
F 2 "Capacitor_SMD:C_Elec_8x10.2" H 9038 4600 50  0001 C CNN
F 3 "~" H 9000 4750 50  0001 C CNN
F 4 "3000-0000001267" H 9000 4750 50  0001 C CNN "PartSpecification"
	1    9000 4750
	1    0    0    -1  
$EndComp
$Comp
L power:+1V2 #PWR?
U 1 1 60B0C2F3
P 9000 4500
F 0 "#PWR?" H 9000 4350 50  0001 C CNN
F 1 "+1V2" H 9000 4640 50  0000 C CNN
F 2 "" H 9000 4500 50  0001 C CNN
F 3 "" H 9000 4500 50  0001 C CNN
	1    9000 4500
	1    0    0    -1  
$EndComp
$Comp
L power:GND #PWR?
U 1 1 60B0C2F9
P 9000 5000
F 0 "#PWR?" H 9000 4750 50  0001 C CNN
F 1 "GND" H 9000 4850 50  0000 C CNN
F 2 "" H 9000 5000 50  0001 C CNN
F 3 "" H 9000 5000 50  0001 C CNN
	1    9000 5000
	1    0    0    -1  
$EndComp
Wire Wire Line
	9000 5000 9000 4900
Wire Wire Line
	9000 4500 9000 4600
$Comp
L Device:C C3026
U 1 1 60B116E4
P 9500 4750
F 0 "C3026" H 9525 4850 50  0000 L CNN
F 1 "330uF" H 9525 4650 50  0000 L CNN
F 2 "Capacitor_SMD:C_Elec_8x10.2" H 9538 4600 50  0001 C CNN
F 3 "~" H 9500 4750 50  0001 C CNN
F 4 "3000-0000001267" H 9500 4750 50  0001 C CNN "PartSpecification"
	1    9500 4750
	1    0    0    -1  
$EndComp
$Comp
L power:+1V2 #PWR?
U 1 1 60B116EA
P 9500 4500
F 0 "#PWR?" H 9500 4350 50  0001 C CNN
F 1 "+1V2" H 9500 4640 50  0000 C CNN
F 2 "" H 9500 4500 50  0001 C CNN
F 3 "" H 9500 4500 50  0001 C CNN
	1    9500 4500
	1    0    0    -1  
$EndComp
$Comp
L power:GND #PWR?
U 1 1 60B116F0
P 9500 5000
F 0 "#PWR?" H 9500 4750 50  0001 C CNN
F 1 "GND" H 9500 4850 50  0000 C CNN
F 2 "" H 9500 5000 50  0001 C CNN
F 3 "" H 9500 5000 50  0001 C CNN
	1    9500 5000
	1    0    0    -1  
$EndComp
Wire Wire Line
	9500 5000 9500 4900
Wire Wire Line
	9500 4500 9500 4600
$Comp
L Device:C C3001
U 1 1 5FB7A828
P 7000 1750
F 0 "C3001" H 7025 1850 50  0000 L CNN
F 1 "47nF" H 7025 1650 50  0000 L CNN
F 2 "Capacitor_SMD:C_0402_1005Metric" H 7038 1600 50  0001 C CNN
F 3 "~" H 7000 1750 50  0001 C CNN
F 4 "3000-0000001261" H 7000 1750 50  0001 C CNN "PartSpecification"
	1    7000 1750
	1    0    0    -1  
$EndComp
$Comp
L power:+1V2 #PWR?
U 1 1 60A9478E
P 7000 1500
F 0 "#PWR?" H 7000 1350 50  0001 C CNN
F 1 "+1V2" H 7000 1640 50  0000 C CNN
F 2 "" H 7000 1500 50  0001 C CNN
F 3 "" H 7000 1500 50  0001 C CNN
	1    7000 1500
	1    0    0    -1  
$EndComp
$Comp
L power:GND #PWR?
U 1 1 60A95578
P 7000 2000
F 0 "#PWR?" H 7000 1750 50  0001 C CNN
F 1 "GND" H 7000 1850 50  0000 C CNN
F 2 "" H 7000 2000 50  0001 C CNN
F 3 "" H 7000 2000 50  0001 C CNN
	1    7000 2000
	1    0    0    -1  
$EndComp
Wire Wire Line
	7000 2000 7000 1900
Wire Wire Line
	7000 1500 7000 1600
$Comp
L Device:C C3002
U 1 1 60AA2BCE
P 7500 1750
F 0 "C3002" H 7525 1850 50  0000 L CNN
F 1 "47nF" H 7525 1650 50  0000 L CNN
F 2 "Capacitor_SMD:C_0402_1005Metric" H 7538 1600 50  0001 C CNN
F 3 "~" H 7500 1750 50  0001 C CNN
F 4 "3000-0000001261" H 7500 1750 50  0001 C CNN "PartSpecification"
	1    7500 1750
	1    0    0    -1  
$EndComp
$Comp
L power:+1V2 #PWR?
U 1 1 60AA2BD4
P 7500 1500
F 0 "#PWR?" H 7500 1350 50  0001 C CNN
F 1 "+1V2" H 7500 1640 50  0000 C CNN
F 2 "" H 7500 1500 50  0001 C CNN
F 3 "" H 7500 1500 50  0001 C CNN
	1    7500 1500
	1    0    0    -1  
$EndComp
$Comp
L power:GND #PWR?
U 1 1 60AA2BDA
P 7500 2000
F 0 "#PWR?" H 7500 1750 50  0001 C CNN
F 1 "GND" H 7500 1850 50  0000 C CNN
F 2 "" H 7500 2000 50  0001 C CNN
F 3 "" H 7500 2000 50  0001 C CNN
	1    7500 2000
	1    0    0    -1  
$EndComp
Wire Wire Line
	7500 2000 7500 1900
Wire Wire Line
	7500 1500 7500 1600
$Comp
L Device:C C3003
U 1 1 60AA5041
P 8000 1750
F 0 "C3003" H 8025 1850 50  0000 L CNN
F 1 "47nF" H 8025 1650 50  0000 L CNN
F 2 "Capacitor_SMD:C_0402_1005Metric" H 8038 1600 50  0001 C CNN
F 3 "~" H 8000 1750 50  0001 C CNN
F 4 "3000-0000001261" H 8000 1750 50  0001 C CNN "PartSpecification"
	1    8000 1750
	1    0    0    -1  
$EndComp
$Comp
L power:+1V2 #PWR?
U 1 1 60AA5047
P 8000 1500
F 0 "#PWR?" H 8000 1350 50  0001 C CNN
F 1 "+1V2" H 8000 1640 50  0000 C CNN
F 2 "" H 8000 1500 50  0001 C CNN
F 3 "" H 8000 1500 50  0001 C CNN
	1    8000 1500
	1    0    0    -1  
$EndComp
$Comp
L power:GND #PWR?
U 1 1 60AA504D
P 8000 2000
F 0 "#PWR?" H 8000 1750 50  0001 C CNN
F 1 "GND" H 8000 1850 50  0000 C CNN
F 2 "" H 8000 2000 50  0001 C CNN
F 3 "" H 8000 2000 50  0001 C CNN
	1    8000 2000
	1    0    0    -1  
$EndComp
Wire Wire Line
	8000 2000 8000 1900
Wire Wire Line
	8000 1500 8000 1600
$Comp
L Device:C C3004
U 1 1 60AA79A5
P 8500 1750
F 0 "C3004" H 8525 1850 50  0000 L CNN
F 1 "47nF" H 8525 1650 50  0000 L CNN
F 2 "Capacitor_SMD:C_0402_1005Metric" H 8538 1600 50  0001 C CNN
F 3 "~" H 8500 1750 50  0001 C CNN
F 4 "3000-0000001261" H 8500 1750 50  0001 C CNN "PartSpecification"
	1    8500 1750
	1    0    0    -1  
$EndComp
$Comp
L power:+1V2 #PWR?
U 1 1 60AA79AB
P 8500 1500
F 0 "#PWR?" H 8500 1350 50  0001 C CNN
F 1 "+1V2" H 8500 1640 50  0000 C CNN
F 2 "" H 8500 1500 50  0001 C CNN
F 3 "" H 8500 1500 50  0001 C CNN
	1    8500 1500
	1    0    0    -1  
$EndComp
$Comp
L power:GND #PWR?
U 1 1 60AA79B1
P 8500 2000
F 0 "#PWR?" H 8500 1750 50  0001 C CNN
F 1 "GND" H 8500 1850 50  0000 C CNN
F 2 "" H 8500 2000 50  0001 C CNN
F 3 "" H 8500 2000 50  0001 C CNN
	1    8500 2000
	1    0    0    -1  
$EndComp
Wire Wire Line
	8500 2000 8500 1900
Wire Wire Line
	8500 1500 8500 1600
$Comp
L Device:C C3005
U 1 1 60AAA4A1
P 9000 1750
F 0 "C3005" H 9025 1850 50  0000 L CNN
F 1 "47nF" H 9025 1650 50  0000 L CNN
F 2 "Capacitor_SMD:C_0402_1005Metric" H 9038 1600 50  0001 C CNN
F 3 "~" H 9000 1750 50  0001 C CNN
F 4 "3000-0000001261" H 9000 1750 50  0001 C CNN "PartSpecification"
	1    9000 1750
	1    0    0    -1  
$EndComp
$Comp
L power:+1V2 #PWR?
U 1 1 60AAA4A7
P 9000 1500
F 0 "#PWR?" H 9000 1350 50  0001 C CNN
F 1 "+1V2" H 9000 1640 50  0000 C CNN
F 2 "" H 9000 1500 50  0001 C CNN
F 3 "" H 9000 1500 50  0001 C CNN
	1    9000 1500
	1    0    0    -1  
$EndComp
$Comp
L power:GND #PWR?
U 1 1 60AAA4AD
P 9000 2000
F 0 "#PWR?" H 9000 1750 50  0001 C CNN
F 1 "GND" H 9000 1850 50  0000 C CNN
F 2 "" H 9000 2000 50  0001 C CNN
F 3 "" H 9000 2000 50  0001 C CNN
	1    9000 2000
	1    0    0    -1  
$EndComp
Wire Wire Line
	9000 2000 9000 1900
Wire Wire Line
	9000 1500 9000 1600
$Comp
L Device:C C3006
U 1 1 60BB25D7
P 9500 1750
F 0 "C3006" H 9525 1850 50  0000 L CNN
F 1 "47nF" H 9525 1650 50  0000 L CNN
F 2 "Capacitor_SMD:C_0402_1005Metric" H 9538 1600 50  0001 C CNN
F 3 "~" H 9500 1750 50  0001 C CNN
F 4 "3000-0000001261" H 9500 1750 50  0001 C CNN "PartSpecification"
	1    9500 1750
	1    0    0    -1  
$EndComp
$Comp
L power:+1V2 #PWR?
U 1 1 60BB25DD
P 9500 1500
F 0 "#PWR?" H 9500 1350 50  0001 C CNN
F 1 "+1V2" H 9500 1640 50  0000 C CNN
F 2 "" H 9500 1500 50  0001 C CNN
F 3 "" H 9500 1500 50  0001 C CNN
	1    9500 1500
	1    0    0    -1  
$EndComp
$Comp
L power:GND #PWR?
U 1 1 60BB25E3
P 9500 2000
F 0 "#PWR?" H 9500 1750 50  0001 C CNN
F 1 "GND" H 9500 1850 50  0000 C CNN
F 2 "" H 9500 2000 50  0001 C CNN
F 3 "" H 9500 2000 50  0001 C CNN
	1    9500 2000
	1    0    0    -1  
$EndComp
Wire Wire Line
	9500 2000 9500 1900
Wire Wire Line
	9500 1500 9500 1600
$EndSCHEMATC
