EESchema Schematic File Version 4
EELAYER 30 0
EELAYER END
$Descr A4 11693 8268
encoding utf-8
Sheet 18 27
Title ""
Date ""
Rev ""
Comp ""
Comment1 ""
Comment2 ""
Comment3 ""
Comment4 ""
$EndDescr
$Comp
L POWDER_MCU:MSP432E401YTPDTR U2002
U 1 1 5E21ACAA
P 4300 2750
F 0 "U2002" H 4300 2450 60  0000 C CNN
F 1 "MSP432E401YTPDTR" H 4300 3000 60  0000 C CNN
F 2 "POWDER_MCU:MSP432E401YTPDTR" H 4300 2290 60  0001 C CNN
F 3 "" H 4300 2350 60  0000 C CNN
F 4 "Texas Instruments" H 4300 2750 50  0001 C CNN "Manufacturer"
F 5 "MSP432E401YTPDTR" H 4300 2750 50  0001 C CNN "PartNumber"
F 6 "3000-0000000080" H 4300 2750 50  0001 C CNN "PartSpecification"
	1    4300 2750
	1    0    0    -1  
$EndComp
$Comp
L POWDER_MCU:MSP432E401YTPDTR U2002
U 2 1 5E21C118
P 8850 2050
F 0 "U2002" H 8850 1750 60  0000 C CNN
F 1 "MSP432E401YTPDTR" H 8850 2300 60  0000 C CNN
F 2 "POWDER_MCU:MSP432E401YTPDTR" H 8850 1590 60  0001 C CNN
F 3 "" H 8850 1650 60  0000 C CNN
F 4 "Texas Instruments" H 8850 2050 50  0001 C CNN "Manufacturer"
F 5 "MSP432E401YTPDTR" H 8850 2050 50  0001 C CNN "PartNumber"
F 6 "3000-0000000080" H 8850 2050 50  0001 C CNN "PartSpecification"
	2    8850 2050
	1    0    0    -1  
$EndComp
$Comp
L POWDER_Misc:25AA02E48 U?
U 1 1 5E220976
P 4500 6700
AR Path="/5E1922DE/5E220976" Ref="U?"  Part="1" 
AR Path="/5E1922DE/5E218DC0/5E220976" Ref="U2003"  Part="1" 
F 0 "U2003" H 4800 7050 50  0000 C CNN
F 1 "25AA02E48" H 4500 6700 50  0000 C CNN
F 2 "Package_SO:SOIC-8_3.9x4.9mm_P1.27mm" H 5400 6250 50  0001 C CNN
F 3 "" H 4500 6700 50  0001 C CNN
F 4 "3000-0000000189" H 4500 6700 50  0001 C CNN "PartSpecification"
	1    4500 6700
	1    0    0    -1  
$EndComp
$Comp
L POWDER_ESD:TPD6E004 U2001
U 1 1 5E3EAF6B
P 2300 5700
F 0 "U2001" H 3000 6450 50  0000 C CNN
F 1 "TPD6E004" H 1700 6450 50  0000 C CNN
F 2 "POWDER_ESD:TPD6E004_RSE_8" H 1550 6850 50  0001 C CNN
F 3 "" H 1600 6550 50  0001 C CNN
F 4 "Texas Instruments" H 2300 5700 50  0001 C CNN "Manufacturer"
F 5 "TPD6E004RSER" H 2300 5700 50  0001 C CNN "PartNumber"
F 6 "3000-0000000082" H 2300 5700 50  0001 C CNN "PartSpecification"
	1    2300 5700
	1    0    0    -1  
$EndComp
$Comp
L Connector_Generic:Conn_02x05_Odd_Even J2001
U 1 1 5E3F6384
P 1200 2850
F 0 "J2001" H 1250 3150 50  0000 C CNN
F 1 "Conn_02x05_Odd_Even" H 1250 2550 50  0000 C CNN
F 2 "POWDER_MCU:ARM_JTAG_0.127_10" H 1200 2850 50  0001 C CNN
F 3 "~" H 1200 2850 50  0001 C CNN
F 4 "3000-0000000164" H 1200 2850 50  0001 C CNN "PartSpecification"
	1    1200 2850
	1    0    0    -1  
$EndComp
$Comp
L power:+3.3V #PWR?
U 1 1 5E3F8138
P 900 2550
F 0 "#PWR?" H 900 2400 50  0001 C CNN
F 1 "+3.3V" H 900 2690 50  0000 C CNN
F 2 "" H 900 2550 50  0001 C CNN
F 3 "" H 900 2550 50  0001 C CNN
	1    900  2550
	1    0    0    -1  
$EndComp
Wire Wire Line
	900  2550 900  2650
Wire Wire Line
	900  2650 1000 2650
$Comp
L power:GND #PWR?
U 1 1 5E3F8AAF
P 750 3200
F 0 "#PWR?" H 750 2950 50  0001 C CNN
F 1 "GND" H 750 3050 50  0000 C CNN
F 2 "" H 750 3200 50  0001 C CNN
F 3 "" H 750 3200 50  0001 C CNN
	1    750  3200
	1    0    0    -1  
$EndComp
Wire Wire Line
	750  3200 750  3050
Wire Wire Line
	750  3050 900  3050
Wire Wire Line
	1000 2950 900  2950
Wire Wire Line
	900  2950 900  3050
Connection ~ 900  3050
Wire Wire Line
	900  3050 1000 3050
Wire Wire Line
	1000 2750 900  2750
Wire Wire Line
	900  2750 900  2850
Connection ~ 900  2950
Wire Wire Line
	1000 2850 900  2850
Connection ~ 900  2850
Wire Wire Line
	900  2850 900  2950
Text HLabel 1800 3050 2    50   Output ~ 0
RST_N
Wire Wire Line
	1800 3050 1500 3050
Wire Wire Line
	1500 2950 1700 2950
Wire Wire Line
	1700 2850 1500 2850
Wire Wire Line
	1700 2750 1500 2750
Wire Wire Line
	1700 2650 1500 2650
Text Label 1550 2750 0    50   ~ 0
TCK
Text Label 1550 2650 0    50   ~ 0
TMS
Text Label 1550 2850 0    50   ~ 0
TDO
Text Label 1550 2950 0    50   ~ 0
TDI
Wire Wire Line
	3400 2700 3100 2700
Wire Wire Line
	3100 2800 3400 2800
Wire Wire Line
	3400 2900 3100 2900
Wire Wire Line
	3100 3000 3400 3000
Text Label 3100 2800 0    50   ~ 0
TMS
Text Label 3100 2700 0    50   ~ 0
TCK
Text Label 3100 3000 0    50   ~ 0
TDO
Text Label 3100 2900 0    50   ~ 0
TDI
Wire Notes Line
	2550 2800 1750 2800
Text Label 3000 1600 0    50   ~ 0
SSI0RX
Text Label 3000 1500 0    50   ~ 0
SSI0TX
Text Label 3000 1300 0    50   ~ 0
SSI0CLK
Wire Wire Line
	3000 1300 3400 1300
Wire Wire Line
	3000 1400 3400 1400
Wire Wire Line
	3000 1500 3400 1500
Wire Wire Line
	3000 1600 3400 1600
$Comp
L 000_PreferredParts:C_0_1uF C2002
U 1 1 5E41A4A0
P 4750 5850
F 0 "C2002" H 4775 5950 50  0000 L CNN
F 1 "C_0_1uF" H 4775 5750 50  0001 L CNN
F 2 "Capacitor_SMD:C_0402_1005Metric" H 4788 5700 50  0001 C CNN
F 3 "~" H 4750 5850 50  0001 C CNN
F 4 "0.1uF" H 4900 5750 50  0000 C CNN "DisplayValue"
F 5 "3000-0000000125" H 4750 5850 50  0001 C CNN "PartSpecification"
	1    4750 5850
	1    0    0    -1  
$EndComp
$Comp
L power:GND #PWR?
U 1 1 5E4221FC
P 4750 6100
F 0 "#PWR?" H 4750 5850 50  0001 C CNN
F 1 "GND" H 4750 5950 50  0000 C CNN
F 2 "" H 4750 6100 50  0001 C CNN
F 3 "" H 4750 6100 50  0001 C CNN
	1    4750 6100
	1    0    0    -1  
$EndComp
Wire Wire Line
	4750 6100 4750 6000
$Comp
L power:+3.3V #PWR?
U 1 1 5E428AEC
P 4500 5700
F 0 "#PWR?" H 4500 5550 50  0001 C CNN
F 1 "+3.3V" H 4500 5840 50  0000 C CNN
F 2 "" H 4500 5700 50  0001 C CNN
F 3 "" H 4500 5700 50  0001 C CNN
	1    4500 5700
	1    0    0    -1  
$EndComp
Wire Wire Line
	4750 5700 4500 5700
Wire Wire Line
	4500 6300 4500 5700
Connection ~ 4500 5700
$Comp
L Device:R R2002
U 1 1 5E42C5E7
P 5250 6350
F 0 "R2002" V 5330 6350 50  0000 C CNN
F 1 "100" V 5250 6350 50  0000 C CNN
F 2 "Resistor_SMD:R_0402_1005Metric" V 5180 6350 50  0001 C CNN
F 3 "~" H 5250 6350 50  0001 C CNN
F 4 "3000-0000000149" H 5250 6350 50  0001 C CNN "PartSpecification"
	1    5250 6350
	1    0    0    -1  
$EndComp
$Comp
L Device:R R2003
U 1 1 5E42CC65
P 5500 7050
F 0 "R2003" V 5580 7050 50  0000 C CNN
F 1 "100" V 5500 7050 50  0000 C CNN
F 2 "Resistor_SMD:R_0402_1005Metric" V 5430 7050 50  0001 C CNN
F 3 "~" H 5500 7050 50  0001 C CNN
F 4 "3000-0000000149" H 5500 7050 50  0001 C CNN "PartSpecification"
	1    5500 7050
	1    0    0    -1  
$EndComp
Wire Wire Line
	5100 6600 5500 6600
Wire Wire Line
	5500 6600 5500 6900
Wire Wire Line
	5250 6800 5250 6500
Wire Wire Line
	5100 6800 5250 6800
$Comp
L power:+3.3V #PWR?
U 1 1 5E42EF4C
P 5250 6100
F 0 "#PWR?" H 5250 5950 50  0001 C CNN
F 1 "+3.3V" H 5250 6240 50  0000 C CNN
F 2 "" H 5250 6100 50  0001 C CNN
F 3 "" H 5250 6100 50  0001 C CNN
	1    5250 6100
	1    0    0    -1  
$EndComp
Wire Wire Line
	5250 6100 5250 6200
$Comp
L Connector:TestPoint TP2001
U 1 1 5E4302BC
P 5650 6500
F 0 "TP2001" H 5650 6770 50  0000 C CNN
F 1 "TestPoint" H 5650 6700 50  0000 C CNN
F 2 "TestPoint:TestPoint_Pad_D1.0mm" H 5850 6500 50  0001 C CNN
F 3 "~" H 5850 6500 50  0001 C CNN
	1    5650 6500
	1    0    0    -1  
$EndComp
Wire Wire Line
	5650 6500 5650 6600
Wire Wire Line
	5650 6600 5500 6600
Connection ~ 5500 6600
$Comp
L power:GND #PWR?
U 1 1 5E43129B
P 5500 7300
F 0 "#PWR?" H 5500 7050 50  0001 C CNN
F 1 "GND" H 5500 7150 50  0000 C CNN
F 2 "" H 5500 7300 50  0001 C CNN
F 3 "" H 5500 7300 50  0001 C CNN
	1    5500 7300
	1    0    0    -1  
$EndComp
Wire Wire Line
	5500 7300 5500 7200
$Comp
L power:GND #PWR?
U 1 1 5E437013
P 4500 7200
F 0 "#PWR?" H 4500 6950 50  0001 C CNN
F 1 "GND" H 4500 7050 50  0000 C CNN
F 2 "" H 4500 7200 50  0001 C CNN
F 3 "" H 4500 7200 50  0001 C CNN
	1    4500 7200
	1    0    0    -1  
$EndComp
Wire Wire Line
	4500 7200 4500 7100
Text Label 3500 6550 0    50   ~ 0
SSI0RX
Text Label 3500 6650 0    50   ~ 0
SSI0TX
Text Label 3500 6750 0    50   ~ 0
SSI0CLK
Wire Wire Line
	3500 6750 3900 6750
Wire Wire Line
	3500 6650 3900 6650
Wire Wire Line
	3500 6550 3900 6550
Wire Wire Line
	3900 6850 3500 6850
Wire Wire Line
	5200 1800 5500 1800
Wire Wire Line
	5500 2200 5200 2200
Text HLabel 5500 2200 2    50   Output ~ 0
ACT_LED
Text HLabel 5500 1800 2    50   Output ~ 0
LINK_LED
Wire Wire Line
	3250 5850 3450 5850
Wire Wire Line
	1350 5850 1150 5850
Wire Wire Line
	1350 5700 1150 5700
Wire Wire Line
	1350 5550 1150 5550
Text Label 1200 5700 0    50   ~ 0
TCK
Text Label 1200 5550 0    50   ~ 0
TMS
Text Label 1200 5850 0    50   ~ 0
TDO
Text Label 3300 5850 0    50   ~ 0
TDI
Text Label 1550 3050 0    50   ~ 0
RST_N
Text Label 3300 5700 0    50   ~ 0
RST_N
Wire Wire Line
	3250 5700 3450 5700
Wire Wire Line
	3450 5550 3250 5550
$Comp
L power:+3.3V #PWR?
U 1 1 5E47357C
P 2300 4350
F 0 "#PWR?" H 2300 4200 50  0001 C CNN
F 1 "+3.3V" H 2300 4490 50  0000 C CNN
F 2 "" H 2300 4350 50  0001 C CNN
F 3 "" H 2300 4350 50  0001 C CNN
	1    2300 4350
	1    0    0    -1  
$EndComp
$Comp
L 000_PreferredParts:C_0_1uF C2001
U 1 1 5E473C24
P 2500 4600
F 0 "C2001" H 2525 4700 50  0000 L CNN
F 1 "C_0_1uF" H 2525 4500 50  0001 L CNN
F 2 "Capacitor_SMD:C_0402_1005Metric" H 2538 4450 50  0001 C CNN
F 3 "~" H 2500 4600 50  0001 C CNN
F 4 "0.1uF" H 2650 4500 50  0000 C CNN "DisplayValue"
F 5 "3000-0000000125" H 2500 4600 50  0001 C CNN "PartSpecification"
	1    2500 4600
	1    0    0    -1  
$EndComp
Wire Wire Line
	2500 4450 2500 4400
Wire Wire Line
	2500 4400 2300 4400
Wire Wire Line
	2300 4400 2300 4350
Wire Wire Line
	2300 4400 2300 4850
Connection ~ 2300 4400
$Comp
L power:GND #PWR?
U 1 1 5E4762B9
P 2300 6650
F 0 "#PWR?" H 2300 6400 50  0001 C CNN
F 1 "GND" H 2300 6500 50  0000 C CNN
F 2 "" H 2300 6650 50  0001 C CNN
F 3 "" H 2300 6650 50  0001 C CNN
	1    2300 6650
	1    0    0    -1  
$EndComp
Wire Wire Line
	2300 6650 2300 6550
$Comp
L power:GND #PWR?
U 1 1 5E477C02
P 2500 4800
F 0 "#PWR?" H 2500 4550 50  0001 C CNN
F 1 "GND" H 2500 4650 50  0000 C CNN
F 2 "" H 2500 4800 50  0001 C CNN
F 3 "" H 2500 4800 50  0001 C CNN
	1    2500 4800
	1    0    0    -1  
$EndComp
Wire Wire Line
	2500 4800 2500 4750
$Comp
L POWDER_ESD:TPD6E004 U2004
U 1 1 5E4833CE
P 9300 5200
F 0 "U2004" H 10000 5950 50  0000 C CNN
F 1 "TPD6E004" H 8700 5950 50  0000 C CNN
F 2 "POWDER_ESD:TPD6E004_RSE_8" H 8550 6350 50  0001 C CNN
F 3 "" H 8600 6050 50  0001 C CNN
F 4 "Texas Instruments" H 9300 5200 50  0001 C CNN "Manufacturer"
F 5 "TPD6E004RSER" H 9300 5200 50  0001 C CNN "PartNumber"
F 6 "3000-0000000082" H 9300 5200 50  0001 C CNN "PartSpecification"
	1    9300 5200
	1    0    0    -1  
$EndComp
$Comp
L power:GND #PWR?
U 1 1 5E487607
P 9300 6150
F 0 "#PWR?" H 9300 5900 50  0001 C CNN
F 1 "GND" H 9300 6000 50  0000 C CNN
F 2 "" H 9300 6150 50  0001 C CNN
F 3 "" H 9300 6150 50  0001 C CNN
	1    9300 6150
	1    0    0    -1  
$EndComp
Wire Wire Line
	9300 6150 9300 6050
$Comp
L Connector:USB_B_Micro J2002
U 1 1 5E48CBD2
P 7300 5100
F 0 "J2002" H 7100 5550 50  0000 L CNN
F 1 "USB_B_Micro" H 7100 5450 50  0000 L CNN
F 2 "Connector_USB:USB_Micro-B_Amphenol_10103594-0001LF_Horizontal" H 7450 5050 50  0001 C CNN
F 3 "~" H 7450 5050 50  0001 C CNN
F 4 "3000-0000000158" H 7300 5100 50  0001 C CNN "PartSpecification"
	1    7300 5100
	1    0    0    -1  
$EndComp
Wire Wire Line
	8350 5200 7600 5200
Wire Wire Line
	7600 5300 8000 5300
Wire Wire Line
	8000 5300 8000 5350
Wire Wire Line
	8000 5350 8350 5350
Wire Wire Line
	8000 5050 8000 5100
Wire Wire Line
	8000 5100 7600 5100
Wire Wire Line
	8000 5050 8350 5050
Wire Wire Line
	8000 4350 8000 4900
Wire Wire Line
	8000 4900 7600 4900
Wire Wire Line
	8000 4350 9300 4350
Wire Wire Line
	3400 2100 3000 2100
Text Label 3000 2100 0    50   ~ 0
VBUS
Text Label 7650 5300 0    50   ~ 0
USB_ID
Text Label 7650 5200 0    50   ~ 0
USBPD_N
Text Label 7650 5100 0    50   ~ 0
USBPD_P
Text Label 7650 4900 0    50   ~ 0
VBUS
$Comp
L power:GND #PWR?
U 1 1 5E4A273F
P 7300 5600
F 0 "#PWR?" H 7300 5350 50  0001 C CNN
F 1 "GND" H 7300 5450 50  0000 C CNN
F 2 "" H 7300 5600 50  0001 C CNN
F 3 "" H 7300 5600 50  0001 C CNN
	1    7300 5600
	1    0    0    -1  
$EndComp
Wire Wire Line
	7300 5600 7300 5500
$Comp
L 000_PreferredParts:C_1nF C2005
U 1 1 5E4A53F8
P 7000 5800
F 0 "C2005" H 7025 5900 50  0000 L CNN
F 1 "C_1nF" H 7025 5700 50  0000 L CNN
F 2 "Capacitor_SMD:C_0402_1005Metric" H 7038 5650 50  0001 C CNN
F 3 "~" H 7000 5800 50  0001 C CNN
F 4 "3000-0000000128" H 7000 5800 50  0001 C CNN "PartSpecification"
	1    7000 5800
	1    0    0    -1  
$EndComp
$Comp
L 000_PreferredParts:C_1nF C2004
U 1 1 5E4A5FE4
P 6700 5800
F 0 "C2004" H 6725 5900 50  0000 L CNN
F 1 "C_1nF" H 6725 5700 50  0000 L CNN
F 2 "Capacitor_SMD:C_0402_1005Metric" H 6738 5650 50  0001 C CNN
F 3 "~" H 6700 5800 50  0001 C CNN
F 4 "3000-0000000128" H 6700 5800 50  0001 C CNN "PartSpecification"
	1    6700 5800
	1    0    0    -1  
$EndComp
$Comp
L 000_PreferredParts:C_1nF C2003
U 1 1 5E4A6605
P 6400 5800
F 0 "C2003" H 6425 5900 50  0000 L CNN
F 1 "C_1nF" H 6425 5700 50  0000 L CNN
F 2 "Capacitor_SMD:C_0402_1005Metric" H 6438 5650 50  0001 C CNN
F 3 "~" H 6400 5800 50  0001 C CNN
F 4 "3000-0000000128" H 6400 5800 50  0001 C CNN "PartSpecification"
	1    6400 5800
	1    0    0    -1  
$EndComp
$Comp
L Device:R R2004
U 1 1 5E4A6A1B
P 6150 5800
F 0 "R2004" V 6230 5800 50  0000 C CNN
F 1 "1M" V 6150 5800 50  0000 C CNN
F 2 "Resistor_SMD:R_0402_1005Metric" V 6080 5800 50  0001 C CNN
F 3 "~" H 6150 5800 50  0001 C CNN
F 4 "3000-0000000139" H 6150 5800 50  0001 C CNN "PartSpecification"
	1    6150 5800
	1    0    0    -1  
$EndComp
Wire Wire Line
	7200 5500 7200 5600
Wire Wire Line
	7200 5600 7000 5600
Wire Wire Line
	6150 5600 6150 5650
Wire Wire Line
	6400 5650 6400 5600
Wire Wire Line
	6400 5600 6150 5600
$Comp
L power:GND #PWR?
U 1 1 5E4AA212
P 6400 6100
F 0 "#PWR?" H 6400 5850 50  0001 C CNN
F 1 "GND" H 6400 5950 50  0000 C CNN
F 2 "" H 6400 6100 50  0001 C CNN
F 3 "" H 6400 6100 50  0001 C CNN
	1    6400 6100
	1    0    0    -1  
$EndComp
Wire Wire Line
	6150 5950 6150 6050
Wire Wire Line
	6150 6050 6400 6050
Wire Wire Line
	6400 6050 6400 6100
Wire Wire Line
	7000 5950 7000 6050
Wire Wire Line
	7000 6050 6700 6050
Connection ~ 6400 6050
Wire Wire Line
	6400 5950 6400 6050
Wire Wire Line
	6700 5950 6700 6050
Connection ~ 6700 6050
Wire Wire Line
	6700 6050 6400 6050
Wire Wire Line
	6700 5650 6700 5600
Connection ~ 6700 5600
Wire Wire Line
	6700 5600 6400 5600
Wire Wire Line
	7000 5650 7000 5600
Connection ~ 7000 5600
Wire Wire Line
	7000 5600 6700 5600
Text HLabel 7450 1700 0    50   Input ~ 0
pg[0..9]
Text HLabel 6150 3200 2    50   Output ~ 0
en[0..9]
Text HLabel 3150 1700 0    50   Input ~ 0
gpsdo_ser_output
Text HLabel 3150 1100 0    50   Input ~ 0
gpsdo_nmea_txd
Text HLabel 3150 1800 0    50   Output ~ 0
gpsdo_ser_input
Text HLabel 8250 3500 2    50   Output ~ 0
gpsdo_enter_isp
Text HLabel 3150 1200 0    50   Input ~ 0
gpsdo_lock_ok
Text HLabel 8250 3400 2    50   Input ~ 0
gpsdo_pps_in
Text HLabel 7350 800  0    50   Input ~ 0
fan_tach[0..4]
Text HLabel 5000 700  0    50   Input ~ 0
sense[0..12]
Text HLabel 2300 3800 0    50   Input ~ 0
moisture
Text HLabel 5500 2000 2    50   Input ~ 0
cooler_fault
Text HLabel 5500 2100 2    50   Output ~ 0
NUC_reset
Text HLabel 3250 3400 0    50   Output ~ 0
TX_1
Text HLabel 3250 3200 0    50   Output ~ 0
TX_2
Text HLabel 3250 3100 0    50   Input ~ 0
RX_1
Text HLabel 3250 3300 0    50   Input ~ 0
RX_2
Text HLabel 5500 1900 2    50   Output ~ 0
amux_s
Text HLabel 7750 1400 0    50   Input ~ 0
charge_~discharge
Text HLabel 5500 2400 2    50   Input ~ 0
imu_int1
Text HLabel 5500 2500 2    50   Input ~ 0
imu_int2
$Comp
L Device:R R2001
U 1 1 5E45F713
P 2650 2000
F 0 "R2001" V 2730 2000 50  0000 C CNN
F 1 "100" V 2650 2000 50  0000 C CNN
F 2 "Resistor_SMD:R_0402_1005Metric" V 2580 2000 50  0001 C CNN
F 3 "~" H 2650 2000 50  0001 C CNN
F 4 "3000-0000000149" H 2650 2000 50  0001 C CNN "PartSpecification"
	1    2650 2000
	0    1    1    0   
$EndComp
Wire Wire Line
	2800 2000 3400 2000
Wire Wire Line
	2500 2000 2050 2000
Text Label 2150 2000 0    50   ~ 0
USB_ID
Text Label 2900 2000 0    50   ~ 0
USB_ID_MCU
$Comp
L Device:LED D2001
U 1 1 5E46FE1F
P 6600 3600
F 0 "D2001" H 6600 3700 50  0000 C CNN
F 1 "GREEN_LED" H 6600 3500 50  0000 C CNN
F 2 "LED_SMD:LED_0805_2012Metric_Castellated" H 6600 3600 50  0001 C CNN
F 3 "~" H 6600 3600 50  0001 C CNN
F 4 "3000-0000000211" H 6600 3600 50  0001 C CNN "PartSpecification"
	1    6600 3600
	0    -1   -1   0   
$EndComp
$Comp
L Device:LED D2002
U 1 1 5E47238E
P 6900 3600
F 0 "D2002" H 6900 3700 50  0000 C CNN
F 1 "RED LED" H 6900 3500 50  0000 C CNN
F 2 "LED_SMD:LED_0805_2012Metric_Castellated" H 6900 3600 50  0001 C CNN
F 3 "~" H 6900 3600 50  0001 C CNN
F 4 "3000-0000000214" H 6900 3600 50  0001 C CNN "PartSpecification"
	1    6900 3600
	0    -1   -1   0   
$EndComp
$Comp
L Device:LED D2003
U 1 1 5E472A49
P 7200 3600
F 0 "D2003" H 7200 3700 50  0000 C CNN
F 1 "YELLOW LED" H 7200 3500 50  0000 C CNN
F 2 "LED_SMD:LED_0805_2012Metric_Castellated" H 7200 3600 50  0001 C CNN
F 3 "~" H 7200 3600 50  0001 C CNN
F 4 "3000-0000000217" H 7200 3600 50  0001 C CNN "PartSpecification"
	1    7200 3600
	0    -1   -1   0   
$EndComp
$Comp
L Device:LED D2004
U 1 1 5E4730C1
P 7500 3600
F 0 "D2004" H 7500 3700 50  0000 C CNN
F 1 "BLUE LED" H 7500 3500 50  0000 C CNN
F 2 "LED_SMD:LED_0805_2012Metric_Castellated" H 7500 3600 50  0001 C CNN
F 3 "~" H 7500 3600 50  0001 C CNN
F 4 "3000-0000000220" H 7500 3600 50  0001 C CNN "PartSpecification"
	1    7500 3600
	0    -1   -1   0   
$EndComp
$Comp
L Switch:SW_Push SW2001
U 1 1 5E47E2F6
P 10150 1100
F 0 "SW2001" H 10200 1200 50  0000 L CNN
F 1 "SW_Push" H 10150 1040 50  0000 C CNN
F 2 "Button_Switch_SMD:SW_SPST_PTS645" H 10150 1300 50  0001 C CNN
F 3 "~" H 10150 1300 50  0001 C CNN
F 4 "3000-0000000176" H 10150 1100 50  0001 C CNN "PartSpecification"
	1    10150 1100
	0    1    1    0   
$EndComp
$Comp
L Switch:SW_Push SW2002
U 1 1 5E47F3A9
P 10450 1100
F 0 "SW2002" H 10500 1200 50  0000 L CNN
F 1 "SW_Push" H 10450 1040 50  0000 C CNN
F 2 "Button_Switch_SMD:SW_SPST_PTS645" H 10450 1300 50  0001 C CNN
F 3 "~" H 10450 1300 50  0001 C CNN
F 4 "3000-0000000176" H 10450 1100 50  0001 C CNN "PartSpecification"
	1    10450 1100
	0    1    1    0   
$EndComp
$Comp
L Switch:SW_Push SW2003
U 1 1 5E47F6A5
P 10750 1100
F 0 "SW2003" H 10800 1200 50  0000 L CNN
F 1 "SW_Push" H 10750 1040 50  0000 C CNN
F 2 "Button_Switch_SMD:SW_SPST_PTS645" H 10750 1300 50  0001 C CNN
F 3 "~" H 10750 1300 50  0001 C CNN
F 4 "3000-0000000176" H 10750 1100 50  0001 C CNN "PartSpecification"
	1    10750 1100
	0    1    1    0   
$EndComp
$Comp
L Switch:SW_Push SW2004
U 1 1 5E47F8C7
P 11050 1100
F 0 "SW2004" H 11100 1200 50  0000 L CNN
F 1 "SW_Push" H 11050 1040 50  0000 C CNN
F 2 "Button_Switch_SMD:SW_SPST_PTS645" H 11050 1300 50  0001 C CNN
F 3 "~" H 11050 1300 50  0001 C CNN
F 4 "3000-0000000176" H 11050 1100 50  0001 C CNN "PartSpecification"
	1    11050 1100
	0    1    1    0   
$EndComp
Wire Wire Line
	8000 1600 7650 1600
Wire Wire Line
	7650 1500 8000 1500
Text Label 7650 1500 0    50   ~ 0
USBPD_P
Text Label 7650 1600 0    50   ~ 0
USBPD_N
Text Label 5650 700  0    50   ~ 0
sense[0..12]
Wire Wire Line
	5200 1400 5900 1400
Entry Wire Line
	5900 1400 6000 1300
Wire Wire Line
	5200 1300 5900 1300
Entry Wire Line
	5900 1300 6000 1200
Wire Wire Line
	5200 1200 5900 1200
Entry Wire Line
	5900 1200 6000 1100
Wire Wire Line
	5200 1100 5900 1100
Entry Wire Line
	5900 1100 6000 1000
Wire Bus Line
	5000 700  6000 700 
Text Label 5300 1400 0    50   ~ 0
sense0
Text Label 5300 1300 0    50   ~ 0
sense1
Text Label 5300 1200 0    50   ~ 0
sense2
Text Label 5300 1100 0    50   ~ 0
sense3
Connection ~ 6400 5600
Wire Bus Line
	6000 4500 2900 4500
Entry Wire Line
	2900 4400 3000 4300
Entry Wire Line
	2900 4300 3000 4200
Entry Wire Line
	2900 4200 3000 4100
Entry Wire Line
	2900 4100 3000 4000
Wire Wire Line
	3000 4300 3400 4300
Wire Wire Line
	3400 4200 3000 4200
Wire Wire Line
	3000 4100 3400 4100
Wire Wire Line
	3000 4000 3400 4000
Text Label 3000 4300 0    50   ~ 0
sense4
Text Label 3000 4200 0    50   ~ 0
sense5
Text Label 3000 4100 0    50   ~ 0
sense6
Text Label 3000 4000 0    50   ~ 0
sense7
Entry Wire Line
	6000 1500 5900 1600
Entry Wire Line
	6000 1400 5900 1500
Wire Wire Line
	5900 1500 5200 1500
Wire Wire Line
	5200 1600 5900 1600
Text Label 5300 1600 0    50   ~ 0
sense8
Text Label 5300 1500 0    50   ~ 0
sense9
Entry Wire Line
	2900 2500 3000 2400
Entry Wire Line
	2900 2600 3000 2500
Wire Wire Line
	3000 2500 3400 2500
Wire Wire Line
	3400 2400 3000 2400
Text Label 3000 2500 0    50   ~ 0
sense11
Text Label 3000 2400 0    50   ~ 0
sense10
Text HLabel 3000 2200 0    50   Output ~ 0
SCL
Text HLabel 3000 2300 0    50   BiDi ~ 0
SDA
Wire Wire Line
	2300 3800 3400 3800
Text Label 3500 6850 0    50   ~ 0
MAC_CS
Text Label 3000 1400 0    50   ~ 0
MAC_CS
Wire Wire Line
	3000 2200 3400 2200
Wire Wire Line
	3000 2300 3400 2300
Wire Wire Line
	3250 3400 3400 3400
Wire Wire Line
	3250 3200 3400 3200
Wire Wire Line
	3250 3100 3400 3100
Wire Wire Line
	3250 3300 3400 3300
Wire Wire Line
	3150 1100 3400 1100
Wire Wire Line
	3150 1800 3400 1800
Wire Wire Line
	3400 1700 3150 1700
Wire Wire Line
	3150 1200 3400 1200
Wire Wire Line
	8000 1400 7750 1400
Wire Wire Line
	5500 1900 5200 1900
Wire Wire Line
	5500 2000 5200 2000
Wire Wire Line
	5500 2100 5200 2100
Wire Wire Line
	5500 2400 5200 2400
Wire Wire Line
	5200 2500 5500 2500
Wire Bus Line
	6150 3200 5900 3200
Entry Wire Line
	5900 4100 5800 4200
Wire Wire Line
	5800 4200 5200 4200
Text Label 5350 4200 0    50   ~ 0
en7
Entry Wire Line
	5900 4000 5800 4100
Wire Wire Line
	5800 4100 5200 4100
Text Label 5350 4100 0    50   ~ 0
en6
Entry Wire Line
	5900 3900 5800 4000
Wire Wire Line
	5800 4000 5200 4000
Text Label 5350 4000 0    50   ~ 0
en5
Entry Wire Line
	5900 3800 5800 3900
Wire Wire Line
	5800 3900 5200 3900
Text Label 5350 3900 0    50   ~ 0
en4
Entry Wire Line
	5900 3700 5800 3800
Wire Wire Line
	5800 3800 5200 3800
Text Label 5350 3800 0    50   ~ 0
en3
Entry Wire Line
	5900 3600 5800 3700
Wire Wire Line
	5800 3700 5200 3700
Text Label 5350 3700 0    50   ~ 0
en2
Entry Wire Line
	5900 3500 5800 3600
Wire Wire Line
	5800 3600 5200 3600
Text Label 5350 3600 0    50   ~ 0
en1
Entry Wire Line
	5900 3400 5800 3500
Wire Wire Line
	5800 3500 5200 3500
Text Label 5350 3500 0    50   ~ 0
en0
Entry Wire Line
	5900 3100 5800 3200
Wire Wire Line
	5800 3200 5200 3200
Text Label 5350 3200 0    50   ~ 0
en8
Wire Bus Line
	7450 1700 7550 1700
Entry Wire Line
	7550 2400 7650 2500
Entry Wire Line
	7550 2300 7650 2400
Entry Wire Line
	7550 2200 7650 2300
Entry Wire Line
	7550 2100 7650 2200
Entry Wire Line
	7550 2000 7650 2100
Entry Wire Line
	7550 1900 7650 2000
Entry Wire Line
	7550 1800 7650 1900
Entry Wire Line
	7550 1700 7650 1800
Wire Wire Line
	7650 1800 8000 1800
Wire Wire Line
	8000 1900 7650 1900
Wire Wire Line
	7650 2000 8000 2000
Wire Wire Line
	8000 2100 7650 2100
Wire Wire Line
	7650 2200 8000 2200
Wire Wire Line
	8000 2300 7650 2300
Wire Wire Line
	7650 2400 8000 2400
Wire Wire Line
	8000 2500 7650 2500
Text Label 7750 1800 0    50   ~ 0
pg0
Text Label 7750 1900 0    50   ~ 0
pg1
Text Label 7750 2000 0    50   ~ 0
pg2
Text Label 7750 2100 0    50   ~ 0
pg3
Text Label 7750 2200 0    50   ~ 0
pg4
Text Label 7750 2300 0    50   ~ 0
pg5
Text Label 7750 2400 0    50   ~ 0
pg6
Text Label 7750 2500 0    50   ~ 0
pg7
$Comp
L Device:R R2008
U 1 1 5E93AF7C
P 7500 3200
F 0 "R2008" V 7580 3200 50  0000 C CNN
F 1 "10" V 7500 3200 50  0000 C CNN
F 2 "Resistor_SMD:R_0402_1005Metric" V 7430 3200 50  0001 C CNN
F 3 "~" H 7500 3200 50  0001 C CNN
F 4 "3000-0000000146" H 7500 3200 50  0001 C CNN "PartSpecification"
	1    7500 3200
	1    0    0    -1  
$EndComp
$Comp
L Device:R R2007
U 1 1 5E93B547
P 7200 3200
F 0 "R2007" V 7280 3200 50  0000 C CNN
F 1 "66.5" V 7200 3200 50  0000 C CNN
F 2 "Resistor_SMD:R_0402_1005Metric" V 7130 3200 50  0001 C CNN
F 3 "~" H 7200 3200 50  0001 C CNN
F 4 "3000-0000000242" H 7200 3200 50  0001 C CNN "PartSpecification"
	1    7200 3200
	1    0    0    -1  
$EndComp
$Comp
L Device:R R2006
U 1 1 5E93BA8E
P 6900 3200
F 0 "R2006" V 6980 3200 50  0000 C CNN
F 1 "66.5" V 6900 3200 50  0000 C CNN
F 2 "Resistor_SMD:R_0402_1005Metric" V 6830 3200 50  0001 C CNN
F 3 "~" H 6900 3200 50  0001 C CNN
F 4 "3000-0000000242" H 6900 3200 50  0001 C CNN "PartSpecification"
	1    6900 3200
	1    0    0    -1  
$EndComp
$Comp
L Device:R R2005
U 1 1 5E93BFE6
P 6600 3200
F 0 "R2005" V 6680 3200 50  0000 C CNN
F 1 "66.5" V 6600 3200 50  0000 C CNN
F 2 "Resistor_SMD:R_0402_1005Metric" V 6530 3200 50  0001 C CNN
F 3 "~" H 6600 3200 50  0001 C CNN
F 4 "3000-0000000242" H 6600 3200 50  0001 C CNN "PartSpecification"
	1    6600 3200
	1    0    0    -1  
$EndComp
$Comp
L power:GND #PWR?
U 1 1 5E943CBB
P 7500 3850
F 0 "#PWR?" H 7500 3600 50  0001 C CNN
F 1 "GND" H 7500 3700 50  0000 C CNN
F 2 "" H 7500 3850 50  0001 C CNN
F 3 "" H 7500 3850 50  0001 C CNN
	1    7500 3850
	1    0    0    -1  
$EndComp
Wire Wire Line
	7500 3850 7500 3750
$Comp
L power:GND #PWR?
U 1 1 5E949EA6
P 7200 3850
F 0 "#PWR?" H 7200 3600 50  0001 C CNN
F 1 "GND" H 7200 3700 50  0000 C CNN
F 2 "" H 7200 3850 50  0001 C CNN
F 3 "" H 7200 3850 50  0001 C CNN
	1    7200 3850
	1    0    0    -1  
$EndComp
Wire Wire Line
	7200 3850 7200 3750
$Comp
L power:GND #PWR?
U 1 1 5E9501F8
P 6900 3850
F 0 "#PWR?" H 6900 3600 50  0001 C CNN
F 1 "GND" H 6900 3700 50  0000 C CNN
F 2 "" H 6900 3850 50  0001 C CNN
F 3 "" H 6900 3850 50  0001 C CNN
	1    6900 3850
	1    0    0    -1  
$EndComp
Wire Wire Line
	6900 3850 6900 3750
$Comp
L power:GND #PWR?
U 1 1 5E956591
P 6600 3850
F 0 "#PWR?" H 6600 3600 50  0001 C CNN
F 1 "GND" H 6600 3700 50  0000 C CNN
F 2 "" H 6600 3850 50  0001 C CNN
F 3 "" H 6600 3850 50  0001 C CNN
	1    6600 3850
	1    0    0    -1  
$EndComp
Wire Wire Line
	6600 3850 6600 3750
Wire Wire Line
	6600 3450 6600 3350
Wire Wire Line
	6600 3050 6600 3000
Wire Wire Line
	6600 3000 5200 3000
Wire Wire Line
	5200 2900 6900 2900
Wire Wire Line
	6900 2900 6900 3050
Wire Wire Line
	7200 2800 5200 2800
Wire Wire Line
	7200 2800 7200 3050
Wire Wire Line
	5200 2700 7500 2700
Wire Wire Line
	7500 3350 7500 3450
Wire Wire Line
	7200 3450 7200 3350
Wire Wire Line
	6900 3350 6900 3450
Wire Wire Line
	7500 2700 7500 3050
$Comp
L Device:R R2009
U 1 1 5EAC23BB
P 10150 2200
F 0 "R2009" V 10230 2200 50  0000 C CNN
F 1 "10k" V 10150 2200 50  0000 C CNN
F 2 "Resistor_SMD:R_0402_1005Metric" V 10080 2200 50  0001 C CNN
F 3 "~" H 10150 2200 50  0001 C CNN
F 4 "3000-0000000131" H 10150 2200 50  0001 C CNN "PartSpecification"
	1    10150 2200
	1    0    0    -1  
$EndComp
$Comp
L Device:R R2010
U 1 1 5EAC2FA4
P 10450 2200
F 0 "R2010" V 10530 2200 50  0000 C CNN
F 1 "10k" V 10450 2200 50  0000 C CNN
F 2 "Resistor_SMD:R_0402_1005Metric" V 10380 2200 50  0001 C CNN
F 3 "~" H 10450 2200 50  0001 C CNN
F 4 "3000-0000000131" H 10450 2200 50  0001 C CNN "PartSpecification"
	1    10450 2200
	1    0    0    -1  
$EndComp
$Comp
L Device:R R2011
U 1 1 5EAC339A
P 10750 2200
F 0 "R2011" V 10830 2200 50  0000 C CNN
F 1 "10k" V 10750 2200 50  0000 C CNN
F 2 "Resistor_SMD:R_0402_1005Metric" V 10680 2200 50  0001 C CNN
F 3 "~" H 10750 2200 50  0001 C CNN
F 4 "3000-0000000131" H 10750 2200 50  0001 C CNN "PartSpecification"
	1    10750 2200
	1    0    0    -1  
$EndComp
$Comp
L Device:R R2012
U 1 1 5EAC35F8
P 11050 2200
F 0 "R2012" V 11130 2200 50  0000 C CNN
F 1 "10k" V 11050 2200 50  0000 C CNN
F 2 "Resistor_SMD:R_0402_1005Metric" V 10980 2200 50  0001 C CNN
F 3 "~" H 11050 2200 50  0001 C CNN
F 4 "3000-0000000131" H 11050 2200 50  0001 C CNN "PartSpecification"
	1    11050 2200
	1    0    0    -1  
$EndComp
$Comp
L power:GND #PWR?
U 1 1 5EAC78C1
P 10150 2450
F 0 "#PWR?" H 10150 2200 50  0001 C CNN
F 1 "GND" H 10150 2300 50  0000 C CNN
F 2 "" H 10150 2450 50  0001 C CNN
F 3 "" H 10150 2450 50  0001 C CNN
	1    10150 2450
	1    0    0    -1  
$EndComp
Wire Wire Line
	10150 2450 10150 2350
$Comp
L power:GND #PWR?
U 1 1 5EACE86E
P 10450 2450
F 0 "#PWR?" H 10450 2200 50  0001 C CNN
F 1 "GND" H 10450 2300 50  0000 C CNN
F 2 "" H 10450 2450 50  0001 C CNN
F 3 "" H 10450 2450 50  0001 C CNN
	1    10450 2450
	1    0    0    -1  
$EndComp
Wire Wire Line
	10450 2450 10450 2350
$Comp
L power:GND #PWR?
U 1 1 5EAD58DD
P 10750 2450
F 0 "#PWR?" H 10750 2200 50  0001 C CNN
F 1 "GND" H 10750 2300 50  0000 C CNN
F 2 "" H 10750 2450 50  0001 C CNN
F 3 "" H 10750 2450 50  0001 C CNN
	1    10750 2450
	1    0    0    -1  
$EndComp
Wire Wire Line
	10750 2450 10750 2350
$Comp
L power:GND #PWR?
U 1 1 5EADC9E7
P 11050 2450
F 0 "#PWR?" H 11050 2200 50  0001 C CNN
F 1 "GND" H 11050 2300 50  0000 C CNN
F 2 "" H 11050 2450 50  0001 C CNN
F 3 "" H 11050 2450 50  0001 C CNN
	1    11050 2450
	1    0    0    -1  
$EndComp
Wire Wire Line
	11050 2450 11050 2350
Wire Wire Line
	10150 1300 10150 1600
$Comp
L power:+3.3V #PWR?
U 1 1 5EAFAC64
P 10150 800
F 0 "#PWR?" H 10150 650 50  0001 C CNN
F 1 "+3.3V" H 10150 940 50  0000 C CNN
F 2 "" H 10150 800 50  0001 C CNN
F 3 "" H 10150 800 50  0001 C CNN
	1    10150 800 
	1    0    0    -1  
$EndComp
$Comp
L power:+3.3V #PWR?
U 1 1 5EAFC0CC
P 10450 800
F 0 "#PWR?" H 10450 650 50  0001 C CNN
F 1 "+3.3V" H 10450 940 50  0000 C CNN
F 2 "" H 10450 800 50  0001 C CNN
F 3 "" H 10450 800 50  0001 C CNN
	1    10450 800 
	1    0    0    -1  
$EndComp
$Comp
L power:+3.3V #PWR?
U 1 1 5EAFC419
P 10750 800
F 0 "#PWR?" H 10750 650 50  0001 C CNN
F 1 "+3.3V" H 10750 940 50  0000 C CNN
F 2 "" H 10750 800 50  0001 C CNN
F 3 "" H 10750 800 50  0001 C CNN
	1    10750 800 
	1    0    0    -1  
$EndComp
$Comp
L power:+3.3V #PWR?
U 1 1 5EAFC783
P 11050 800
F 0 "#PWR?" H 11050 650 50  0001 C CNN
F 1 "+3.3V" H 11050 940 50  0000 C CNN
F 2 "" H 11050 800 50  0001 C CNN
F 3 "" H 11050 800 50  0001 C CNN
	1    11050 800 
	1    0    0    -1  
$EndComp
Wire Wire Line
	11050 800  11050 900 
Wire Wire Line
	10750 800  10750 900 
Wire Wire Line
	10450 800  10450 900 
Wire Wire Line
	10150 800  10150 900 
Wire Wire Line
	10450 1300 10450 1700
Wire Wire Line
	10750 1300 10750 1800
Wire Wire Line
	11050 1300 11050 1900
Wire Wire Line
	9750 1600 10150 1600
Connection ~ 10150 1600
Wire Wire Line
	10150 1600 10150 2050
Wire Wire Line
	9750 1800 10750 1800
Connection ~ 10750 1800
Wire Wire Line
	10750 1800 10750 2050
Wire Wire Line
	9750 1700 10450 1700
Connection ~ 10450 1700
Wire Wire Line
	10450 1700 10450 2050
Wire Wire Line
	11050 1900 9750 1900
Connection ~ 11050 1900
Wire Wire Line
	11050 1900 11050 2050
Wire Bus Line
	7350 800  7500 800 
Entry Wire Line
	7500 900  7600 1000
Entry Wire Line
	7500 800  7600 900 
Entry Wire Line
	7500 1000 7600 1100
Wire Wire Line
	7600 1100 8000 1100
Wire Wire Line
	8000 1000 7600 1000
Wire Wire Line
	7600 900  8000 900 
Text Label 7600 900  0    50   ~ 0
fan_tach0
Text Label 7600 1000 0    50   ~ 0
fan_tach1
Text Label 7600 1100 0    50   ~ 0
fan_tach2
Wire Bus Line
	5900 3200 5900 3100
Connection ~ 5900 3200
Entry Wire Line
	5900 3200 5800 3300
Wire Wire Line
	5800 3300 5200 3300
Text Label 5350 3300 0    50   ~ 0
en9
Wire Wire Line
	3000 3900 3400 3900
Text Label 3000 3900 0    50   ~ 0
sense12
Wire Wire Line
	8000 2700 7650 2700
Text Label 7750 2700 0    50   ~ 0
pg8
Wire Wire Line
	8000 2800 7650 2800
Text Label 7750 2800 0    50   ~ 0
pg9
Entry Wire Line
	2900 4000 3000 3900
Entry Wire Line
	7550 2700 7650 2800
Entry Wire Line
	7550 2600 7650 2700
Wire Wire Line
	7900 3400 7900 3000
Wire Wire Line
	7900 3000 8000 3000
Wire Wire Line
	7900 3400 8250 3400
Wire Wire Line
	8000 2900 7800 2900
Wire Wire Line
	7800 2900 7800 3500
Wire Wire Line
	7800 3500 8250 3500
Entry Wire Line
	7500 1100 7600 1200
Entry Wire Line
	7500 1200 7600 1300
Wire Wire Line
	7600 1300 8000 1300
Wire Wire Line
	8000 1200 7600 1200
Text Label 7600 1200 0    50   ~ 0
fan_tach3
Text Label 7600 1300 0    50   ~ 0
fan_tach4
Text Label 9850 1600 0    50   ~ 0
SW0
Text Label 9850 1700 0    50   ~ 0
SW1
Text Label 9850 1800 0    50   ~ 0
SW2
Text Label 9850 1900 0    50   ~ 0
SW3
Text Label 5350 2700 0    50   ~ 0
LED0_IO
Text Label 5350 2800 0    50   ~ 0
LED1_IO
Text Label 5350 2900 0    50   ~ 0
LED2_IO
Text Label 5350 3000 0    50   ~ 0
LED3_IO
Text Label 7500 3400 0    50   ~ 0
LED0
Text Label 7200 3400 0    50   ~ 0
LED1
Text Label 6900 3400 0    50   ~ 0
LED2
Text Label 6600 3400 0    50   ~ 0
LED3
Text Label 5250 6800 0    50   ~ 0
HOLD_B
Text Label 5350 6600 0    50   ~ 0
WP_B
Text Label 6550 5600 0    50   ~ 0
USB_SHIELD
NoConn ~ 10250 5050
NoConn ~ 10250 5200
NoConn ~ 10250 5350
NoConn ~ 3450 5550
Text HLabel 10000 2800 2    50   Input ~ 0
GPIO_INT_B
Text HLabel 10000 2900 2    50   Output ~ 0
GPIO_RESET_B
Wire Wire Line
	9750 2500 9900 2500
Wire Wire Line
	9900 2500 9900 2800
Wire Wire Line
	9900 2800 10000 2800
Wire Wire Line
	9750 2600 9800 2600
Wire Wire Line
	9800 2600 9800 2900
Wire Wire Line
	9800 2900 10000 2900
Wire Bus Line
	7500 800  7500 1200
Wire Bus Line
	6000 700  6000 4500
Wire Bus Line
	2900 2500 2900 4500
Wire Bus Line
	5900 3200 5900 4100
Wire Bus Line
	7550 1700 7550 2700
$EndSCHEMATC
