EESchema Schematic File Version 4
LIBS:iris_clock_pps-cache
EELAYER 30 0
EELAYER END
$Descr A4 11693 8268
encoding utf-8
Sheet 1 1
Title ""
Date ""
Rev ""
Comp ""
Comment1 ""
Comment2 ""
Comment3 ""
Comment4 ""
$EndDescr
$Comp
L Connector_Generic_MountingPin:Conn_02x20_Odd_Even_MountingPin J103
U 1 1 5E600357
P 9800 3250
F 0 "J103" H 9850 4250 50  0000 C CNN
F 1 "Conn_02x20_Odd_Even" H 9850 2150 50  0000 C CNN
F 2 "POWDER_Misc:ERF8-020-01-L-D-RA-L-TR" H 9800 3250 50  0001 C CNN
F 3 "~" H 9800 3250 50  0001 C CNN
F 4 "3000-0000000592" H 9800 3250 50  0001 C CNN "PartSpecification"
	1    9800 3250
	1    0    0    -1  
$EndComp
$Comp
L power:GND #PWR?
U 1 1 5E6019A4
P 9500 4450
F 0 "#PWR?" H 9500 4200 50  0001 C CNN
F 1 "GND" H 9500 4300 50  0000 C CNN
F 2 "" H 9500 4450 50  0001 C CNN
F 3 "" H 9500 4450 50  0001 C CNN
	1    9500 4450
	1    0    0    -1  
$EndComp
$Comp
L power:GND #PWR?
U 1 1 5E601EBF
P 10200 4450
F 0 "#PWR?" H 10200 4200 50  0001 C CNN
F 1 "GND" H 10200 4300 50  0000 C CNN
F 2 "" H 10200 4450 50  0001 C CNN
F 3 "" H 10200 4450 50  0001 C CNN
	1    10200 4450
	1    0    0    -1  
$EndComp
Wire Wire Line
	9600 2350 9500 2350
Wire Wire Line
	9500 2350 9500 2650
Wire Wire Line
	9600 2650 9500 2650
Connection ~ 9500 2650
Wire Wire Line
	9500 2650 9500 2950
Wire Wire Line
	9600 2950 9500 2950
Connection ~ 9500 2950
Wire Wire Line
	9500 2950 9500 3250
Wire Wire Line
	9600 3250 9500 3250
Connection ~ 9500 3250
Wire Wire Line
	9500 3250 9500 3750
Wire Wire Line
	9600 3750 9500 3750
Connection ~ 9500 3750
Wire Wire Line
	9500 3750 9500 3850
Wire Wire Line
	9500 3850 9600 3850
Connection ~ 9500 3850
Wire Wire Line
	9500 3850 9500 4450
Wire Wire Line
	10200 3750 10100 3750
Wire Wire Line
	10200 3750 10200 4450
Wire Wire Line
	10100 3650 10200 3650
Wire Wire Line
	10200 3650 10200 3750
Connection ~ 10200 3750
Wire Wire Line
	10100 3450 10200 3450
Wire Wire Line
	10200 3450 10200 3550
Connection ~ 10200 3650
Wire Wire Line
	10200 3550 10100 3550
Connection ~ 10200 3550
Wire Wire Line
	10200 3550 10200 3650
Wire Wire Line
	10100 2350 10200 2350
Wire Wire Line
	10200 2350 10200 2650
Connection ~ 10200 3450
Wire Wire Line
	10100 2950 10200 2950
Connection ~ 10200 2950
Wire Wire Line
	10200 2950 10200 3450
Wire Wire Line
	10100 2650 10200 2650
Connection ~ 10200 2650
Wire Wire Line
	10200 2650 10200 2950
Text Label 9000 2450 0    50   ~ 0
FWDCLKIN_P
Text Label 9000 2550 0    50   ~ 0
FWDCLKIN_N
Wire Wire Line
	9600 2750 9000 2750
Wire Wire Line
	9000 2850 9600 2850
Text Label 9000 2750 0    50   ~ 0
MGTTX0_P
Text Label 9000 2850 0    50   ~ 0
MGTTX0_N
Text Label 10300 2450 0    50   ~ 0
MGTTX1_P
Text Label 10300 2550 0    50   ~ 0
MGTTX1_N
Text Label 10300 2750 0    50   ~ 0
MGTRX1_P
Text Label 10300 2850 0    50   ~ 0
MGTRX1_N
Wire Wire Line
	9600 3050 9000 3050
Wire Wire Line
	9000 3150 9600 3150
Text Label 9000 3050 0    50   ~ 0
MGTRX0_P
Text Label 9000 3150 0    50   ~ 0
MGTRX0_N
Wire Wire Line
	9000 3450 9600 3450
Wire Wire Line
	9000 3650 9600 3650
Wire Wire Line
	10100 3350 10700 3350
Wire Wire Line
	10100 3250 10700 3250
Wire Wire Line
	10100 3150 10700 3150
Wire Wire Line
	10100 3050 10700 3050
Wire Wire Line
	10100 2850 10700 2850
Wire Wire Line
	10100 2750 10700 2750
Wire Wire Line
	10100 2550 10700 2550
Wire Wire Line
	10100 2450 10700 2450
$Comp
L Device:R R118
U 1 1 5E6167A6
P 8250 3800
F 0 "R118" V 8330 3800 50  0000 C CNN
F 1 "200" V 8250 3800 50  0000 C CNN
F 2 "Resistor_SMD:R_0402_1005Metric" V 8180 3800 50  0001 C CNN
F 3 "~" H 8250 3800 50  0001 C CNN
F 4 "3000-0000000415" H 8250 3800 50  0001 C CNN "PartSpecification"
	1    8250 3800
	1    0    0    -1  
$EndComp
Wire Wire Line
	8250 3350 9600 3350
$Comp
L power:GND #PWR?
U 1 1 5E617838
P 8250 4050
F 0 "#PWR?" H 8250 3800 50  0001 C CNN
F 1 "GND" H 8250 3900 50  0000 C CNN
F 2 "" H 8250 4050 50  0001 C CNN
F 3 "" H 8250 4050 50  0001 C CNN
	1    8250 4050
	1    0    0    -1  
$EndComp
Wire Wire Line
	8250 4050 8250 3950
$Comp
L Connector:Conn_Coaxial J102
U 1 1 5E61984D
P 7000 4950
F 0 "J102" H 7010 5070 50  0000 C CNN
F 1 "Conn_Coaxial" V 7115 4950 50  0000 C CNN
F 2 "POWDER_RF:SMP_RA_MSLD-PCS17T" H 7000 4950 50  0001 C CNN
F 3 " ~" H 7000 4950 50  0001 C CNN
F 4 "3000-0000000485" H 7000 4950 50  0001 C CNN "PartSpecification"
	1    7000 4950
	-1   0    0    -1  
$EndComp
$Comp
L Connector:Conn_Coaxial J101
U 1 1 5E619DE8
P 750 2400
F 0 "J101" H 760 2520 50  0000 C CNN
F 1 "Conn_Coaxial" V 865 2400 50  0000 C CNN
F 2 "POWDER_RF:SMP_RA_MSLD-PCS17T" H 750 2400 50  0001 C CNN
F 3 " ~" H 750 2400 50  0001 C CNN
F 4 "3000-0000000485" H 750 2400 50  0001 C CNN "PartSpecification"
	1    750  2400
	-1   0    0    -1  
$EndComp
$Comp
L power:GND #PWR?
U 1 1 5E61A2A6
P 7000 5250
F 0 "#PWR?" H 7000 5000 50  0001 C CNN
F 1 "GND" H 7000 5100 50  0000 C CNN
F 2 "" H 7000 5250 50  0001 C CNN
F 3 "" H 7000 5250 50  0001 C CNN
	1    7000 5250
	-1   0    0    -1  
$EndComp
$Comp
L power:GND #PWR?
U 1 1 5E61A4A5
P 750 2700
F 0 "#PWR?" H 750 2450 50  0001 C CNN
F 1 "GND" H 750 2550 50  0000 C CNN
F 2 "" H 750 2700 50  0001 C CNN
F 3 "" H 750 2700 50  0001 C CNN
	1    750  2700
	-1   0    0    -1  
$EndComp
Wire Wire Line
	750  2700 750  2600
Wire Wire Line
	7000 5150 7000 5250
Text Label 9000 3550 0    50   ~ 0
PPS_OUT
$Comp
L POWDER_Digital:LMK00334-Q1 U101
U 1 1 5E6071A4
P 4850 3000
F 0 "U101" H 4850 3050 50  0000 C CNN
F 1 "LMK00334-Q1" H 4850 2950 50  0000 C CNN
F 2 "Package_DFN_QFN:Texas_S-PVQFN-N32_EP3.45x3.45mm" H 4700 3150 50  0001 C CNN
F 3 "" H 4700 3150 50  0001 C CNN
F 4 "3000-0000000595" H 4850 3000 50  0001 C CNN "PartSpecification"
	1    4850 3000
	1    0    0    -1  
$EndComp
$Comp
L POWDER_Digital:SN74LVC1T45-Q1 U102
U 1 1 5E609112
P 8150 4950
F 0 "U102" H 7900 5300 50  0000 C CNN
F 1 "SN74LVC1T45-Q1" H 8300 5300 50  0000 L CNN
F 2 "POWDER_RF:SOT-363_SC-70-6_SN74LVC1T45-Q1" H 8150 4500 50  0001 C CNN
F 3 "" H 7250 4300 50  0001 C CNN
F 4 "3000-0000000596" H 8150 4950 50  0001 C CNN "PartSpecification"
	1    8150 4950
	1    0    0    -1  
$EndComp
Wire Wire Line
	8550 4950 8750 4950
Wire Wire Line
	8750 3550 9600 3550
$Comp
L power:+1V8 #PWR?
U 1 1 5E60B4FB
P 8250 4450
F 0 "#PWR?" H 8250 4300 50  0001 C CNN
F 1 "+1V8" H 8250 4590 50  0000 C CNN
F 2 "" H 8250 4450 50  0001 C CNN
F 3 "" H 8250 4450 50  0001 C CNN
	1    8250 4450
	1    0    0    -1  
$EndComp
Wire Wire Line
	8250 4450 8250 4500
Wire Wire Line
	7200 4950 7300 4950
$Comp
L Device:R R117
U 1 1 5E61577D
P 7650 4700
F 0 "R117" V 7730 4700 50  0000 C CNN
F 1 "200" V 7650 4700 50  0000 C CNN
F 2 "Resistor_SMD:R_0402_1005Metric" V 7580 4700 50  0001 C CNN
F 3 "~" H 7650 4700 50  0001 C CNN
F 4 "3000-0000000415" H 7650 4700 50  0001 C CNN "PartSpecification"
	1    7650 4700
	1    0    0    -1  
$EndComp
Wire Wire Line
	7650 4850 7650 5150
Wire Wire Line
	7650 5150 7750 5150
Wire Wire Line
	7650 4550 7650 4450
Wire Wire Line
	7650 4450 8050 4450
Wire Wire Line
	8050 4450 8050 4550
$Comp
L power:+3.3V #PWR?
U 1 1 5E6188E0
P 6200 3950
F 0 "#PWR?" H 6200 3800 50  0001 C CNN
F 1 "+3.3V" H 6200 4090 50  0000 C CNN
F 2 "" H 6200 3950 50  0001 C CNN
F 3 "" H 6200 3950 50  0001 C CNN
	1    6200 3950
	1    0    0    -1  
$EndComp
$Comp
L power:GND #PWR?
U 1 1 5E628E90
P 8150 5450
F 0 "#PWR?" H 8150 5200 50  0001 C CNN
F 1 "GND" H 8150 5300 50  0000 C CNN
F 2 "" H 8150 5450 50  0001 C CNN
F 3 "" H 8150 5450 50  0001 C CNN
	1    8150 5450
	1    0    0    -1  
$EndComp
Wire Wire Line
	8150 5450 8150 5350
$Comp
L Device:R R101
U 1 1 5E63D2CB
P 1500 2650
F 0 "R101" V 1580 2650 50  0000 C CNN
F 1 "24.9" V 1500 2650 50  0000 C CNN
F 2 "Resistor_SMD:R_0402_1005Metric" V 1430 2650 50  0001 C CNN
F 3 "~" H 1500 2650 50  0001 C CNN
F 4 "3000-0000000594" H 1500 2650 50  0001 C CNN "PartSpecification"
	1    1500 2650
	1    0    0    -1  
$EndComp
Wire Wire Line
	1500 2500 1500 2400
Wire Wire Line
	1500 2400 1400 2400
Text Label 1000 2400 1    50   ~ 0
CLK_10MHz_in
$Comp
L Device:R R102
U 1 1 5E653325
P 1500 3050
F 0 "R102" V 1580 3050 50  0000 C CNN
F 1 "24.9" V 1500 3050 50  0000 C CNN
F 2 "Resistor_SMD:R_0402_1005Metric" V 1430 3050 50  0001 C CNN
F 3 "~" H 1500 3050 50  0001 C CNN
F 4 "3000-0000000594" H 1500 3050 50  0001 C CNN "PartSpecification"
	1    1500 3050
	1    0    0    -1  
$EndComp
$Comp
L Device:R R103
U 1 1 5E61DDAD
P 2500 3400
F 0 "R103" V 2580 3400 50  0000 C CNN
F 1 "1k" V 2500 3400 50  0000 C CNN
F 2 "Resistor_SMD:R_0402_1005Metric" V 2430 3400 50  0001 C CNN
F 3 "~" H 2500 3400 50  0001 C CNN
F 4 "3000-0000000156" H 2500 3400 50  0001 C CNN "PartSpecification"
	1    2500 3400
	1    0    0    -1  
$EndComp
$Comp
L Device:R R104
U 1 1 5E61E203
P 2500 3850
F 0 "R104" V 2580 3850 50  0000 C CNN
F 1 "1k" V 2500 3850 50  0000 C CNN
F 2 "Resistor_SMD:R_0402_1005Metric" V 2430 3850 50  0001 C CNN
F 3 "~" H 2500 3850 50  0001 C CNN
F 4 "3000-0000000156" H 2500 3850 50  0001 C CNN "PartSpecification"
	1    2500 3850
	1    0    0    -1  
$EndComp
Wire Wire Line
	2500 3550 2500 3600
Wire Wire Line
	2500 3250 2500 3150
$Comp
L power:GND #PWR?
U 1 1 5E622BCF
P 2500 4100
F 0 "#PWR?" H 2500 3850 50  0001 C CNN
F 1 "GND" H 2500 3950 50  0000 C CNN
F 2 "" H 2500 4100 50  0001 C CNN
F 3 "" H 2500 4100 50  0001 C CNN
	1    2500 4100
	-1   0    0    -1  
$EndComp
Wire Wire Line
	2500 4100 2500 4000
Wire Wire Line
	2500 3600 2750 3600
Wire Wire Line
	2750 3600 2750 2950
Wire Wire Line
	2750 2950 3900 2950
Connection ~ 2500 3600
Wire Wire Line
	2500 3600 2500 3700
$Comp
L power:+3.3V #PWR?
U 1 1 5E626863
P 750 1400
F 0 "#PWR?" H 750 1250 50  0001 C CNN
F 1 "+3.3V" H 750 1540 50  0000 C CNN
F 2 "" H 750 1400 50  0001 C CNN
F 3 "" H 750 1400 50  0001 C CNN
	1    750  1400
	1    0    0    -1  
$EndComp
$Comp
L Device:Ferrite_Bead FB101
U 1 1 5E628C3D
P 1000 1500
F 0 "FB101" V 850 1525 50  0000 C CNN
F 1 "Ferrite_Bead" V 1150 1500 50  0000 C CNN
F 2 "Inductor_SMD:L_0603_1608Metric" V 930 1500 50  0001 C CNN
F 3 "~" H 1000 1500 50  0001 C CNN
F 4 "3000-0000000091" H 1000 1500 50  0001 C CNN "PartSpecification"
	1    1000 1500
	0    1    1    0   
$EndComp
Wire Wire Line
	750  1400 750  1500
Wire Wire Line
	750  1500 850  1500
$Comp
L Device:Ferrite_Bead FB102
U 1 1 5E641A15
P 6200 4200
F 0 "FB102" V 6050 4225 50  0000 C CNN
F 1 "Ferrite_Bead" V 6350 4200 50  0000 C CNN
F 2 "Inductor_SMD:L_0603_1608Metric" V 6130 4200 50  0001 C CNN
F 3 "~" H 6200 4200 50  0001 C CNN
F 4 "3000-0000000091" H 6200 4200 50  0001 C CNN "PartSpecification"
	1    6200 4200
	-1   0    0    1   
$EndComp
$Comp
L 000_PreferredParts:C_0_1uF C106
U 1 1 5E645C38
P 6200 4700
F 0 "C106" H 6225 4800 50  0000 L CNN
F 1 "C_0_1uF" H 6225 4600 50  0001 L CNN
F 2 "Capacitor_SMD:C_0402_1005Metric" H 6238 4550 50  0001 C CNN
F 3 "~" H 6200 4700 50  0001 C CNN
F 4 "0.1uF" H 6350 4600 50  0000 C CNN "DisplayValue"
F 5 "3000-0000000125" H 6200 4700 50  0001 C CNN "PartSpecification"
F 6 "100V" H 6200 4700 50  0001 C CNN "Voltage"
	1    6200 4700
	1    0    0    -1  
$EndComp
$Comp
L 000_PreferredParts:C_1nF C108
U 1 1 5E646418
P 6550 4700
F 0 "C108" H 6575 4800 50  0000 L CNN
F 1 "C_1nF" H 6575 4600 50  0000 L CNN
F 2 "Capacitor_SMD:C_0402_1005Metric" H 6588 4550 50  0001 C CNN
F 3 "~" H 6550 4700 50  0001 C CNN
F 4 "3000-0000000128" H 6550 4700 50  0001 C CNN "PartSpecification"
	1    6550 4700
	1    0    0    -1  
$EndComp
$Comp
L power:GND #PWR?
U 1 1 5E646FF3
P 6200 4950
F 0 "#PWR?" H 6200 4700 50  0001 C CNN
F 1 "GND" H 6200 4800 50  0000 C CNN
F 2 "" H 6200 4950 50  0001 C CNN
F 3 "" H 6200 4950 50  0001 C CNN
	1    6200 4950
	1    0    0    -1  
$EndComp
$Comp
L power:GND #PWR?
U 1 1 5E6473A9
P 6550 4950
F 0 "#PWR?" H 6550 4700 50  0001 C CNN
F 1 "GND" H 6550 4800 50  0000 C CNN
F 2 "" H 6550 4950 50  0001 C CNN
F 3 "" H 6550 4950 50  0001 C CNN
	1    6550 4950
	1    0    0    -1  
$EndComp
Wire Wire Line
	6550 4950 6550 4850
Wire Wire Line
	6200 4850 6200 4950
Wire Wire Line
	6550 4450 6200 4450
Wire Wire Line
	6200 4450 6200 4350
Wire Wire Line
	6200 4450 6200 4550
Connection ~ 6200 4450
Wire Wire Line
	6550 4450 6550 4550
Connection ~ 6550 4450
Wire Wire Line
	6200 4050 6200 3950
$Comp
L 000_PreferredParts:C_0_1uF C101
U 1 1 5E658CB0
P 1250 1750
F 0 "C101" H 1275 1850 50  0000 L CNN
F 1 "C_0_1uF" H 1275 1650 50  0001 L CNN
F 2 "Capacitor_SMD:C_0402_1005Metric" H 1288 1600 50  0001 C CNN
F 3 "~" H 1250 1750 50  0001 C CNN
F 4 "0.1uF" H 1400 1650 50  0000 C CNN "DisplayValue"
F 5 "3000-0000000125" H 1250 1750 50  0001 C CNN "PartSpecification"
F 6 "100V" H 1250 1750 50  0001 C CNN "Voltage"
	1    1250 1750
	1    0    0    -1  
$EndComp
$Comp
L 000_PreferredParts:C_1nF C102
U 1 1 5E658CB7
P 1600 1750
F 0 "C102" H 1625 1850 50  0000 L CNN
F 1 "C_1nF" H 1625 1650 50  0000 L CNN
F 2 "Capacitor_SMD:C_0402_1005Metric" H 1638 1600 50  0001 C CNN
F 3 "~" H 1600 1750 50  0001 C CNN
F 4 "3000-0000000128" H 1600 1750 50  0001 C CNN "PartSpecification"
	1    1600 1750
	1    0    0    -1  
$EndComp
$Comp
L power:GND #PWR?
U 1 1 5E658CBD
P 1250 2000
F 0 "#PWR?" H 1250 1750 50  0001 C CNN
F 1 "GND" H 1250 1850 50  0000 C CNN
F 2 "" H 1250 2000 50  0001 C CNN
F 3 "" H 1250 2000 50  0001 C CNN
	1    1250 2000
	1    0    0    -1  
$EndComp
$Comp
L power:GND #PWR?
U 1 1 5E658CC3
P 1600 2000
F 0 "#PWR?" H 1600 1750 50  0001 C CNN
F 1 "GND" H 1600 1850 50  0000 C CNN
F 2 "" H 1600 2000 50  0001 C CNN
F 3 "" H 1600 2000 50  0001 C CNN
	1    1600 2000
	1    0    0    -1  
$EndComp
Wire Wire Line
	1600 2000 1600 1900
Wire Wire Line
	1250 1900 1250 2000
Wire Wire Line
	1250 1500 1250 1600
Wire Wire Line
	1600 1500 1600 1600
Connection ~ 1250 1500
Wire Wire Line
	1250 1500 1150 1500
Connection ~ 1600 1500
Wire Wire Line
	1600 1500 1250 1500
$Comp
L 000_PreferredParts:C_10pF C103
U 1 1 5E65E202
P 1950 1750
F 0 "C103" H 1975 1850 50  0000 L CNN
F 1 "C_10pF" H 1975 1650 50  0000 L CNN
F 2 "Capacitor_SMD:C_0402_1005Metric" H 1988 1600 50  0001 C CNN
F 3 "~" H 1950 1750 50  0001 C CNN
F 4 "3000-0000000582" H 1950 1750 50  0001 C CNN "PartSpecification"
	1    1950 1750
	1    0    0    -1  
$EndComp
Wire Wire Line
	1950 1600 1950 1500
Wire Wire Line
	1950 1500 1600 1500
$Comp
L power:GND #PWR?
U 1 1 5E661BC0
P 1950 2000
F 0 "#PWR?" H 1950 1750 50  0001 C CNN
F 1 "GND" H 1950 1850 50  0000 C CNN
F 2 "" H 1950 2000 50  0001 C CNN
F 3 "" H 1950 2000 50  0001 C CNN
	1    1950 2000
	1    0    0    -1  
$EndComp
Wire Wire Line
	1950 2000 1950 1900
$Comp
L power:GND #PWR?
U 1 1 5E66BE16
P 3100 4150
F 0 "#PWR?" H 3100 3900 50  0001 C CNN
F 1 "GND" H 3100 4000 50  0000 C CNN
F 2 "" H 3100 4150 50  0001 C CNN
F 3 "" H 3100 4150 50  0001 C CNN
	1    3100 4150
	-1   0    0    -1  
$EndComp
$Comp
L Device:R R105
U 1 1 5E66CD87
P 3100 3900
F 0 "R105" V 3180 3900 50  0000 C CNN
F 1 "24.9" V 3100 3900 50  0000 C CNN
F 2 "Resistor_SMD:R_0402_1005Metric" V 3030 3900 50  0001 C CNN
F 3 "~" H 3100 3900 50  0001 C CNN
F 4 "3000-0000000594" H 3100 3900 50  0001 C CNN "PartSpecification"
	1    3100 3900
	1    0    0    -1  
$EndComp
Wire Wire Line
	3100 4050 3100 4150
Wire Wire Line
	4850 1500 4850 1900
Wire Wire Line
	4750 1900 4750 1500
Wire Wire Line
	4750 1500 4850 1500
Wire Wire Line
	4550 1900 4550 1500
Connection ~ 4450 1500
Wire Wire Line
	4450 1500 4550 1500
Wire Wire Line
	4450 1500 4450 1900
Wire Wire Line
	4350 1900 4350 1500
Wire Wire Line
	4350 1500 4450 1500
Wire Wire Line
	6550 4450 7650 4450
Connection ~ 7650 4450
$Comp
L 000_PreferredParts:C_0_1uF C105
U 1 1 5E6F5B2A
P 2200 900
F 0 "C105" H 2225 1000 50  0000 L CNN
F 1 "C_0_1uF" H 2225 800 50  0001 L CNN
F 2 "Capacitor_SMD:C_0402_1005Metric" H 2238 750 50  0001 C CNN
F 3 "~" H 2200 900 50  0001 C CNN
F 4 "0.1uF" H 2350 800 50  0000 C CNN "DisplayValue"
F 5 "3000-0000000125" H 2200 900 50  0001 C CNN "PartSpecification"
F 6 "100V" H 2200 900 50  0001 C CNN "Voltage"
	1    2200 900 
	1    0    0    -1  
$EndComp
$Comp
L 000_PreferredParts:C_1nF C107
U 1 1 5E6F5B31
P 2550 900
F 0 "C107" H 2575 1000 50  0000 L CNN
F 1 "C_1nF" H 2575 800 50  0000 L CNN
F 2 "Capacitor_SMD:C_0402_1005Metric" H 2588 750 50  0001 C CNN
F 3 "~" H 2550 900 50  0001 C CNN
F 4 "3000-0000000128" H 2550 900 50  0001 C CNN "PartSpecification"
	1    2550 900 
	1    0    0    -1  
$EndComp
$Comp
L power:GND #PWR?
U 1 1 5E6F5B37
P 2200 1150
F 0 "#PWR?" H 2200 900 50  0001 C CNN
F 1 "GND" H 2200 1000 50  0000 C CNN
F 2 "" H 2200 1150 50  0001 C CNN
F 3 "" H 2200 1150 50  0001 C CNN
	1    2200 1150
	1    0    0    -1  
$EndComp
$Comp
L power:GND #PWR?
U 1 1 5E6F5B3D
P 2550 1150
F 0 "#PWR?" H 2550 900 50  0001 C CNN
F 1 "GND" H 2550 1000 50  0000 C CNN
F 2 "" H 2550 1150 50  0001 C CNN
F 3 "" H 2550 1150 50  0001 C CNN
	1    2550 1150
	1    0    0    -1  
$EndComp
Wire Wire Line
	2550 1150 2550 1050
Wire Wire Line
	2200 1050 2200 1150
Wire Wire Line
	2200 650  2200 750 
Wire Wire Line
	2550 650  2550 750 
$Comp
L 000_PreferredParts:C_10pF C109
U 1 1 5E6F5B48
P 2900 900
F 0 "C109" H 2925 1000 50  0000 L CNN
F 1 "C_10pF" H 2925 800 50  0000 L CNN
F 2 "Capacitor_SMD:C_0402_1005Metric" H 2938 750 50  0001 C CNN
F 3 "~" H 2900 900 50  0001 C CNN
F 4 "3000-0000000582" H 2900 900 50  0001 C CNN "PartSpecification"
	1    2900 900 
	1    0    0    -1  
$EndComp
Wire Wire Line
	2900 750  2900 650 
$Comp
L power:GND #PWR?
U 1 1 5E6F5B4F
P 2900 1150
F 0 "#PWR?" H 2900 900 50  0001 C CNN
F 1 "GND" H 2900 1000 50  0000 C CNN
F 2 "" H 2900 1150 50  0001 C CNN
F 3 "" H 2900 1150 50  0001 C CNN
	1    2900 1150
	1    0    0    -1  
$EndComp
Wire Wire Line
	2900 1150 2900 1050
$Comp
L 000_PreferredParts:C_0_1uF C110
U 1 1 5E6FAB7A
P 3450 900
F 0 "C110" H 3475 1000 50  0000 L CNN
F 1 "C_0_1uF" H 3475 800 50  0001 L CNN
F 2 "Capacitor_SMD:C_0402_1005Metric" H 3488 750 50  0001 C CNN
F 3 "~" H 3450 900 50  0001 C CNN
F 4 "0.1uF" H 3600 800 50  0000 C CNN "DisplayValue"
F 5 "3000-0000000125" H 3450 900 50  0001 C CNN "PartSpecification"
F 6 "100V" H 3450 900 50  0001 C CNN "Voltage"
	1    3450 900 
	1    0    0    -1  
$EndComp
$Comp
L 000_PreferredParts:C_1nF C111
U 1 1 5E6FAB81
P 3800 900
F 0 "C111" H 3825 1000 50  0000 L CNN
F 1 "C_1nF" H 3825 800 50  0000 L CNN
F 2 "Capacitor_SMD:C_0402_1005Metric" H 3838 750 50  0001 C CNN
F 3 "~" H 3800 900 50  0001 C CNN
F 4 "3000-0000000128" H 3800 900 50  0001 C CNN "PartSpecification"
	1    3800 900 
	1    0    0    -1  
$EndComp
$Comp
L power:GND #PWR?
U 1 1 5E6FAB87
P 3450 1150
F 0 "#PWR?" H 3450 900 50  0001 C CNN
F 1 "GND" H 3450 1000 50  0000 C CNN
F 2 "" H 3450 1150 50  0001 C CNN
F 3 "" H 3450 1150 50  0001 C CNN
	1    3450 1150
	1    0    0    -1  
$EndComp
$Comp
L power:GND #PWR?
U 1 1 5E6FAB8D
P 3800 1150
F 0 "#PWR?" H 3800 900 50  0001 C CNN
F 1 "GND" H 3800 1000 50  0000 C CNN
F 2 "" H 3800 1150 50  0001 C CNN
F 3 "" H 3800 1150 50  0001 C CNN
	1    3800 1150
	1    0    0    -1  
$EndComp
Wire Wire Line
	3800 1150 3800 1050
Wire Wire Line
	3450 1050 3450 1150
Wire Wire Line
	3450 650  3450 750 
Wire Wire Line
	3800 650  3800 750 
$Comp
L 000_PreferredParts:C_10pF C113
U 1 1 5E6FAB98
P 4150 900
F 0 "C113" H 4175 1000 50  0000 L CNN
F 1 "C_10pF" H 4175 800 50  0000 L CNN
F 2 "Capacitor_SMD:C_0402_1005Metric" H 4188 750 50  0001 C CNN
F 3 "~" H 4150 900 50  0001 C CNN
F 4 "3000-0000000582" H 4150 900 50  0001 C CNN "PartSpecification"
	1    4150 900 
	1    0    0    -1  
$EndComp
Wire Wire Line
	4150 750  4150 650 
$Comp
L power:GND #PWR?
U 1 1 5E6FAB9F
P 4150 1150
F 0 "#PWR?" H 4150 900 50  0001 C CNN
F 1 "GND" H 4150 1000 50  0000 C CNN
F 2 "" H 4150 1150 50  0001 C CNN
F 3 "" H 4150 1150 50  0001 C CNN
	1    4150 1150
	1    0    0    -1  
$EndComp
Wire Wire Line
	4150 1150 4150 1050
$Comp
L 000_PreferredParts:C_0_1uF C115
U 1 1 5E70ECC9
P 8550 1750
F 0 "C115" H 8575 1850 50  0000 L CNN
F 1 "C_0_1uF" H 8575 1650 50  0001 L CNN
F 2 "Capacitor_SMD:C_0402_1005Metric" H 8588 1600 50  0001 C CNN
F 3 "~" H 8550 1750 50  0001 C CNN
F 4 "0.1uF" H 8700 1650 50  0000 C CNN "DisplayValue"
F 5 "3000-0000000125" H 8550 1750 50  0001 C CNN "PartSpecification"
F 6 "100V" H 8550 1750 50  0001 C CNN "Voltage"
	1    8550 1750
	1    0    0    -1  
$EndComp
$Comp
L 000_PreferredParts:C_1nF C116
U 1 1 5E70ECD4
P 8900 1750
F 0 "C116" H 8925 1850 50  0000 L CNN
F 1 "C_1nF" H 8925 1650 50  0000 L CNN
F 2 "Capacitor_SMD:C_0402_1005Metric" H 8938 1600 50  0001 C CNN
F 3 "~" H 8900 1750 50  0001 C CNN
F 4 "3000-0000000128" H 8900 1750 50  0001 C CNN "PartSpecification"
	1    8900 1750
	1    0    0    -1  
$EndComp
$Comp
L power:GND #PWR?
U 1 1 5E70ECDE
P 8550 2000
F 0 "#PWR?" H 8550 1750 50  0001 C CNN
F 1 "GND" H 8550 1850 50  0000 C CNN
F 2 "" H 8550 2000 50  0001 C CNN
F 3 "" H 8550 2000 50  0001 C CNN
	1    8550 2000
	1    0    0    -1  
$EndComp
$Comp
L power:GND #PWR?
U 1 1 5E70ECE8
P 8900 2000
F 0 "#PWR?" H 8900 1750 50  0001 C CNN
F 1 "GND" H 8900 1850 50  0000 C CNN
F 2 "" H 8900 2000 50  0001 C CNN
F 3 "" H 8900 2000 50  0001 C CNN
	1    8900 2000
	1    0    0    -1  
$EndComp
Wire Wire Line
	8900 2000 8900 1900
Wire Wire Line
	8550 1900 8550 2000
Wire Wire Line
	8550 1500 8550 1600
Wire Wire Line
	8900 1500 8900 1600
$Comp
L 000_PreferredParts:C_10pF C117
U 1 1 5E70ECF7
P 9250 1750
F 0 "C117" H 9275 1850 50  0000 L CNN
F 1 "C_10pF" H 9275 1650 50  0000 L CNN
F 2 "Capacitor_SMD:C_0402_1005Metric" H 9288 1600 50  0001 C CNN
F 3 "~" H 9250 1750 50  0001 C CNN
F 4 "3000-0000000582" H 9250 1750 50  0001 C CNN "PartSpecification"
	1    9250 1750
	1    0    0    -1  
$EndComp
Wire Wire Line
	9250 1600 9250 1500
$Comp
L power:GND #PWR?
U 1 1 5E70ED02
P 9250 2000
F 0 "#PWR?" H 9250 1750 50  0001 C CNN
F 1 "GND" H 9250 1850 50  0000 C CNN
F 2 "" H 9250 2000 50  0001 C CNN
F 3 "" H 9250 2000 50  0001 C CNN
	1    9250 2000
	1    0    0    -1  
$EndComp
Wire Wire Line
	9250 2000 9250 1900
$Comp
L 000_PreferredParts:C_0_1uF C118
U 1 1 5E70ED10
P 10050 1750
F 0 "C118" H 10075 1850 50  0000 L CNN
F 1 "C_0_1uF" H 10075 1650 50  0001 L CNN
F 2 "Capacitor_SMD:C_0402_1005Metric" H 10088 1600 50  0001 C CNN
F 3 "~" H 10050 1750 50  0001 C CNN
F 4 "0.1uF" H 10200 1650 50  0000 C CNN "DisplayValue"
F 5 "3000-0000000125" H 10050 1750 50  0001 C CNN "PartSpecification"
F 6 "100V" H 10050 1750 50  0001 C CNN "Voltage"
	1    10050 1750
	1    0    0    -1  
$EndComp
$Comp
L 000_PreferredParts:C_1nF C119
U 1 1 5E70ED1B
P 10400 1750
F 0 "C119" H 10425 1850 50  0000 L CNN
F 1 "C_1nF" H 10425 1650 50  0000 L CNN
F 2 "Capacitor_SMD:C_0402_1005Metric" H 10438 1600 50  0001 C CNN
F 3 "~" H 10400 1750 50  0001 C CNN
F 4 "3000-0000000128" H 10400 1750 50  0001 C CNN "PartSpecification"
	1    10400 1750
	1    0    0    -1  
$EndComp
$Comp
L power:GND #PWR?
U 1 1 5E70ED25
P 10050 2000
F 0 "#PWR?" H 10050 1750 50  0001 C CNN
F 1 "GND" H 10050 1850 50  0000 C CNN
F 2 "" H 10050 2000 50  0001 C CNN
F 3 "" H 10050 2000 50  0001 C CNN
	1    10050 2000
	1    0    0    -1  
$EndComp
$Comp
L power:GND #PWR?
U 1 1 5E70ED2F
P 10400 2000
F 0 "#PWR?" H 10400 1750 50  0001 C CNN
F 1 "GND" H 10400 1850 50  0000 C CNN
F 2 "" H 10400 2000 50  0001 C CNN
F 3 "" H 10400 2000 50  0001 C CNN
	1    10400 2000
	1    0    0    -1  
$EndComp
Wire Wire Line
	10400 2000 10400 1900
Wire Wire Line
	10050 1900 10050 2000
Wire Wire Line
	10050 1500 10050 1600
Wire Wire Line
	10400 1500 10400 1600
$Comp
L 000_PreferredParts:C_10pF C120
U 1 1 5E70ED3E
P 10750 1750
F 0 "C120" H 10775 1850 50  0000 L CNN
F 1 "C_10pF" H 10775 1650 50  0000 L CNN
F 2 "Capacitor_SMD:C_0402_1005Metric" H 10788 1600 50  0001 C CNN
F 3 "~" H 10750 1750 50  0001 C CNN
F 4 "3000-0000000582" H 10750 1750 50  0001 C CNN "PartSpecification"
	1    10750 1750
	1    0    0    -1  
$EndComp
Wire Wire Line
	10750 1600 10750 1500
$Comp
L power:GND #PWR?
U 1 1 5E70ED49
P 10750 2000
F 0 "#PWR?" H 10750 1750 50  0001 C CNN
F 1 "GND" H 10750 1850 50  0000 C CNN
F 2 "" H 10750 2000 50  0001 C CNN
F 3 "" H 10750 2000 50  0001 C CNN
	1    10750 2000
	1    0    0    -1  
$EndComp
Wire Wire Line
	10750 2000 10750 1900
Wire Wire Line
	10750 1500 10400 1500
Connection ~ 4850 1500
Connection ~ 8550 1500
Connection ~ 8900 1500
Wire Wire Line
	8900 1500 8550 1500
Connection ~ 9250 1500
Wire Wire Line
	9250 1500 8900 1500
Connection ~ 10050 1500
Wire Wire Line
	10050 1500 9250 1500
Connection ~ 10400 1500
Wire Wire Line
	10400 1500 10050 1500
Wire Wire Line
	8750 3550 8750 4950
Wire Wire Line
	8250 3350 8250 3650
$Comp
L 000_PreferredParts:C_0_1uF C104
U 1 1 5E76A0F2
P 2150 3850
F 0 "C104" H 2175 3950 50  0000 L CNN
F 1 "C_0_1uF" H 2175 3750 50  0001 L CNN
F 2 "Capacitor_SMD:C_0402_1005Metric" H 2188 3700 50  0001 C CNN
F 3 "~" H 2150 3850 50  0001 C CNN
F 4 "0.1uF" H 2300 3750 50  0000 C CNN "DisplayValue"
F 5 "3000-0000000125" H 2150 3850 50  0001 C CNN "PartSpecification"
F 6 "100V" H 2150 3850 50  0001 C CNN "Voltage"
	1    2150 3850
	1    0    0    -1  
$EndComp
Wire Wire Line
	2150 3700 2150 3600
Wire Wire Line
	2150 3600 2500 3600
$Comp
L power:GND #PWR?
U 1 1 5E770991
P 2150 4100
F 0 "#PWR?" H 2150 3850 50  0001 C CNN
F 1 "GND" H 2150 3950 50  0000 C CNN
F 2 "" H 2150 4100 50  0001 C CNN
F 3 "" H 2150 4100 50  0001 C CNN
	1    2150 4100
	-1   0    0    -1  
$EndComp
Wire Wire Line
	2150 4100 2150 4000
Wire Wire Line
	3100 3050 3900 3050
Connection ~ 3100 3050
Wire Wire Line
	3900 3150 3100 3150
Connection ~ 3100 3150
Wire Wire Line
	3100 3150 3100 3050
Wire Wire Line
	3900 3350 3100 3350
Connection ~ 3100 3350
Wire Wire Line
	3100 3350 3100 3150
$Comp
L power:GND #PWR?
U 1 1 5E7AE1A9
P 4450 4200
F 0 "#PWR?" H 4450 3950 50  0001 C CNN
F 1 "GND" H 4450 4050 50  0000 C CNN
F 2 "" H 4450 4200 50  0001 C CNN
F 3 "" H 4450 4200 50  0001 C CNN
	1    4450 4200
	-1   0    0    -1  
$EndComp
$Comp
L power:GND #PWR?
U 1 1 5E7AE6BA
P 4550 4200
F 0 "#PWR?" H 4550 3950 50  0001 C CNN
F 1 "GND" H 4550 4050 50  0000 C CNN
F 2 "" H 4550 4200 50  0001 C CNN
F 3 "" H 4550 4200 50  0001 C CNN
	1    4550 4200
	-1   0    0    -1  
$EndComp
$Comp
L power:GND #PWR?
U 1 1 5E7AEB04
P 4650 4200
F 0 "#PWR?" H 4650 3950 50  0001 C CNN
F 1 "GND" H 4650 4050 50  0000 C CNN
F 2 "" H 4650 4200 50  0001 C CNN
F 3 "" H 4650 4200 50  0001 C CNN
	1    4650 4200
	-1   0    0    -1  
$EndComp
$Comp
L power:GND #PWR?
U 1 1 5E7AEF40
P 4750 4200
F 0 "#PWR?" H 4750 3950 50  0001 C CNN
F 1 "GND" H 4750 4050 50  0000 C CNN
F 2 "" H 4750 4200 50  0001 C CNN
F 3 "" H 4750 4200 50  0001 C CNN
	1    4750 4200
	-1   0    0    -1  
$EndComp
Wire Wire Line
	4750 4200 4750 4100
$Comp
L power:GND #PWR?
U 1 1 5E7B6C3C
P 4950 4200
F 0 "#PWR?" H 4950 3950 50  0001 C CNN
F 1 "GND" H 4950 4050 50  0000 C CNN
F 2 "" H 4950 4200 50  0001 C CNN
F 3 "" H 4950 4200 50  0001 C CNN
	1    4950 4200
	-1   0    0    -1  
$EndComp
Wire Wire Line
	4950 4200 4950 4100
Wire Wire Line
	4650 4200 4650 4100
Wire Wire Line
	4550 4200 4550 4100
Wire Wire Line
	4450 4200 4450 4100
$Comp
L Device:R R112
U 1 1 5E7D80EA
P 6050 3000
F 0 "R112" V 6130 3000 50  0000 C CNN
F 1 "49.9" V 6050 3000 50  0000 C CNN
F 2 "Resistor_SMD:R_0402_1005Metric" V 5980 3000 50  0001 C CNN
F 3 "~" H 6050 3000 50  0001 C CNN
F 4 "3000-0000000577" H 6050 3000 50  0001 C CNN "PartSpecification"
	1    6050 3000
	1    0    0    -1  
$EndComp
NoConn ~ 5800 3050
NoConn ~ 5800 3150
NoConn ~ 5800 3250
NoConn ~ 5800 3350
NoConn ~ 5800 3650
$Comp
L power:GND #PWR?
U 1 1 5E7FED5C
P 6050 3250
F 0 "#PWR?" H 6050 3000 50  0001 C CNN
F 1 "GND" H 6050 3100 50  0000 C CNN
F 2 "" H 6050 3250 50  0001 C CNN
F 3 "" H 6050 3250 50  0001 C CNN
	1    6050 3250
	1    0    0    -1  
$EndComp
Wire Wire Line
	6050 3250 6050 3150
$Comp
L Device:R R113
U 1 1 5E808EB4
P 6250 3000
F 0 "R113" V 6330 3000 50  0000 C CNN
F 1 "49.9" V 6250 3000 50  0000 C CNN
F 2 "Resistor_SMD:R_0402_1005Metric" V 6180 3000 50  0001 C CNN
F 3 "~" H 6250 3000 50  0001 C CNN
F 4 "3000-0000000577" H 6250 3000 50  0001 C CNN "PartSpecification"
	1    6250 3000
	1    0    0    -1  
$EndComp
$Comp
L power:GND #PWR?
U 1 1 5E808EBA
P 6250 3250
F 0 "#PWR?" H 6250 3000 50  0001 C CNN
F 1 "GND" H 6250 3100 50  0000 C CNN
F 2 "" H 6250 3250 50  0001 C CNN
F 3 "" H 6250 3250 50  0001 C CNN
	1    6250 3250
	1    0    0    -1  
$EndComp
Wire Wire Line
	6250 3250 6250 3150
$Comp
L Device:R R115
U 1 1 5E810DFD
P 7800 3000
F 0 "R115" V 7880 3000 50  0000 C CNN
F 1 "49.9" V 7800 3000 50  0000 C CNN
F 2 "Resistor_SMD:R_0402_1005Metric" V 7730 3000 50  0001 C CNN
F 3 "~" H 7800 3000 50  0001 C CNN
F 4 "3000-0000000577" H 7800 3000 50  0001 C CNN "PartSpecification"
	1    7800 3000
	1    0    0    -1  
$EndComp
$Comp
L power:GND #PWR?
U 1 1 5E810E03
P 7800 3250
F 0 "#PWR?" H 7800 3000 50  0001 C CNN
F 1 "GND" H 7800 3100 50  0000 C CNN
F 2 "" H 7800 3250 50  0001 C CNN
F 3 "" H 7800 3250 50  0001 C CNN
	1    7800 3250
	1    0    0    -1  
$EndComp
Wire Wire Line
	7800 3250 7800 3150
$Comp
L Device:R R116
U 1 1 5E818EE0
P 8000 3000
F 0 "R116" V 8080 3000 50  0000 C CNN
F 1 "49.9" V 8000 3000 50  0000 C CNN
F 2 "Resistor_SMD:R_0402_1005Metric" V 7930 3000 50  0001 C CNN
F 3 "~" H 8000 3000 50  0001 C CNN
F 4 "3000-0000000577" H 8000 3000 50  0001 C CNN "PartSpecification"
	1    8000 3000
	1    0    0    -1  
$EndComp
$Comp
L power:GND #PWR?
U 1 1 5E818EE6
P 8000 3250
F 0 "#PWR?" H 8000 3000 50  0001 C CNN
F 1 "GND" H 8000 3100 50  0000 C CNN
F 2 "" H 8000 3250 50  0001 C CNN
F 3 "" H 8000 3250 50  0001 C CNN
	1    8000 3250
	1    0    0    -1  
$EndComp
Wire Wire Line
	8000 3250 8000 3150
Wire Wire Line
	5800 2750 6050 2750
Wire Wire Line
	6050 2750 6050 2850
Wire Wire Line
	6250 2850 6250 2650
Wire Wire Line
	6250 2650 5800 2650
$Comp
L Device:R R114
U 1 1 5E845D5E
P 6500 2800
F 0 "R114" V 6580 2800 50  0000 C CNN
F 1 "100" V 6500 2800 50  0000 C CNN
F 2 "Resistor_SMD:R_0402_1005Metric" V 6430 2800 50  0001 C CNN
F 3 "~" H 6500 2800 50  0001 C CNN
F 4 "3000-0000000149" H 6500 2800 50  0001 C CNN "PartSpecification"
	1    6500 2800
	1    0    0    -1  
$EndComp
Wire Wire Line
	6500 2950 6400 2950
Wire Wire Line
	6400 2950 6400 2750
Wire Wire Line
	6400 2750 6050 2750
Connection ~ 6050 2750
Wire Wire Line
	6500 2650 6250 2650
Connection ~ 6250 2650
Wire Wire Line
	7800 2850 7800 2550
Wire Wire Line
	8000 2450 8000 2850
$Comp
L 000_PreferredParts:C_0_1uF C112
U 1 1 5E86C2E0
P 8250 2450
F 0 "C112" H 8275 2550 50  0000 L CNN
F 1 "C_0_1uF" H 8275 2350 50  0001 L CNN
F 2 "Capacitor_SMD:C_0402_1005Metric" H 8288 2300 50  0001 C CNN
F 3 "~" H 8250 2450 50  0001 C CNN
F 4 "0.1uF" H 8400 2350 50  0000 C CNN "DisplayValue"
F 5 "3000-0000000125" H 8250 2450 50  0001 C CNN "PartSpecification"
F 6 "100V" H 8250 2450 50  0001 C CNN "Voltage"
	1    8250 2450
	0    1    1    0   
$EndComp
Wire Wire Line
	8100 2450 8000 2450
$Comp
L 000_PreferredParts:C_0_1uF C114
U 1 1 5E876557
P 8650 2550
F 0 "C114" H 8675 2650 50  0000 L CNN
F 1 "C_0_1uF" H 8675 2450 50  0001 L CNN
F 2 "Capacitor_SMD:C_0402_1005Metric" H 8688 2400 50  0001 C CNN
F 3 "~" H 8650 2550 50  0001 C CNN
F 4 "0.1uF" H 8800 2450 50  0000 C CNN "DisplayValue"
F 5 "3000-0000000125" H 8650 2550 50  0001 C CNN "PartSpecification"
F 6 "100V" H 8650 2550 50  0001 C CNN "Voltage"
	1    8650 2550
	0    1    1    0   
$EndComp
Wire Wire Line
	8500 2550 7800 2550
Wire Wire Line
	8400 2450 9600 2450
Wire Wire Line
	8800 2550 9600 2550
Text Label 7250 4950 0    50   ~ 0
PPS_IN
NoConn ~ 3900 3450
$Comp
L Mechanical:Fiducial FID101
U 1 1 5E8C0CD5
P 1650 5000
F 0 "FID101" H 1650 5200 50  0000 C CNN
F 1 "Fiducial" H 1650 5125 50  0000 C CNN
F 2 "POWDER_Misc:Fiducial_1.2mm_Mask2.5mm" H 1650 5000 50  0001 C CNN
F 3 "~" H 1650 5000 50  0001 C CNN
	1    1650 5000
	1    0    0    -1  
$EndComp
$Comp
L Mechanical:Fiducial FID102
U 1 1 5E8C2518
P 2150 5000
F 0 "FID102" H 2150 5200 50  0000 C CNN
F 1 "Fiducial" H 2150 5125 50  0000 C CNN
F 2 "POWDER_Misc:Fiducial_1.2mm_Mask2.5mm" H 2150 5000 50  0001 C CNN
F 3 "~" H 2150 5000 50  0001 C CNN
	1    2150 5000
	1    0    0    -1  
$EndComp
$Comp
L Mechanical:Fiducial FID103
U 1 1 5E8C2AC7
P 2650 5000
F 0 "FID103" H 2650 5200 50  0000 C CNN
F 1 "Fiducial" H 2650 5125 50  0000 C CNN
F 2 "POWDER_Misc:Fiducial_1.2mm_Mask2.5mm" H 2650 5000 50  0001 C CNN
F 3 "~" H 2650 5000 50  0001 C CNN
	1    2650 5000
	1    0    0    -1  
$EndComp
$Comp
L Mechanical:Fiducial FID104
U 1 1 5E8C3046
P 3150 5000
F 0 "FID104" H 3150 5200 50  0000 C CNN
F 1 "Fiducial" H 3150 5125 50  0000 C CNN
F 2 "POWDER_Misc:Fiducial_1.2mm_Mask2.5mm" H 3150 5000 50  0001 C CNN
F 3 "~" H 3150 5000 50  0001 C CNN
	1    3150 5000
	1    0    0    -1  
$EndComp
$Comp
L Mechanical:MountingHole_Pad H101
U 1 1 5E8C3D4F
P 1650 5550
F 0 "H101" H 1650 5800 50  0000 C CNN
F 1 "MountingHole_Pad" H 1650 5725 50  0000 C CNN
F 2 "MountingHole:MountingHole_3.2mm_M3_ISO7380_Pad" H 1650 5550 50  0001 C CNN
F 3 "~" H 1650 5550 50  0001 C CNN
	1    1650 5550
	1    0    0    -1  
$EndComp
$Comp
L Mechanical:MountingHole_Pad H102
U 1 1 5E8C4403
P 2650 5550
F 0 "H102" H 2650 5800 50  0000 C CNN
F 1 "MountingHole_Pad" H 2650 5725 50  0000 C CNN
F 2 "MountingHole:MountingHole_3.2mm_M3_ISO7380_Pad" H 2650 5550 50  0001 C CNN
F 3 "~" H 2650 5550 50  0001 C CNN
	1    2650 5550
	1    0    0    -1  
$EndComp
$Comp
L power:GND #PWR?
U 1 1 5E8C49F6
P 1650 5750
F 0 "#PWR?" H 1650 5500 50  0001 C CNN
F 1 "GND" H 1650 5600 50  0000 C CNN
F 2 "" H 1650 5750 50  0001 C CNN
F 3 "" H 1650 5750 50  0001 C CNN
	1    1650 5750
	-1   0    0    -1  
$EndComp
Wire Wire Line
	1650 5750 1650 5650
$Comp
L power:GND #PWR?
U 1 1 5E8CEEB8
P 2650 5750
F 0 "#PWR?" H 2650 5500 50  0001 C CNN
F 1 "GND" H 2650 5600 50  0000 C CNN
F 2 "" H 2650 5750 50  0001 C CNN
F 3 "" H 2650 5750 50  0001 C CNN
	1    2650 5750
	-1   0    0    -1  
$EndComp
Wire Wire Line
	2650 5750 2650 5650
Wire Wire Line
	10100 3850 10500 3850
Wire Wire Line
	10500 3850 10500 3950
Wire Wire Line
	10500 4250 10100 4250
Wire Wire Line
	10100 4150 10500 4150
Connection ~ 10500 4150
Wire Wire Line
	10500 4150 10500 4250
Wire Wire Line
	10500 4050 10100 4050
Connection ~ 10500 4050
Wire Wire Line
	10500 4050 10500 4150
Wire Wire Line
	10100 3950 10500 3950
Connection ~ 10500 3950
Wire Wire Line
	10500 3950 10500 4050
Wire Wire Line
	9600 3950 9350 3950
Wire Wire Line
	9350 3950 9350 4050
Wire Wire Line
	9350 4250 9600 4250
Wire Wire Line
	9600 4150 9350 4150
Connection ~ 9350 4150
Wire Wire Line
	9350 4150 9350 4250
Wire Wire Line
	9350 4050 9600 4050
Connection ~ 9350 4050
Wire Wire Line
	9350 4050 9350 4150
Text Label 10500 3850 0    50   ~ 0
V_IN_HI_BUS
Text Label 8850 4250 0    50   ~ 0
V_IN_HI_BUS
Wire Wire Line
	8850 4250 9350 4250
Connection ~ 9350 4250
Text Label 10300 3050 0    50   ~ 0
ICNT_DN_RX0
Text Label 10300 3150 0    50   ~ 0
ICNT_DN_RX1
Text Label 10300 3250 0    50   ~ 0
ICNT_DN_RX2
Text Label 10300 3350 0    50   ~ 0
ICNT_DN_RX3
Text Label 9000 3650 0    50   ~ 0
ICNT_DN_TX3
Text Label 9000 3450 0    50   ~ 0
ICNT_DN_TX1
Text Label 2300 2850 0    50   ~ 0
CLK_10MHz_in_half
Text Label 2150 3600 0    50   ~ 0
bias
Text Label 2800 1500 0    50   ~ 0
clk_buffer_vcc_3_3
Text Label 6200 2450 0    50   ~ 0
HSCL_CLK_P
Text Label 6200 2550 0    50   ~ 0
HSCL_CLK_N
Text Label 6000 2650 0    50   ~ 0
DUMMY_P
Text Label 5900 2750 0    50   ~ 0
DUMMY_N
Text Label 6900 4450 0    50   ~ 0
PPS_VCC_3_3
$Comp
L Device:R R111
U 1 1 5E95B6F9
P 5350 1700
F 0 "R111" V 5430 1700 50  0000 C CNN
F 1 "DNP" V 5350 1700 50  0000 C CNN
F 2 "Resistor_SMD:R_0402_1005Metric" V 5280 1700 50  0001 C CNN
F 3 "~" H 5350 1700 50  0001 C CNN
	1    5350 1700
	1    0    0    -1  
$EndComp
$Comp
L Device:R R110
U 1 1 5E95D76B
P 5050 1700
F 0 "R110" V 5130 1700 50  0000 C CNN
F 1 "DNP" V 5050 1700 50  0000 C CNN
F 2 "Resistor_SMD:R_0402_1005Metric" V 4980 1700 50  0001 C CNN
F 3 "~" H 5050 1700 50  0001 C CNN
	1    5050 1700
	1    0    0    -1  
$EndComp
Wire Wire Line
	5050 1550 5050 1500
Connection ~ 5050 1500
Wire Wire Line
	5050 1500 4850 1500
Wire Wire Line
	5050 1850 5050 1900
Wire Wire Line
	5150 1900 5150 1850
Wire Wire Line
	5350 1900 5350 1850
Wire Wire Line
	5350 1550 5350 1500
Connection ~ 5350 1500
Connection ~ 4350 1500
Wire Wire Line
	1950 1500 2250 1500
Connection ~ 1950 1500
Wire Wire Line
	5150 1850 5050 1850
Connection ~ 5050 1850
Wire Wire Line
	5050 1500 5350 1500
Wire Wire Line
	3100 3350 3100 3650
$Comp
L Device:R R106
U 1 1 5EA4AAFA
P 3300 2350
F 0 "R106" V 3380 2350 50  0000 C CNN
F 1 "0" V 3300 2350 50  0000 C CNN
F 2 "Resistor_SMD:R_0402_1005Metric" V 3230 2350 50  0001 C CNN
F 3 "~" H 3300 2350 50  0001 C CNN
F 4 "3000-0000000142" H 3300 2350 50  0001 C CNN "PartSpecification"
	1    3300 2350
	0    1    1    0   
$EndComp
$Comp
L Device:R R107
U 1 1 5EA4B76A
P 3300 2550
F 0 "R107" V 3380 2550 50  0000 C CNN
F 1 "0" V 3300 2550 50  0000 C CNN
F 2 "Resistor_SMD:R_0402_1005Metric" V 3230 2550 50  0001 C CNN
F 3 "~" H 3300 2550 50  0001 C CNN
F 4 "3000-0000000142" H 3300 2550 50  0001 C CNN "PartSpecification"
	1    3300 2550
	0    1    1    0   
$EndComp
$Comp
L Device:R R109
U 1 1 5EA4BAFE
P 3500 2650
F 0 "R109" V 3580 2650 50  0000 C CNN
F 1 "0" V 3500 2650 50  0000 C CNN
F 2 "Resistor_SMD:R_0402_1005Metric" V 3430 2650 50  0001 C CNN
F 3 "~" H 3500 2650 50  0001 C CNN
F 4 "3000-0000000142" H 3500 2650 50  0001 C CNN "PartSpecification"
	1    3500 2650
	0    1    1    0   
$EndComp
$Comp
L Device:R R108
U 1 1 5EA4BDE6
P 3300 3650
F 0 "R108" V 3380 3650 50  0000 C CNN
F 1 "0" V 3300 3650 50  0000 C CNN
F 2 "Resistor_SMD:R_0402_1005Metric" V 3230 3650 50  0001 C CNN
F 3 "~" H 3300 3650 50  0001 C CNN
F 4 "3000-0000000142" H 3300 3650 50  0001 C CNN "PartSpecification"
	1    3300 3650
	0    1    1    0   
$EndComp
Wire Wire Line
	3450 3650 3900 3650
Wire Wire Line
	3150 3650 3100 3650
Connection ~ 3100 3650
Wire Wire Line
	3100 3650 3100 3750
Wire Wire Line
	3100 2550 3150 2550
Wire Wire Line
	3100 2350 3100 2550
Connection ~ 3100 2550
Wire Wire Line
	3100 2550 3100 2650
Wire Wire Line
	3350 2650 3100 2650
Connection ~ 3100 2650
Wire Wire Line
	3100 2650 3100 3050
Wire Wire Line
	3650 2650 3900 2650
Wire Wire Line
	3900 2550 3450 2550
Wire Wire Line
	3450 2350 3900 2350
Wire Wire Line
	3150 2350 3100 2350
Text Label 3500 2350 1    50   ~ 0
~clkout_en
Text Label 3600 2550 1    50   ~ 0
clkin_sel0
Text Label 3700 2650 1    50   ~ 0
clkin_sel1
Text Label 3550 3650 1    50   ~ 0
refout_en
Text Label 3200 3150 0    50   ~ 0
pull_down
$Comp
L power:GND #PWR?
U 1 1 5EAF090C
P 9850 4550
F 0 "#PWR?" H 9850 4300 50  0001 C CNN
F 1 "GND" H 9850 4400 50  0000 C CNN
F 2 "" H 9850 4550 50  0001 C CNN
F 3 "" H 9850 4550 50  0001 C CNN
	1    9850 4550
	1    0    0    -1  
$EndComp
Wire Wire Line
	9850 4550 9850 4450
Wire Wire Line
	1500 2800 1500 2850
$Comp
L Device:R R119
U 1 1 5EB33A55
P 1850 3400
F 0 "R119" V 1930 3400 50  0000 C CNN
F 1 "1k" V 1850 3400 50  0000 C CNN
F 2 "Resistor_SMD:R_0402_1005Metric" V 1780 3400 50  0001 C CNN
F 3 "~" H 1850 3400 50  0001 C CNN
F 4 "3000-0000000156" H 1850 3400 50  0001 C CNN "PartSpecification"
	1    1850 3400
	1    0    0    -1  
$EndComp
$Comp
L Device:R R120
U 1 1 5EB33A5B
P 1850 3850
F 0 "R120" V 1930 3850 50  0000 C CNN
F 1 "1k" V 1850 3850 50  0000 C CNN
F 2 "Resistor_SMD:R_0402_1005Metric" V 1780 3850 50  0001 C CNN
F 3 "~" H 1850 3850 50  0001 C CNN
F 4 "3000-0000000156" H 1850 3850 50  0001 C CNN "PartSpecification"
	1    1850 3850
	1    0    0    -1  
$EndComp
Wire Wire Line
	1850 3550 1850 3600
Wire Wire Line
	1850 3250 1850 3150
$Comp
L power:GND #PWR?
U 1 1 5EB33A63
P 1850 4100
F 0 "#PWR?" H 1850 3850 50  0001 C CNN
F 1 "GND" H 1850 3950 50  0000 C CNN
F 2 "" H 1850 4100 50  0001 C CNN
F 3 "" H 1850 4100 50  0001 C CNN
	1    1850 4100
	-1   0    0    -1  
$EndComp
Wire Wire Line
	1850 4100 1850 4000
Connection ~ 1850 3600
Wire Wire Line
	1850 3600 1850 3700
$Comp
L 000_PreferredParts:C_0_1uF C122
U 1 1 5EB33A70
P 1500 3850
F 0 "C122" H 1525 3950 50  0000 L CNN
F 1 "C_0_1uF" H 1525 3750 50  0001 L CNN
F 2 "Capacitor_SMD:C_0402_1005Metric" H 1538 3700 50  0001 C CNN
F 3 "~" H 1500 3850 50  0001 C CNN
F 4 "0.1uF" H 1650 3750 50  0000 C CNN "DisplayValue"
F 5 "3000-0000000125" H 1500 3850 50  0001 C CNN "PartSpecification"
F 6 "100V" H 1500 3850 50  0001 C CNN "Voltage"
	1    1500 3850
	1    0    0    -1  
$EndComp
Wire Wire Line
	1500 3700 1500 3600
Wire Wire Line
	1500 3600 1850 3600
$Comp
L power:GND #PWR?
U 1 1 5EB33A78
P 1500 4100
F 0 "#PWR?" H 1500 3850 50  0001 C CNN
F 1 "GND" H 1500 3950 50  0000 C CNN
F 2 "" H 1500 4100 50  0001 C CNN
F 3 "" H 1500 4100 50  0001 C CNN
	1    1500 4100
	-1   0    0    -1  
$EndComp
Wire Wire Line
	1500 4100 1500 4000
Text Label 1500 3600 0    50   ~ 0
bias_2
$Comp
L 000_PreferredParts:C_0_1uF C121
U 1 1 5EB5159E
P 1250 2400
F 0 "C121" H 1275 2500 50  0000 L CNN
F 1 "C_0_1uF" H 1275 2300 50  0001 L CNN
F 2 "Capacitor_SMD:C_0402_1005Metric" H 1288 2250 50  0001 C CNN
F 3 "~" H 1250 2400 50  0001 C CNN
F 4 "0.1uF" H 1400 2300 50  0000 C CNN "DisplayValue"
F 5 "3000-0000000125" H 1250 2400 50  0001 C CNN "PartSpecification"
F 6 "100V" H 1250 2400 50  0001 C CNN "Voltage"
	1    1250 2400
	0    1    1    0   
$EndComp
Wire Wire Line
	1100 2400 950  2400
Wire Wire Line
	1500 3200 1500 3600
Connection ~ 1500 3600
Wire Wire Line
	1500 2850 3900 2850
Connection ~ 1500 2850
Wire Wire Line
	1500 2850 1500 2900
Text Label 1500 2400 0    50   ~ 0
CLK_10MHz_in_decoupled
Text Label 5350 1850 0    50   ~ 0
VCCOC
Text Label 5050 1850 0    50   ~ 0
VCCOB
Wire Wire Line
	5350 1500 8550 1500
Wire Wire Line
	4150 650  3800 650 
Wire Wire Line
	1950 650  1950 1500
Connection ~ 2200 650 
Wire Wire Line
	2200 650  1950 650 
Connection ~ 2550 650 
Wire Wire Line
	2550 650  2200 650 
Connection ~ 2900 650 
Wire Wire Line
	2900 650  2550 650 
Connection ~ 3450 650 
Wire Wire Line
	3450 650  2900 650 
Connection ~ 3800 650 
Wire Wire Line
	3800 650  3450 650 
$Comp
L Device:Ferrite_Bead FB103
U 1 1 5EBDC45B
P 5350 1250
F 0 "FB103" V 5200 1275 50  0000 C CNN
F 1 "Ferrite_Bead" V 5500 1250 50  0000 C CNN
F 2 "Inductor_SMD:L_0603_1608Metric" V 5280 1250 50  0001 C CNN
F 3 "~" H 5350 1250 50  0001 C CNN
F 4 "3000-0000000091" H 5350 1250 50  0001 C CNN "PartSpecification"
	1    5350 1250
	-1   0    0    1   
$EndComp
$Comp
L power:+3.3V #PWR?
U 1 1 5EBDCC75
P 5350 1000
F 0 "#PWR?" H 5350 850 50  0001 C CNN
F 1 "+3.3V" H 5350 1140 50  0000 C CNN
F 2 "" H 5350 1000 50  0001 C CNN
F 3 "" H 5350 1000 50  0001 C CNN
	1    5350 1000
	1    0    0    -1  
$EndComp
Wire Wire Line
	5350 1000 5350 1100
Wire Wire Line
	5350 1400 5350 1500
Text Label 6000 1500 0    50   ~ 0
VCCOA
Text Label 7650 5050 0    50   ~ 0
PPS_DIR
Wire Wire Line
	1850 3150 2250 3150
Wire Wire Line
	2250 1500 2250 3150
Connection ~ 2250 1500
Wire Wire Line
	2250 1500 4350 1500
Connection ~ 2250 3150
Wire Wire Line
	2250 3150 2500 3150
$Comp
L Device:R R121
U 1 1 5EC6F5B2
P 7500 5200
F 0 "R121" V 7580 5200 50  0000 C CNN
F 1 "49.9" V 7500 5200 50  0000 C CNN
F 2 "Resistor_SMD:R_0402_1005Metric" V 7430 5200 50  0001 C CNN
F 3 "~" H 7500 5200 50  0001 C CNN
F 4 "3000-0000000577" H 7500 5200 50  0001 C CNN "PartSpecification"
	1    7500 5200
	1    0    0    -1  
$EndComp
$Comp
L 000_PreferredParts:C_0_1uF C123
U 1 1 5EC70239
P 7500 5600
F 0 "C123" H 7525 5700 50  0000 L CNN
F 1 "C_0_1uF" H 7525 5500 50  0001 L CNN
F 2 "Capacitor_SMD:C_0402_1005Metric" H 7538 5450 50  0001 C CNN
F 3 "~" H 7500 5600 50  0001 C CNN
F 4 "0.1uF" H 7650 5500 50  0000 C CNN "DisplayValue"
F 5 "3000-0000000125" H 7500 5600 50  0001 C CNN "PartSpecification"
F 6 "100V" H 7500 5600 50  0001 C CNN "Voltage"
	1    7500 5600
	1    0    0    -1  
$EndComp
$Comp
L power:GND #PWR?
U 1 1 5EC71CF5
P 7500 5850
F 0 "#PWR?" H 7500 5600 50  0001 C CNN
F 1 "GND" H 7500 5700 50  0000 C CNN
F 2 "" H 7500 5850 50  0001 C CNN
F 3 "" H 7500 5850 50  0001 C CNN
	1    7500 5850
	1    0    0    -1  
$EndComp
Wire Wire Line
	7500 5850 7500 5750
Wire Wire Line
	7500 5450 7500 5350
Wire Wire Line
	7500 5050 7500 4950
Connection ~ 7500 4950
Wire Wire Line
	7500 4950 7750 4950
Text Label 7500 5400 0    50   ~ 0
PPS_TERM_DECOUPLE
$Comp
L 000_PreferredParts:C_0_1uF C124
U 1 1 5ECA88EE
P 8900 4750
F 0 "C124" H 8925 4850 50  0000 L CNN
F 1 "C_0_1uF" H 8925 4650 50  0001 L CNN
F 2 "Capacitor_SMD:C_0402_1005Metric" H 8938 4600 50  0001 C CNN
F 3 "~" H 8900 4750 50  0001 C CNN
F 4 "0.1uF" H 9050 4650 50  0000 C CNN "DisplayValue"
F 5 "3000-0000000125" H 8900 4750 50  0001 C CNN "PartSpecification"
F 6 "100V" H 8900 4750 50  0001 C CNN "Voltage"
	1    8900 4750
	1    0    0    -1  
$EndComp
$Comp
L 000_PreferredParts:C_1nF C125
U 1 1 5ECA88F5
P 9250 4750
F 0 "C125" H 9275 4850 50  0000 L CNN
F 1 "C_1nF" H 9275 4650 50  0000 L CNN
F 2 "Capacitor_SMD:C_0402_1005Metric" H 9288 4600 50  0001 C CNN
F 3 "~" H 9250 4750 50  0001 C CNN
F 4 "3000-0000000128" H 9250 4750 50  0001 C CNN "PartSpecification"
	1    9250 4750
	1    0    0    -1  
$EndComp
$Comp
L power:GND #PWR?
U 1 1 5ECA88FB
P 8900 5000
F 0 "#PWR?" H 8900 4750 50  0001 C CNN
F 1 "GND" H 8900 4850 50  0000 C CNN
F 2 "" H 8900 5000 50  0001 C CNN
F 3 "" H 8900 5000 50  0001 C CNN
	1    8900 5000
	1    0    0    -1  
$EndComp
$Comp
L power:GND #PWR?
U 1 1 5ECA8901
P 9250 5000
F 0 "#PWR?" H 9250 4750 50  0001 C CNN
F 1 "GND" H 9250 4850 50  0000 C CNN
F 2 "" H 9250 5000 50  0001 C CNN
F 3 "" H 9250 5000 50  0001 C CNN
	1    9250 5000
	1    0    0    -1  
$EndComp
Wire Wire Line
	9250 5000 9250 4900
Wire Wire Line
	8900 4900 8900 5000
Wire Wire Line
	8900 4500 8900 4600
Wire Wire Line
	9250 4500 9250 4600
Wire Wire Line
	9250 4500 8900 4500
Connection ~ 8250 4500
Wire Wire Line
	8250 4500 8250 4550
Connection ~ 8900 4500
Wire Wire Line
	8900 4500 8250 4500
$Comp
L power:+3.3V #PWR?
U 1 1 5ECF06FA
P 4500 5000
F 0 "#PWR?" H 4500 4850 50  0001 C CNN
F 1 "+3.3V" H 4500 5140 50  0000 C CNN
F 2 "" H 4500 5000 50  0001 C CNN
F 3 "" H 4500 5000 50  0001 C CNN
	1    4500 5000
	1    0    0    -1  
$EndComp
$Comp
L Connector_Generic:Conn_01x02 J104
U 1 1 5ECF2AA4
P 4100 5300
F 0 "J104" H 4100 5400 50  0000 C CNN
F 1 "Conn_01x02" H 4100 5100 50  0000 C CNN
F 2 "TerminalBlock:TerminalBlock_bornier-2_P5.08mm" H 4100 5300 50  0001 C CNN
F 3 "~" H 4100 5300 50  0001 C CNN
F 4 "3000-0000000184" H 4100 5300 50  0001 C CNN "PartSpecification"
	1    4100 5300
	-1   0    0    1   
$EndComp
$Comp
L power:GND #PWR?
U 1 1 5ECF48C7
P 4500 5500
F 0 "#PWR?" H 4500 5250 50  0001 C CNN
F 1 "GND" H 4500 5350 50  0000 C CNN
F 2 "" H 4500 5500 50  0001 C CNN
F 3 "" H 4500 5500 50  0001 C CNN
	1    4500 5500
	-1   0    0    -1  
$EndComp
Wire Wire Line
	4500 5500 4500 5300
Wire Wire Line
	4500 5300 4300 5300
Wire Wire Line
	4500 5000 4500 5100
Wire Wire Line
	4500 5200 4300 5200
$Comp
L POWDER_Power:TPS709-Q1 U103
U 1 1 5ED1DC4C
P 5250 5150
F 0 "U103" H 5450 4850 50  0000 C CNN
F 1 "TPS70918-Q1" H 5250 5350 50  0000 C CNN
F 2 "Package_TO_SOT_SMD:SOT-23-5" H 5250 5150 50  0001 C CNN
F 3 "" H 5250 5150 50  0001 C CNN
F 4 "3000-0000000598" H 5250 5150 50  0001 C CNN "PartSpecification"
	1    5250 5150
	1    0    0    -1  
$EndComp
Wire Wire Line
	4900 5100 4700 5100
Connection ~ 4500 5100
Wire Wire Line
	4500 5100 4500 5200
$Comp
L 000_PreferredParts:C_1uF C126
U 1 1 5ED2FEEE
P 4700 5350
F 0 "C126" H 4725 5450 50  0000 L CNN
F 1 "C_1uF" H 4725 5250 50  0000 L CNN
F 2 "Capacitor_SMD:C_0603_1608Metric" H 4738 5200 50  0001 C CNN
F 3 "~" H 4700 5350 50  0001 C CNN
F 4 "3000-0000000136" H 4700 5350 50  0001 C CNN "PartSpecification"
	1    4700 5350
	1    0    0    -1  
$EndComp
$Comp
L power:GND #PWR?
U 1 1 5ED30323
P 4700 5600
F 0 "#PWR?" H 4700 5350 50  0001 C CNN
F 1 "GND" H 4700 5450 50  0000 C CNN
F 2 "" H 4700 5600 50  0001 C CNN
F 3 "" H 4700 5600 50  0001 C CNN
	1    4700 5600
	-1   0    0    -1  
$EndComp
Wire Wire Line
	4700 5600 4700 5500
Wire Wire Line
	4700 5200 4700 5100
Connection ~ 4700 5100
Wire Wire Line
	4700 5100 4500 5100
$Comp
L power:GND #PWR?
U 1 1 5ED5399E
P 5250 5600
F 0 "#PWR?" H 5250 5350 50  0001 C CNN
F 1 "GND" H 5250 5450 50  0000 C CNN
F 2 "" H 5250 5600 50  0001 C CNN
F 3 "" H 5250 5600 50  0001 C CNN
	1    5250 5600
	-1   0    0    -1  
$EndComp
Wire Wire Line
	5250 5600 5250 5500
$Comp
L 000_PreferredParts:C_1uF C127
U 1 1 5ED65C54
P 5700 5350
F 0 "C127" H 5725 5450 50  0000 L CNN
F 1 "C_1uF" H 5725 5250 50  0000 L CNN
F 2 "Capacitor_SMD:C_0603_1608Metric" H 5738 5200 50  0001 C CNN
F 3 "~" H 5700 5350 50  0001 C CNN
F 4 "3000-0000000136" H 5700 5350 50  0001 C CNN "PartSpecification"
	1    5700 5350
	1    0    0    -1  
$EndComp
$Comp
L 000_PreferredParts:C_1uF C128
U 1 1 5ED65FBF
P 6000 5350
F 0 "C128" H 6025 5450 50  0000 L CNN
F 1 "C_1uF" H 6025 5250 50  0000 L CNN
F 2 "Capacitor_SMD:C_0603_1608Metric" H 6038 5200 50  0001 C CNN
F 3 "~" H 6000 5350 50  0001 C CNN
F 4 "3000-0000000136" H 6000 5350 50  0001 C CNN "PartSpecification"
	1    6000 5350
	1    0    0    -1  
$EndComp
$Comp
L power:GND #PWR?
U 1 1 5ED6637F
P 5700 5600
F 0 "#PWR?" H 5700 5350 50  0001 C CNN
F 1 "GND" H 5700 5450 50  0000 C CNN
F 2 "" H 5700 5600 50  0001 C CNN
F 3 "" H 5700 5600 50  0001 C CNN
	1    5700 5600
	-1   0    0    -1  
$EndComp
$Comp
L power:GND #PWR?
U 1 1 5ED666E3
P 6000 5600
F 0 "#PWR?" H 6000 5350 50  0001 C CNN
F 1 "GND" H 6000 5450 50  0000 C CNN
F 2 "" H 6000 5600 50  0001 C CNN
F 3 "" H 6000 5600 50  0001 C CNN
	1    6000 5600
	-1   0    0    -1  
$EndComp
Wire Wire Line
	6000 5600 6000 5500
Wire Wire Line
	6000 5200 6000 5100
Wire Wire Line
	6000 5100 5700 5100
$Comp
L power:+1V8 #PWR?
U 1 1 5ED8DE51
P 6000 5000
F 0 "#PWR?" H 6000 4850 50  0001 C CNN
F 1 "+1V8" H 6000 5140 50  0000 C CNN
F 2 "" H 6000 5000 50  0001 C CNN
F 3 "" H 6000 5000 50  0001 C CNN
	1    6000 5000
	1    0    0    -1  
$EndComp
Wire Wire Line
	6000 5000 6000 5100
Connection ~ 6000 5100
Wire Wire Line
	5700 5500 5700 5600
Wire Wire Line
	5700 5100 5700 5200
Connection ~ 5700 5100
Wire Wire Line
	5700 5100 5600 5100
NoConn ~ 4900 5200
Wire Wire Line
	7000 2450 5800 2450
$Comp
L Device:R R122
U 1 1 5E6FB8A8
P 7150 2450
F 0 "R122" V 7230 2450 50  0000 C CNN
F 1 "0" V 7150 2450 50  0000 C CNN
F 2 "Resistor_SMD:R_0402_1005Metric" V 7080 2450 50  0001 C CNN
F 3 "~" H 7150 2450 50  0001 C CNN
F 4 "3000-0000000142" H 7150 2450 50  0001 C CNN "PartSpecification"
	1    7150 2450
	0    1    1    0   
$EndComp
$Comp
L Device:R R123
U 1 1 5E6FBF90
P 7450 2550
F 0 "R123" V 7530 2550 50  0000 C CNN
F 1 "0" V 7450 2550 50  0000 C CNN
F 2 "Resistor_SMD:R_0402_1005Metric" V 7380 2550 50  0001 C CNN
F 3 "~" H 7450 2550 50  0001 C CNN
F 4 "3000-0000000142" H 7450 2550 50  0001 C CNN "PartSpecification"
	1    7450 2550
	0    1    1    0   
$EndComp
Wire Wire Line
	7800 2550 7600 2550
Connection ~ 7800 2550
Wire Wire Line
	8000 2450 7300 2450
Connection ~ 8000 2450
Wire Wire Line
	5800 2550 7300 2550
Text Label 7550 2450 0    50   ~ 0
HSCL_CLK_OS_P
Text Label 7650 2550 0    50   ~ 0
HSCL_CLK_OS_N
Text Notes 6900 2350 0    50   ~ 0
These resistors can be\nreplaced with 10-30 ohm\nresistors if necessary\nfor overshoot.
Text Notes 5650 1800 0    50   ~ 0
These resistors pads can be used for\n0 ohm resistors if IC is unhappy with\nno supply on unused outputs.
$Comp
L Device:R R124
U 1 1 5E7730B8
P 7300 5200
F 0 "R124" V 7380 5200 50  0000 C CNN
F 1 "1k" V 7300 5200 50  0000 C CNN
F 2 "Resistor_SMD:R_0402_1005Metric" V 7230 5200 50  0001 C CNN
F 3 "~" H 7300 5200 50  0001 C CNN
	1    7300 5200
	1    0    0    -1  
$EndComp
Wire Wire Line
	7300 5050 7300 4950
Connection ~ 7300 4950
Wire Wire Line
	7300 4950 7500 4950
$Comp
L power:GND #PWR?
U 1 1 5E788095
P 7300 5450
F 0 "#PWR?" H 7300 5200 50  0001 C CNN
F 1 "GND" H 7300 5300 50  0000 C CNN
F 2 "" H 7300 5450 50  0001 C CNN
F 3 "" H 7300 5450 50  0001 C CNN
	1    7300 5450
	1    0    0    -1  
$EndComp
Wire Wire Line
	7300 5450 7300 5350
$EndSCHEMATC
