EESchema Schematic File Version 4
LIBS:power_supply-cache
EELAYER 29 0
EELAYER END
$Descr A4 11693 8268
encoding utf-8
Sheet 3 5
Title ""
Date ""
Rev ""
Comp ""
Comment1 ""
Comment2 ""
Comment3 ""
Comment4 ""
$EndDescr
$Comp
L POWDER_Power:TPS54561-Q1 U?
U 1 1 5C6912FE
P 5400 3450
AR Path="/5C6912FE" Ref="U?"  Part="1" 
AR Path="/5C66EB2D/5C6912FE" Ref="U?"  Part="1" 
AR Path="/5C67E09D/5C6912FE" Ref="U303"  Part="1" 
F 0 "U303" H 5400 4065 50  0000 C CNN
F 1 "TPS54561-Q1" H 5400 3974 50  0000 C CNN
F 2 "POWDER_Power:TPS54561-Q1" H 5400 2750 50  0001 C CNN
F 3 "" H 5050 3950 50  0001 C CNN
F 4 "TPS54561QDPRTQ1" H 5400 3450 50  0001 C CNN "PartNumber"
F 5 "Texas Instruments" H 5400 3450 50  0001 C CNN "Manufacturer"
	1    5400 3450
	1    0    0    -1  
$EndComp
$Comp
L Device:C C?
U 1 1 5C691305
P 4600 4150
AR Path="/5C691305" Ref="C?"  Part="1" 
AR Path="/5C66EB2D/5C691305" Ref="C?"  Part="1" 
AR Path="/5C67E09D/5C691305" Ref="C308"  Part="1" 
F 0 "C308" H 4715 4196 50  0000 L CNN
F 1 "27pF" H 4715 4105 50  0000 L CNN
F 2 "Capacitor_SMD:C_0402_1005Metric" H 4638 4000 50  0001 C CNN
F 3 "~" H 4600 4150 50  0001 C CNN
F 4 "KEMET" H 4600 4150 50  0001 C CNN "Manufacturer"
F 5 "C0402C270J5GACTU" H 4600 4150 50  0001 C CNN "PartNumber"
	1    4600 4150
	1    0    0    -1  
$EndComp
$Comp
L Device:C C?
U 1 1 5C69130C
P 4200 4400
AR Path="/5C69130C" Ref="C?"  Part="1" 
AR Path="/5C66EB2D/5C69130C" Ref="C?"  Part="1" 
AR Path="/5C67E09D/5C69130C" Ref="C307"  Part="1" 
F 0 "C307" H 4315 4446 50  0000 L CNN
F 1 "4.7nF" H 4315 4355 50  0000 L CNN
F 2 "Capacitor_SMD:C_0402_1005Metric" H 4238 4250 50  0001 C CNN
F 3 "~" H 4200 4400 50  0001 C CNN
F 4 "Murata Electronics North America" H 4200 4400 50  0001 C CNN "Manufacturer"
F 5 "GCM155R71H472KA37D" H 4200 4400 50  0001 C CNN "PartNumber"
	1    4200 4400
	1    0    0    -1  
$EndComp
$Comp
L Device:R R?
U 1 1 5C691313
P 4200 4050
AR Path="/5C691313" Ref="R?"  Part="1" 
AR Path="/5C66EB2D/5C691313" Ref="R?"  Part="1" 
AR Path="/5C67E09D/5C691313" Ref="R306"  Part="1" 
F 0 "R306" H 4270 4096 50  0000 L CNN
F 1 "29.4k" H 4270 4005 50  0000 L CNN
F 2 "Resistor_SMD:R_0402_1005Metric" V 4130 4050 50  0001 C CNN
F 3 "~" H 4200 4050 50  0001 C CNN
F 4 "Stackpole Electronics Inc" H 4200 4050 50  0001 C CNN "Manufacturer"
F 5 "RMCF0402FT29K4" H 4200 4050 50  0001 C CNN "PartNumber"
	1    4200 4050
	1    0    0    -1  
$EndComp
Wire Wire Line
	4200 3900 4200 3800
Wire Wire Line
	4200 3800 4600 3800
Wire Wire Line
	4600 4000 4600 3800
Connection ~ 4600 3800
Wire Wire Line
	4600 3800 4900 3800
Wire Wire Line
	4200 4200 4200 4250
$Comp
L Device:C C?
U 1 1 5C691320
P 3800 4050
AR Path="/5C691320" Ref="C?"  Part="1" 
AR Path="/5C66EB2D/5C691320" Ref="C?"  Part="1" 
AR Path="/5C67E09D/5C691320" Ref="C306"  Part="1" 
F 0 "C306" H 3915 4096 50  0000 L CNN
F 1 "2.7nF" H 3915 4005 50  0000 L CNN
F 2 "Capacitor_SMD:C_0402_1005Metric" H 3838 3900 50  0001 C CNN
F 3 "~" H 3800 4050 50  0001 C CNN
F 4 "CL05B272KB5NNNC" H 3800 4050 50  0001 C CNN "PartNumber"
F 5 "Samsung Electro-Mechanics" H 3800 4050 50  0001 C CNN "Manufacturer"
	1    3800 4050
	1    0    0    -1  
$EndComp
Wire Wire Line
	3800 3900 3800 3600
Wire Wire Line
	3800 3600 4900 3600
$Comp
L Device:R R?
U 1 1 5C691329
P 3350 4050
AR Path="/5C691329" Ref="R?"  Part="1" 
AR Path="/5C66EB2D/5C691329" Ref="R?"  Part="1" 
AR Path="/5C67E09D/5C691329" Ref="R305"  Part="1" 
F 0 "R305" H 3420 4096 50  0000 L CNN
F 1 "243k" H 3420 4005 50  0000 L CNN
F 2 "Resistor_SMD:R_0402_1005Metric" V 3280 4050 50  0001 C CNN
F 3 "~" H 3350 4050 50  0001 C CNN
F 4 "Stackpole Electronics Inc" H 3350 4050 50  0001 C CNN "Manufacturer"
F 5 "RMCF0402FT243K" H 3350 4050 50  0001 C CNN "PartNumber"
	1    3350 4050
	1    0    0    -1  
$EndComp
Wire Wire Line
	3350 3900 3350 3500
Wire Wire Line
	3350 3500 4900 3500
$Comp
L Device:R R?
U 1 1 5C691332
P 3050 3100
AR Path="/5C691332" Ref="R?"  Part="1" 
AR Path="/5C66EB2D/5C691332" Ref="R?"  Part="1" 
AR Path="/5C67E09D/5C691332" Ref="R303"  Part="1" 
F 0 "R303" H 3120 3146 50  0000 L CNN
F 1 "4.42M" H 3120 3055 50  0000 L CNN
F 2 "Resistor_SMD:R_0402_1005Metric" V 2980 3100 50  0001 C CNN
F 3 "~" H 3050 3100 50  0001 C CNN
F 4 "Stackpole Electronics Inc" H 3050 3100 50  0001 C CNN "Manufacturer"
F 5 "RMCF0402FT4M42" H 3050 3100 50  0001 C CNN "PartNumber"
	1    3050 3100
	1    0    0    -1  
$EndComp
$Comp
L Device:R R?
U 1 1 5C691339
P 3050 3700
AR Path="/5C691339" Ref="R?"  Part="1" 
AR Path="/5C66EB2D/5C691339" Ref="R?"  Part="1" 
AR Path="/5C67E09D/5C691339" Ref="R304"  Part="1" 
F 0 "R304" H 3120 3746 50  0000 L CNN
F 1 "121k" H 3120 3655 50  0000 L CNN
F 2 "Resistor_SMD:R_0402_1005Metric" V 2980 3700 50  0001 C CNN
F 3 "~" H 3050 3700 50  0001 C CNN
F 4 "3000-0000000404" H 3050 3700 50  0001 C CNN "PartSpecification"
	1    3050 3700
	1    0    0    -1  
$EndComp
Wire Wire Line
	3050 3550 3050 3300
Wire Wire Line
	4900 3300 3050 3300
Connection ~ 3050 3300
Wire Wire Line
	3050 3300 3050 3250
Wire Wire Line
	4900 3100 4350 3100
Wire Wire Line
	4350 3100 4350 2450
$Comp
L power:GND #PWR?
U 1 1 5C691349
P 4600 4800
AR Path="/5C691349" Ref="#PWR?"  Part="1" 
AR Path="/5C66EB2D/5C691349" Ref="#PWR?"  Part="1" 
AR Path="/5C67E09D/5C691349" Ref="#PWR?"  Part="1" 
F 0 "#PWR?" H 4600 4550 50  0001 C CNN
F 1 "GND" H 4605 4627 50  0000 C CNN
F 2 "" H 4600 4800 50  0001 C CNN
F 3 "" H 4600 4800 50  0001 C CNN
	1    4600 4800
	1    0    0    -1  
$EndComp
Wire Wire Line
	4600 4800 4600 4700
Wire Wire Line
	4200 4550 4200 4700
Wire Wire Line
	4200 4700 4600 4700
Connection ~ 4600 4700
Wire Wire Line
	4600 4700 4600 4300
Wire Wire Line
	3800 4200 3800 4700
Wire Wire Line
	3800 4700 4200 4700
Connection ~ 4200 4700
Wire Wire Line
	3350 4200 3350 4700
Wire Wire Line
	3350 4700 3800 4700
Connection ~ 3800 4700
Wire Wire Line
	3050 3850 3050 4700
Wire Wire Line
	3050 4700 3350 4700
Connection ~ 3350 4700
$Comp
L Device:C C?
U 1 1 5C69135F
P 1050 2800
AR Path="/5C69135F" Ref="C?"  Part="1" 
AR Path="/5C66EB2D/5C69135F" Ref="C?"  Part="1" 
AR Path="/5C67E09D/5C69135F" Ref="C302"  Part="1" 
F 0 "C302" H 1165 2846 50  0000 L CNN
F 1 "2.2uF" H 1165 2755 50  0000 L CNN
F 2 "Capacitor_SMD:C_1206_3216Metric" H 1088 2650 50  0001 C CNN
F 3 "~" H 1050 2800 50  0001 C CNN
F 4 "TDK" H 1050 2800 50  0001 C CNN "Manufacturer"
F 5 "CGA5L3X7S2A225M160AB" H 1050 2800 50  0001 C CNN "PartNumber"
	1    1050 2800
	1    0    0    -1  
$EndComp
Wire Wire Line
	2300 2450 2300 2650
Wire Wire Line
	2300 2950 2300 3200
Wire Wire Line
	2300 3200 1850 3200
Wire Wire Line
	1650 3200 1650 3300
Wire Wire Line
	1850 3200 1850 2950
Connection ~ 1850 3200
Wire Wire Line
	1850 3200 1650 3200
Wire Wire Line
	2300 2450 1850 2450
Wire Wire Line
	1850 2450 1850 2650
Connection ~ 2300 2450
Wire Wire Line
	1450 2650 1450 2450
Wire Wire Line
	1450 2450 1850 2450
Connection ~ 1850 2450
Wire Wire Line
	1050 2650 1050 2450
Wire Wire Line
	1050 2450 1450 2450
Connection ~ 1450 2450
Wire Wire Line
	1450 2950 1450 3200
Wire Wire Line
	1450 3200 1650 3200
Connection ~ 1650 3200
Wire Wire Line
	1050 2950 1050 3200
Wire Wire Line
	1050 3200 1450 3200
Connection ~ 1450 3200
$Comp
L power:GND #PWR?
U 1 1 5C69137D
P 1650 3300
AR Path="/5C69137D" Ref="#PWR?"  Part="1" 
AR Path="/5C66EB2D/5C69137D" Ref="#PWR?"  Part="1" 
AR Path="/5C67E09D/5C69137D" Ref="#PWR?"  Part="1" 
F 0 "#PWR?" H 1650 3050 50  0001 C CNN
F 1 "GND" H 1655 3127 50  0000 C CNN
F 2 "" H 1650 3300 50  0001 C CNN
F 3 "" H 1650 3300 50  0001 C CNN
	1    1650 3300
	1    0    0    -1  
$EndComp
$Comp
L power:VDD #PWR?
U 1 1 5C691383
P 1450 2200
AR Path="/5C691383" Ref="#PWR?"  Part="1" 
AR Path="/5C66EB2D/5C691383" Ref="#PWR?"  Part="1" 
AR Path="/5C67E09D/5C691383" Ref="#PWR?"  Part="1" 
F 0 "#PWR?" H 1450 2050 50  0001 C CNN
F 1 "VDD" H 1467 2373 50  0000 C CNN
F 2 "" H 1450 2200 50  0001 C CNN
F 3 "" H 1450 2200 50  0001 C CNN
	1    1450 2200
	1    0    0    -1  
$EndComp
Wire Wire Line
	1450 2200 1450 2450
$Comp
L Device:C C?
U 1 1 5C69138C
P 1450 2800
AR Path="/5C69138C" Ref="C?"  Part="1" 
AR Path="/5C66EB2D/5C69138C" Ref="C?"  Part="1" 
AR Path="/5C67E09D/5C69138C" Ref="C303"  Part="1" 
F 0 "C303" H 1565 2846 50  0000 L CNN
F 1 "2.2uF" H 1565 2755 50  0000 L CNN
F 2 "Capacitor_SMD:C_1206_3216Metric" H 1488 2650 50  0001 C CNN
F 3 "~" H 1450 2800 50  0001 C CNN
F 4 "TDK" H 1450 2800 50  0001 C CNN "Manufacturer"
F 5 "CGA5L3X7S2A225M160AB" H 1450 2800 50  0001 C CNN "PartNumber"
	1    1450 2800
	1    0    0    -1  
$EndComp
$Comp
L Device:C C?
U 1 1 5C691395
P 1850 2800
AR Path="/5C691395" Ref="C?"  Part="1" 
AR Path="/5C66EB2D/5C691395" Ref="C?"  Part="1" 
AR Path="/5C67E09D/5C691395" Ref="C304"  Part="1" 
F 0 "C304" H 1965 2846 50  0000 L CNN
F 1 "2.2uF" H 1965 2755 50  0000 L CNN
F 2 "Capacitor_SMD:C_1206_3216Metric" H 1888 2650 50  0001 C CNN
F 3 "~" H 1850 2800 50  0001 C CNN
F 4 "TDK" H 1850 2800 50  0001 C CNN "Manufacturer"
F 5 "CGA5L3X7S2A225M160AB" H 1850 2800 50  0001 C CNN "PartNumber"
	1    1850 2800
	1    0    0    -1  
$EndComp
$Comp
L Device:C C?
U 1 1 5C69139E
P 2300 2800
AR Path="/5C69139E" Ref="C?"  Part="1" 
AR Path="/5C66EB2D/5C69139E" Ref="C?"  Part="1" 
AR Path="/5C67E09D/5C69139E" Ref="C305"  Part="1" 
F 0 "C305" H 2415 2846 50  0000 L CNN
F 1 "2.2uF" H 2415 2755 50  0000 L CNN
F 2 "Capacitor_SMD:C_1206_3216Metric" H 2338 2650 50  0001 C CNN
F 3 "~" H 2300 2800 50  0001 C CNN
F 4 "TDK" H 2300 2800 50  0001 C CNN "Manufacturer"
F 5 "CGA5L3X7S2A225M160AB" H 2300 2800 50  0001 C CNN "PartNumber"
	1    2300 2800
	1    0    0    -1  
$EndComp
$Comp
L Device:C C?
U 1 1 5C6913A5
P 6250 3300
AR Path="/5C6913A5" Ref="C?"  Part="1" 
AR Path="/5C66EB2D/5C6913A5" Ref="C?"  Part="1" 
AR Path="/5C67E09D/5C6913A5" Ref="C309"  Part="1" 
F 0 "C309" V 5998 3300 50  0000 C CNN
F 1 "0.1uF" V 6089 3300 50  0000 C CNN
F 2 "Capacitor_SMD:C_0402_1005Metric" H 6288 3150 50  0001 C CNN
F 3 "~" H 6250 3300 50  0001 C CNN
F 4 "CL05F104ZO5NNNC" V 6250 3300 50  0001 C CNN "PartNumber"
F 5 "Samsung Electro-Mechanics" V 6250 3300 50  0001 C CNN "Manufacturer"
	1    6250 3300
	0    1    1    0   
$EndComp
Wire Wire Line
	6100 3300 5900 3300
$Comp
L Device:R R?
U 1 1 5C6913AD
P 6100 2650
AR Path="/5C6913AD" Ref="R?"  Part="1" 
AR Path="/5C66EB2D/5C6913AD" Ref="R?"  Part="1" 
AR Path="/5C67E09D/5C6913AD" Ref="R307"  Part="1" 
F 0 "R307" H 6170 2696 50  0000 L CNN
F 1 "1k" H 6170 2605 50  0000 L CNN
F 2 "Resistor_SMD:R_0402_1005Metric" V 6030 2650 50  0001 C CNN
F 3 "~" H 6100 2650 50  0001 C CNN
F 4 "3000-0000000156" H 6100 2650 50  0001 C CNN "PartSpecification"
	1    6100 2650
	1    0    0    -1  
$EndComp
Wire Wire Line
	6100 2800 6100 2950
Wire Wire Line
	6100 3100 5900 3100
Wire Wire Line
	6100 2500 6100 2300
Wire Wire Line
	5900 3500 6650 3500
Wire Wire Line
	6650 3500 6650 3300
Wire Wire Line
	6650 3300 6400 3300
$Comp
L power:GND #PWR?
U 1 1 5C6913BA
P 6100 4150
AR Path="/5C6913BA" Ref="#PWR?"  Part="1" 
AR Path="/5C66EB2D/5C6913BA" Ref="#PWR?"  Part="1" 
AR Path="/5C67E09D/5C6913BA" Ref="#PWR?"  Part="1" 
F 0 "#PWR?" H 6100 3900 50  0001 C CNN
F 1 "GND" H 6105 3977 50  0000 C CNN
F 2 "" H 6100 4150 50  0001 C CNN
F 3 "" H 6100 4150 50  0001 C CNN
	1    6100 4150
	1    0    0    -1  
$EndComp
Wire Wire Line
	6100 4150 6100 4000
Wire Wire Line
	6100 4000 5900 4000
Wire Wire Line
	5900 3900 6100 3900
Wire Wire Line
	6100 3900 6100 4000
Connection ~ 6100 4000
$Comp
L Device:D_Schottky_AAK D?
U 1 1 5C6913C7
P 6950 3550
AR Path="/5C6913C7" Ref="D?"  Part="1" 
AR Path="/5C66EB2D/5C6913C7" Ref="D?"  Part="1" 
AR Path="/5C67E09D/5C6913C7" Ref="D301"  Part="1" 
F 0 "D301" V 6929 3691 50  0000 L CNN
F 1 "D_Schottky_AAK" V 7020 3691 50  0000 L CNN
F 2 "Package_TO_SOT_SMD:TO-277B" H 6950 3550 50  0001 C CNN
F 3 "~" H 6950 3550 50  0001 C CNN
F 4 "ON Semiconductor" V 6950 3550 50  0001 C CNN "Manufacturer"
F 5 "FSV8100V" V 6950 3550 50  0001 C CNN "PartNumber"
	1    6950 3550
	0    1    1    0   
$EndComp
$Comp
L power:GND #PWR?
U 1 1 5C6913CE
P 6950 3950
AR Path="/5C6913CE" Ref="#PWR?"  Part="1" 
AR Path="/5C66EB2D/5C6913CE" Ref="#PWR?"  Part="1" 
AR Path="/5C67E09D/5C6913CE" Ref="#PWR?"  Part="1" 
F 0 "#PWR?" H 6950 3700 50  0001 C CNN
F 1 "GND" H 6955 3777 50  0000 C CNN
F 2 "" H 6950 3950 50  0001 C CNN
F 3 "" H 6950 3950 50  0001 C CNN
	1    6950 3950
	1    0    0    -1  
$EndComp
Wire Wire Line
	6950 3950 6950 3850
Wire Wire Line
	6950 3850 7050 3850
Wire Wire Line
	7050 3850 7050 3750
Connection ~ 6950 3850
Wire Wire Line
	6950 3850 6950 3750
Wire Wire Line
	6950 3400 6950 3300
Wire Wire Line
	6950 3300 6650 3300
Connection ~ 6650 3300
$Comp
L Device:L L?
U 1 1 5C6913DE
P 7300 3300
AR Path="/5C6913DE" Ref="L?"  Part="1" 
AR Path="/5C66EB2D/5C6913DE" Ref="L?"  Part="1" 
AR Path="/5C67E09D/5C6913DE" Ref="L301"  Part="1" 
F 0 "L301" V 7490 3300 50  0000 C CNN
F 1 "22uH" V 7399 3300 50  0000 C CNN
F 2 "Inductor_SMD:L_Bourns_SRP1245A" H 7300 3300 50  0001 C CNN
F 3 "~" H 7300 3300 50  0001 C CNN
F 4 "Bourns" V 7300 3300 50  0001 C CNN "Manufacturer"
F 5 "SRP1265A-220M" V 7300 3300 50  0001 C CNN "PartNumber"
	1    7300 3300
	0    -1   -1   0   
$EndComp
Wire Wire Line
	7150 3300 6950 3300
Connection ~ 6950 3300
$Comp
L Device:C C?
U 1 1 5C6913EA
P 8100 3650
AR Path="/5C6913EA" Ref="C?"  Part="1" 
AR Path="/5C66EB2D/5C6913EA" Ref="C?"  Part="1" 
AR Path="/5C67E09D/5C6913EA" Ref="C310"  Part="1" 
F 0 "C310" H 8215 3696 50  0000 L CNN
F 1 "22uF" H 8215 3605 50  0000 L CNN
F 2 "Capacitor_SMD:C_0805_2012Metric" H 8138 3500 50  0001 C CNN
F 3 "~" H 8100 3650 50  0001 C CNN
F 4 "Murata" H 8100 3650 50  0001 C CNN "Manufacturer"
F 5 "GRM21BR61E226ME44K" H 8100 3650 50  0001 C CNN "PartNumber"
F 6 "2m" H 8100 3650 50  0001 C CNN "ESR"
	1    8100 3650
	1    0    0    -1  
$EndComp
$Comp
L Device:C C?
U 1 1 5C6913F3
P 600 2800
AR Path="/5C6913F3" Ref="C?"  Part="1" 
AR Path="/5C66EB2D/5C6913F3" Ref="C?"  Part="1" 
AR Path="/5C67E09D/5C6913F3" Ref="C301"  Part="1" 
F 0 "C301" H 715 2846 50  0000 L CNN
F 1 "2.2uF" H 715 2755 50  0000 L CNN
F 2 "Capacitor_SMD:C_1206_3216Metric" H 638 2650 50  0001 C CNN
F 3 "~" H 600 2800 50  0001 C CNN
F 4 "TDK" H 600 2800 50  0001 C CNN "Manufacturer"
F 5 "CGA5L3X7S2A225M160AB" H 600 2800 50  0001 C CNN "PartNumber"
	1    600  2800
	1    0    0    -1  
$EndComp
Wire Wire Line
	600  2950 600  3200
Wire Wire Line
	600  3200 1050 3200
Connection ~ 1050 3200
Wire Wire Line
	600  2650 600  2450
Wire Wire Line
	600  2450 1050 2450
Connection ~ 1050 2450
Wire Wire Line
	8100 3500 8100 3300
Wire Wire Line
	8100 3300 7650 3300
$Comp
L power:GND #PWR?
U 1 1 5C691402
P 8100 3950
AR Path="/5C691402" Ref="#PWR?"  Part="1" 
AR Path="/5C66EB2D/5C691402" Ref="#PWR?"  Part="1" 
AR Path="/5C67E09D/5C691402" Ref="#PWR?"  Part="1" 
F 0 "#PWR?" H 8100 3700 50  0001 C CNN
F 1 "GND" H 8105 3777 50  0000 C CNN
F 2 "" H 8100 3950 50  0001 C CNN
F 3 "" H 8100 3950 50  0001 C CNN
	1    8100 3950
	1    0    0    -1  
$EndComp
$Comp
L power:GND #PWR?
U 1 1 5C691408
P 8500 3950
AR Path="/5C691408" Ref="#PWR?"  Part="1" 
AR Path="/5C66EB2D/5C691408" Ref="#PWR?"  Part="1" 
AR Path="/5C67E09D/5C691408" Ref="#PWR?"  Part="1" 
F 0 "#PWR?" H 8500 3700 50  0001 C CNN
F 1 "GND" H 8505 3777 50  0000 C CNN
F 2 "" H 8500 3950 50  0001 C CNN
F 3 "" H 8500 3950 50  0001 C CNN
	1    8500 3950
	1    0    0    -1  
$EndComp
$Comp
L power:GND #PWR?
U 1 1 5C69140E
P 8900 3950
AR Path="/5C69140E" Ref="#PWR?"  Part="1" 
AR Path="/5C66EB2D/5C69140E" Ref="#PWR?"  Part="1" 
AR Path="/5C67E09D/5C69140E" Ref="#PWR?"  Part="1" 
F 0 "#PWR?" H 8900 3700 50  0001 C CNN
F 1 "GND" H 8905 3777 50  0000 C CNN
F 2 "" H 8900 3950 50  0001 C CNN
F 3 "" H 8900 3950 50  0001 C CNN
	1    8900 3950
	1    0    0    -1  
$EndComp
Wire Wire Line
	8100 3950 8100 3800
Wire Wire Line
	8500 3800 8500 3950
Wire Wire Line
	8900 3950 8900 3800
Connection ~ 8100 3300
Wire Wire Line
	8500 3300 8500 3500
Connection ~ 8500 3300
Wire Wire Line
	8500 3300 8100 3300
Wire Wire Line
	8900 3300 8900 3500
Wire Wire Line
	8900 3300 8500 3300
Text Notes 8500 3150 0    50   ~ 0
C=30 uF
$Comp
L Device:R R?
U 1 1 5C691428
P 7650 3600
AR Path="/5C691428" Ref="R?"  Part="1" 
AR Path="/5C66EB2D/5C691428" Ref="R?"  Part="1" 
AR Path="/5C67E09D/5C691428" Ref="R308"  Part="1" 
F 0 "R308" H 7720 3646 50  0000 L CNN
F 1 "232k" H 7720 3555 50  0000 L CNN
F 2 "Resistor_SMD:R_0402_1005Metric" V 7580 3600 50  0001 C CNN
F 3 "~" H 7650 3600 50  0001 C CNN
F 4 "Stackpole Electronics Inc" H 7650 3600 50  0001 C CNN "Manufacturer"
F 5 "RMCF0402FT232K" H 7650 3600 50  0001 C CNN "PartNumber"
	1    7650 3600
	1    0    0    -1  
$EndComp
Wire Wire Line
	7650 3450 7650 3300
Connection ~ 7650 3300
Wire Wire Line
	7650 3300 7450 3300
$Comp
L Device:R R?
U 1 1 5C691432
P 7650 4450
AR Path="/5C691432" Ref="R?"  Part="1" 
AR Path="/5C66EB2D/5C691432" Ref="R?"  Part="1" 
AR Path="/5C67E09D/5C691432" Ref="R309"  Part="1" 
F 0 "R309" H 7720 4496 50  0000 L CNN
F 1 "10k" H 7720 4405 50  0000 L CNN
F 2 "Resistor_SMD:R_0402_1005Metric" V 7580 4450 50  0001 C CNN
F 3 "~" H 7650 4450 50  0001 C CNN
F 4 "Stackpole Electronics Inc" H 7650 4450 50  0001 C CNN "Manufacturer"
F 5 "RMCF0402FT10K0" H 7650 4450 50  0001 C CNN "PartNumber"
	1    7650 4450
	1    0    0    -1  
$EndComp
Wire Wire Line
	7650 4300 7650 4200
$Comp
L power:GND #PWR?
U 1 1 5C69143A
P 7650 4750
AR Path="/5C69143A" Ref="#PWR?"  Part="1" 
AR Path="/5C66EB2D/5C69143A" Ref="#PWR?"  Part="1" 
AR Path="/5C67E09D/5C69143A" Ref="#PWR?"  Part="1" 
F 0 "#PWR?" H 7650 4500 50  0001 C CNN
F 1 "GND" H 7655 4577 50  0000 C CNN
F 2 "" H 7650 4750 50  0001 C CNN
F 3 "" H 7650 4750 50  0001 C CNN
	1    7650 4750
	1    0    0    -1  
$EndComp
Wire Wire Line
	7650 4750 7650 4600
Wire Wire Line
	6350 4200 6350 3700
Wire Wire Line
	5900 3700 6350 3700
Connection ~ 7650 4200
Wire Wire Line
	7650 4200 7650 3750
$Comp
L Device:C C?
U 1 1 5C691459
P 8500 3650
AR Path="/5C691459" Ref="C?"  Part="1" 
AR Path="/5C66EB2D/5C691459" Ref="C?"  Part="1" 
AR Path="/5C67E09D/5C691459" Ref="C311"  Part="1" 
F 0 "C311" H 8615 3696 50  0000 L CNN
F 1 "22uF" H 8615 3605 50  0000 L CNN
F 2 "Capacitor_SMD:C_0805_2012Metric" H 8538 3500 50  0001 C CNN
F 3 "~" H 8500 3650 50  0001 C CNN
F 4 "Murata" H 8500 3650 50  0001 C CNN "Manufacturer"
F 5 "GRM21BR61E226ME44K" H 8500 3650 50  0001 C CNN "PartNumber"
	1    8500 3650
	1    0    0    -1  
$EndComp
$Comp
L Device:C C?
U 1 1 5C691462
P 8900 3650
AR Path="/5C691462" Ref="C?"  Part="1" 
AR Path="/5C66EB2D/5C691462" Ref="C?"  Part="1" 
AR Path="/5C67E09D/5C691462" Ref="C312"  Part="1" 
F 0 "C312" H 9015 3696 50  0000 L CNN
F 1 "22uF" H 9015 3605 50  0000 L CNN
F 2 "Capacitor_SMD:C_0805_2012Metric" H 8938 3500 50  0001 C CNN
F 3 "~" H 8900 3650 50  0001 C CNN
F 4 "Murata" H 8900 3650 50  0001 C CNN "Manufacturer"
F 5 "GRM21BR61E226ME44K" H 8900 3650 50  0001 C CNN "PartNumber"
	1    8900 3650
	1    0    0    -1  
$EndComp
Text Notes 3800 2000 0    50   ~ 0
30V UVLO stop voltage\n45V start voltage
Text Label 3800 3300 0    50   ~ 0
EN_Control
Text Label 3950 3500 0    50   ~ 0
RT_Control
Text Label 4150 3600 0    50   ~ 0
SS_Control
Text Label 4350 3800 0    50   ~ 0
COMP_Control
Text Label 4200 4250 0    50   ~ 0
COMP_RC_Control
Text Label 7250 4200 0    50   ~ 0
FB_Control
Text Label 6550 3300 0    50   ~ 0
SW_Control
Text Label 6100 2950 0    50   ~ 0
PWRGD_Control
Text Label 6000 3300 0    50   ~ 0
BOOT_Control
Text Label 7950 3300 0    50   ~ 0
VOUT_Control
Text HLabel 6750 2950 2    100  Output ~ 0
PWRGD
Wire Wire Line
	6750 2950 6100 2950
Connection ~ 6100 2950
Wire Wire Line
	6100 2950 6100 3100
Wire Wire Line
	2300 2450 3050 2450
$Comp
L POWDER_Power:EL3H7-G U302
U 1 1 5C6942F3
P 2850 2700
F 0 "U302" H 2850 2975 50  0000 C CNN
F 1 "EL3H7-G" H 2850 2884 50  0000 C CNN
F 2 "POWDER_Power:EL3H7-G" H 2850 2400 50  0001 C CNN
F 3 "" H 2850 2700 50  0001 C CNN
F 4 "Everlight Electronics Co Ltd" H 2850 2700 50  0001 C CNN "Manufacturer"
F 5 "EL3H7(B)(TA)-VG" H 2850 2700 50  0001 C CNN "PartNumber"
	1    2850 2700
	1    0    0    -1  
$EndComp
Wire Wire Line
	7650 4200 6350 4200
Wire Wire Line
	3050 2750 3050 2950
Wire Wire Line
	3050 2650 3050 2450
Connection ~ 3050 2450
Wire Wire Line
	3050 2450 4350 2450
$Comp
L Device:R R?
U 1 1 5C69A657
P 2150 3600
AR Path="/5C69A657" Ref="R?"  Part="1" 
AR Path="/5C66EB2D/5C69A657" Ref="R?"  Part="1" 
AR Path="/5C67E09D/5C69A657" Ref="R302"  Part="1" 
F 0 "R302" V 1943 3600 50  0000 C CNN
F 1 "4k" V 2034 3600 50  0000 C CNN
F 2 "Resistor_SMD:R_0402_1005Metric" V 2080 3600 50  0001 C CNN
F 3 "~" H 2150 3600 50  0001 C CNN
F 4 "RMCF0402FT200R" V 2150 3600 50  0001 C CNN "PartNumber"
F 5 "Stackpole Electronics Inc" V 2150 3600 50  0001 C CNN "Manufacturer"
	1    2150 3600
	0    1    1    0   
$EndComp
Wire Wire Line
	2650 2650 2500 2650
Wire Wire Line
	2500 2650 2500 3600
Wire Wire Line
	2500 3600 2300 3600
Wire Wire Line
	2000 3600 1800 3600
$Comp
L power:GND #PWR?
U 1 1 5C69F000
P 2650 3300
AR Path="/5C69F000" Ref="#PWR?"  Part="1" 
AR Path="/5C66EB2D/5C69F000" Ref="#PWR?"  Part="1" 
AR Path="/5C67E09D/5C69F000" Ref="#PWR?"  Part="1" 
F 0 "#PWR?" H 2650 3050 50  0001 C CNN
F 1 "GND" H 2655 3127 50  0000 C CNN
F 2 "" H 2650 3300 50  0001 C CNN
F 3 "" H 2650 3300 50  0001 C CNN
	1    2650 3300
	1    0    0    -1  
$EndComp
Wire Wire Line
	2650 3300 2650 2750
Text HLabel 1800 3600 0    100  Input ~ 0
START
$Comp
L POWDER_Power:EL3H7-G U301
U 1 1 5C6A944F
P 2350 4150
F 0 "U301" H 2350 4425 50  0000 C CNN
F 1 "EL3H7-G" H 2350 4334 50  0000 C CNN
F 2 "POWDER_Power:EL3H7-G" H 2350 3850 50  0001 C CNN
F 3 "" H 2350 4150 50  0001 C CNN
F 4 "EL3H7(B)(TA)-VG" H 2350 4150 50  0001 C CNN "PartNumber"
F 5 "Everlight Electronics Co Ltd" H 2350 4150 50  0001 C CNN "Manufacturer"
	1    2350 4150
	1    0    0    -1  
$EndComp
Wire Wire Line
	2550 4100 2900 4100
Wire Wire Line
	2900 4100 2900 3300
Wire Wire Line
	2900 3300 3050 3300
Wire Wire Line
	2550 4200 2900 4200
Wire Wire Line
	2900 4200 2900 4700
Wire Wire Line
	2900 4700 3050 4700
Connection ~ 3050 4700
$Comp
L Device:R R?
U 1 1 5C6AE8D1
P 1850 4100
AR Path="/5C6AE8D1" Ref="R?"  Part="1" 
AR Path="/5C66EB2D/5C6AE8D1" Ref="R?"  Part="1" 
AR Path="/5C67E09D/5C6AE8D1" Ref="R301"  Part="1" 
F 0 "R301" V 1643 4100 50  0000 C CNN
F 1 "2.0k" V 1734 4100 50  0000 C CNN
F 2 "Resistor_SMD:R_0402_1005Metric" V 1780 4100 50  0001 C CNN
F 3 "~" H 1850 4100 50  0001 C CNN
F 4 "RMCF0402FT2K00" V 1850 4100 50  0001 C CNN "PartNumber"
F 5 "Stackpole Electronics Inc" V 1850 4100 50  0001 C CNN "Manufacturer"
	1    1850 4100
	0    1    1    0   
$EndComp
$Comp
L power:GND #PWR?
U 1 1 5C6AE941
P 2000 4800
AR Path="/5C6AE941" Ref="#PWR?"  Part="1" 
AR Path="/5C66EB2D/5C6AE941" Ref="#PWR?"  Part="1" 
AR Path="/5C67E09D/5C6AE941" Ref="#PWR?"  Part="1" 
F 0 "#PWR?" H 2000 4550 50  0001 C CNN
F 1 "GND" H 2005 4627 50  0000 C CNN
F 2 "" H 2000 4800 50  0001 C CNN
F 3 "" H 2000 4800 50  0001 C CNN
	1    2000 4800
	1    0    0    -1  
$EndComp
Wire Wire Line
	2000 4800 2000 4200
Wire Wire Line
	2000 4200 2150 4200
Wire Wire Line
	2000 4100 2150 4100
Wire Wire Line
	1700 4100 1550 4100
Text HLabel 1550 4100 0    100  Input ~ 0
DISABLE
$Comp
L power:+5V #PWR?
U 1 1 5C6BCB7C
P 6100 2300
F 0 "#PWR?" H 6100 2150 50  0001 C CNN
F 1 "+5V" H 6115 2473 50  0000 C CNN
F 2 "" H 6100 2300 50  0001 C CNN
F 3 "" H 6100 2300 50  0001 C CNN
	1    6100 2300
	1    0    0    -1  
$EndComp
$Comp
L power:GND #PWR?
U 1 1 5C6C60D0
P 9350 3950
AR Path="/5C6C60D0" Ref="#PWR?"  Part="1" 
AR Path="/5C66EB2D/5C6C60D0" Ref="#PWR?"  Part="1" 
AR Path="/5C67E09D/5C6C60D0" Ref="#PWR?"  Part="1" 
F 0 "#PWR?" H 9350 3700 50  0001 C CNN
F 1 "GND" H 9355 3777 50  0000 C CNN
F 2 "" H 9350 3950 50  0001 C CNN
F 3 "" H 9350 3950 50  0001 C CNN
	1    9350 3950
	1    0    0    -1  
$EndComp
Wire Wire Line
	9350 3800 9350 3950
Wire Wire Line
	9350 3500 9350 3300
Wire Wire Line
	9350 3300 8900 3300
$Comp
L power:GND #PWR?
U 1 1 5C6C60D9
P 9850 3950
AR Path="/5C6C60D9" Ref="#PWR?"  Part="1" 
AR Path="/5C66EB2D/5C6C60D9" Ref="#PWR?"  Part="1" 
AR Path="/5C67E09D/5C6C60D9" Ref="#PWR?"  Part="1" 
F 0 "#PWR?" H 9850 3700 50  0001 C CNN
F 1 "GND" H 9855 3777 50  0000 C CNN
F 2 "" H 9850 3950 50  0001 C CNN
F 3 "" H 9850 3950 50  0001 C CNN
	1    9850 3950
	1    0    0    -1  
$EndComp
$Comp
L Connector:Screw_Terminal_01x02 J?
U 1 1 5C6C60DF
P 10600 3300
AR Path="/5C6C60DF" Ref="J?"  Part="1" 
AR Path="/5C66EB2D/5C6C60DF" Ref="J?"  Part="1" 
AR Path="/5C67E09D/5C6C60DF" Ref="J301"  Part="1" 
F 0 "J301" H 10680 3292 50  0000 L CNN
F 1 "Screw_Terminal_01x02" H 10680 3201 50  0000 L CNN
F 2 "TerminalBlock:TerminalBlock_bornier-2_P5.08mm" H 10600 3300 50  0001 C CNN
F 3 "~" H 10600 3300 50  0001 C CNN
F 4 "0398800302" H 10600 3300 50  0001 C CNN "PartNumber"
F 5 "Molex" H 10600 3300 50  0001 C CNN "Manufacturer"
	1    10600 3300
	1    0    0    -1  
$EndComp
Wire Wire Line
	9850 3400 9850 3950
$Comp
L Device:C C?
U 1 1 5C6C60EA
P 9350 3650
AR Path="/5C6C60EA" Ref="C?"  Part="1" 
AR Path="/5C66EB2D/5C6C60EA" Ref="C?"  Part="1" 
AR Path="/5C67E09D/5C6C60EA" Ref="C313"  Part="1" 
F 0 "C313" H 9465 3696 50  0000 L CNN
F 1 "22uF" H 9465 3605 50  0000 L CNN
F 2 "Capacitor_SMD:C_0805_2012Metric" H 9388 3500 50  0001 C CNN
F 3 "~" H 9350 3650 50  0001 C CNN
F 4 "Murata" H 9350 3650 50  0001 C CNN "Manufacturer"
F 5 "GRM21BR61E226ME44K" H 9350 3650 50  0001 C CNN "PartNumber"
	1    9350 3650
	1    0    0    -1  
$EndComp
$Comp
L Device:R R?
U 1 1 5C6C60F1
P 9650 3300
AR Path="/5C6C60F1" Ref="R?"  Part="1" 
AR Path="/5C66EB2D/5C6C60F1" Ref="R?"  Part="1" 
AR Path="/5C67E09D/5C6C60F1" Ref="R310"  Part="1" 
F 0 "R310" V 9443 3300 50  0000 C CNN
F 1 "5m" V 9534 3300 50  0000 C CNN
F 2 "Resistor_SMD:R_0612_1632Metric" V 9580 3300 50  0001 C CNN
F 3 "~" H 9650 3300 50  0001 C CNN
F 4 "FCSL32R005FER" V 9650 3300 50  0001 C CNN "PartNumber"
F 5 "Ohmite" V 9650 3300 50  0001 C CNN "Manufacturer"
	1    9650 3300
	0    1    1    0   
$EndComp
Wire Wire Line
	9500 3300 9350 3300
Connection ~ 9350 3300
Wire Wire Line
	9800 3300 9900 3300
Text HLabel 10000 2900 2    100  Output ~ 0
RSM
Text HLabel 10000 2750 2    100  Output ~ 0
RSP
Wire Wire Line
	10000 2900 9900 2900
Wire Wire Line
	9900 2900 9900 3300
Connection ~ 9900 3300
Wire Wire Line
	9900 3300 9950 3300
Wire Wire Line
	10000 2750 9350 2750
Wire Wire Line
	9350 2750 9350 3300
Connection ~ 8900 3300
$Comp
L Device:Fuse F301
U 1 1 5C9297F0
P 10100 3300
F 0 "F301" V 9903 3300 50  0000 C CNN
F 1 "Fuse" V 9994 3300 50  0000 C CNN
F 2 "Fuse:Fuseholder_Cylinder-5x20mm_Stelvio-Kontek_PTF78_Horizontal_Open" V 10030 3300 50  0001 C CNN
F 3 "~" H 10100 3300 50  0001 C CNN
	1    10100 3300
	0    1    1    0   
$EndComp
Wire Wire Line
	10250 3300 10400 3300
Wire Wire Line
	9850 3400 10400 3400
Text Label 10350 3300 1    50   ~ 0
EXP1_OUT
$EndSCHEMATC
