(kicad_sch
	(version 20231120)
	(generator "eeschema")
	(generator_version "8.0")
	(uuid "05dbc049-b48b-4bb6-aac4-64240a90f5f1")
	(paper "A4")
	(lib_symbols
		(symbol "000_PreferredParts:C_100nF"
			(pin_numbers hide)
			(pin_names
				(offset 0.254)
			)
			(exclude_from_sim no)
			(in_bom yes)
			(on_board yes)
			(property "Reference" "C"
				(at 0.635 2.54 0)
				(effects
					(font
						(size 1.27 1.27)
					)
					(justify left)
				)
			)
			(property "Value" "C_100nF"
				(at 0.635 -2.54 0)
				(effects
					(font
						(size 1.27 1.27)
					)
					(justify left)
					(hide yes)
				)
			)
			(property "Footprint" "Capacitor_SMD:C_0402_1005Metric"
				(at 0.9652 -3.81 0)
				(effects
					(font
						(size 1.27 1.27)
					)
					(hide yes)
				)
			)
			(property "Datasheet" "~"
				(at 0 0 0)
				(effects
					(font
						(size 1.27 1.27)
					)
					(hide yes)
				)
			)
			(property "Description" "Unpolarized capacitor"
				(at 0 0 0)
				(effects
					(font
						(size 1.27 1.27)
					)
					(hide yes)
				)
			)
			(property "DisplayValue" "100nF"
				(at 3.81 -2.54 0)
				(effects
					(font
						(size 1.27 1.27)
					)
				)
			)
			(property "PartSpecification" "3000-0000000125"
				(at 0 0 0)
				(effects
					(font
						(size 1.27 1.27)
					)
					(hide yes)
				)
			)
			(property "ki_keywords" "cap capacitor"
				(at 0 0 0)
				(effects
					(font
						(size 1.27 1.27)
					)
					(hide yes)
				)
			)
			(property "ki_fp_filters" "C_*"
				(at 0 0 0)
				(effects
					(font
						(size 1.27 1.27)
					)
					(hide yes)
				)
			)
			(symbol "C_100nF_0_1"
				(polyline
					(pts
						(xy -2.032 -0.762) (xy 2.032 -0.762)
					)
					(stroke
						(width 0.508)
						(type default)
					)
					(fill
						(type none)
					)
				)
				(polyline
					(pts
						(xy -2.032 0.762) (xy 2.032 0.762)
					)
					(stroke
						(width 0.508)
						(type default)
					)
					(fill
						(type none)
					)
				)
			)
			(symbol "C_100nF_1_1"
				(pin passive line
					(at 0 3.81 270)
					(length 2.794)
					(name "~"
						(effects
							(font
								(size 1.27 1.27)
							)
						)
					)
					(number "1"
						(effects
							(font
								(size 1.27 1.27)
							)
						)
					)
				)
				(pin passive line
					(at 0 -3.81 90)
					(length 2.794)
					(name "~"
						(effects
							(font
								(size 1.27 1.27)
							)
						)
					)
					(number "2"
						(effects
							(font
								(size 1.27 1.27)
							)
						)
					)
				)
			)
		)
		(symbol "000_PreferredParts:C_10uF_0603"
			(pin_numbers hide)
			(pin_names
				(offset 0.254)
			)
			(exclude_from_sim no)
			(in_bom yes)
			(on_board yes)
			(property "Reference" "C"
				(at 0.635 2.54 0)
				(effects
					(font
						(size 1.27 1.27)
					)
					(justify left)
				)
			)
			(property "Value" "C_10uF_0603"
				(at 0.635 -2.54 0)
				(effects
					(font
						(size 1.27 1.27)
					)
					(justify left)
					(hide yes)
				)
			)
			(property "Footprint" "Capacitor_SMD:C_0603_1608Metric"
				(at 0.9652 -3.81 0)
				(effects
					(font
						(size 1.27 1.27)
					)
					(hide yes)
				)
			)
			(property "Datasheet" "~"
				(at 0 0 0)
				(effects
					(font
						(size 1.27 1.27)
					)
					(hide yes)
				)
			)
			(property "Description" "Unpolarized capacitor"
				(at 0 0 0)
				(effects
					(font
						(size 1.27 1.27)
					)
					(hide yes)
				)
			)
			(property "DisplayValue" "10uF"
				(at 3.81 -2.54 0)
				(effects
					(font
						(size 1.27 1.27)
					)
				)
			)
			(property "DisplayFootprint" "0603"
				(at 3.81 -5.08 0)
				(effects
					(font
						(size 1.27 1.27)
					)
				)
			)
			(property "PartSpecification" "3000-0000000135"
				(at 0 0 0)
				(effects
					(font
						(size 1.27 1.27)
					)
					(hide yes)
				)
			)
			(property "ki_keywords" "cap capacitor"
				(at 0 0 0)
				(effects
					(font
						(size 1.27 1.27)
					)
					(hide yes)
				)
			)
			(property "ki_fp_filters" "C_*"
				(at 0 0 0)
				(effects
					(font
						(size 1.27 1.27)
					)
					(hide yes)
				)
			)
			(symbol "C_10uF_0603_0_1"
				(polyline
					(pts
						(xy -2.032 -0.762) (xy 2.032 -0.762)
					)
					(stroke
						(width 0.508)
						(type default)
					)
					(fill
						(type none)
					)
				)
				(polyline
					(pts
						(xy -2.032 0.762) (xy 2.032 0.762)
					)
					(stroke
						(width 0.508)
						(type default)
					)
					(fill
						(type none)
					)
				)
			)
			(symbol "C_10uF_0603_1_1"
				(pin passive line
					(at 0 3.81 270)
					(length 2.794)
					(name "~"
						(effects
							(font
								(size 1.27 1.27)
							)
						)
					)
					(number "1"
						(effects
							(font
								(size 1.27 1.27)
							)
						)
					)
				)
				(pin passive line
					(at 0 -3.81 90)
					(length 2.794)
					(name "~"
						(effects
							(font
								(size 1.27 1.27)
							)
						)
					)
					(number "2"
						(effects
							(font
								(size 1.27 1.27)
							)
						)
					)
				)
			)
		)
		(symbol "000_PreferredParts:C_10uF_0805"
			(pin_numbers hide)
			(pin_names
				(offset 0.254)
			)
			(exclude_from_sim no)
			(in_bom yes)
			(on_board yes)
			(property "Reference" "C"
				(at 0.635 2.54 0)
				(effects
					(font
						(size 1.27 1.27)
					)
					(justify left)
				)
			)
			(property "Value" "C_10uF_0805"
				(at 0.635 -2.54 0)
				(effects
					(font
						(size 1.27 1.27)
					)
					(justify left)
					(hide yes)
				)
			)
			(property "Footprint" "Capacitor_SMD:C_0805_2012Metric"
				(at 0.9652 -3.81 0)
				(effects
					(font
						(size 1.27 1.27)
					)
					(hide yes)
				)
			)
			(property "Datasheet" "~"
				(at 0 0 0)
				(effects
					(font
						(size 1.27 1.27)
					)
					(hide yes)
				)
			)
			(property "Description" "Unpolarized capacitor"
				(at 0 0 0)
				(effects
					(font
						(size 1.27 1.27)
					)
					(hide yes)
				)
			)
			(property "DisplayValue" "10uF"
				(at 3.81 -2.54 0)
				(effects
					(font
						(size 1.27 1.27)
					)
				)
			)
			(property "DisplayFootprint" "0805"
				(at 3.81 -5.08 0)
				(effects
					(font
						(size 1.27 1.27)
					)
				)
			)
			(property "PartSpecification" "3000-0000000134"
				(at 0 0 0)
				(effects
					(font
						(size 1.27 1.27)
					)
					(hide yes)
				)
			)
			(property "ki_keywords" "cap capacitor"
				(at 0 0 0)
				(effects
					(font
						(size 1.27 1.27)
					)
					(hide yes)
				)
			)
			(property "ki_fp_filters" "C_*"
				(at 0 0 0)
				(effects
					(font
						(size 1.27 1.27)
					)
					(hide yes)
				)
			)
			(symbol "C_10uF_0805_0_1"
				(polyline
					(pts
						(xy -2.032 -0.762) (xy 2.032 -0.762)
					)
					(stroke
						(width 0.508)
						(type default)
					)
					(fill
						(type none)
					)
				)
				(polyline
					(pts
						(xy -2.032 0.762) (xy 2.032 0.762)
					)
					(stroke
						(width 0.508)
						(type default)
					)
					(fill
						(type none)
					)
				)
			)
			(symbol "C_10uF_0805_1_1"
				(pin passive line
					(at 0 3.81 270)
					(length 2.794)
					(name "~"
						(effects
							(font
								(size 1.27 1.27)
							)
						)
					)
					(number "1"
						(effects
							(font
								(size 1.27 1.27)
							)
						)
					)
				)
				(pin passive line
					(at 0 -3.81 90)
					(length 2.794)
					(name "~"
						(effects
							(font
								(size 1.27 1.27)
							)
						)
					)
					(number "2"
						(effects
							(font
								(size 1.27 1.27)
							)
						)
					)
				)
			)
		)
		(symbol "Device:L"
			(pin_numbers hide)
			(pin_names
				(offset 1.016) hide)
			(exclude_from_sim no)
			(in_bom yes)
			(on_board yes)
			(property "Reference" "L"
				(at -1.27 0 90)
				(effects
					(font
						(size 1.27 1.27)
					)
				)
			)
			(property "Value" "L"
				(at 1.905 0 90)
				(effects
					(font
						(size 1.27 1.27)
					)
				)
			)
			(property "Footprint" ""
				(at 0 0 0)
				(effects
					(font
						(size 1.27 1.27)
					)
					(hide yes)
				)
			)
			(property "Datasheet" "~"
				(at 0 0 0)
				(effects
					(font
						(size 1.27 1.27)
					)
					(hide yes)
				)
			)
			(property "Description" "Inductor"
				(at 0 0 0)
				(effects
					(font
						(size 1.27 1.27)
					)
					(hide yes)
				)
			)
			(property "ki_keywords" "inductor choke coil reactor magnetic"
				(at 0 0 0)
				(effects
					(font
						(size 1.27 1.27)
					)
					(hide yes)
				)
			)
			(property "ki_fp_filters" "Choke_* *Coil* Inductor_* L_*"
				(at 0 0 0)
				(effects
					(font
						(size 1.27 1.27)
					)
					(hide yes)
				)
			)
			(symbol "L_0_1"
				(arc
					(start 0 -2.54)
					(mid 0.6323 -1.905)
					(end 0 -1.27)
					(stroke
						(width 0)
						(type default)
					)
					(fill
						(type none)
					)
				)
				(arc
					(start 0 -1.27)
					(mid 0.6323 -0.635)
					(end 0 0)
					(stroke
						(width 0)
						(type default)
					)
					(fill
						(type none)
					)
				)
				(arc
					(start 0 0)
					(mid 0.6323 0.635)
					(end 0 1.27)
					(stroke
						(width 0)
						(type default)
					)
					(fill
						(type none)
					)
				)
				(arc
					(start 0 1.27)
					(mid 0.6323 1.905)
					(end 0 2.54)
					(stroke
						(width 0)
						(type default)
					)
					(fill
						(type none)
					)
				)
			)
			(symbol "L_1_1"
				(pin passive line
					(at 0 3.81 270)
					(length 1.27)
					(name "1"
						(effects
							(font
								(size 1.27 1.27)
							)
						)
					)
					(number "1"
						(effects
							(font
								(size 1.27 1.27)
							)
						)
					)
				)
				(pin passive line
					(at 0 -3.81 90)
					(length 1.27)
					(name "2"
						(effects
							(font
								(size 1.27 1.27)
							)
						)
					)
					(number "2"
						(effects
							(font
								(size 1.27 1.27)
							)
						)
					)
				)
			)
		)
		(symbol "Device:R"
			(pin_numbers hide)
			(pin_names
				(offset 0)
			)
			(exclude_from_sim no)
			(in_bom yes)
			(on_board yes)
			(property "Reference" "R"
				(at 2.032 0 90)
				(effects
					(font
						(size 1.27 1.27)
					)
				)
			)
			(property "Value" "R"
				(at 0 0 90)
				(effects
					(font
						(size 1.27 1.27)
					)
				)
			)
			(property "Footprint" ""
				(at -1.778 0 90)
				(effects
					(font
						(size 1.27 1.27)
					)
					(hide yes)
				)
			)
			(property "Datasheet" "~"
				(at 0 0 0)
				(effects
					(font
						(size 1.27 1.27)
					)
					(hide yes)
				)
			)
			(property "Description" "Resistor"
				(at 0 0 0)
				(effects
					(font
						(size 1.27 1.27)
					)
					(hide yes)
				)
			)
			(property "ki_keywords" "R res resistor"
				(at 0 0 0)
				(effects
					(font
						(size 1.27 1.27)
					)
					(hide yes)
				)
			)
			(property "ki_fp_filters" "R_*"
				(at 0 0 0)
				(effects
					(font
						(size 1.27 1.27)
					)
					(hide yes)
				)
			)
			(symbol "R_0_1"
				(rectangle
					(start -1.016 -2.54)
					(end 1.016 2.54)
					(stroke
						(width 0.254)
						(type default)
					)
					(fill
						(type none)
					)
				)
			)
			(symbol "R_1_1"
				(pin passive line
					(at 0 3.81 270)
					(length 1.27)
					(name "~"
						(effects
							(font
								(size 1.27 1.27)
							)
						)
					)
					(number "1"
						(effects
							(font
								(size 1.27 1.27)
							)
						)
					)
				)
				(pin passive line
					(at 0 -3.81 90)
					(length 1.27)
					(name "~"
						(effects
							(font
								(size 1.27 1.27)
							)
						)
					)
					(number "2"
						(effects
							(font
								(size 1.27 1.27)
							)
						)
					)
				)
			)
		)
		(symbol "POWDER_Power:TPS63070RNM"
			(pin_names
				(offset 0.254)
			)
			(exclude_from_sim no)
			(in_bom yes)
			(on_board yes)
			(property "Reference" "U"
				(at 8.89 15.24 0)
				(effects
					(font
						(size 1.524 1.524)
					)
				)
			)
			(property "Value" "TPS63070RNM"
				(at 1.27 3.81 0)
				(effects
					(font
						(size 1.524 1.524)
					)
				)
			)
			(property "Footprint" "POWDER_Power:TPS63070RNMR"
				(at 2.54 -0.254 0)
				(effects
					(font
						(size 1.524 1.524)
					)
					(hide yes)
				)
			)
			(property "Datasheet" ""
				(at 2.54 10.16 0)
				(effects
					(font
						(size 1.524 1.524)
					)
				)
			)
			(property "Description" "2-V to 16-V Buck-Boost Converter With 3.6-A Switch Current"
				(at 0 0 0)
				(effects
					(font
						(size 1.27 1.27)
					)
					(hide yes)
				)
			)
			(property "Manufacturer" "Texas Instruments"
				(at 0 0 0)
				(effects
					(font
						(size 1.27 1.27)
					)
					(hide yes)
				)
			)
			(property "PartNumber" "TPS63070RNMR"
				(at 0 0 0)
				(effects
					(font
						(size 1.27 1.27)
					)
					(hide yes)
				)
			)
			(property "ki_fp_filters" "RNM0015A"
				(at 0 0 0)
				(effects
					(font
						(size 1.27 1.27)
					)
					(hide yes)
				)
			)
			(symbol "TPS63070RNM_0_0"
				(rectangle
					(start -12.7 13.97)
					(end 12.7 -15.24)
					(stroke
						(width 0.2032)
						(type default)
					)
					(fill
						(type background)
					)
				)
			)
			(symbol "TPS63070RNM_1_0"
				(pin input line
					(at -15.24 -7.62 0)
					(length 2.54)
					(name "PS_SYNC"
						(effects
							(font
								(size 1.27 1.27)
							)
						)
					)
					(number "1"
						(effects
							(font
								(size 1.27 1.27)
							)
						)
					)
				)
				(pin power_in line
					(at 2.54 -17.78 90)
					(length 2.54)
					(name "PGND"
						(effects
							(font
								(size 1.27 1.27)
							)
						)
					)
					(number "10"
						(effects
							(font
								(size 1.27 1.27)
							)
						)
					)
				)
				(pin bidirectional line
					(at -5.08 16.51 270)
					(length 2.54)
					(name "L1"
						(effects
							(font
								(size 1.27 1.27)
							)
						)
					)
					(number "11"
						(effects
							(font
								(size 1.27 1.27)
							)
						)
					)
				)
				(pin power_in line
					(at -15.24 10.16 0)
					(length 2.54)
					(name "VIN"
						(effects
							(font
								(size 1.27 1.27)
							)
						)
					)
					(number "12"
						(effects
							(font
								(size 1.27 1.27)
							)
						)
					)
				)
				(pin power_in line
					(at -15.24 7.62 0)
					(length 2.54)
					(name "VIN"
						(effects
							(font
								(size 1.27 1.27)
							)
						)
					)
					(number "13"
						(effects
							(font
								(size 1.27 1.27)
							)
						)
					)
				)
				(pin input line
					(at -15.24 -5.08 0)
					(length 2.54)
					(name "EN"
						(effects
							(font
								(size 1.27 1.27)
							)
						)
					)
					(number "14"
						(effects
							(font
								(size 1.27 1.27)
							)
						)
					)
				)
				(pin input line
					(at -15.24 -10.16 0)
					(length 2.54)
					(name "VSEL"
						(effects
							(font
								(size 1.27 1.27)
							)
						)
					)
					(number "15"
						(effects
							(font
								(size 1.27 1.27)
							)
						)
					)
				)
				(pin output line
					(at 15.24 -7.62 180)
					(length 2.54)
					(name "PG"
						(effects
							(font
								(size 1.27 1.27)
							)
						)
					)
					(number "2"
						(effects
							(font
								(size 1.27 1.27)
							)
						)
					)
				)
				(pin passive line
					(at -15.24 1.27 0)
					(length 2.54)
					(name "VAUX"
						(effects
							(font
								(size 1.27 1.27)
							)
						)
					)
					(number "3"
						(effects
							(font
								(size 1.27 1.27)
							)
						)
					)
				)
				(pin power_in line
					(at -2.54 -17.78 90)
					(length 2.54)
					(name "GND"
						(effects
							(font
								(size 1.27 1.27)
							)
						)
					)
					(number "4"
						(effects
							(font
								(size 1.27 1.27)
							)
						)
					)
				)
				(pin input line
					(at 15.24 1.27 180)
					(length 2.54)
					(name "FB"
						(effects
							(font
								(size 1.27 1.27)
							)
						)
					)
					(number "5"
						(effects
							(font
								(size 1.27 1.27)
							)
						)
					)
				)
				(pin input line
					(at 15.24 -1.27 180)
					(length 2.54)
					(name "FB2"
						(effects
							(font
								(size 1.27 1.27)
							)
						)
					)
					(number "6"
						(effects
							(font
								(size 1.27 1.27)
							)
						)
					)
				)
				(pin power_out line
					(at 15.24 7.62 180)
					(length 2.54)
					(name "VOUT"
						(effects
							(font
								(size 1.27 1.27)
							)
						)
					)
					(number "7"
						(effects
							(font
								(size 1.27 1.27)
							)
						)
					)
				)
				(pin power_out line
					(at 15.24 10.16 180)
					(length 2.54)
					(name "VOUT"
						(effects
							(font
								(size 1.27 1.27)
							)
						)
					)
					(number "8"
						(effects
							(font
								(size 1.27 1.27)
							)
						)
					)
				)
				(pin bidirectional line
					(at 5.08 16.51 270)
					(length 2.54)
					(name "L2"
						(effects
							(font
								(size 1.27 1.27)
							)
						)
					)
					(number "9"
						(effects
							(font
								(size 1.27 1.27)
							)
						)
					)
				)
			)
		)
		(symbol "power:+3.3V"
			(power)
			(pin_numbers hide)
			(pin_names
				(offset 0) hide)
			(exclude_from_sim no)
			(in_bom yes)
			(on_board yes)
			(property "Reference" "#PWR"
				(at 0 -3.81 0)
				(effects
					(font
						(size 1.27 1.27)
					)
					(hide yes)
				)
			)
			(property "Value" "+3.3V"
				(at 0 3.556 0)
				(effects
					(font
						(size 1.27 1.27)
					)
				)
			)
			(property "Footprint" ""
				(at 0 0 0)
				(effects
					(font
						(size 1.27 1.27)
					)
					(hide yes)
				)
			)
			(property "Datasheet" ""
				(at 0 0 0)
				(effects
					(font
						(size 1.27 1.27)
					)
					(hide yes)
				)
			)
			(property "Description" "Power symbol creates a global label with name \"+3.3V\""
				(at 0 0 0)
				(effects
					(font
						(size 1.27 1.27)
					)
					(hide yes)
				)
			)
			(property "ki_keywords" "global power"
				(at 0 0 0)
				(effects
					(font
						(size 1.27 1.27)
					)
					(hide yes)
				)
			)
			(symbol "+3.3V_0_1"
				(polyline
					(pts
						(xy -0.762 1.27) (xy 0 2.54)
					)
					(stroke
						(width 0)
						(type default)
					)
					(fill
						(type none)
					)
				)
				(polyline
					(pts
						(xy 0 0) (xy 0 2.54)
					)
					(stroke
						(width 0)
						(type default)
					)
					(fill
						(type none)
					)
				)
				(polyline
					(pts
						(xy 0 2.54) (xy 0.762 1.27)
					)
					(stroke
						(width 0)
						(type default)
					)
					(fill
						(type none)
					)
				)
			)
			(symbol "+3.3V_1_1"
				(pin power_in line
					(at 0 0 90)
					(length 0)
					(name "~"
						(effects
							(font
								(size 1.27 1.27)
							)
						)
					)
					(number "1"
						(effects
							(font
								(size 1.27 1.27)
							)
						)
					)
				)
			)
		)
		(symbol "power:GND"
			(power)
			(pin_numbers hide)
			(pin_names
				(offset 0) hide)
			(exclude_from_sim no)
			(in_bom yes)
			(on_board yes)
			(property "Reference" "#PWR"
				(at 0 -6.35 0)
				(effects
					(font
						(size 1.27 1.27)
					)
					(hide yes)
				)
			)
			(property "Value" "GND"
				(at 0 -3.81 0)
				(effects
					(font
						(size 1.27 1.27)
					)
				)
			)
			(property "Footprint" ""
				(at 0 0 0)
				(effects
					(font
						(size 1.27 1.27)
					)
					(hide yes)
				)
			)
			(property "Datasheet" ""
				(at 0 0 0)
				(effects
					(font
						(size 1.27 1.27)
					)
					(hide yes)
				)
			)
			(property "Description" "Power symbol creates a global label with name \"GND\" , ground"
				(at 0 0 0)
				(effects
					(font
						(size 1.27 1.27)
					)
					(hide yes)
				)
			)
			(property "ki_keywords" "global power"
				(at 0 0 0)
				(effects
					(font
						(size 1.27 1.27)
					)
					(hide yes)
				)
			)
			(symbol "GND_0_1"
				(polyline
					(pts
						(xy 0 0) (xy 0 -1.27) (xy 1.27 -1.27) (xy 0 -2.54) (xy -1.27 -1.27) (xy 0 -1.27)
					)
					(stroke
						(width 0)
						(type default)
					)
					(fill
						(type none)
					)
				)
			)
			(symbol "GND_1_1"
				(pin power_in line
					(at 0 0 270)
					(length 0)
					(name "~"
						(effects
							(font
								(size 1.27 1.27)
							)
						)
					)
					(number "1"
						(effects
							(font
								(size 1.27 1.27)
							)
						)
					)
				)
			)
		)
	)
	(junction
		(at 220.98 60.96)
		(diameter 0)
		(color 0 0 0 0)
		(uuid "0840e5da-47b4-4737-bf3f-46f98c6019c2")
	)
	(junction
		(at 157.48 69.85)
		(diameter 0)
		(color 0 0 0 0)
		(uuid "09cf041a-cd9c-4967-ae40-f02c18de5817")
	)
	(junction
		(at 165.1 78.74)
		(diameter 0)
		(color 0 0 0 0)
		(uuid "16f9968d-66e0-4e59-afe4-1afebed2e05e")
	)
	(junction
		(at 236.22 60.96)
		(diameter 0)
		(color 0 0 0 0)
		(uuid "2a00bc60-36cc-4f7c-86b9-1d97d536f039")
	)
	(junction
		(at 241.3 80.01)
		(diameter 0)
		(color 0 0 0 0)
		(uuid "2fd4bab4-8fea-432e-9b94-a06af8695eca")
	)
	(junction
		(at 241.3 60.96)
		(diameter 0)
		(color 0 0 0 0)
		(uuid "527189ab-38b7-46f3-a75b-2b0146accaea")
	)
	(junction
		(at 165.1 60.96)
		(diameter 0)
		(color 0 0 0 0)
		(uuid "59bdee47-9594-4e8a-b1fa-dd6d59fe5014")
	)
	(junction
		(at 157.48 60.96)
		(diameter 0)
		(color 0 0 0 0)
		(uuid "5b89a731-cb31-4037-bd0e-02cb2b2423cc")
	)
	(junction
		(at 62.23 63.5)
		(diameter 0)
		(color 0 0 0 0)
		(uuid "5fbf6c88-465a-4a12-ace5-9469f54111c3")
	)
	(junction
		(at 177.8 60.96)
		(diameter 0)
		(color 0 0 0 0)
		(uuid "750804bf-467a-4f65-94ff-6b6bcd1bd3cd")
	)
	(junction
		(at 228.6 60.96)
		(diameter 0)
		(color 0 0 0 0)
		(uuid "a4691135-8ccb-4723-ab3e-d82d8004ed13")
	)
	(junction
		(at 107.95 78.74)
		(diameter 0)
		(color 0 0 0 0)
		(uuid "a68773b0-b8de-48eb-bce1-0e73b959073f")
	)
	(junction
		(at 147.32 60.96)
		(diameter 0)
		(color 0 0 0 0)
		(uuid "a7c8a6f9-1f38-4110-89b3-a8a0d4a2623f")
	)
	(junction
		(at 74.93 63.5)
		(diameter 0)
		(color 0 0 0 0)
		(uuid "a841570d-67fe-40c7-b3c8-d5ca7130f062")
	)
	(junction
		(at 87.63 63.5)
		(diameter 0)
		(color 0 0 0 0)
		(uuid "b81fec9d-bca0-4026-985e-e09be5076776")
	)
	(junction
		(at 185.42 60.96)
		(diameter 0)
		(color 0 0 0 0)
		(uuid "c3dcb8e3-9285-47d7-9d9f-3c86e13c6a92")
	)
	(junction
		(at 193.04 60.96)
		(diameter 0)
		(color 0 0 0 0)
		(uuid "d4130385-d138-4c8e-9271-f7390dd6c1d3")
	)
	(junction
		(at 96.52 63.5)
		(diameter 0)
		(color 0 0 0 0)
		(uuid "dda8021f-9e61-4000-a3eb-cad5ff82efea")
	)
	(junction
		(at 49.53 63.5)
		(diameter 0)
		(color 0 0 0 0)
		(uuid "dde8bd8b-11eb-458b-b93b-2436d3e973cb")
	)
	(junction
		(at 208.28 60.96)
		(diameter 0)
		(color 0 0 0 0)
		(uuid "f976de39-91ea-4dd7-9bc4-34904d1ace6c")
	)
	(junction
		(at 200.66 60.96)
		(diameter 0)
		(color 0 0 0 0)
		(uuid "f9acb3d8-c910-4198-b1ab-d60f6b4d6aa2")
	)
	(wire
		(pts
			(xy 114.3 81.28) (xy 99.06 81.28)
		)
		(stroke
			(width 0)
			(type default)
		)
		(uuid "0e8d7179-43eb-4411-9453-4c02bc8cb996")
	)
	(wire
		(pts
			(xy 114.3 63.5) (xy 96.52 63.5)
		)
		(stroke
			(width 0)
			(type default)
		)
		(uuid "0fb581d5-70bc-4fb7-ad4b-54e99082a80a")
	)
	(wire
		(pts
			(xy 49.53 63.5) (xy 38.1 63.5)
		)
		(stroke
			(width 0)
			(type default)
		)
		(uuid "10529eaf-4e21-40de-b7e5-67709ae60d5b")
	)
	(wire
		(pts
			(xy 147.32 63.5) (xy 147.32 60.96)
		)
		(stroke
			(width 0)
			(type default)
		)
		(uuid "159c97b8-99c8-4a9d-9dfd-50d2cecca784")
	)
	(wire
		(pts
			(xy 208.28 50.8) (xy 208.28 60.96)
		)
		(stroke
			(width 0)
			(type default)
		)
		(uuid "17b29b21-474d-4a91-a18b-24ba7e8d1115")
	)
	(wire
		(pts
			(xy 241.3 78.74) (xy 241.3 80.01)
		)
		(stroke
			(width 0)
			(type default)
		)
		(uuid "18794079-8687-4537-bd2a-4b086715b726")
	)
	(wire
		(pts
			(xy 62.23 66.04) (xy 62.23 63.5)
		)
		(stroke
			(width 0)
			(type default)
		)
		(uuid "1ce913be-198d-49c8-b3b9-ce010897ce03")
	)
	(wire
		(pts
			(xy 101.6 101.6) (xy 107.95 101.6)
		)
		(stroke
			(width 0)
			(type default)
		)
		(uuid "1e96ad79-5215-4dbd-8fbf-99b659516fee")
	)
	(wire
		(pts
			(xy 124.46 50.8) (xy 124.46 54.61)
		)
		(stroke
			(width 0)
			(type default)
		)
		(uuid "21c2f0f3-e33f-4b6d-8372-4483dfce5c04")
	)
	(wire
		(pts
			(xy 193.04 73.66) (xy 193.04 76.2)
		)
		(stroke
			(width 0)
			(type default)
		)
		(uuid "23c0331e-4fc0-4517-b384-803e43601f5a")
	)
	(wire
		(pts
			(xy 152.4 72.39) (xy 152.4 88.9)
		)
		(stroke
			(width 0)
			(type default)
		)
		(uuid "24245544-98bd-40cc-929a-b33409ba8889")
	)
	(wire
		(pts
			(xy 193.04 60.96) (xy 200.66 60.96)
		)
		(stroke
			(width 0)
			(type default)
		)
		(uuid "25f04a16-c651-482e-8355-5c9ab2e4372f")
	)
	(wire
		(pts
			(xy 62.23 76.2) (xy 62.23 73.66)
		)
		(stroke
			(width 0)
			(type default)
		)
		(uuid "2b009455-4ae6-47ab-b561-0658d10e9156")
	)
	(wire
		(pts
			(xy 220.98 73.66) (xy 220.98 76.2)
		)
		(stroke
			(width 0)
			(type default)
		)
		(uuid "30d20311-8be5-47b3-bd66-006326c94239")
	)
	(wire
		(pts
			(xy 49.53 66.04) (xy 49.53 63.5)
		)
		(stroke
			(width 0)
			(type default)
		)
		(uuid "30f93f3c-179d-42fa-a63f-cd8f834931cb")
	)
	(wire
		(pts
			(xy 132.08 91.44) (xy 132.08 88.9)
		)
		(stroke
			(width 0)
			(type default)
		)
		(uuid "35bf895f-26f7-49d9-91e7-56721f889af2")
	)
	(wire
		(pts
			(xy 97.79 78.74) (xy 107.95 78.74)
		)
		(stroke
			(width 0)
			(type default)
		)
		(uuid "389ecdf8-277a-444a-a4bf-b697ecffbc1b")
	)
	(wire
		(pts
			(xy 49.53 76.2) (xy 49.53 73.66)
		)
		(stroke
			(width 0)
			(type default)
		)
		(uuid "3aa5ba3d-fdc0-4157-83c6-5c1db9c5b0a6")
	)
	(wire
		(pts
			(xy 185.42 60.96) (xy 193.04 60.96)
		)
		(stroke
			(width 0)
			(type default)
		)
		(uuid "3c9cd772-fea1-4c48-9a74-d8d368fe04a7")
	)
	(wire
		(pts
			(xy 241.3 71.12) (xy 241.3 60.96)
		)
		(stroke
			(width 0)
			(type default)
		)
		(uuid "3d8bf27a-d697-4508-bfd6-4bd620136ef6")
	)
	(wire
		(pts
			(xy 208.28 50.8) (xy 215.9 50.8)
		)
		(stroke
			(width 0)
			(type default)
		)
		(uuid "3ffc1fb9-5148-4374-bf74-d86cca5397ba")
	)
	(wire
		(pts
			(xy 133.35 50.8) (xy 134.62 50.8)
		)
		(stroke
			(width 0)
			(type default)
		)
		(uuid "43720af8-958e-4b09-bc36-1c7a58baf395")
	)
	(wire
		(pts
			(xy 200.66 66.04) (xy 200.66 60.96)
		)
		(stroke
			(width 0)
			(type default)
		)
		(uuid "47001acd-6c26-4b3b-8852-9714b7e0f209")
	)
	(wire
		(pts
			(xy 208.28 73.66) (xy 208.28 76.2)
		)
		(stroke
			(width 0)
			(type default)
		)
		(uuid "4d96a742-3a64-49bc-bae9-d695e28ecd13")
	)
	(wire
		(pts
			(xy 241.3 80.01) (xy 260.35 80.01)
		)
		(stroke
			(width 0)
			(type default)
		)
		(uuid "513cff30-9000-44fe-9c63-26213790e4d7")
	)
	(wire
		(pts
			(xy 228.6 60.96) (xy 220.98 60.96)
		)
		(stroke
			(width 0)
			(type default)
		)
		(uuid "520b8615-eb6d-4da2-b1ba-aa659ca82de0")
	)
	(wire
		(pts
			(xy 228.6 73.66) (xy 228.6 76.2)
		)
		(stroke
			(width 0)
			(type default)
		)
		(uuid "539bb229-8cde-41d5-8999-49cf258e3fc3")
	)
	(wire
		(pts
			(xy 200.66 73.66) (xy 200.66 76.2)
		)
		(stroke
			(width 0)
			(type default)
		)
		(uuid "55f8de8b-047b-41a7-9858-cedb8174ffca")
	)
	(wire
		(pts
			(xy 83.82 77.47) (xy 83.82 69.85)
		)
		(stroke
			(width 0)
			(type default)
		)
		(uuid "56f68aef-64d6-4149-a31c-2166c5f930f3")
	)
	(wire
		(pts
			(xy 236.22 60.96) (xy 241.3 60.96)
		)
		(stroke
			(width 0)
			(type default)
		)
		(uuid "5b12c97b-58a6-4fbe-a5d7-bac8550e8be9")
	)
	(wire
		(pts
			(xy 87.63 63.5) (xy 74.93 63.5)
		)
		(stroke
			(width 0)
			(type default)
		)
		(uuid "5cebc2ad-de0c-47c2-9a94-0a30b96f38c4")
	)
	(wire
		(pts
			(xy 96.52 60.96) (xy 96.52 63.5)
		)
		(stroke
			(width 0)
			(type default)
		)
		(uuid "5e96769c-07ac-49cd-87a6-81455faa9ead")
	)
	(wire
		(pts
			(xy 87.63 63.5) (xy 87.63 78.74)
		)
		(stroke
			(width 0)
			(type default)
		)
		(uuid "60971585-0b5e-4703-9582-843ccd525c8d")
	)
	(wire
		(pts
			(xy 241.3 60.96) (xy 243.84 60.96)
		)
		(stroke
			(width 0)
			(type default)
		)
		(uuid "641d879d-0604-4a65-a879-5b98de0ec85a")
	)
	(wire
		(pts
			(xy 147.32 60.96) (xy 144.78 60.96)
		)
		(stroke
			(width 0)
			(type default)
		)
		(uuid "65e8704b-8ead-4777-ac9d-e45837fa079a")
	)
	(wire
		(pts
			(xy 185.42 66.04) (xy 185.42 60.96)
		)
		(stroke
			(width 0)
			(type default)
		)
		(uuid "67a8b664-9523-4c09-94bd-e32d6aed574c")
	)
	(wire
		(pts
			(xy 208.28 66.04) (xy 208.28 60.96)
		)
		(stroke
			(width 0)
			(type default)
		)
		(uuid "6b973f35-2c82-4d3f-9fa9-687039e14699")
	)
	(wire
		(pts
			(xy 236.22 60.96) (xy 228.6 60.96)
		)
		(stroke
			(width 0)
			(type default)
		)
		(uuid "71e0556b-b343-4640-bcae-04aabc02a7e5")
	)
	(wire
		(pts
			(xy 157.48 88.9) (xy 157.48 87.63)
		)
		(stroke
			(width 0)
			(type default)
		)
		(uuid "738e4b5f-56a7-486a-a54f-25b80421389b")
	)
	(wire
		(pts
			(xy 200.66 60.96) (xy 208.28 60.96)
		)
		(stroke
			(width 0)
			(type default)
		)
		(uuid "74c491d1-b29a-429a-9f1d-d2edb3f3f03a")
	)
	(wire
		(pts
			(xy 134.62 50.8) (xy 134.62 54.61)
		)
		(stroke
			(width 0)
			(type default)
		)
		(uuid "75e7cd37-8706-47a6-9367-8b0d0ef69a56")
	)
	(wire
		(pts
			(xy 114.3 60.96) (xy 96.52 60.96)
		)
		(stroke
			(width 0)
			(type default)
		)
		(uuid "7f6d1816-60b5-42b4-8445-5a0bb87b3ae9")
	)
	(wire
		(pts
			(xy 165.1 78.74) (xy 165.1 76.2)
		)
		(stroke
			(width 0)
			(type default)
		)
		(uuid "7fa712ae-1fb9-46f1-88d4-1a4a27887f32")
	)
	(wire
		(pts
			(xy 144.78 78.74) (xy 165.1 78.74)
		)
		(stroke
			(width 0)
			(type default)
		)
		(uuid "863b46c2-cd04-45ea-a431-62ddfd6db416")
	)
	(wire
		(pts
			(xy 144.78 72.39) (xy 152.4 72.39)
		)
		(stroke
			(width 0)
			(type default)
		)
		(uuid "8800b85a-cf6e-4424-aeaa-4f3af83ccd2d")
	)
	(wire
		(pts
			(xy 193.04 66.04) (xy 193.04 60.96)
		)
		(stroke
			(width 0)
			(type default)
		)
		(uuid "887ed633-8b6d-475d-a1dd-a7ed1d0ad5ce")
	)
	(wire
		(pts
			(xy 83.82 69.85) (xy 114.3 69.85)
		)
		(stroke
			(width 0)
			(type default)
		)
		(uuid "8cfa8a8a-2c8a-4ee4-9931-34ff75f2fb7b")
	)
	(wire
		(pts
			(xy 177.8 73.66) (xy 177.8 76.2)
		)
		(stroke
			(width 0)
			(type default)
		)
		(uuid "91951420-430b-4868-992e-1ead74d1eba7")
	)
	(wire
		(pts
			(xy 144.78 69.85) (xy 157.48 69.85)
		)
		(stroke
			(width 0)
			(type default)
		)
		(uuid "939f1b69-3186-4f84-a8e2-12c13336d2dc")
	)
	(wire
		(pts
			(xy 74.93 76.2) (xy 74.93 73.66)
		)
		(stroke
			(width 0)
			(type default)
		)
		(uuid "9e91089f-f88e-457d-9895-e99611173c6e")
	)
	(wire
		(pts
			(xy 99.06 83.82) (xy 99.06 81.28)
		)
		(stroke
			(width 0)
			(type default)
		)
		(uuid "a194c73d-0747-4b02-bcbe-89a81dd1d3a5")
	)
	(wire
		(pts
			(xy 228.6 66.04) (xy 228.6 60.96)
		)
		(stroke
			(width 0)
			(type default)
		)
		(uuid "a19f380e-0605-488a-b3bd-13b7dcf32b6e")
	)
	(wire
		(pts
			(xy 62.23 63.5) (xy 49.53 63.5)
		)
		(stroke
			(width 0)
			(type default)
		)
		(uuid "a3ad29db-9b40-4554-8846-9981b3ef83d7")
	)
	(wire
		(pts
			(xy 167.64 78.74) (xy 165.1 78.74)
		)
		(stroke
			(width 0)
			(type default)
		)
		(uuid "aa769d41-7a6b-4e6d-8bc3-3161bd0e6dda")
	)
	(wire
		(pts
			(xy 125.73 50.8) (xy 124.46 50.8)
		)
		(stroke
			(width 0)
			(type default)
		)
		(uuid "adf3a963-f45b-446f-990a-c28e7aee2b2d")
	)
	(wire
		(pts
			(xy 127 91.44) (xy 127 88.9)
		)
		(stroke
			(width 0)
			(type default)
		)
		(uuid "aff11e01-4db9-4250-822a-f01e1b82f403")
	)
	(wire
		(pts
			(xy 97.79 76.2) (xy 114.3 76.2)
		)
		(stroke
			(width 0)
			(type default)
		)
		(uuid "b17b5d83-f45e-456c-9e8b-778426e1caac")
	)
	(wire
		(pts
			(xy 177.8 60.96) (xy 185.42 60.96)
		)
		(stroke
			(width 0)
			(type default)
		)
		(uuid "b4320c6f-f454-438b-96c4-dcae5f59f859")
	)
	(wire
		(pts
			(xy 107.95 101.6) (xy 107.95 78.74)
		)
		(stroke
			(width 0)
			(type default)
		)
		(uuid "bac66e89-e364-44e2-8886-66ed64988829")
	)
	(wire
		(pts
			(xy 241.3 91.44) (xy 241.3 88.9)
		)
		(stroke
			(width 0)
			(type default)
		)
		(uuid "bb24ee85-968a-493c-abcf-7e9b8c29d36a")
	)
	(wire
		(pts
			(xy 210.82 60.96) (xy 208.28 60.96)
		)
		(stroke
			(width 0)
			(type default)
		)
		(uuid "bdc713ab-fca4-49c9-9121-4aa1264e4aea")
	)
	(wire
		(pts
			(xy 185.42 73.66) (xy 185.42 76.2)
		)
		(stroke
			(width 0)
			(type default)
		)
		(uuid "c099bea9-793e-4422-bd5b-d712ead708f3")
	)
	(wire
		(pts
			(xy 157.48 69.85) (xy 157.48 68.58)
		)
		(stroke
			(width 0)
			(type default)
		)
		(uuid "c71c2119-a1d2-4a62-b3e3-22612badff40")
	)
	(wire
		(pts
			(xy 74.93 63.5) (xy 62.23 63.5)
		)
		(stroke
			(width 0)
			(type default)
		)
		(uuid "c8973663-4430-4a54-bd8e-e029cef624d9")
	)
	(wire
		(pts
			(xy 177.8 66.04) (xy 177.8 60.96)
		)
		(stroke
			(width 0)
			(type default)
		)
		(uuid "ca631fee-d704-4f43-9222-ef7f7cbbe7e0")
	)
	(wire
		(pts
			(xy 90.17 78.74) (xy 87.63 78.74)
		)
		(stroke
			(width 0)
			(type default)
		)
		(uuid "cfaf9b68-b1fe-49b1-b772-2c2a6e08bdf3")
	)
	(wire
		(pts
			(xy 144.78 63.5) (xy 147.32 63.5)
		)
		(stroke
			(width 0)
			(type default)
		)
		(uuid "d4d6ceaf-dbf6-4b4f-a0cb-8cd469257cd7")
	)
	(wire
		(pts
			(xy 107.95 78.74) (xy 114.3 78.74)
		)
		(stroke
			(width 0)
			(type default)
		)
		(uuid "e175ebba-db50-472d-a425-b04399aa6422")
	)
	(wire
		(pts
			(xy 241.3 80.01) (xy 241.3 81.28)
		)
		(stroke
			(width 0)
			(type default)
		)
		(uuid "e1a3f1b2-83ef-4aca-8485-eaf3a547ca20")
	)
	(wire
		(pts
			(xy 96.52 63.5) (xy 87.63 63.5)
		)
		(stroke
			(width 0)
			(type default)
		)
		(uuid "e6c9bbb9-97ad-49f9-8727-784ebc0dbce7")
	)
	(wire
		(pts
			(xy 157.48 60.96) (xy 165.1 60.96)
		)
		(stroke
			(width 0)
			(type default)
		)
		(uuid "eb6742ef-fdfc-4f82-9e49-e6edc01b4715")
	)
	(wire
		(pts
			(xy 165.1 68.58) (xy 165.1 60.96)
		)
		(stroke
			(width 0)
			(type default)
		)
		(uuid "ed009760-872f-4750-80ba-b4b059a0074c")
	)
	(wire
		(pts
			(xy 165.1 60.96) (xy 177.8 60.96)
		)
		(stroke
			(width 0)
			(type default)
		)
		(uuid "eeff6980-2f74-4605-9eeb-0fb07e478088")
	)
	(wire
		(pts
			(xy 147.32 60.96) (xy 157.48 60.96)
		)
		(stroke
			(width 0)
			(type default)
		)
		(uuid "eff630da-fb57-429e-ac4d-8b0845fa1bff")
	)
	(wire
		(pts
			(xy 220.98 60.96) (xy 218.44 60.96)
		)
		(stroke
			(width 0)
			(type default)
		)
		(uuid "f93cbab5-b658-4ac9-a4a2-c8b6dc5f71c1")
	)
	(wire
		(pts
			(xy 220.98 66.04) (xy 220.98 60.96)
		)
		(stroke
			(width 0)
			(type default)
		)
		(uuid "fa5c803c-bd6c-4f5a-a765-3d625d3b8805")
	)
	(wire
		(pts
			(xy 83.82 87.63) (xy 83.82 85.09)
		)
		(stroke
			(width 0)
			(type default)
		)
		(uuid "fb39fa0b-93ff-4a27-865d-c6218723b278")
	)
	(wire
		(pts
			(xy 157.48 80.01) (xy 157.48 69.85)
		)
		(stroke
			(width 0)
			(type default)
		)
		(uuid "fbc2cafb-43b7-4fb3-9607-5951287fa467")
	)
	(wire
		(pts
			(xy 236.22 58.42) (xy 236.22 60.96)
		)
		(stroke
			(width 0)
			(type default)
		)
		(uuid "fca71193-8011-44df-b664-bee608b0a641")
	)
	(wire
		(pts
			(xy 74.93 66.04) (xy 74.93 63.5)
		)
		(stroke
			(width 0)
			(type default)
		)
		(uuid "ffa72102-6a82-43b8-baae-2c918a97a6a2")
	)
	(label "L2"
		(at 134.62 50.8 0)
		(fields_autoplaced yes)
		(effects
			(font
				(size 1.27 1.27)
			)
			(justify left bottom)
		)
		(uuid "00ecb265-918f-4e29-8494-03b88d2ca01d")
	)
	(label "FB"
		(at 148.59 69.85 0)
		(fields_autoplaced yes)
		(effects
			(font
				(size 1.27 1.27)
			)
			(justify left bottom)
		)
		(uuid "0baff0a3-b950-45d7-babc-9bd4d914e8d7")
	)
	(label "PS_SYNC"
		(at 99.06 78.74 0)
		(fields_autoplaced yes)
		(effects
			(font
				(size 1.27 1.27)
			)
			(justify left bottom)
		)
		(uuid "1da799a0-bf87-4fde-b282-61f20fa2e7b4")
	)
	(label "L1"
		(at 124.46 50.8 90)
		(fields_autoplaced yes)
		(effects
			(font
				(size 1.27 1.27)
			)
			(justify left bottom)
		)
		(uuid "2b5f61be-4a4a-478e-a035-8ecd4ca302e4")
	)
	(label "VAUX"
		(at 91.44 69.85 0)
		(fields_autoplaced yes)
		(effects
			(font
				(size 1.27 1.27)
			)
			(justify left bottom)
		)
		(uuid "9a2eae22-6717-42bb-b6e1-8de04a386031")
	)
	(hierarchical_label "EN"
		(shape input)
		(at 97.79 76.2 180)
		(fields_autoplaced yes)
		(effects
			(font
				(size 1.27 1.27)
			)
			(justify right)
		)
		(uuid "0b6c5a12-ccec-4e0f-a4be-d658000fc8c3")
	)
	(hierarchical_label "rsp_3_3"
		(shape output)
		(at 215.9 50.8 0)
		(fields_autoplaced yes)
		(effects
			(font
				(size 1.27 1.27)
			)
			(justify left)
		)
		(uuid "34de69c2-1291-4f09-8435-c06bb0e965dd")
	)
	(hierarchical_label "v_sense_3_3"
		(shape output)
		(at 260.35 80.01 0)
		(fields_autoplaced yes)
		(effects
			(font
				(size 1.27 1.27)
			)
			(justify left)
		)
		(uuid "642c042e-eed7-4776-adaf-70c17efb5c9f")
	)
	(hierarchical_label "v_12"
		(shape input)
		(at 38.1 63.5 180)
		(fields_autoplaced yes)
		(effects
			(font
				(size 1.27 1.27)
			)
			(justify right)
		)
		(uuid "6b7bc8d8-309c-4563-a139-be8ea8d8ebba")
	)
	(hierarchical_label "rsn_3_3"
		(shape output)
		(at 243.84 60.96 0)
		(fields_autoplaced yes)
		(effects
			(font
				(size 1.27 1.27)
			)
			(justify left)
		)
		(uuid "ab402b96-783d-4f53-b8ca-a02ad7105ea9")
	)
	(hierarchical_label "sync"
		(shape input)
		(at 101.6 101.6 180)
		(fields_autoplaced yes)
		(effects
			(font
				(size 1.27 1.27)
			)
			(justify right)
		)
		(uuid "cbf2abe8-7fba-4133-a82e-0477ae863a81")
	)
	(hierarchical_label "pg"
		(shape output)
		(at 167.64 78.74 0)
		(fields_autoplaced yes)
		(effects
			(font
				(size 1.27 1.27)
			)
			(justify left)
		)
		(uuid "d0343b3c-6078-43ed-81f3-b1b90dc49c4c")
	)
	(symbol
		(lib_id "000_PreferredParts:C_10uF_0805")
		(at 49.53 69.85 0)
		(unit 1)
		(exclude_from_sim no)
		(in_bom yes)
		(on_board yes)
		(dnp no)
		(uuid "00000000-0000-0000-0000-00005e2d1ce0")
		(property "Reference" "C1301"
			(at 50.165 67.31 0)
			(effects
				(font
					(size 1.27 1.27)
				)
				(justify left)
			)
		)
		(property "Value" "C_10uF_0805"
			(at 50.165 72.39 0)
			(effects
				(font
					(size 1.27 1.27)
				)
				(justify left)
				(hide yes)
			)
		)
		(property "Footprint" "Capacitor_SMD:C_0805_2012Metric"
			(at 50.4952 73.66 0)
			(effects
				(font
					(size 1.27 1.27)
				)
				(hide yes)
			)
		)
		(property "Datasheet" "~"
			(at 49.53 69.85 0)
			(effects
				(font
					(size 1.27 1.27)
				)
				(hide yes)
			)
		)
		(property "Description" "Unpolarized capacitor"
			(at 49.53 69.85 0)
			(effects
				(font
					(size 1.27 1.27)
				)
				(hide yes)
			)
		)
		(property "DisplayValue" "10uF"
			(at 53.34 72.39 0)
			(effects
				(font
					(size 1.27 1.27)
				)
			)
		)
		(property "DisplayFootprint" "0805"
			(at 53.34 74.93 0)
			(effects
				(font
					(size 1.27 1.27)
				)
			)
		)
		(property "PartSpecification" "3000-0000000134"
			(at 49.53 69.85 0)
			(effects
				(font
					(size 1.27 1.27)
				)
				(hide yes)
			)
		)
		(pin "1"
			(uuid "75751198-5454-4077-bacd-48b9a22b2571")
		)
		(pin "2"
			(uuid "85f10283-0092-4817-a8be-e83dd944b174")
		)
	)
	(symbol
		(lib_id "000_PreferredParts:C_10uF_0805")
		(at 62.23 69.85 0)
		(unit 1)
		(exclude_from_sim no)
		(in_bom yes)
		(on_board yes)
		(dnp no)
		(uuid "00000000-0000-0000-0000-00005e2d2034")
		(property "Reference" "C1302"
			(at 62.865 67.31 0)
			(effects
				(font
					(size 1.27 1.27)
				)
				(justify left)
			)
		)
		(property "Value" "C_10uF_0805"
			(at 62.865 72.39 0)
			(effects
				(font
					(size 1.27 1.27)
				)
				(justify left)
				(hide yes)
			)
		)
		(property "Footprint" "Capacitor_SMD:C_0805_2012Metric"
			(at 63.1952 73.66 0)
			(effects
				(font
					(size 1.27 1.27)
				)
				(hide yes)
			)
		)
		(property "Datasheet" "~"
			(at 62.23 69.85 0)
			(effects
				(font
					(size 1.27 1.27)
				)
				(hide yes)
			)
		)
		(property "Description" "Unpolarized capacitor"
			(at 62.23 69.85 0)
			(effects
				(font
					(size 1.27 1.27)
				)
				(hide yes)
			)
		)
		(property "DisplayValue" "10uF"
			(at 66.04 72.39 0)
			(effects
				(font
					(size 1.27 1.27)
				)
			)
		)
		(property "DisplayFootprint" "0805"
			(at 66.04 74.93 0)
			(effects
				(font
					(size 1.27 1.27)
				)
			)
		)
		(property "PartSpecification" "3000-0000000134"
			(at 62.23 69.85 0)
			(effects
				(font
					(size 1.27 1.27)
				)
				(hide yes)
			)
		)
		(pin "2"
			(uuid "62f3ad71-5935-4386-a0b0-ee9f4ae7cc59")
		)
		(pin "1"
			(uuid "e74764ad-dd8a-4bba-a21a-e0c54f0a7129")
		)
	)
	(symbol
		(lib_id "000_PreferredParts:C_10uF_0603")
		(at 74.93 69.85 0)
		(unit 1)
		(exclude_from_sim no)
		(in_bom yes)
		(on_board yes)
		(dnp no)
		(uuid "00000000-0000-0000-0000-00005e2d2257")
		(property "Reference" "C1303"
			(at 75.565 67.31 0)
			(effects
				(font
					(size 1.27 1.27)
				)
				(justify left)
			)
		)
		(property "Value" "C_10uF_0603"
			(at 75.565 72.39 0)
			(effects
				(font
					(size 1.27 1.27)
				)
				(justify left)
				(hide yes)
			)
		)
		(property "Footprint" "Capacitor_SMD:C_0603_1608Metric"
			(at 75.8952 73.66 0)
			(effects
				(font
					(size 1.27 1.27)
				)
				(hide yes)
			)
		)
		(property "Datasheet" "~"
			(at 74.93 69.85 0)
			(effects
				(font
					(size 1.27 1.27)
				)
				(hide yes)
			)
		)
		(property "Description" "Unpolarized capacitor"
			(at 74.93 69.85 0)
			(effects
				(font
					(size 1.27 1.27)
				)
				(hide yes)
			)
		)
		(property "DisplayValue" "10uF"
			(at 78.74 72.39 0)
			(effects
				(font
					(size 1.27 1.27)
				)
			)
		)
		(property "DisplayFootprint" "0603"
			(at 78.74 74.93 0)
			(effects
				(font
					(size 1.27 1.27)
				)
			)
		)
		(property "PartSpecification" "3000-0000000135"
			(at 74.93 69.85 0)
			(effects
				(font
					(size 1.27 1.27)
				)
				(hide yes)
			)
		)
		(pin "1"
			(uuid "a8fe1982-2462-4ef0-827a-4e758de945ee")
		)
		(pin "2"
			(uuid "7ff58299-309f-431a-90d2-4609e994f1a4")
		)
	)
	(symbol
		(lib_id "power:GND")
		(at 49.53 76.2 0)
		(unit 1)
		(exclude_from_sim no)
		(in_bom yes)
		(on_board yes)
		(dnp no)
		(uuid "00000000-0000-0000-0000-00005e2d24cf")
		(property "Reference" "#PWR?"
			(at 49.53 82.55 0)
			(effects
				(font
					(size 1.27 1.27)
				)
				(hide yes)
			)
		)
		(property "Value" "GND"
			(at 49.53 80.01 0)
			(effects
				(font
					(size 1.27 1.27)
				)
			)
		)
		(property "Footprint" ""
			(at 49.53 76.2 0)
			(effects
				(font
					(size 1.27 1.27)
				)
				(hide yes)
			)
		)
		(property "Datasheet" ""
			(at 49.53 76.2 0)
			(effects
				(font
					(size 1.27 1.27)
				)
				(hide yes)
			)
		)
		(property "Description" "Power symbol creates a global label with name \"GND\" , ground"
			(at 49.53 76.2 0)
			(effects
				(font
					(size 1.27 1.27)
				)
				(hide yes)
			)
		)
		(pin "1"
			(uuid "e8663da5-6213-49d8-8f72-e7a750181358")
		)
	)
	(symbol
		(lib_id "power:GND")
		(at 62.23 76.2 0)
		(unit 1)
		(exclude_from_sim no)
		(in_bom yes)
		(on_board yes)
		(dnp no)
		(uuid "00000000-0000-0000-0000-00005e2d29df")
		(property "Reference" "#PWR?"
			(at 62.23 82.55 0)
			(effects
				(font
					(size 1.27 1.27)
				)
				(hide yes)
			)
		)
		(property "Value" "GND"
			(at 62.23 80.01 0)
			(effects
				(font
					(size 1.27 1.27)
				)
			)
		)
		(property "Footprint" ""
			(at 62.23 76.2 0)
			(effects
				(font
					(size 1.27 1.27)
				)
				(hide yes)
			)
		)
		(property "Datasheet" ""
			(at 62.23 76.2 0)
			(effects
				(font
					(size 1.27 1.27)
				)
				(hide yes)
			)
		)
		(property "Description" "Power symbol creates a global label with name \"GND\" , ground"
			(at 62.23 76.2 0)
			(effects
				(font
					(size 1.27 1.27)
				)
				(hide yes)
			)
		)
		(pin "1"
			(uuid "f9e2f02a-83a9-4f12-8b7b-4b4ec81e8ac5")
		)
	)
	(symbol
		(lib_id "power:GND")
		(at 74.93 76.2 0)
		(unit 1)
		(exclude_from_sim no)
		(in_bom yes)
		(on_board yes)
		(dnp no)
		(uuid "00000000-0000-0000-0000-00005e2d2b3c")
		(property "Reference" "#PWR?"
			(at 74.93 82.55 0)
			(effects
				(font
					(size 1.27 1.27)
				)
				(hide yes)
			)
		)
		(property "Value" "GND"
			(at 74.93 80.01 0)
			(effects
				(font
					(size 1.27 1.27)
				)
			)
		)
		(property "Footprint" ""
			(at 74.93 76.2 0)
			(effects
				(font
					(size 1.27 1.27)
				)
				(hide yes)
			)
		)
		(property "Datasheet" ""
			(at 74.93 76.2 0)
			(effects
				(font
					(size 1.27 1.27)
				)
				(hide yes)
			)
		)
		(property "Description" "Power symbol creates a global label with name \"GND\" , ground"
			(at 74.93 76.2 0)
			(effects
				(font
					(size 1.27 1.27)
				)
				(hide yes)
			)
		)
		(pin "1"
			(uuid "96439950-cf23-45bd-ad7c-30f7b607481b")
		)
	)
	(symbol
		(lib_id "POWDER_Power:TPS63070RNM")
		(at 129.54 71.12 0)
		(unit 1)
		(exclude_from_sim no)
		(in_bom yes)
		(on_board yes)
		(dnp no)
		(uuid "00000000-0000-0000-0000-00005e2d3eb4")
		(property "Reference" "U1301"
			(at 138.43 55.88 0)
			(effects
				(font
					(size 1.524 1.524)
				)
			)
		)
		(property "Value" "TPS63070RNM"
			(at 130.81 67.31 0)
			(effects
				(font
					(size 1.524 1.524)
				)
			)
		)
		(property "Footprint" "POWDER_Power:TPS63070RNMR"
			(at 132.08 71.374 0)
			(effects
				(font
					(size 1.524 1.524)
				)
				(hide yes)
			)
		)
		(property "Datasheet" ""
			(at 132.08 60.96 0)
			(effects
				(font
					(size 1.524 1.524)
				)
			)
		)
		(property "Description" "2-V to 16-V Buck-Boost Converter With 3.6-A Switch Current"
			(at 129.54 71.12 0)
			(effects
				(font
					(size 1.27 1.27)
				)
				(hide yes)
			)
		)
		(property "Manufacturer" "Texas Instruments"
			(at 129.54 71.12 0)
			(effects
				(font
					(size 1.27 1.27)
				)
				(hide yes)
			)
		)
		(property "PartNumber" "TPS63070RNMR"
			(at 129.54 71.12 0)
			(effects
				(font
					(size 1.27 1.27)
				)
				(hide yes)
			)
		)
		(property "PartSpecification" "3000-0000000079"
			(at 129.54 71.12 0)
			(effects
				(font
					(size 1.27 1.27)
				)
				(hide yes)
			)
		)
		(pin "1"
			(uuid "088e0e15-2916-410e-9d1e-678b92ff3303")
		)
		(pin "10"
			(uuid "75db26ff-b992-4000-81d5-1be94ab9e3ba")
		)
		(pin "11"
			(uuid "6c22f453-28a0-45e5-be21-1d5fc1fa6067")
		)
		(pin "12"
			(uuid "4f631c60-b324-4b6a-9c48-d92808a11718")
		)
		(pin "13"
			(uuid "4fb62ee6-b72f-48f3-b445-5c7fb36cb431")
		)
		(pin "14"
			(uuid "bd799d8d-d320-4a82-9cf7-c9fcb19ea79c")
		)
		(pin "15"
			(uuid "e2d2458d-b37b-4ed6-a06f-4660af74200a")
		)
		(pin "2"
			(uuid "01117ce9-2ce2-4527-94fd-0485cbdfdb1f")
		)
		(pin "3"
			(uuid "ec74cd86-57ed-46e7-8034-d8d847d130e1")
		)
		(pin "4"
			(uuid "ee1225ec-99a4-49b7-b0fa-20d72274a93b")
		)
		(pin "5"
			(uuid "d11294d3-2ae3-4837-86c7-67ae33bd8231")
		)
		(pin "6"
			(uuid "f382cf48-524f-4a93-ac0f-7644480fc04d")
		)
		(pin "7"
			(uuid "ee6a6315-8653-4f0c-a0bd-74414674560a")
		)
		(pin "8"
			(uuid "a3f1885b-d795-4da4-bd59-74206fe47c7b")
		)
		(pin "9"
			(uuid "0196e4e7-7556-4570-b2b2-06285c381b01")
		)
	)
	(symbol
		(lib_id "Device:R")
		(at 93.98 78.74 270)
		(unit 1)
		(exclude_from_sim no)
		(in_bom yes)
		(on_board yes)
		(dnp no)
		(uuid "00000000-0000-0000-0000-00005e2d4c6a")
		(property "Reference" "R1301"
			(at 93.98 80.772 90)
			(effects
				(font
					(size 1.27 1.27)
				)
			)
		)
		(property "Value" "10k"
			(at 93.98 78.74 90)
			(effects
				(font
					(size 1.27 1.27)
				)
			)
		)
		(property "Footprint" "Resistor_SMD:R_0402_1005Metric"
			(at 93.98 76.962 90)
			(effects
				(font
					(size 1.27 1.27)
				)
				(hide yes)
			)
		)
		(property "Datasheet" "~"
			(at 93.98 78.74 0)
			(effects
				(font
					(size 1.27 1.27)
				)
				(hide yes)
			)
		)
		(property "Description" "Resistor"
			(at 93.98 78.74 0)
			(effects
				(font
					(size 1.27 1.27)
				)
				(hide yes)
			)
		)
		(property "PartSpecification" "3000-0000000131"
			(at 93.98 78.74 0)
			(effects
				(font
					(size 1.27 1.27)
				)
				(hide yes)
			)
		)
		(pin "1"
			(uuid "e121113c-a39d-4450-8e82-7f8753f9886a")
		)
		(pin "2"
			(uuid "54ac6d46-6d01-4229-a2da-eaf4d1c88cc6")
		)
	)
	(symbol
		(lib_id "power:GND")
		(at 99.06 83.82 0)
		(unit 1)
		(exclude_from_sim no)
		(in_bom yes)
		(on_board yes)
		(dnp no)
		(uuid "00000000-0000-0000-0000-00005e2d719d")
		(property "Reference" "#PWR?"
			(at 99.06 90.17 0)
			(effects
				(font
					(size 1.27 1.27)
				)
				(hide yes)
			)
		)
		(property "Value" "GND"
			(at 99.06 87.63 0)
			(effects
				(font
					(size 1.27 1.27)
				)
			)
		)
		(property "Footprint" ""
			(at 99.06 83.82 0)
			(effects
				(font
					(size 1.27 1.27)
				)
				(hide yes)
			)
		)
		(property "Datasheet" ""
			(at 99.06 83.82 0)
			(effects
				(font
					(size 1.27 1.27)
				)
				(hide yes)
			)
		)
		(property "Description" "Power symbol creates a global label with name \"GND\" , ground"
			(at 99.06 83.82 0)
			(effects
				(font
					(size 1.27 1.27)
				)
				(hide yes)
			)
		)
		(pin "1"
			(uuid "76122cc6-194d-4333-b56b-2d539d21c037")
		)
	)
	(symbol
		(lib_id "000_PreferredParts:C_100nF")
		(at 83.82 81.28 0)
		(unit 1)
		(exclude_from_sim no)
		(in_bom yes)
		(on_board yes)
		(dnp no)
		(uuid "00000000-0000-0000-0000-00005e2d8296")
		(property "Reference" "C1304"
			(at 84.455 78.74 0)
			(effects
				(font
					(size 1.27 1.27)
				)
				(justify left)
			)
		)
		(property "Value" "C_100nF"
			(at 84.455 83.82 0)
			(effects
				(font
					(size 1.27 1.27)
				)
				(justify left)
				(hide yes)
			)
		)
		(property "Footprint" "Capacitor_SMD:C_0402_1005Metric"
			(at 84.7852 85.09 0)
			(effects
				(font
					(size 1.27 1.27)
				)
				(hide yes)
			)
		)
		(property "Datasheet" "~"
			(at 83.82 81.28 0)
			(effects
				(font
					(size 1.27 1.27)
				)
				(hide yes)
			)
		)
		(property "Description" "Unpolarized capacitor"
			(at 83.82 81.28 0)
			(effects
				(font
					(size 1.27 1.27)
				)
				(hide yes)
			)
		)
		(property "DisplayValue" "100nF"
			(at 87.63 83.82 0)
			(effects
				(font
					(size 1.27 1.27)
				)
			)
		)
		(property "PartSpecification" "3000-0000000125"
			(at 83.82 81.28 0)
			(effects
				(font
					(size 1.27 1.27)
				)
				(hide yes)
			)
		)
		(pin "1"
			(uuid "8657faf8-b0c0-4f65-b16a-45cb0d8be84d")
		)
		(pin "2"
			(uuid "dd76367c-f471-47d5-adea-271b5afe8281")
		)
	)
	(symbol
		(lib_id "power:GND")
		(at 83.82 87.63 0)
		(unit 1)
		(exclude_from_sim no)
		(in_bom yes)
		(on_board yes)
		(dnp no)
		(uuid "00000000-0000-0000-0000-00005e2d8a48")
		(property "Reference" "#PWR?"
			(at 83.82 93.98 0)
			(effects
				(font
					(size 1.27 1.27)
				)
				(hide yes)
			)
		)
		(property "Value" "GND"
			(at 83.82 91.44 0)
			(effects
				(font
					(size 1.27 1.27)
				)
			)
		)
		(property "Footprint" ""
			(at 83.82 87.63 0)
			(effects
				(font
					(size 1.27 1.27)
				)
				(hide yes)
			)
		)
		(property "Datasheet" ""
			(at 83.82 87.63 0)
			(effects
				(font
					(size 1.27 1.27)
				)
				(hide yes)
			)
		)
		(property "Description" "Power symbol creates a global label with name \"GND\" , ground"
			(at 83.82 87.63 0)
			(effects
				(font
					(size 1.27 1.27)
				)
				(hide yes)
			)
		)
		(pin "1"
			(uuid "37412ba2-0aff-48a9-860c-368ab0db904f")
		)
	)
	(symbol
		(lib_id "power:GND")
		(at 127 91.44 0)
		(unit 1)
		(exclude_from_sim no)
		(in_bom yes)
		(on_board yes)
		(dnp no)
		(uuid "00000000-0000-0000-0000-00005e2d8f7f")
		(property "Reference" "#PWR?"
			(at 127 97.79 0)
			(effects
				(font
					(size 1.27 1.27)
				)
				(hide yes)
			)
		)
		(property "Value" "GND"
			(at 127 95.25 0)
			(effects
				(font
					(size 1.27 1.27)
				)
			)
		)
		(property "Footprint" ""
			(at 127 91.44 0)
			(effects
				(font
					(size 1.27 1.27)
				)
				(hide yes)
			)
		)
		(property "Datasheet" ""
			(at 127 91.44 0)
			(effects
				(font
					(size 1.27 1.27)
				)
				(hide yes)
			)
		)
		(property "Description" "Power symbol creates a global label with name \"GND\" , ground"
			(at 127 91.44 0)
			(effects
				(font
					(size 1.27 1.27)
				)
				(hide yes)
			)
		)
		(pin "1"
			(uuid "25ba254b-904b-4eb8-990e-6b357094a990")
		)
	)
	(symbol
		(lib_id "power:GND")
		(at 132.08 91.44 0)
		(unit 1)
		(exclude_from_sim no)
		(in_bom yes)
		(on_board yes)
		(dnp no)
		(uuid "00000000-0000-0000-0000-00005e2d914f")
		(property "Reference" "#PWR?"
			(at 132.08 97.79 0)
			(effects
				(font
					(size 1.27 1.27)
				)
				(hide yes)
			)
		)
		(property "Value" "GND"
			(at 132.08 95.25 0)
			(effects
				(font
					(size 1.27 1.27)
				)
			)
		)
		(property "Footprint" ""
			(at 132.08 91.44 0)
			(effects
				(font
					(size 1.27 1.27)
				)
				(hide yes)
			)
		)
		(property "Datasheet" ""
			(at 132.08 91.44 0)
			(effects
				(font
					(size 1.27 1.27)
				)
				(hide yes)
			)
		)
		(property "Description" "Power symbol creates a global label with name \"GND\" , ground"
			(at 132.08 91.44 0)
			(effects
				(font
					(size 1.27 1.27)
				)
				(hide yes)
			)
		)
		(pin "1"
			(uuid "129619ff-c67a-4b24-9959-7fcd39eb3b1b")
		)
	)
	(symbol
		(lib_id "Device:L")
		(at 129.54 50.8 90)
		(unit 1)
		(exclude_from_sim no)
		(in_bom yes)
		(on_board yes)
		(dnp no)
		(uuid "00000000-0000-0000-0000-00005e2d9b50")
		(property "Reference" "L1301"
			(at 129.54 52.07 90)
			(effects
				(font
					(size 1.27 1.27)
				)
			)
		)
		(property "Value" "1.5uH"
			(at 129.54 48.895 90)
			(effects
				(font
					(size 1.27 1.27)
				)
			)
		)
		(property "Footprint" "Inductor_SMD:L_Taiyo-Yuden_MD-4040"
			(at 129.54 50.8 0)
			(effects
				(font
					(size 1.27 1.27)
				)
				(hide yes)
			)
		)
		(property "Datasheet" "~"
			(at 129.54 50.8 0)
			(effects
				(font
					(size 1.27 1.27)
				)
				(hide yes)
			)
		)
		(property "Description" "Inductor"
			(at 129.54 50.8 0)
			(effects
				(font
					(size 1.27 1.27)
				)
				(hide yes)
			)
		)
		(property "PartSpecification" "3000-0000000076"
			(at 129.54 50.8 90)
			(effects
				(font
					(size 1.27 1.27)
				)
				(hide yes)
			)
		)
		(pin "1"
			(uuid "f784e44b-a317-4f4e-80bf-6a99ada4cc80")
		)
		(pin "2"
			(uuid "a580fe86-d680-4bb9-aa1b-ffce59f10216")
		)
	)
	(symbol
		(lib_id "power:GND")
		(at 152.4 88.9 0)
		(unit 1)
		(exclude_from_sim no)
		(in_bom yes)
		(on_board yes)
		(dnp no)
		(uuid "00000000-0000-0000-0000-00005e2dbd86")
		(property "Reference" "#PWR?"
			(at 152.4 95.25 0)
			(effects
				(font
					(size 1.27 1.27)
				)
				(hide yes)
			)
		)
		(property "Value" "GND"
			(at 152.4 92.71 0)
			(effects
				(font
					(size 1.27 1.27)
				)
			)
		)
		(property "Footprint" ""
			(at 152.4 88.9 0)
			(effects
				(font
					(size 1.27 1.27)
				)
				(hide yes)
			)
		)
		(property "Datasheet" ""
			(at 152.4 88.9 0)
			(effects
				(font
					(size 1.27 1.27)
				)
				(hide yes)
			)
		)
		(property "Description" "Power symbol creates a global label with name \"GND\" , ground"
			(at 152.4 88.9 0)
			(effects
				(font
					(size 1.27 1.27)
				)
				(hide yes)
			)
		)
		(pin "1"
			(uuid "6ee74be0-00d2-4db7-9f64-c587e222dc24")
		)
	)
	(symbol
		(lib_id "Device:R")
		(at 165.1 72.39 180)
		(unit 1)
		(exclude_from_sim no)
		(in_bom yes)
		(on_board yes)
		(dnp no)
		(uuid "00000000-0000-0000-0000-00005e2dca41")
		(property "Reference" "R1304"
			(at 163.068 72.39 90)
			(effects
				(font
					(size 1.27 1.27)
				)
			)
		)
		(property "Value" "100k"
			(at 165.1 72.39 90)
			(effects
				(font
					(size 1.27 1.27)
				)
			)
		)
		(property "Footprint" "Resistor_SMD:R_0402_1005Metric"
			(at 166.878 72.39 90)
			(effects
				(font
					(size 1.27 1.27)
				)
				(hide yes)
			)
		)
		(property "Datasheet" "~"
			(at 165.1 72.39 0)
			(effects
				(font
					(size 1.27 1.27)
				)
				(hide yes)
			)
		)
		(property "Description" "Resistor"
			(at 165.1 72.39 0)
			(effects
				(font
					(size 1.27 1.27)
				)
				(hide yes)
			)
		)
		(property "PartSpecification" "3000-0000000575"
			(at 165.1 72.39 0)
			(effects
				(font
					(size 1.27 1.27)
				)
				(hide yes)
			)
		)
		(pin "1"
			(uuid "94f9e2b9-3fe4-48ca-9199-df64b8f52ecd")
		)
		(pin "2"
			(uuid "eb3ab7d0-159e-449f-8ad0-7cc7122f37a1")
		)
	)
	(symbol
		(lib_id "Device:R")
		(at 157.48 64.77 180)
		(unit 1)
		(exclude_from_sim no)
		(in_bom yes)
		(on_board yes)
		(dnp no)
		(uuid "00000000-0000-0000-0000-00005e2dcd42")
		(property "Reference" "R1302"
			(at 155.448 64.77 90)
			(effects
				(font
					(size 1.27 1.27)
				)
			)
		)
		(property "Value" "470k"
			(at 157.48 64.77 90)
			(effects
				(font
					(size 1.27 1.27)
				)
			)
		)
		(property "Footprint" "Resistor_SMD:R_0402_1005Metric"
			(at 159.258 64.77 90)
			(effects
				(font
					(size 1.27 1.27)
				)
				(hide yes)
			)
		)
		(property "Datasheet" "~"
			(at 157.48 64.77 0)
			(effects
				(font
					(size 1.27 1.27)
				)
				(hide yes)
			)
		)
		(property "Description" "Resistor"
			(at 157.48 64.77 0)
			(effects
				(font
					(size 1.27 1.27)
				)
				(hide yes)
			)
		)
		(property "PartSpecification" "3000-0000000157"
			(at 157.48 64.77 0)
			(effects
				(font
					(size 1.27 1.27)
				)
				(hide yes)
			)
		)
		(pin "1"
			(uuid "5e3677f3-1c6d-4b8f-a0a2-560097aa9d0a")
		)
		(pin "2"
			(uuid "f81ae411-c082-48d2-a905-8c10d6439047")
		)
	)
	(symbol
		(lib_id "Device:R")
		(at 157.48 83.82 180)
		(unit 1)
		(exclude_from_sim no)
		(in_bom yes)
		(on_board yes)
		(dnp no)
		(uuid "00000000-0000-0000-0000-00005e2de62e")
		(property "Reference" "R1303"
			(at 155.448 83.82 90)
			(effects
				(font
					(size 1.27 1.27)
				)
			)
		)
		(property "Value" "150k"
			(at 157.48 83.82 90)
			(effects
				(font
					(size 1.27 1.27)
				)
			)
		)
		(property "Footprint" "Resistor_SMD:R_0402_1005Metric"
			(at 159.258 83.82 90)
			(effects
				(font
					(size 1.27 1.27)
				)
				(hide yes)
			)
		)
		(property "Datasheet" "~"
			(at 157.48 83.82 0)
			(effects
				(font
					(size 1.27 1.27)
				)
				(hide yes)
			)
		)
		(property "Description" "Resistor"
			(at 157.48 83.82 0)
			(effects
				(font
					(size 1.27 1.27)
				)
				(hide yes)
			)
		)
		(property "PartSpecification" "3000-0000000579"
			(at 157.48 83.82 0)
			(effects
				(font
					(size 1.27 1.27)
				)
				(hide yes)
			)
		)
		(pin "1"
			(uuid "9a7ea9e0-ed00-4541-aed0-c3e6202d165d")
		)
		(pin "2"
			(uuid "bc4be58d-1564-4fc5-9d84-d803781d2e6d")
		)
	)
	(symbol
		(lib_id "power:GND")
		(at 157.48 88.9 0)
		(unit 1)
		(exclude_from_sim no)
		(in_bom yes)
		(on_board yes)
		(dnp no)
		(uuid "00000000-0000-0000-0000-00005e2de908")
		(property "Reference" "#PWR?"
			(at 157.48 95.25 0)
			(effects
				(font
					(size 1.27 1.27)
				)
				(hide yes)
			)
		)
		(property "Value" "GND"
			(at 157.48 92.71 0)
			(effects
				(font
					(size 1.27 1.27)
				)
			)
		)
		(property "Footprint" ""
			(at 157.48 88.9 0)
			(effects
				(font
					(size 1.27 1.27)
				)
				(hide yes)
			)
		)
		(property "Datasheet" ""
			(at 157.48 88.9 0)
			(effects
				(font
					(size 1.27 1.27)
				)
				(hide yes)
			)
		)
		(property "Description" "Power symbol creates a global label with name \"GND\" , ground"
			(at 157.48 88.9 0)
			(effects
				(font
					(size 1.27 1.27)
				)
				(hide yes)
			)
		)
		(pin "1"
			(uuid "7d25fde1-7a01-432c-bf04-3a53f4101a94")
		)
	)
	(symbol
		(lib_id "000_PreferredParts:C_10uF_0603")
		(at 177.8 69.85 0)
		(unit 1)
		(exclude_from_sim no)
		(in_bom yes)
		(on_board yes)
		(dnp no)
		(uuid "00000000-0000-0000-0000-00005e2e1ffc")
		(property "Reference" "C1305"
			(at 178.435 67.31 0)
			(effects
				(font
					(size 1.27 1.27)
				)
				(justify left)
			)
		)
		(property "Value" "C_10uF_0603"
			(at 178.435 72.39 0)
			(effects
				(font
					(size 1.27 1.27)
				)
				(justify left)
				(hide yes)
			)
		)
		(property "Footprint" "Capacitor_SMD:C_0603_1608Metric"
			(at 178.7652 73.66 0)
			(effects
				(font
					(size 1.27 1.27)
				)
				(hide yes)
			)
		)
		(property "Datasheet" "~"
			(at 177.8 69.85 0)
			(effects
				(font
					(size 1.27 1.27)
				)
				(hide yes)
			)
		)
		(property "Description" "Unpolarized capacitor"
			(at 177.8 69.85 0)
			(effects
				(font
					(size 1.27 1.27)
				)
				(hide yes)
			)
		)
		(property "DisplayValue" "10uF"
			(at 181.61 72.39 0)
			(effects
				(font
					(size 1.27 1.27)
				)
			)
		)
		(property "DisplayFootprint" "0603"
			(at 181.61 74.93 0)
			(effects
				(font
					(size 1.27 1.27)
				)
			)
		)
		(property "PartSpecification" "3000-0000000135"
			(at 177.8 69.85 0)
			(effects
				(font
					(size 1.27 1.27)
				)
				(hide yes)
			)
		)
		(pin "1"
			(uuid "c33342c6-f97a-4357-bbd7-c748128b01cc")
		)
		(pin "2"
			(uuid "accd9c86-5c89-4874-93d1-313055edffef")
		)
	)
	(symbol
		(lib_id "000_PreferredParts:C_10uF_0603")
		(at 185.42 69.85 0)
		(unit 1)
		(exclude_from_sim no)
		(in_bom yes)
		(on_board yes)
		(dnp no)
		(uuid "00000000-0000-0000-0000-00005e2e2720")
		(property "Reference" "C1306"
			(at 186.055 67.31 0)
			(effects
				(font
					(size 1.27 1.27)
				)
				(justify left)
			)
		)
		(property "Value" "C_10uF_0603"
			(at 186.055 72.39 0)
			(effects
				(font
					(size 1.27 1.27)
				)
				(justify left)
				(hide yes)
			)
		)
		(property "Footprint" "Capacitor_SMD:C_0603_1608Metric"
			(at 186.3852 73.66 0)
			(effects
				(font
					(size 1.27 1.27)
				)
				(hide yes)
			)
		)
		(property "Datasheet" "~"
			(at 185.42 69.85 0)
			(effects
				(font
					(size 1.27 1.27)
				)
				(hide yes)
			)
		)
		(property "Description" "Unpolarized capacitor"
			(at 185.42 69.85 0)
			(effects
				(font
					(size 1.27 1.27)
				)
				(hide yes)
			)
		)
		(property "DisplayValue" "10uF"
			(at 189.23 72.39 0)
			(effects
				(font
					(size 1.27 1.27)
				)
			)
		)
		(property "DisplayFootprint" "0603"
			(at 189.23 74.93 0)
			(effects
				(font
					(size 1.27 1.27)
				)
			)
		)
		(property "PartSpecification" "3000-0000000135"
			(at 185.42 69.85 0)
			(effects
				(font
					(size 1.27 1.27)
				)
				(hide yes)
			)
		)
		(pin "2"
			(uuid "8cd04c45-e11c-41e4-8acc-e66579d4c63c")
		)
		(pin "1"
			(uuid "43fa2bf0-81ef-4943-a863-a77396792550")
		)
	)
	(symbol
		(lib_id "000_PreferredParts:C_10uF_0603")
		(at 193.04 69.85 0)
		(unit 1)
		(exclude_from_sim no)
		(in_bom yes)
		(on_board yes)
		(dnp no)
		(uuid "00000000-0000-0000-0000-00005e2e2a81")
		(property "Reference" "C1307"
			(at 193.675 67.31 0)
			(effects
				(font
					(size 1.27 1.27)
				)
				(justify left)
			)
		)
		(property "Value" "C_10uF_0603"
			(at 193.675 72.39 0)
			(effects
				(font
					(size 1.27 1.27)
				)
				(justify left)
				(hide yes)
			)
		)
		(property "Footprint" "Capacitor_SMD:C_0603_1608Metric"
			(at 194.0052 73.66 0)
			(effects
				(font
					(size 1.27 1.27)
				)
				(hide yes)
			)
		)
		(property "Datasheet" "~"
			(at 193.04 69.85 0)
			(effects
				(font
					(size 1.27 1.27)
				)
				(hide yes)
			)
		)
		(property "Description" "Unpolarized capacitor"
			(at 193.04 69.85 0)
			(effects
				(font
					(size 1.27 1.27)
				)
				(hide yes)
			)
		)
		(property "DisplayValue" "10uF"
			(at 196.85 72.39 0)
			(effects
				(font
					(size 1.27 1.27)
				)
			)
		)
		(property "DisplayFootprint" "0603"
			(at 196.85 74.93 0)
			(effects
				(font
					(size 1.27 1.27)
				)
			)
		)
		(property "PartSpecification" "3000-0000000135"
			(at 193.04 69.85 0)
			(effects
				(font
					(size 1.27 1.27)
				)
				(hide yes)
			)
		)
		(pin "2"
			(uuid "7d953780-834b-4e28-9ce3-0187b1e92d9d")
		)
		(pin "1"
			(uuid "8c642ff2-7934-4103-a0dc-02205bc78136")
		)
	)
	(symbol
		(lib_id "000_PreferredParts:C_10uF_0603")
		(at 200.66 69.85 0)
		(unit 1)
		(exclude_from_sim no)
		(in_bom yes)
		(on_board yes)
		(dnp no)
		(uuid "00000000-0000-0000-0000-00005e2e2d8a")
		(property "Reference" "C1308"
			(at 201.295 67.31 0)
			(effects
				(font
					(size 1.27 1.27)
				)
				(justify left)
			)
		)
		(property "Value" "C_10uF_0603"
			(at 201.295 72.39 0)
			(effects
				(font
					(size 1.27 1.27)
				)
				(justify left)
				(hide yes)
			)
		)
		(property "Footprint" "Capacitor_SMD:C_0603_1608Metric"
			(at 201.6252 73.66 0)
			(effects
				(font
					(size 1.27 1.27)
				)
				(hide yes)
			)
		)
		(property "Datasheet" "~"
			(at 200.66 69.85 0)
			(effects
				(font
					(size 1.27 1.27)
				)
				(hide yes)
			)
		)
		(property "Description" "Unpolarized capacitor"
			(at 200.66 69.85 0)
			(effects
				(font
					(size 1.27 1.27)
				)
				(hide yes)
			)
		)
		(property "DisplayValue" "10uF"
			(at 204.47 72.39 0)
			(effects
				(font
					(size 1.27 1.27)
				)
			)
		)
		(property "DisplayFootprint" "0603"
			(at 204.47 74.93 0)
			(effects
				(font
					(size 1.27 1.27)
				)
			)
		)
		(property "PartSpecification" "3000-0000000135"
			(at 200.66 69.85 0)
			(effects
				(font
					(size 1.27 1.27)
				)
				(hide yes)
			)
		)
		(pin "2"
			(uuid "fa6ef76a-3166-4275-a5fa-2ba45ba7b4cd")
		)
		(pin "1"
			(uuid "b2a680af-a43c-4cdc-9d72-45d35c7a3ff3")
		)
	)
	(symbol
		(lib_id "000_PreferredParts:C_10uF_0603")
		(at 208.28 69.85 0)
		(unit 1)
		(exclude_from_sim no)
		(in_bom yes)
		(on_board yes)
		(dnp no)
		(uuid "00000000-0000-0000-0000-00005e2e3019")
		(property "Reference" "C1309"
			(at 208.915 67.31 0)
			(effects
				(font
					(size 1.27 1.27)
				)
				(justify left)
			)
		)
		(property "Value" "C_10uF_0603"
			(at 208.915 72.39 0)
			(effects
				(font
					(size 1.27 1.27)
				)
				(justify left)
				(hide yes)
			)
		)
		(property "Footprint" "Capacitor_SMD:C_0603_1608Metric"
			(at 209.2452 73.66 0)
			(effects
				(font
					(size 1.27 1.27)
				)
				(hide yes)
			)
		)
		(property "Datasheet" "~"
			(at 208.28 69.85 0)
			(effects
				(font
					(size 1.27 1.27)
				)
				(hide yes)
			)
		)
		(property "Description" "Unpolarized capacitor"
			(at 208.28 69.85 0)
			(effects
				(font
					(size 1.27 1.27)
				)
				(hide yes)
			)
		)
		(property "DisplayValue" "10uF"
			(at 212.09 72.39 0)
			(effects
				(font
					(size 1.27 1.27)
				)
			)
		)
		(property "DisplayFootprint" "0603"
			(at 212.09 74.93 0)
			(effects
				(font
					(size 1.27 1.27)
				)
			)
		)
		(property "PartSpecification" "3000-0000000135"
			(at 208.28 69.85 0)
			(effects
				(font
					(size 1.27 1.27)
				)
				(hide yes)
			)
		)
		(pin "2"
			(uuid "022a82b4-f63d-4d1f-8f08-bc3bbaa63fde")
		)
		(pin "1"
			(uuid "1103ec54-9103-44b8-b75a-09c4cd0addf8")
		)
	)
	(symbol
		(lib_id "000_PreferredParts:C_10uF_0603")
		(at 220.98 69.85 0)
		(unit 1)
		(exclude_from_sim no)
		(in_bom yes)
		(on_board yes)
		(dnp no)
		(uuid "00000000-0000-0000-0000-00005e2e32e0")
		(property "Reference" "C1310"
			(at 221.615 67.31 0)
			(effects
				(font
					(size 1.27 1.27)
				)
				(justify left)
			)
		)
		(property "Value" "C_10uF_0603"
			(at 221.615 72.39 0)
			(effects
				(font
					(size 1.27 1.27)
				)
				(justify left)
				(hide yes)
			)
		)
		(property "Footprint" "Capacitor_SMD:C_0603_1608Metric"
			(at 221.9452 73.66 0)
			(effects
				(font
					(size 1.27 1.27)
				)
				(hide yes)
			)
		)
		(property "Datasheet" "~"
			(at 220.98 69.85 0)
			(effects
				(font
					(size 1.27 1.27)
				)
				(hide yes)
			)
		)
		(property "Description" "Unpolarized capacitor"
			(at 220.98 69.85 0)
			(effects
				(font
					(size 1.27 1.27)
				)
				(hide yes)
			)
		)
		(property "DisplayValue" "10uF"
			(at 224.79 72.39 0)
			(effects
				(font
					(size 1.27 1.27)
				)
			)
		)
		(property "DisplayFootprint" "0603"
			(at 224.79 74.93 0)
			(effects
				(font
					(size 1.27 1.27)
				)
			)
		)
		(property "PartSpecification" "3000-0000000135"
			(at 220.98 69.85 0)
			(effects
				(font
					(size 1.27 1.27)
				)
				(hide yes)
			)
		)
		(pin "2"
			(uuid "279dad25-e22c-4124-8758-701707f0186a")
		)
		(pin "1"
			(uuid "a8d14317-8392-4256-80a1-3a8efa43ce06")
		)
	)
	(symbol
		(lib_id "000_PreferredParts:C_10uF_0603")
		(at 228.6 69.85 0)
		(unit 1)
		(exclude_from_sim no)
		(in_bom yes)
		(on_board yes)
		(dnp no)
		(uuid "00000000-0000-0000-0000-00005e2e356f")
		(property "Reference" "C1311"
			(at 229.235 67.31 0)
			(effects
				(font
					(size 1.27 1.27)
				)
				(justify left)
			)
		)
		(property "Value" "C_10uF_0603"
			(at 229.235 72.39 0)
			(effects
				(font
					(size 1.27 1.27)
				)
				(justify left)
				(hide yes)
			)
		)
		(property "Footprint" "Capacitor_SMD:C_0603_1608Metric"
			(at 229.5652 73.66 0)
			(effects
				(font
					(size 1.27 1.27)
				)
				(hide yes)
			)
		)
		(property "Datasheet" "~"
			(at 228.6 69.85 0)
			(effects
				(font
					(size 1.27 1.27)
				)
				(hide yes)
			)
		)
		(property "Description" "Unpolarized capacitor"
			(at 228.6 69.85 0)
			(effects
				(font
					(size 1.27 1.27)
				)
				(hide yes)
			)
		)
		(property "DisplayValue" "10uF"
			(at 232.41 72.39 0)
			(effects
				(font
					(size 1.27 1.27)
				)
			)
		)
		(property "DisplayFootprint" "0603"
			(at 232.41 74.93 0)
			(effects
				(font
					(size 1.27 1.27)
				)
			)
		)
		(property "PartSpecification" "3000-0000000135"
			(at 228.6 69.85 0)
			(effects
				(font
					(size 1.27 1.27)
				)
				(hide yes)
			)
		)
		(pin "2"
			(uuid "a58dcf9f-8849-4ec5-9ad2-00f69a392105")
		)
		(pin "1"
			(uuid "0736f011-cb5a-49d5-9f16-401106a69e18")
		)
	)
	(symbol
		(lib_id "power:GND")
		(at 177.8 76.2 0)
		(unit 1)
		(exclude_from_sim no)
		(in_bom yes)
		(on_board yes)
		(dnp no)
		(uuid "00000000-0000-0000-0000-00005e2e49dc")
		(property "Reference" "#PWR?"
			(at 177.8 82.55 0)
			(effects
				(font
					(size 1.27 1.27)
				)
				(hide yes)
			)
		)
		(property "Value" "GND"
			(at 177.8 80.01 0)
			(effects
				(font
					(size 1.27 1.27)
				)
			)
		)
		(property "Footprint" ""
			(at 177.8 76.2 0)
			(effects
				(font
					(size 1.27 1.27)
				)
				(hide yes)
			)
		)
		(property "Datasheet" ""
			(at 177.8 76.2 0)
			(effects
				(font
					(size 1.27 1.27)
				)
				(hide yes)
			)
		)
		(property "Description" "Power symbol creates a global label with name \"GND\" , ground"
			(at 177.8 76.2 0)
			(effects
				(font
					(size 1.27 1.27)
				)
				(hide yes)
			)
		)
		(pin "1"
			(uuid "898647b3-4032-49c0-999a-cf1c7bb54fdf")
		)
	)
	(symbol
		(lib_id "power:GND")
		(at 185.42 76.2 0)
		(unit 1)
		(exclude_from_sim no)
		(in_bom yes)
		(on_board yes)
		(dnp no)
		(uuid "00000000-0000-0000-0000-00005e2e63ab")
		(property "Reference" "#PWR?"
			(at 185.42 82.55 0)
			(effects
				(font
					(size 1.27 1.27)
				)
				(hide yes)
			)
		)
		(property "Value" "GND"
			(at 185.42 80.01 0)
			(effects
				(font
					(size 1.27 1.27)
				)
			)
		)
		(property "Footprint" ""
			(at 185.42 76.2 0)
			(effects
				(font
					(size 1.27 1.27)
				)
				(hide yes)
			)
		)
		(property "Datasheet" ""
			(at 185.42 76.2 0)
			(effects
				(font
					(size 1.27 1.27)
				)
				(hide yes)
			)
		)
		(property "Description" "Power symbol creates a global label with name \"GND\" , ground"
			(at 185.42 76.2 0)
			(effects
				(font
					(size 1.27 1.27)
				)
				(hide yes)
			)
		)
		(pin "1"
			(uuid "7958bf42-df86-4fc5-b807-2d6e52a05cfa")
		)
	)
	(symbol
		(lib_id "power:GND")
		(at 193.04 76.2 0)
		(unit 1)
		(exclude_from_sim no)
		(in_bom yes)
		(on_board yes)
		(dnp no)
		(uuid "00000000-0000-0000-0000-00005e2e6d03")
		(property "Reference" "#PWR?"
			(at 193.04 82.55 0)
			(effects
				(font
					(size 1.27 1.27)
				)
				(hide yes)
			)
		)
		(property "Value" "GND"
			(at 193.04 80.01 0)
			(effects
				(font
					(size 1.27 1.27)
				)
			)
		)
		(property "Footprint" ""
			(at 193.04 76.2 0)
			(effects
				(font
					(size 1.27 1.27)
				)
				(hide yes)
			)
		)
		(property "Datasheet" ""
			(at 193.04 76.2 0)
			(effects
				(font
					(size 1.27 1.27)
				)
				(hide yes)
			)
		)
		(property "Description" "Power symbol creates a global label with name \"GND\" , ground"
			(at 193.04 76.2 0)
			(effects
				(font
					(size 1.27 1.27)
				)
				(hide yes)
			)
		)
		(pin "1"
			(uuid "b17c77b4-3d74-4835-b355-83ef7f351f35")
		)
	)
	(symbol
		(lib_id "power:GND")
		(at 200.66 76.2 0)
		(unit 1)
		(exclude_from_sim no)
		(in_bom yes)
		(on_board yes)
		(dnp no)
		(uuid "00000000-0000-0000-0000-00005e2e7660")
		(property "Reference" "#PWR?"
			(at 200.66 82.55 0)
			(effects
				(font
					(size 1.27 1.27)
				)
				(hide yes)
			)
		)
		(property "Value" "GND"
			(at 200.66 80.01 0)
			(effects
				(font
					(size 1.27 1.27)
				)
			)
		)
		(property "Footprint" ""
			(at 200.66 76.2 0)
			(effects
				(font
					(size 1.27 1.27)
				)
				(hide yes)
			)
		)
		(property "Datasheet" ""
			(at 200.66 76.2 0)
			(effects
				(font
					(size 1.27 1.27)
				)
				(hide yes)
			)
		)
		(property "Description" "Power symbol creates a global label with name \"GND\" , ground"
			(at 200.66 76.2 0)
			(effects
				(font
					(size 1.27 1.27)
				)
				(hide yes)
			)
		)
		(pin "1"
			(uuid "dcc7dfb6-307c-43fd-b578-e318f60293d0")
		)
	)
	(symbol
		(lib_id "power:GND")
		(at 208.28 76.2 0)
		(unit 1)
		(exclude_from_sim no)
		(in_bom yes)
		(on_board yes)
		(dnp no)
		(uuid "00000000-0000-0000-0000-00005e2e7ff5")
		(property "Reference" "#PWR?"
			(at 208.28 82.55 0)
			(effects
				(font
					(size 1.27 1.27)
				)
				(hide yes)
			)
		)
		(property "Value" "GND"
			(at 208.28 80.01 0)
			(effects
				(font
					(size 1.27 1.27)
				)
			)
		)
		(property "Footprint" ""
			(at 208.28 76.2 0)
			(effects
				(font
					(size 1.27 1.27)
				)
				(hide yes)
			)
		)
		(property "Datasheet" ""
			(at 208.28 76.2 0)
			(effects
				(font
					(size 1.27 1.27)
				)
				(hide yes)
			)
		)
		(property "Description" "Power symbol creates a global label with name \"GND\" , ground"
			(at 208.28 76.2 0)
			(effects
				(font
					(size 1.27 1.27)
				)
				(hide yes)
			)
		)
		(pin "1"
			(uuid "cc806bc7-3e15-492c-bd45-21e37f4ef478")
		)
	)
	(symbol
		(lib_id "power:GND")
		(at 220.98 76.2 0)
		(unit 1)
		(exclude_from_sim no)
		(in_bom yes)
		(on_board yes)
		(dnp no)
		(uuid "00000000-0000-0000-0000-00005e2e8a79")
		(property "Reference" "#PWR?"
			(at 220.98 82.55 0)
			(effects
				(font
					(size 1.27 1.27)
				)
				(hide yes)
			)
		)
		(property "Value" "GND"
			(at 220.98 80.01 0)
			(effects
				(font
					(size 1.27 1.27)
				)
			)
		)
		(property "Footprint" ""
			(at 220.98 76.2 0)
			(effects
				(font
					(size 1.27 1.27)
				)
				(hide yes)
			)
		)
		(property "Datasheet" ""
			(at 220.98 76.2 0)
			(effects
				(font
					(size 1.27 1.27)
				)
				(hide yes)
			)
		)
		(property "Description" "Power symbol creates a global label with name \"GND\" , ground"
			(at 220.98 76.2 0)
			(effects
				(font
					(size 1.27 1.27)
				)
				(hide yes)
			)
		)
		(pin "1"
			(uuid "ab073346-47fe-4e6e-8142-769296b88127")
		)
	)
	(symbol
		(lib_id "power:GND")
		(at 228.6 76.2 0)
		(unit 1)
		(exclude_from_sim no)
		(in_bom yes)
		(on_board yes)
		(dnp no)
		(uuid "00000000-0000-0000-0000-00005e2e94bd")
		(property "Reference" "#PWR?"
			(at 228.6 82.55 0)
			(effects
				(font
					(size 1.27 1.27)
				)
				(hide yes)
			)
		)
		(property "Value" "GND"
			(at 228.6 80.01 0)
			(effects
				(font
					(size 1.27 1.27)
				)
			)
		)
		(property "Footprint" ""
			(at 228.6 76.2 0)
			(effects
				(font
					(size 1.27 1.27)
				)
				(hide yes)
			)
		)
		(property "Datasheet" ""
			(at 228.6 76.2 0)
			(effects
				(font
					(size 1.27 1.27)
				)
				(hide yes)
			)
		)
		(property "Description" "Power symbol creates a global label with name \"GND\" , ground"
			(at 228.6 76.2 0)
			(effects
				(font
					(size 1.27 1.27)
				)
				(hide yes)
			)
		)
		(pin "1"
			(uuid "4476adbe-3374-4227-9a86-3bcbcf733bf2")
		)
	)
	(symbol
		(lib_id "power:+3.3V")
		(at 236.22 58.42 0)
		(unit 1)
		(exclude_from_sim no)
		(in_bom yes)
		(on_board yes)
		(dnp no)
		(uuid "00000000-0000-0000-0000-00005e2f45a9")
		(property "Reference" "#PWR?"
			(at 236.22 62.23 0)
			(effects
				(font
					(size 1.27 1.27)
				)
				(hide yes)
			)
		)
		(property "Value" "+3.3V"
			(at 236.22 54.864 0)
			(effects
				(font
					(size 1.27 1.27)
				)
			)
		)
		(property "Footprint" ""
			(at 236.22 58.42 0)
			(effects
				(font
					(size 1.27 1.27)
				)
				(hide yes)
			)
		)
		(property "Datasheet" ""
			(at 236.22 58.42 0)
			(effects
				(font
					(size 1.27 1.27)
				)
				(hide yes)
			)
		)
		(property "Description" "Power symbol creates a global label with name \"+3.3V\""
			(at 236.22 58.42 0)
			(effects
				(font
					(size 1.27 1.27)
				)
				(hide yes)
			)
		)
		(pin "1"
			(uuid "9399be24-b607-4ab1-8a97-d59d74cef55e")
		)
	)
	(symbol
		(lib_id "Device:R")
		(at 214.63 60.96 270)
		(unit 1)
		(exclude_from_sim no)
		(in_bom yes)
		(on_board yes)
		(dnp no)
		(uuid "00000000-0000-0000-0000-00005e312b06")
		(property "Reference" "R1305"
			(at 214.63 62.992 90)
			(effects
				(font
					(size 1.27 1.27)
				)
			)
		)
		(property "Value" "3m"
			(at 214.63 60.96 90)
			(effects
				(font
					(size 1.27 1.27)
				)
			)
		)
		(property "Footprint" "POWDER_Power:R_0508_1220Metric"
			(at 214.63 59.182 90)
			(effects
				(font
					(size 1.27 1.27)
				)
				(hide yes)
			)
		)
		(property "Datasheet" "~"
			(at 214.63 60.96 0)
			(effects
				(font
					(size 1.27 1.27)
				)
				(hide yes)
			)
		)
		(property "Description" "Resistor"
			(at 214.63 60.96 0)
			(effects
				(font
					(size 1.27 1.27)
				)
				(hide yes)
			)
		)
		(property "PartSpecification" "3000-0000000499"
			(at 214.63 60.96 0)
			(effects
				(font
					(size 1.27 1.27)
				)
				(hide yes)
			)
		)
		(pin "1"
			(uuid "4744c68e-9484-42e9-b4f7-1ecd67a58013")
		)
		(pin "2"
			(uuid "becd01d9-b377-41e6-a22f-b6216d089781")
		)
	)
	(symbol
		(lib_id "Device:R")
		(at 241.3 85.09 0)
		(unit 1)
		(exclude_from_sim no)
		(in_bom yes)
		(on_board yes)
		(dnp no)
		(uuid "00000000-0000-0000-0000-00005e638d45")
		(property "Reference" "R1307"
			(at 243.332 85.09 90)
			(effects
				(font
					(size 1.27 1.27)
				)
			)
		)
		(property "Value" "11.8k"
			(at 241.3 85.09 90)
			(effects
				(font
					(size 1.27 1.27)
				)
			)
		)
		(property "Footprint" "Resistor_SMD:R_0402_1005Metric"
			(at 239.522 85.09 90)
			(effects
				(font
					(size 1.27 1.27)
				)
				(hide yes)
			)
		)
		(property "Datasheet" "~"
			(at 241.3 85.09 0)
			(effects
				(font
					(size 1.27 1.27)
				)
				(hide yes)
			)
		)
		(property "Description" "Resistor"
			(at 241.3 85.09 0)
			(effects
				(font
					(size 1.27 1.27)
				)
				(hide yes)
			)
		)
		(property "PartNumber" "RMCF0402FT11K8"
			(at 241.3 85.09 0)
			(effects
				(font
					(size 1.27 1.27)
				)
				(hide yes)
			)
		)
		(property "PartSpecification" "3000-0000001124"
			(at 241.3 85.09 0)
			(effects
				(font
					(size 1.27 1.27)
				)
				(hide yes)
			)
		)
		(pin "1"
			(uuid "50365e46-1b75-4212-a419-f29a82211ce3")
		)
		(pin "2"
			(uuid "e68428e9-a3e2-4b7e-b1c9-38523657b7f2")
		)
		(instances
			(project ""
				(path "/ec7a7b70-ccb9-4390-b6b5-6b4a2f30098a/00000000-0000-0000-0000-00005ef8ef7c/00000000-0000-0000-0000-000060c9565d"
					(reference "R1307")
					(unit 1)
				)
			)
		)
	)
	(symbol
		(lib_id "Device:R")
		(at 241.3 74.93 0)
		(unit 1)
		(exclude_from_sim no)
		(in_bom yes)
		(on_board yes)
		(dnp no)
		(uuid "00000000-0000-0000-0000-00005e638d4b")
		(property "Reference" "R1306"
			(at 243.332 74.93 90)
			(effects
				(font
					(size 1.27 1.27)
				)
			)
		)
		(property "Value" "11.8k"
			(at 241.3 74.93 90)
			(effects
				(font
					(size 1.27 1.27)
				)
			)
		)
		(property "Footprint" "Resistor_SMD:R_0402_1005Metric"
			(at 239.522 74.93 90)
			(effects
				(font
					(size 1.27 1.27)
				)
				(hide yes)
			)
		)
		(property "Datasheet" "~"
			(at 241.3 74.93 0)
			(effects
				(font
					(size 1.27 1.27)
				)
				(hide yes)
			)
		)
		(property "Description" "Resistor"
			(at 241.3 74.93 0)
			(effects
				(font
					(size 1.27 1.27)
				)
				(hide yes)
			)
		)
		(property "PartNumber" "RMCF0402FT11K8"
			(at 241.3 74.93 0)
			(effects
				(font
					(size 1.27 1.27)
				)
				(hide yes)
			)
		)
		(property "PartSpecification" "3000-0000001124"
			(at 241.3 74.93 0)
			(effects
				(font
					(size 1.27 1.27)
				)
				(hide yes)
			)
		)
		(pin "1"
			(uuid "e4f439b5-a3b3-4df9-b04e-33633d4d911a")
		)
		(pin "2"
			(uuid "b5ab5ff7-bf5d-4eed-8b74-51a8f0b1e46f")
		)
		(instances
			(project ""
				(path "/ec7a7b70-ccb9-4390-b6b5-6b4a2f30098a/00000000-0000-0000-0000-00005ef8ef7c/00000000-0000-0000-0000-000060c9565d"
					(reference "R1306")
					(unit 1)
				)
			)
		)
	)
	(symbol
		(lib_id "power:GND")
		(at 241.3 91.44 0)
		(unit 1)
		(exclude_from_sim no)
		(in_bom yes)
		(on_board yes)
		(dnp no)
		(uuid "00000000-0000-0000-0000-00005e638d52")
		(property "Reference" "#PWR?"
			(at 241.3 97.79 0)
			(effects
				(font
					(size 1.27 1.27)
				)
				(hide yes)
			)
		)
		(property "Value" "GND"
			(at 241.3 95.25 0)
			(effects
				(font
					(size 1.27 1.27)
				)
			)
		)
		(property "Footprint" ""
			(at 241.3 91.44 0)
			(effects
				(font
					(size 1.27 1.27)
				)
				(hide yes)
			)
		)
		(property "Datasheet" ""
			(at 241.3 91.44 0)
			(effects
				(font
					(size 1.27 1.27)
				)
				(hide yes)
			)
		)
		(property "Description" "Power symbol creates a global label with name \"GND\" , ground"
			(at 241.3 91.44 0)
			(effects
				(font
					(size 1.27 1.27)
				)
				(hide yes)
			)
		)
		(pin "1"
			(uuid "e9dfe564-34df-48b0-b5c4-f3d915731954")
		)
		(instances
			(project ""
				(path "/ec7a7b70-ccb9-4390-b6b5-6b4a2f30098a/00000000-0000-0000-0000-00005ef8ef7c/00000000-0000-0000-0000-000060c9565d"
					(reference "#PWR?")
					(unit 1)
				)
			)
		)
	)
)
