(kicad_sch (version 20211123) (generator eeschema)

  (uuid cc0b2b4b-4f68-472f-86b7-7133cb0b4b57)

  (paper "A4")

  (lib_symbols
    (symbol "000_PreferredParts:C_0_1uF" (pin_numbers hide) (pin_names (offset 0.254)) (in_bom yes) (on_board yes)
      (property "Reference" "C" (id 0) (at 0.635 2.54 0)
        (effects (font (size 1.27 1.27)) (justify left))
      )
      (property "Value" "C_0_1uF" (id 1) (at 0.635 -2.54 0)
        (effects (font (size 1.27 1.27)) (justify left) hide)
      )
      (property "Footprint" "Capacitor_SMD:C_0402_1005Metric" (id 2) (at 0.9652 -3.81 0)
        (effects (font (size 1.27 1.27)) hide)
      )
      (property "Datasheet" "~" (id 3) (at 0 0 0)
        (effects (font (size 1.27 1.27)) hide)
      )
      (property "DisplayValue" "0.1uF" (id 4) (at 3.81 -2.54 0)
        (effects (font (size 1.27 1.27)))
      )
      (property "PartSpecification" "3000-0000000125" (id 5) (at 0 0 0)
        (effects (font (size 1.27 1.27)) hide)
      )
      (property "Voltage" "100V" (id 6) (at 0 0 0)
        (effects (font (size 1.27 1.27)) hide)
      )
      (property "ki_keywords" "cap capacitor" (id 7) (at 0 0 0)
        (effects (font (size 1.27 1.27)) hide)
      )
      (property "ki_description" "Unpolarized capacitor" (id 8) (at 0 0 0)
        (effects (font (size 1.27 1.27)) hide)
      )
      (property "ki_fp_filters" "C_*" (id 9) (at 0 0 0)
        (effects (font (size 1.27 1.27)) hide)
      )
      (symbol "C_0_1uF_0_1"
        (polyline
          (pts
            (xy -2.032 -0.762)
            (xy 2.032 -0.762)
          )
          (stroke (width 0.508) (type default) (color 0 0 0 0))
          (fill (type none))
        )
        (polyline
          (pts
            (xy -2.032 0.762)
            (xy 2.032 0.762)
          )
          (stroke (width 0.508) (type default) (color 0 0 0 0))
          (fill (type none))
        )
      )
      (symbol "C_0_1uF_1_1"
        (pin passive line (at 0 3.81 270) (length 2.794)
          (name "~" (effects (font (size 1.27 1.27))))
          (number "1" (effects (font (size 1.27 1.27))))
        )
        (pin passive line (at 0 -3.81 90) (length 2.794)
          (name "~" (effects (font (size 1.27 1.27))))
          (number "2" (effects (font (size 1.27 1.27))))
        )
      )
    )
    (symbol "000_PreferredParts:C_10pF" (pin_numbers hide) (pin_names (offset 0.254)) (in_bom yes) (on_board yes)
      (property "Reference" "C" (id 0) (at 0.635 2.54 0)
        (effects (font (size 1.27 1.27)) (justify left))
      )
      (property "Value" "C_10pF" (id 1) (at 0.635 -2.54 0)
        (effects (font (size 1.27 1.27)) (justify left))
      )
      (property "Footprint" "Capacitor_SMD:C_0402_1005Metric" (id 2) (at 0.9652 -3.81 0)
        (effects (font (size 1.27 1.27)) hide)
      )
      (property "Datasheet" "~" (id 3) (at 0 0 0)
        (effects (font (size 1.27 1.27)) hide)
      )
      (property "PartSpecification" "3000-0000000582" (id 4) (at 0 0 0)
        (effects (font (size 1.27 1.27)) hide)
      )
      (property "ki_keywords" "cap capacitor" (id 5) (at 0 0 0)
        (effects (font (size 1.27 1.27)) hide)
      )
      (property "ki_description" "Unpolarized capacitor" (id 6) (at 0 0 0)
        (effects (font (size 1.27 1.27)) hide)
      )
      (property "ki_fp_filters" "C_*" (id 7) (at 0 0 0)
        (effects (font (size 1.27 1.27)) hide)
      )
      (symbol "C_10pF_0_1"
        (polyline
          (pts
            (xy -2.032 -0.762)
            (xy 2.032 -0.762)
          )
          (stroke (width 0.508) (type default) (color 0 0 0 0))
          (fill (type none))
        )
        (polyline
          (pts
            (xy -2.032 0.762)
            (xy 2.032 0.762)
          )
          (stroke (width 0.508) (type default) (color 0 0 0 0))
          (fill (type none))
        )
      )
      (symbol "C_10pF_1_1"
        (pin passive line (at 0 3.81 270) (length 2.794)
          (name "~" (effects (font (size 1.27 1.27))))
          (number "1" (effects (font (size 1.27 1.27))))
        )
        (pin passive line (at 0 -3.81 90) (length 2.794)
          (name "~" (effects (font (size 1.27 1.27))))
          (number "2" (effects (font (size 1.27 1.27))))
        )
      )
    )
    (symbol "000_PreferredParts:C_1nF" (pin_numbers hide) (pin_names (offset 0.254)) (in_bom yes) (on_board yes)
      (property "Reference" "C" (id 0) (at 0.635 2.54 0)
        (effects (font (size 1.27 1.27)) (justify left))
      )
      (property "Value" "C_1nF" (id 1) (at 0.635 -2.54 0)
        (effects (font (size 1.27 1.27)) (justify left))
      )
      (property "Footprint" "Capacitor_SMD:C_0402_1005Metric" (id 2) (at 0.9652 -3.81 0)
        (effects (font (size 1.27 1.27)) hide)
      )
      (property "Datasheet" "~" (id 3) (at 0 0 0)
        (effects (font (size 1.27 1.27)) hide)
      )
      (property "PartSpecification" "3000-0000000128" (id 4) (at 0 0 0)
        (effects (font (size 1.27 1.27)) hide)
      )
      (property "ki_keywords" "cap capacitor" (id 5) (at 0 0 0)
        (effects (font (size 1.27 1.27)) hide)
      )
      (property "ki_description" "Unpolarized capacitor" (id 6) (at 0 0 0)
        (effects (font (size 1.27 1.27)) hide)
      )
      (property "ki_fp_filters" "C_*" (id 7) (at 0 0 0)
        (effects (font (size 1.27 1.27)) hide)
      )
      (symbol "C_1nF_0_1"
        (polyline
          (pts
            (xy -2.032 -0.762)
            (xy 2.032 -0.762)
          )
          (stroke (width 0.508) (type default) (color 0 0 0 0))
          (fill (type none))
        )
        (polyline
          (pts
            (xy -2.032 0.762)
            (xy 2.032 0.762)
          )
          (stroke (width 0.508) (type default) (color 0 0 0 0))
          (fill (type none))
        )
      )
      (symbol "C_1nF_1_1"
        (pin passive line (at 0 3.81 270) (length 2.794)
          (name "~" (effects (font (size 1.27 1.27))))
          (number "1" (effects (font (size 1.27 1.27))))
        )
        (pin passive line (at 0 -3.81 90) (length 2.794)
          (name "~" (effects (font (size 1.27 1.27))))
          (number "2" (effects (font (size 1.27 1.27))))
        )
      )
    )
    (symbol "Device:C" (pin_numbers hide) (pin_names (offset 0.254)) (in_bom yes) (on_board yes)
      (property "Reference" "C" (id 0) (at 0.635 2.54 0)
        (effects (font (size 1.27 1.27)) (justify left))
      )
      (property "Value" "C" (id 1) (at 0.635 -2.54 0)
        (effects (font (size 1.27 1.27)) (justify left))
      )
      (property "Footprint" "" (id 2) (at 0.9652 -3.81 0)
        (effects (font (size 1.27 1.27)) hide)
      )
      (property "Datasheet" "~" (id 3) (at 0 0 0)
        (effects (font (size 1.27 1.27)) hide)
      )
      (property "ki_keywords" "cap capacitor" (id 4) (at 0 0 0)
        (effects (font (size 1.27 1.27)) hide)
      )
      (property "ki_description" "Unpolarized capacitor" (id 5) (at 0 0 0)
        (effects (font (size 1.27 1.27)) hide)
      )
      (property "ki_fp_filters" "C_*" (id 6) (at 0 0 0)
        (effects (font (size 1.27 1.27)) hide)
      )
      (symbol "C_0_1"
        (polyline
          (pts
            (xy -2.032 -0.762)
            (xy 2.032 -0.762)
          )
          (stroke (width 0.508) (type default) (color 0 0 0 0))
          (fill (type none))
        )
        (polyline
          (pts
            (xy -2.032 0.762)
            (xy 2.032 0.762)
          )
          (stroke (width 0.508) (type default) (color 0 0 0 0))
          (fill (type none))
        )
      )
      (symbol "C_1_1"
        (pin passive line (at 0 3.81 270) (length 2.794)
          (name "~" (effects (font (size 1.27 1.27))))
          (number "1" (effects (font (size 1.27 1.27))))
        )
        (pin passive line (at 0 -3.81 90) (length 2.794)
          (name "~" (effects (font (size 1.27 1.27))))
          (number "2" (effects (font (size 1.27 1.27))))
        )
      )
    )
    (symbol "Device:FerriteBead" (pin_numbers hide) (pin_names (offset 0)) (in_bom yes) (on_board yes)
      (property "Reference" "FB" (id 0) (at -3.81 0.635 90)
        (effects (font (size 1.27 1.27)))
      )
      (property "Value" "FerriteBead" (id 1) (at 3.81 0 90)
        (effects (font (size 1.27 1.27)))
      )
      (property "Footprint" "" (id 2) (at -1.778 0 90)
        (effects (font (size 1.27 1.27)) hide)
      )
      (property "Datasheet" "~" (id 3) (at 0 0 0)
        (effects (font (size 1.27 1.27)) hide)
      )
      (property "ki_keywords" "L ferrite bead inductor filter" (id 4) (at 0 0 0)
        (effects (font (size 1.27 1.27)) hide)
      )
      (property "ki_description" "Ferrite bead" (id 5) (at 0 0 0)
        (effects (font (size 1.27 1.27)) hide)
      )
      (property "ki_fp_filters" "Inductor_* L_* *Ferrite*" (id 6) (at 0 0 0)
        (effects (font (size 1.27 1.27)) hide)
      )
      (symbol "FerriteBead_0_1"
        (polyline
          (pts
            (xy 0 -1.27)
            (xy 0 -1.2192)
          )
          (stroke (width 0) (type default) (color 0 0 0 0))
          (fill (type none))
        )
        (polyline
          (pts
            (xy 0 1.27)
            (xy 0 1.2954)
          )
          (stroke (width 0) (type default) (color 0 0 0 0))
          (fill (type none))
        )
        (polyline
          (pts
            (xy -2.7686 0.4064)
            (xy -1.7018 2.2606)
            (xy 2.7686 -0.3048)
            (xy 1.6764 -2.159)
            (xy -2.7686 0.4064)
          )
          (stroke (width 0) (type default) (color 0 0 0 0))
          (fill (type none))
        )
      )
      (symbol "FerriteBead_1_1"
        (pin passive line (at 0 3.81 270) (length 2.54)
          (name "~" (effects (font (size 1.27 1.27))))
          (number "1" (effects (font (size 1.27 1.27))))
        )
        (pin passive line (at 0 -3.81 90) (length 2.54)
          (name "~" (effects (font (size 1.27 1.27))))
          (number "2" (effects (font (size 1.27 1.27))))
        )
      )
    )
    (symbol "Device:L" (pin_numbers hide) (pin_names (offset 1.016) hide) (in_bom yes) (on_board yes)
      (property "Reference" "L" (id 0) (at -1.27 0 90)
        (effects (font (size 1.27 1.27)))
      )
      (property "Value" "L" (id 1) (at 1.905 0 90)
        (effects (font (size 1.27 1.27)))
      )
      (property "Footprint" "" (id 2) (at 0 0 0)
        (effects (font (size 1.27 1.27)) hide)
      )
      (property "Datasheet" "~" (id 3) (at 0 0 0)
        (effects (font (size 1.27 1.27)) hide)
      )
      (property "ki_keywords" "inductor choke coil reactor magnetic" (id 4) (at 0 0 0)
        (effects (font (size 1.27 1.27)) hide)
      )
      (property "ki_description" "Inductor" (id 5) (at 0 0 0)
        (effects (font (size 1.27 1.27)) hide)
      )
      (property "ki_fp_filters" "Choke_* *Coil* Inductor_* L_*" (id 6) (at 0 0 0)
        (effects (font (size 1.27 1.27)) hide)
      )
      (symbol "L_0_1"
        (arc (start 0 -2.54) (mid 0.635 -1.905) (end 0 -1.27)
          (stroke (width 0) (type default) (color 0 0 0 0))
          (fill (type none))
        )
        (arc (start 0 -1.27) (mid 0.635 -0.635) (end 0 0)
          (stroke (width 0) (type default) (color 0 0 0 0))
          (fill (type none))
        )
        (arc (start 0 0) (mid 0.635 0.635) (end 0 1.27)
          (stroke (width 0) (type default) (color 0 0 0 0))
          (fill (type none))
        )
        (arc (start 0 1.27) (mid 0.635 1.905) (end 0 2.54)
          (stroke (width 0) (type default) (color 0 0 0 0))
          (fill (type none))
        )
      )
      (symbol "L_1_1"
        (pin passive line (at 0 3.81 270) (length 1.27)
          (name "1" (effects (font (size 1.27 1.27))))
          (number "1" (effects (font (size 1.27 1.27))))
        )
        (pin passive line (at 0 -3.81 90) (length 1.27)
          (name "2" (effects (font (size 1.27 1.27))))
          (number "2" (effects (font (size 1.27 1.27))))
        )
      )
    )
    (symbol "Device:R" (pin_numbers hide) (pin_names (offset 0)) (in_bom yes) (on_board yes)
      (property "Reference" "R" (id 0) (at 2.032 0 90)
        (effects (font (size 1.27 1.27)))
      )
      (property "Value" "R" (id 1) (at 0 0 90)
        (effects (font (size 1.27 1.27)))
      )
      (property "Footprint" "" (id 2) (at -1.778 0 90)
        (effects (font (size 1.27 1.27)) hide)
      )
      (property "Datasheet" "~" (id 3) (at 0 0 0)
        (effects (font (size 1.27 1.27)) hide)
      )
      (property "ki_keywords" "R res resistor" (id 4) (at 0 0 0)
        (effects (font (size 1.27 1.27)) hide)
      )
      (property "ki_description" "Resistor" (id 5) (at 0 0 0)
        (effects (font (size 1.27 1.27)) hide)
      )
      (property "ki_fp_filters" "R_*" (id 6) (at 0 0 0)
        (effects (font (size 1.27 1.27)) hide)
      )
      (symbol "R_0_1"
        (rectangle (start -1.016 -2.54) (end 1.016 2.54)
          (stroke (width 0.254) (type default) (color 0 0 0 0))
          (fill (type none))
        )
      )
      (symbol "R_1_1"
        (pin passive line (at 0 3.81 270) (length 1.27)
          (name "~" (effects (font (size 1.27 1.27))))
          (number "1" (effects (font (size 1.27 1.27))))
        )
        (pin passive line (at 0 -3.81 90) (length 1.27)
          (name "~" (effects (font (size 1.27 1.27))))
          (number "2" (effects (font (size 1.27 1.27))))
        )
      )
    )
    (symbol "POWDER_Data_Converter:BH2226F" (in_bom yes) (on_board yes)
      (property "Reference" "U" (id 0) (at 5.08 -13.97 0)
        (effects (font (size 1.27 1.27)))
      )
      (property "Value" "BH2226F" (id 1) (at 6.35 13.97 0)
        (effects (font (size 1.27 1.27)))
      )
      (property "Footprint" "Package_SO:SOP-16_4.4x10.4mm_P1.27mm" (id 2) (at 0 -25.4 0)
        (effects (font (size 1.27 1.27)) hide)
      )
      (property "Datasheet" "" (id 3) (at 0 0 0)
        (effects (font (size 1.27 1.27)) hide)
      )
      (symbol "BH2226F_0_1"
        (rectangle (start -12.7 12.7) (end 12.7 -12.7)
          (stroke (width 0) (type default) (color 0 0 0 0))
          (fill (type background))
        )
      )
      (symbol "BH2226F_1_1"
        (pin output line (at 15.24 8.89 180) (length 2.54)
          (name "DA1" (effects (font (size 1.27 1.27))))
          (number "1" (effects (font (size 1.27 1.27))))
        )
        (pin input line (at -15.24 -5.08 0) (length 2.54)
          (name "~{RESET}" (effects (font (size 1.27 1.27))))
          (number "10" (effects (font (size 1.27 1.27))))
        )
        (pin input line (at -15.24 -7.62 0) (length 2.54)
          (name "TEST" (effects (font (size 1.27 1.27))))
          (number "11" (effects (font (size 1.27 1.27))))
        )
        (pin input line (at -15.24 0 0) (length 2.54)
          (name "~{CS}" (effects (font (size 1.27 1.27))))
          (number "12" (effects (font (size 1.27 1.27))))
        )
        (pin input line (at -15.24 2.54 0) (length 2.54)
          (name "CLK" (effects (font (size 1.27 1.27))))
          (number "13" (effects (font (size 1.27 1.27))))
        )
        (pin input line (at -15.24 5.08 0) (length 2.54)
          (name "DI" (effects (font (size 1.27 1.27))))
          (number "14" (effects (font (size 1.27 1.27))))
        )
        (pin input line (at -15.24 7.62 0) (length 2.54)
          (name "SO" (effects (font (size 1.27 1.27))))
          (number "15" (effects (font (size 1.27 1.27))))
        )
        (pin power_in line (at 0 -15.24 90) (length 2.54)
          (name "GND" (effects (font (size 1.27 1.27))))
          (number "16" (effects (font (size 1.27 1.27))))
        )
        (pin output line (at 15.24 6.35 180) (length 2.54)
          (name "DA2" (effects (font (size 1.27 1.27))))
          (number "2" (effects (font (size 1.27 1.27))))
        )
        (pin output line (at 15.24 3.81 180) (length 2.54)
          (name "DA3" (effects (font (size 1.27 1.27))))
          (number "3" (effects (font (size 1.27 1.27))))
        )
        (pin output line (at 15.24 1.27 180) (length 2.54)
          (name "DA4" (effects (font (size 1.27 1.27))))
          (number "4" (effects (font (size 1.27 1.27))))
        )
        (pin output line (at 15.24 -1.27 180) (length 2.54)
          (name "DA5" (effects (font (size 1.27 1.27))))
          (number "5" (effects (font (size 1.27 1.27))))
        )
        (pin output line (at 15.24 -3.81 180) (length 2.54)
          (name "DA6" (effects (font (size 1.27 1.27))))
          (number "6" (effects (font (size 1.27 1.27))))
        )
        (pin output line (at 15.24 -6.35 180) (length 2.54)
          (name "DA7" (effects (font (size 1.27 1.27))))
          (number "7" (effects (font (size 1.27 1.27))))
        )
        (pin output line (at 15.24 -8.89 180) (length 2.54)
          (name "DA8" (effects (font (size 1.27 1.27))))
          (number "8" (effects (font (size 1.27 1.27))))
        )
        (pin power_in line (at 0 15.24 270) (length 2.54)
          (name "VCC" (effects (font (size 1.27 1.27))))
          (number "9" (effects (font (size 1.27 1.27))))
        )
      )
    )
    (symbol "power:+5V" (power) (pin_names (offset 0)) (in_bom yes) (on_board yes)
      (property "Reference" "#PWR" (id 0) (at 0 -3.81 0)
        (effects (font (size 1.27 1.27)) hide)
      )
      (property "Value" "+5V" (id 1) (at 0 3.556 0)
        (effects (font (size 1.27 1.27)))
      )
      (property "Footprint" "" (id 2) (at 0 0 0)
        (effects (font (size 1.27 1.27)) hide)
      )
      (property "Datasheet" "" (id 3) (at 0 0 0)
        (effects (font (size 1.27 1.27)) hide)
      )
      (property "ki_keywords" "power-flag" (id 4) (at 0 0 0)
        (effects (font (size 1.27 1.27)) hide)
      )
      (property "ki_description" "Power symbol creates a global label with name \"+5V\"" (id 5) (at 0 0 0)
        (effects (font (size 1.27 1.27)) hide)
      )
      (symbol "+5V_0_1"
        (polyline
          (pts
            (xy -0.762 1.27)
            (xy 0 2.54)
          )
          (stroke (width 0) (type default) (color 0 0 0 0))
          (fill (type none))
        )
        (polyline
          (pts
            (xy 0 0)
            (xy 0 2.54)
          )
          (stroke (width 0) (type default) (color 0 0 0 0))
          (fill (type none))
        )
        (polyline
          (pts
            (xy 0 2.54)
            (xy 0.762 1.27)
          )
          (stroke (width 0) (type default) (color 0 0 0 0))
          (fill (type none))
        )
      )
      (symbol "+5V_1_1"
        (pin power_in line (at 0 0 90) (length 0) hide
          (name "+5V" (effects (font (size 1.27 1.27))))
          (number "1" (effects (font (size 1.27 1.27))))
        )
      )
    )
    (symbol "power:GNDA" (power) (pin_names (offset 0)) (in_bom yes) (on_board yes)
      (property "Reference" "#PWR" (id 0) (at 0 -6.35 0)
        (effects (font (size 1.27 1.27)) hide)
      )
      (property "Value" "GNDA" (id 1) (at 0 -3.81 0)
        (effects (font (size 1.27 1.27)))
      )
      (property "Footprint" "" (id 2) (at 0 0 0)
        (effects (font (size 1.27 1.27)) hide)
      )
      (property "Datasheet" "" (id 3) (at 0 0 0)
        (effects (font (size 1.27 1.27)) hide)
      )
      (property "ki_keywords" "power-flag" (id 4) (at 0 0 0)
        (effects (font (size 1.27 1.27)) hide)
      )
      (property "ki_description" "Power symbol creates a global label with name \"GNDA\" , analog ground" (id 5) (at 0 0 0)
        (effects (font (size 1.27 1.27)) hide)
      )
      (symbol "GNDA_0_1"
        (polyline
          (pts
            (xy 0 0)
            (xy 0 -1.27)
            (xy 1.27 -1.27)
            (xy 0 -2.54)
            (xy -1.27 -1.27)
            (xy 0 -1.27)
          )
          (stroke (width 0) (type default) (color 0 0 0 0))
          (fill (type none))
        )
      )
      (symbol "GNDA_1_1"
        (pin power_in line (at 0 0 270) (length 0) hide
          (name "GNDA" (effects (font (size 1.27 1.27))))
          (number "1" (effects (font (size 1.27 1.27))))
        )
      )
    )
  )

  (junction (at 215.9 95.25) (diameter 0) (color 0 0 0 0)
    (uuid 023d0bd8-ec7d-4eaa-a584-5f910b59c6e2)
  )
  (junction (at 190.5 85.09) (diameter 0) (color 0 0 0 0)
    (uuid 0406b3bc-ad4a-4cb0-84d8-f3b899bcf19d)
  )
  (junction (at 203.2 90.17) (diameter 0) (color 0 0 0 0)
    (uuid 1ee96d66-46b1-44f1-a981-d389b6f8670d)
  )
  (junction (at 209.55 92.71) (diameter 0) (color 0 0 0 0)
    (uuid 50749b96-f76d-4487-9fec-6197bfaaf0be)
  )
  (junction (at 222.25 97.79) (diameter 0) (color 0 0 0 0)
    (uuid 597e2c00-8161-41f9-91c2-8abe26a53ff9)
  )
  (junction (at 184.15 82.55) (diameter 0) (color 0 0 0 0)
    (uuid 657c4edf-55d4-4af2-aa2e-d6c54cfe9419)
  )
  (junction (at 114.3 50.8) (diameter 0) (color 0 0 0 0)
    (uuid ad6e520d-fe36-4bc1-9b8e-7efdbe4a7be4)
  )
  (junction (at 196.85 87.63) (diameter 0) (color 0 0 0 0)
    (uuid b26c1763-5e0d-4993-80bb-189a1c1d1029)
  )
  (junction (at 101.6 50.8) (diameter 0) (color 0 0 0 0)
    (uuid b2b206df-b186-4a9f-a202-e3fbab3554a8)
  )
  (junction (at 88.9 50.8) (diameter 0) (color 0 0 0 0)
    (uuid b60dc703-9bd0-4208-8c3b-64263e54044f)
  )
  (junction (at 120.65 50.8) (diameter 0) (color 0 0 0 0)
    (uuid c861c788-1f34-4b99-b11a-2f2e6b150028)
  )
  (junction (at 88.9 93.98) (diameter 0) (color 0 0 0 0)
    (uuid e1439141-fc53-430c-bf3d-af3c87791f5f)
  )
  (junction (at 177.8 80.01) (diameter 0) (color 0 0 0 0)
    (uuid f915357b-6b98-4e98-9422-4b9930f3edde)
  )

  (wire (pts (xy 88.9 104.14) (xy 88.9 106.68))
    (stroke (width 0) (type default) (color 0 0 0 0))
    (uuid 08498a4e-71b4-461d-b02b-57561429d74e)
  )
  (wire (pts (xy 184.15 82.55) (xy 184.15 116.84))
    (stroke (width 0) (type default) (color 0 0 0 0))
    (uuid 0e2d4924-8242-4bd5-b8d5-8e431a18850b)
  )
  (wire (pts (xy 215.9 95.25) (xy 228.6 95.25))
    (stroke (width 0) (type default) (color 0 0 0 0))
    (uuid 138ace14-ff2d-4662-aebc-e2bd389b84af)
  )
  (wire (pts (xy 120.65 60.96) (xy 120.65 63.5))
    (stroke (width 0) (type default) (color 0 0 0 0))
    (uuid 15f36a33-3d09-4221-baf3-f666493e0fc7)
  )
  (wire (pts (xy 196.85 87.63) (xy 228.6 87.63))
    (stroke (width 0) (type default) (color 0 0 0 0))
    (uuid 1fa07c3d-c0c4-4a25-99ac-49ebf1b4ff0f)
  )
  (wire (pts (xy 215.9 95.25) (xy 215.9 104.14))
    (stroke (width 0) (type default) (color 0 0 0 0))
    (uuid 218d9c82-2c23-4dfa-bf64-63b859865832)
  )
  (wire (pts (xy 203.2 90.17) (xy 203.2 104.14))
    (stroke (width 0) (type default) (color 0 0 0 0))
    (uuid 22659ca4-4398-476c-8f5d-0d8056662997)
  )
  (wire (pts (xy 76.2 83.82) (xy 99.06 83.82))
    (stroke (width 0) (type default) (color 0 0 0 0))
    (uuid 22f9a60c-fde5-428f-b175-03bd4dad620e)
  )
  (wire (pts (xy 172.72 97.79) (xy 222.25 97.79))
    (stroke (width 0) (type default) (color 0 0 0 0))
    (uuid 253697f1-2937-4ff4-a9f5-2106ed354a5c)
  )
  (wire (pts (xy 222.25 124.46) (xy 222.25 127))
    (stroke (width 0) (type default) (color 0 0 0 0))
    (uuid 2680cde0-ab14-444b-9963-990ea1950797)
  )
  (wire (pts (xy 76.2 86.36) (xy 99.06 86.36))
    (stroke (width 0) (type default) (color 0 0 0 0))
    (uuid 2cedd572-87e9-45b3-abfe-a9965abfa6b4)
  )
  (wire (pts (xy 99.06 93.98) (xy 88.9 93.98))
    (stroke (width 0) (type default) (color 0 0 0 0))
    (uuid 2e1e0384-3d81-4296-91dc-0516a65e446c)
  )
  (wire (pts (xy 203.2 111.76) (xy 203.2 127))
    (stroke (width 0) (type default) (color 0 0 0 0))
    (uuid 2ff2425c-646d-490a-8b9e-e4fff94b4dfb)
  )
  (wire (pts (xy 172.72 87.63) (xy 196.85 87.63))
    (stroke (width 0) (type default) (color 0 0 0 0))
    (uuid 39b789f0-aa18-4d65-b5ca-0d61ae362da7)
  )
  (wire (pts (xy 209.55 92.71) (xy 209.55 116.84))
    (stroke (width 0) (type default) (color 0 0 0 0))
    (uuid 3c487357-0d41-4a69-8228-b20b744eec47)
  )
  (wire (pts (xy 96.52 106.68) (xy 96.52 96.52))
    (stroke (width 0) (type default) (color 0 0 0 0))
    (uuid 3f38451c-419b-43db-9250-442b3adb02dc)
  )
  (wire (pts (xy 209.55 124.46) (xy 209.55 127))
    (stroke (width 0) (type default) (color 0 0 0 0))
    (uuid 41861a2f-75c9-45e1-95f3-0cd6abaa9d00)
  )
  (wire (pts (xy 184.15 82.55) (xy 228.6 82.55))
    (stroke (width 0) (type default) (color 0 0 0 0))
    (uuid 46bc8d3f-1524-4b0e-9064-223f7b5e74dc)
  )
  (wire (pts (xy 203.2 90.17) (xy 228.6 90.17))
    (stroke (width 0) (type default) (color 0 0 0 0))
    (uuid 48494891-1456-4746-a97c-e99218a5adb5)
  )
  (wire (pts (xy 177.8 80.01) (xy 177.8 104.14))
    (stroke (width 0) (type default) (color 0 0 0 0))
    (uuid 48f141bc-700a-42b4-8bad-3ca32aac6a07)
  )
  (wire (pts (xy 133.35 50.8) (xy 120.65 50.8))
    (stroke (width 0) (type default) (color 0 0 0 0))
    (uuid 4fd25b7c-d1c3-4051-bab8-282ede0c978a)
  )
  (wire (pts (xy 222.25 97.79) (xy 228.6 97.79))
    (stroke (width 0) (type default) (color 0 0 0 0))
    (uuid 536ca35a-62f9-4be3-b84d-7c655f2378d4)
  )
  (wire (pts (xy 114.3 50.8) (xy 114.3 73.66))
    (stroke (width 0) (type default) (color 0 0 0 0))
    (uuid 536ff5dc-f828-45c1-acfb-792f706056b0)
  )
  (wire (pts (xy 120.65 53.34) (xy 120.65 50.8))
    (stroke (width 0) (type default) (color 0 0 0 0))
    (uuid 55694057-93fe-4797-8562-13a44cfb79f9)
  )
  (wire (pts (xy 196.85 87.63) (xy 196.85 116.84))
    (stroke (width 0) (type default) (color 0 0 0 0))
    (uuid 607c7266-ce1b-4323-b4f5-3fd0b875e16d)
  )
  (wire (pts (xy 133.35 53.34) (xy 133.35 50.8))
    (stroke (width 0) (type default) (color 0 0 0 0))
    (uuid 63b765f6-d705-4e71-ab94-d00daacc85fe)
  )
  (wire (pts (xy 88.9 60.96) (xy 88.9 63.5))
    (stroke (width 0) (type default) (color 0 0 0 0))
    (uuid 654531e4-e2b7-4316-b6c7-fe0f6db73265)
  )
  (wire (pts (xy 172.72 92.71) (xy 209.55 92.71))
    (stroke (width 0) (type default) (color 0 0 0 0))
    (uuid 698c8fd7-256b-4067-90ad-8a39ebab2448)
  )
  (wire (pts (xy 101.6 50.8) (xy 101.6 53.34))
    (stroke (width 0) (type default) (color 0 0 0 0))
    (uuid 6a8cf72a-1827-46e2-ae5d-e5426196502e)
  )
  (wire (pts (xy 88.9 50.8) (xy 91.44 50.8))
    (stroke (width 0) (type default) (color 0 0 0 0))
    (uuid 6c84b867-77d4-475c-b28d-1086aa39c806)
  )
  (wire (pts (xy 101.6 50.8) (xy 114.3 50.8))
    (stroke (width 0) (type default) (color 0 0 0 0))
    (uuid 72597eb4-77d2-47ba-9f69-8b0027f75e4e)
  )
  (wire (pts (xy 114.3 104.14) (xy 114.3 106.68))
    (stroke (width 0) (type default) (color 0 0 0 0))
    (uuid 75834304-4bc3-450e-bd08-45e8013bde35)
  )
  (wire (pts (xy 190.5 85.09) (xy 228.6 85.09))
    (stroke (width 0) (type default) (color 0 0 0 0))
    (uuid 772cdd3a-9b71-4658-8625-c74cae839001)
  )
  (wire (pts (xy 129.54 87.63) (xy 165.1 87.63))
    (stroke (width 0) (type default) (color 0 0 0 0))
    (uuid 7bfd92d7-b360-41c2-b3a0-26ead6fafc5c)
  )
  (wire (pts (xy 88.9 93.98) (xy 88.9 96.52))
    (stroke (width 0) (type default) (color 0 0 0 0))
    (uuid 902ee83f-6c80-4f7f-ac31-af00cd3cb8eb)
  )
  (wire (pts (xy 209.55 92.71) (xy 228.6 92.71))
    (stroke (width 0) (type default) (color 0 0 0 0))
    (uuid 9792e01f-ee0d-4c43-b9aa-46823dc9caf6)
  )
  (wire (pts (xy 101.6 60.96) (xy 101.6 63.5))
    (stroke (width 0) (type default) (color 0 0 0 0))
    (uuid 9b99d186-1bd4-4a0c-af0d-833747595710)
  )
  (wire (pts (xy 76.2 93.98) (xy 88.9 93.98))
    (stroke (width 0) (type default) (color 0 0 0 0))
    (uuid a3500a52-477d-40d2-9259-244020f7389b)
  )
  (wire (pts (xy 76.2 48.26) (xy 76.2 50.8))
    (stroke (width 0) (type default) (color 0 0 0 0))
    (uuid a3903b2a-0b18-4e70-8949-a2ba09a18946)
  )
  (wire (pts (xy 172.72 82.55) (xy 184.15 82.55))
    (stroke (width 0) (type default) (color 0 0 0 0))
    (uuid a4318e9a-b37e-4b3c-a8f9-3a1a0b32d4d0)
  )
  (wire (pts (xy 129.54 90.17) (xy 154.94 90.17))
    (stroke (width 0) (type default) (color 0 0 0 0))
    (uuid a9379941-ca01-486f-8d6c-6c306ba5d5a8)
  )
  (wire (pts (xy 76.2 50.8) (xy 78.74 50.8))
    (stroke (width 0) (type default) (color 0 0 0 0))
    (uuid a976acc0-eef2-4701-a1d8-7abe0b7a8782)
  )
  (wire (pts (xy 177.8 80.01) (xy 228.6 80.01))
    (stroke (width 0) (type default) (color 0 0 0 0))
    (uuid acbf2e7c-a9bf-4c21-ac16-e9026eeebc4c)
  )
  (wire (pts (xy 129.54 92.71) (xy 165.1 92.71))
    (stroke (width 0) (type default) (color 0 0 0 0))
    (uuid ad3d9361-80d5-430b-9c01-2c9d0246d721)
  )
  (wire (pts (xy 120.65 50.8) (xy 114.3 50.8))
    (stroke (width 0) (type default) (color 0 0 0 0))
    (uuid bb30c0b8-d077-4907-b835-9e8308940acd)
  )
  (wire (pts (xy 99.06 50.8) (xy 101.6 50.8))
    (stroke (width 0) (type default) (color 0 0 0 0))
    (uuid be648134-9f7d-461f-a3d8-3ea24560877e)
  )
  (wire (pts (xy 196.85 124.46) (xy 196.85 127))
    (stroke (width 0) (type default) (color 0 0 0 0))
    (uuid c1140a43-21d2-4b9e-9625-e645d8abe49e)
  )
  (wire (pts (xy 88.9 50.8) (xy 88.9 53.34))
    (stroke (width 0) (type default) (color 0 0 0 0))
    (uuid c1b16d0a-a4c4-47a2-89e0-9d93a84682cf)
  )
  (wire (pts (xy 184.15 124.46) (xy 184.15 127))
    (stroke (width 0) (type default) (color 0 0 0 0))
    (uuid c3cdfc24-d37b-4220-ad09-8f939b1f0cca)
  )
  (wire (pts (xy 162.56 90.17) (xy 203.2 90.17))
    (stroke (width 0) (type default) (color 0 0 0 0))
    (uuid c479f9a9-d6ed-4821-8158-fae27c787232)
  )
  (wire (pts (xy 162.56 80.01) (xy 177.8 80.01))
    (stroke (width 0) (type default) (color 0 0 0 0))
    (uuid cba97790-bd4c-4e2d-bdc2-ea727882dc0e)
  )
  (wire (pts (xy 86.36 50.8) (xy 88.9 50.8))
    (stroke (width 0) (type default) (color 0 0 0 0))
    (uuid cd465a50-97aa-49e5-98a7-96deda2313c4)
  )
  (wire (pts (xy 162.56 95.25) (xy 215.9 95.25))
    (stroke (width 0) (type default) (color 0 0 0 0))
    (uuid d02357d6-c545-409e-beb7-7528deee10d6)
  )
  (wire (pts (xy 129.54 85.09) (xy 154.94 85.09))
    (stroke (width 0) (type default) (color 0 0 0 0))
    (uuid d0d3c2e6-4356-49f8-908c-655398cbe120)
  )
  (wire (pts (xy 129.54 82.55) (xy 165.1 82.55))
    (stroke (width 0) (type default) (color 0 0 0 0))
    (uuid d76a7174-cd78-4b2a-bcf1-1f91b37d029f)
  )
  (wire (pts (xy 129.54 80.01) (xy 154.94 80.01))
    (stroke (width 0) (type default) (color 0 0 0 0))
    (uuid dbe800d3-a8a0-40a9-b1ae-f90bb45144b8)
  )
  (wire (pts (xy 76.2 81.28) (xy 99.06 81.28))
    (stroke (width 0) (type default) (color 0 0 0 0))
    (uuid dcb32333-6339-46c6-91a9-ba11d6748b16)
  )
  (wire (pts (xy 162.56 85.09) (xy 190.5 85.09))
    (stroke (width 0) (type default) (color 0 0 0 0))
    (uuid dd9f99d4-7ad8-40ad-960a-dc36d054f704)
  )
  (wire (pts (xy 76.2 88.9) (xy 99.06 88.9))
    (stroke (width 0) (type default) (color 0 0 0 0))
    (uuid dea5f3ca-6352-4161-9ded-15393eb97c55)
  )
  (wire (pts (xy 129.54 95.25) (xy 154.94 95.25))
    (stroke (width 0) (type default) (color 0 0 0 0))
    (uuid e6e3433a-b926-4dfe-9831-02572048e644)
  )
  (wire (pts (xy 215.9 111.76) (xy 215.9 127))
    (stroke (width 0) (type default) (color 0 0 0 0))
    (uuid ee8012a0-797e-47f6-961c-205dd1716ef8)
  )
  (wire (pts (xy 133.35 60.96) (xy 133.35 63.5))
    (stroke (width 0) (type default) (color 0 0 0 0))
    (uuid efd9c50e-715e-46e2-b93c-cef00e56ef9e)
  )
  (wire (pts (xy 177.8 111.76) (xy 177.8 127))
    (stroke (width 0) (type default) (color 0 0 0 0))
    (uuid f1b96de7-f852-4a96-a36c-3815969ccdc0)
  )
  (wire (pts (xy 190.5 111.76) (xy 190.5 127))
    (stroke (width 0) (type default) (color 0 0 0 0))
    (uuid f25b3429-a47a-4459-b65b-bc9210864614)
  )
  (wire (pts (xy 96.52 96.52) (xy 99.06 96.52))
    (stroke (width 0) (type default) (color 0 0 0 0))
    (uuid f55eb57a-b42f-4275-976d-c94c613b2123)
  )
  (wire (pts (xy 222.25 97.79) (xy 222.25 116.84))
    (stroke (width 0) (type default) (color 0 0 0 0))
    (uuid f678359b-36a6-4b1d-9256-8fa5f5812cd5)
  )
  (wire (pts (xy 129.54 97.79) (xy 165.1 97.79))
    (stroke (width 0) (type default) (color 0 0 0 0))
    (uuid f8baf812-0fd5-46c7-800a-97d773aa393e)
  )
  (wire (pts (xy 190.5 85.09) (xy 190.5 104.14))
    (stroke (width 0) (type default) (color 0 0 0 0))
    (uuid fc644077-7ea4-4f03-ba9e-28258c257664)
  )

  (text "3.3V I/O" (at 91.44 69.85 0)
    (effects (font (size 1.27 1.27)) (justify left bottom))
    (uuid 55bcf23a-4df8-4c40-8753-92be300ce681)
  )

  (label "DAC2_PREFILT" (at 130.81 82.55 0)
    (effects (font (size 1.27 1.27)) (justify left bottom))
    (uuid 023c9982-993a-4c73-b1a1-5ce162e6fd19)
  )
  (label "DAC5_PREFILT" (at 130.81 90.17 0)
    (effects (font (size 1.27 1.27)) (justify left bottom))
    (uuid 12e3667f-654f-48ed-a343-dd40dadaea75)
  )
  (label "DAC6_PREFILT" (at 130.81 92.71 0)
    (effects (font (size 1.27 1.27)) (justify left bottom))
    (uuid 13ca0ac0-3f2d-43db-aafb-7603db72a7d2)
  )
  (label "DAC_V5_FILT" (at 125.73 50.8 0)
    (effects (font (size 1.27 1.27)) (justify left bottom))
    (uuid 1a3a320a-049c-4148-9d8c-b67127eed410)
  )
  (label "DAC4_PREFILT" (at 130.81 87.63 0)
    (effects (font (size 1.27 1.27)) (justify left bottom))
    (uuid 1e91e53c-7b3f-4a7b-88c7-be2ea61e23da)
  )
  (label "DAC_V5_MID_FILT" (at 88.9 50.8 90)
    (effects (font (size 1.27 1.27)) (justify left bottom))
    (uuid 238c9e60-8645-436f-bccf-780be0afb00d)
  )
  (label "DAC1_PREFILT" (at 130.81 80.01 0)
    (effects (font (size 1.27 1.27)) (justify left bottom))
    (uuid 6fa002e7-0cbd-4ada-a3fc-8456d19d3f67)
  )
  (label "DAC8_PREFILT" (at 130.81 97.79 0)
    (effects (font (size 1.27 1.27)) (justify left bottom))
    (uuid bda5fb53-d01a-4c50-bd57-d41e80776da8)
  )
  (label "DAC3_PREFILT" (at 130.81 85.09 0)
    (effects (font (size 1.27 1.27)) (justify left bottom))
    (uuid f075a49b-bede-41ce-9ebf-2c149b71ef93)
  )
  (label "DAC7_PREFILT" (at 130.81 95.25 0)
    (effects (font (size 1.27 1.27)) (justify left bottom))
    (uuid f1bbb3f0-32ce-4a50-a429-84d36a57e76c)
  )

  (hierarchical_label "CLK" (shape input) (at 76.2 86.36 180)
    (effects (font (size 1.27 1.27)) (justify right))
    (uuid 04d61ecb-1005-4cd6-bbfc-ee27c0d17684)
  )
  (hierarchical_label "SO" (shape output) (at 76.2 81.28 180)
    (effects (font (size 1.27 1.27)) (justify right))
    (uuid 0f4af406-f56f-4052-83cc-74f5c0814e80)
  )
  (hierarchical_label "DAC5" (shape output) (at 228.6 90.17 0)
    (effects (font (size 1.27 1.27)) (justify left))
    (uuid 1801b028-b1d0-4279-9bab-295113be5e38)
  )
  (hierarchical_label "~{CS}" (shape input) (at 76.2 88.9 180)
    (effects (font (size 1.27 1.27)) (justify right))
    (uuid 3fcbd2c4-6b29-443b-97e6-111e7676d4c1)
  )
  (hierarchical_label "DAC2" (shape output) (at 228.6 82.55 0)
    (effects (font (size 1.27 1.27)) (justify left))
    (uuid 53f43ddf-ebac-4d6b-a8c7-1a4005081c60)
  )
  (hierarchical_label "DI" (shape input) (at 76.2 83.82 180)
    (effects (font (size 1.27 1.27)) (justify right))
    (uuid 5f24ef0b-180c-46bf-9b44-914e0988e012)
  )
  (hierarchical_label "DAC1" (shape output) (at 228.6 80.01 0)
    (effects (font (size 1.27 1.27)) (justify left))
    (uuid a8e56148-9091-404f-9198-bf3ef7e40b15)
  )
  (hierarchical_label "~{RESET}" (shape input) (at 76.2 93.98 180)
    (effects (font (size 1.27 1.27)) (justify right))
    (uuid b35c011d-f041-431c-94f4-68a76c84d765)
  )
  (hierarchical_label "DAC8" (shape output) (at 228.6 97.79 0)
    (effects (font (size 1.27 1.27)) (justify left))
    (uuid be0babfa-e520-4e4a-87ec-01be4a6a5111)
  )
  (hierarchical_label "DAC6" (shape output) (at 228.6 92.71 0)
    (effects (font (size 1.27 1.27)) (justify left))
    (uuid c557e0fc-ec87-4765-afb1-1123225c7773)
  )
  (hierarchical_label "DAC7" (shape output) (at 228.6 95.25 0)
    (effects (font (size 1.27 1.27)) (justify left))
    (uuid c5eda566-f390-4379-a9aa-e7310a13e116)
  )
  (hierarchical_label "DAC3" (shape output) (at 228.6 85.09 0)
    (effects (font (size 1.27 1.27)) (justify left))
    (uuid e8ab2e4e-2ca2-4dee-893e-42c4fa82e260)
  )
  (hierarchical_label "DAC4" (shape output) (at 228.6 87.63 0)
    (effects (font (size 1.27 1.27)) (justify left))
    (uuid ffa1dc75-eccf-4796-8da6-a667bbf1f042)
  )

  (symbol (lib_id "power:GNDA") (at 88.9 63.5 0) (unit 1)
    (in_bom yes) (on_board yes) (fields_autoplaced)
    (uuid 0755fc8f-365c-4733-aafc-9f4a393d568a)
    (property "Reference" "#PWR0602" (id 0) (at 88.9 69.85 0)
      (effects (font (size 1.27 1.27)) hide)
    )
    (property "Value" "GNDA" (id 1) (at 88.9 68.58 0))
    (property "Footprint" "" (id 2) (at 88.9 63.5 0)
      (effects (font (size 1.27 1.27)) hide)
    )
    (property "Datasheet" "" (id 3) (at 88.9 63.5 0)
      (effects (font (size 1.27 1.27)) hide)
    )
    (pin "1" (uuid 5cc4f903-888b-4e29-8025-4295ce033916))
  )

  (symbol (lib_id "Device:R") (at 168.91 82.55 90) (unit 1)
    (in_bom yes) (on_board yes)
    (uuid 1657d820-bb4f-4e48-a16f-9c4228a60b2d)
    (property "Reference" "R606" (id 0) (at 168.91 80.01 90))
    (property "Value" "0" (id 1) (at 168.91 82.55 90))
    (property "Footprint" "Resistor_SMD:R_0402_1005Metric" (id 2) (at 168.91 84.328 90)
      (effects (font (size 1.27 1.27)) hide)
    )
    (property "Datasheet" "~" (id 3) (at 168.91 82.55 0)
      (effects (font (size 1.27 1.27)) hide)
    )
    (property "PartSpecification" "3000-0000000142" (id 4) (at 168.91 82.55 0)
      (effects (font (size 1.27 1.27)) hide)
    )
    (pin "1" (uuid aece6db6-9bb3-4f06-a8ce-9eec719a2f26))
    (pin "2" (uuid b0a067ff-a3f5-4437-9ecf-a13899c777bf))
  )

  (symbol (lib_id "Device:L") (at 82.55 50.8 90) (unit 1)
    (in_bom yes) (on_board yes) (fields_autoplaced)
    (uuid 1a45e41b-f434-466c-815a-b2796b66f30f)
    (property "Reference" "L601" (id 0) (at 82.55 44.45 90))
    (property "Value" "1uH" (id 1) (at 82.55 46.99 90))
    (property "Footprint" "Inductor_SMD:L_0805_2012Metric" (id 2) (at 82.55 50.8 0)
      (effects (font (size 1.27 1.27)) hide)
    )
    (property "Datasheet" "~" (id 3) (at 82.55 50.8 0)
      (effects (font (size 1.27 1.27)) hide)
    )
    (property "Manufacturer" "Bourns Inc." (id 4) (at 82.55 50.8 90)
      (effects (font (size 1.27 1.27)) hide)
    )
    (property "PartNumber" "CV201210-1R0K" (id 5) (at 82.55 50.8 90)
      (effects (font (size 1.27 1.27)) hide)
    )
    (property "PartSpecification" "3000-0000001446" (id 6) (at 82.55 50.8 0)
      (effects (font (size 1.27 1.27)) hide)
    )
    (pin "1" (uuid b63fc58d-f7c5-4303-ad61-45b91526076a))
    (pin "2" (uuid da3afcd3-7f48-4b8a-9d9a-7627b39d351d))
  )

  (symbol (lib_id "000_PreferredParts:C_1nF") (at 120.65 57.15 0) (unit 1)
    (in_bom yes) (on_board yes) (fields_autoplaced)
    (uuid 1b31bc77-897f-41ea-aefe-3836e7a19f18)
    (property "Reference" "C603" (id 0) (at 124.46 55.8799 0)
      (effects (font (size 1.27 1.27)) (justify left))
    )
    (property "Value" "C_1nF" (id 1) (at 124.46 58.4199 0)
      (effects (font (size 1.27 1.27)) (justify left))
    )
    (property "Footprint" "Capacitor_SMD:C_0402_1005Metric" (id 2) (at 121.6152 60.96 0)
      (effects (font (size 1.27 1.27)) hide)
    )
    (property "Datasheet" "~" (id 3) (at 120.65 57.15 0)
      (effects (font (size 1.27 1.27)) hide)
    )
    (property "PartSpecification" "3000-0000000128" (id 4) (at 120.65 57.15 0)
      (effects (font (size 1.27 1.27)) hide)
    )
    (pin "1" (uuid d0246122-85d3-4088-8d89-20e35670f9d4))
    (pin "2" (uuid 696d61be-2189-4eb6-81cb-b5e18c63eef6))
  )

  (symbol (lib_id "Device:C") (at 203.2 107.95 0) (unit 1)
    (in_bom yes) (on_board yes) (fields_autoplaced)
    (uuid 2549c81d-b906-43bf-b37b-af9193e242c9)
    (property "Reference" "C609" (id 0) (at 207.01 106.6799 0)
      (effects (font (size 1.27 1.27)) (justify left))
    )
    (property "Value" "DNP" (id 1) (at 207.01 109.2199 0)
      (effects (font (size 1.27 1.27)) (justify left))
    )
    (property "Footprint" "Capacitor_SMD:C_0402_1005Metric" (id 2) (at 204.1652 111.76 0)
      (effects (font (size 1.27 1.27)) hide)
    )
    (property "Datasheet" "~" (id 3) (at 203.2 107.95 0)
      (effects (font (size 1.27 1.27)) hide)
    )
    (pin "1" (uuid 2f7c969e-941a-4771-8d04-5e30f0a7d84f))
    (pin "2" (uuid 612fdfb6-c847-4086-aaa0-ff081c85522e))
  )

  (symbol (lib_id "power:GNDA") (at 88.9 106.68 0) (unit 1)
    (in_bom yes) (on_board yes) (fields_autoplaced)
    (uuid 25d5a392-f365-4bd2-a290-9f649efe45de)
    (property "Reference" "#PWR0603" (id 0) (at 88.9 113.03 0)
      (effects (font (size 1.27 1.27)) hide)
    )
    (property "Value" "GNDA" (id 1) (at 88.9 111.76 0))
    (property "Footprint" "" (id 2) (at 88.9 106.68 0)
      (effects (font (size 1.27 1.27)) hide)
    )
    (property "Datasheet" "" (id 3) (at 88.9 106.68 0)
      (effects (font (size 1.27 1.27)) hide)
    )
    (pin "1" (uuid 24e2375b-b86e-43e1-805a-ef079c08bccc))
  )

  (symbol (lib_id "Device:C") (at 215.9 107.95 0) (unit 1)
    (in_bom yes) (on_board yes) (fields_autoplaced)
    (uuid 30d99ecd-c21d-4491-a771-0f7f44aa3b67)
    (property "Reference" "C611" (id 0) (at 219.71 106.6799 0)
      (effects (font (size 1.27 1.27)) (justify left))
    )
    (property "Value" "DNP" (id 1) (at 219.71 109.2199 0)
      (effects (font (size 1.27 1.27)) (justify left))
    )
    (property "Footprint" "Capacitor_SMD:C_0402_1005Metric" (id 2) (at 216.8652 111.76 0)
      (effects (font (size 1.27 1.27)) hide)
    )
    (property "Datasheet" "~" (id 3) (at 215.9 107.95 0)
      (effects (font (size 1.27 1.27)) hide)
    )
    (pin "1" (uuid 218cc904-cb01-4420-bf8e-041ae2cae109))
    (pin "2" (uuid 87396a55-48a8-4060-b924-080cb091fb5e))
  )

  (symbol (lib_id "power:GNDA") (at 215.9 127 0) (unit 1)
    (in_bom yes) (on_board yes) (fields_autoplaced)
    (uuid 3eef6868-1379-49ca-8b2a-ac8b81b6517c)
    (property "Reference" "#PWR0615" (id 0) (at 215.9 133.35 0)
      (effects (font (size 1.27 1.27)) hide)
    )
    (property "Value" "GNDA" (id 1) (at 215.9 132.08 0))
    (property "Footprint" "" (id 2) (at 215.9 127 0)
      (effects (font (size 1.27 1.27)) hide)
    )
    (property "Datasheet" "" (id 3) (at 215.9 127 0)
      (effects (font (size 1.27 1.27)) hide)
    )
    (pin "1" (uuid 9b4767c1-4e44-4606-b025-c59ce2a31411))
  )

  (symbol (lib_id "Device:C") (at 190.5 107.95 0) (unit 1)
    (in_bom yes) (on_board yes) (fields_autoplaced)
    (uuid 405d0c07-5615-4d3a-a80b-cde08338bd4f)
    (property "Reference" "C607" (id 0) (at 194.31 106.6799 0)
      (effects (font (size 1.27 1.27)) (justify left))
    )
    (property "Value" "DNP" (id 1) (at 194.31 109.2199 0)
      (effects (font (size 1.27 1.27)) (justify left))
    )
    (property "Footprint" "Capacitor_SMD:C_0402_1005Metric" (id 2) (at 191.4652 111.76 0)
      (effects (font (size 1.27 1.27)) hide)
    )
    (property "Datasheet" "~" (id 3) (at 190.5 107.95 0)
      (effects (font (size 1.27 1.27)) hide)
    )
    (pin "1" (uuid 9acc50de-d8d0-4614-acab-4298fc303443))
    (pin "2" (uuid b5be9a5c-7a20-4641-9d1f-ff87a71b0f8e))
  )

  (symbol (lib_id "Device:R") (at 158.75 85.09 90) (unit 1)
    (in_bom yes) (on_board yes)
    (uuid 4d5a457e-c3a3-40a1-bce7-388d3a7b55ee)
    (property "Reference" "R603" (id 0) (at 158.75 82.55 90))
    (property "Value" "0" (id 1) (at 158.75 85.09 90))
    (property "Footprint" "Resistor_SMD:R_0402_1005Metric" (id 2) (at 158.75 86.868 90)
      (effects (font (size 1.27 1.27)) hide)
    )
    (property "Datasheet" "~" (id 3) (at 158.75 85.09 0)
      (effects (font (size 1.27 1.27)) hide)
    )
    (property "PartSpecification" "3000-0000000142" (id 4) (at 158.75 85.09 0)
      (effects (font (size 1.27 1.27)) hide)
    )
    (pin "1" (uuid 9f7ec2f2-ccd5-4991-94b6-5a67b2590dc7))
    (pin "2" (uuid a9b332b7-e01d-4e03-90f5-7af6a6d5181d))
  )

  (symbol (lib_id "power:GNDA") (at 120.65 63.5 0) (unit 1)
    (in_bom yes) (on_board yes) (fields_autoplaced)
    (uuid 4dfbca19-ed60-470c-8879-547416c7f064)
    (property "Reference" "#PWR0607" (id 0) (at 120.65 69.85 0)
      (effects (font (size 1.27 1.27)) hide)
    )
    (property "Value" "GNDA" (id 1) (at 120.65 68.58 0))
    (property "Footprint" "" (id 2) (at 120.65 63.5 0)
      (effects (font (size 1.27 1.27)) hide)
    )
    (property "Datasheet" "" (id 3) (at 120.65 63.5 0)
      (effects (font (size 1.27 1.27)) hide)
    )
    (pin "1" (uuid 25c465d7-4c73-4914-86dc-7dfc5568d99b))
  )

  (symbol (lib_id "power:GNDA") (at 203.2 127 0) (unit 1)
    (in_bom yes) (on_board yes) (fields_autoplaced)
    (uuid 50cc2ae9-287e-4474-a84a-678e2d7eb33a)
    (property "Reference" "#PWR0613" (id 0) (at 203.2 133.35 0)
      (effects (font (size 1.27 1.27)) hide)
    )
    (property "Value" "GNDA" (id 1) (at 203.2 132.08 0))
    (property "Footprint" "" (id 2) (at 203.2 127 0)
      (effects (font (size 1.27 1.27)) hide)
    )
    (property "Datasheet" "" (id 3) (at 203.2 127 0)
      (effects (font (size 1.27 1.27)) hide)
    )
    (pin "1" (uuid 57aa2a11-7fcd-4e09-9777-bdf35ac2db55))
  )

  (symbol (lib_id "Device:R") (at 158.75 95.25 90) (unit 1)
    (in_bom yes) (on_board yes)
    (uuid 52abd944-e449-4071-bdd0-bd67e56d82b7)
    (property "Reference" "R605" (id 0) (at 158.75 92.71 90))
    (property "Value" "0" (id 1) (at 158.75 95.25 90))
    (property "Footprint" "Resistor_SMD:R_0402_1005Metric" (id 2) (at 158.75 97.028 90)
      (effects (font (size 1.27 1.27)) hide)
    )
    (property "Datasheet" "~" (id 3) (at 158.75 95.25 0)
      (effects (font (size 1.27 1.27)) hide)
    )
    (property "PartSpecification" "3000-0000000142" (id 4) (at 158.75 95.25 0)
      (effects (font (size 1.27 1.27)) hide)
    )
    (pin "1" (uuid 65d10d24-0ffc-4f9f-a216-52e8b653b284))
    (pin "2" (uuid 28b774e3-d5fc-4793-b65e-085bfdd8de76))
  )

  (symbol (lib_id "000_PreferredParts:C_0_1uF") (at 101.6 57.15 0) (unit 1)
    (in_bom yes) (on_board yes) (fields_autoplaced)
    (uuid 56b01b59-a7a8-4fb8-b509-ff98b41bd9b3)
    (property "Reference" "C602" (id 0) (at 105.41 55.8799 0)
      (effects (font (size 1.27 1.27)) (justify left))
    )
    (property "Value" "C_0_1uF" (id 1) (at 102.235 59.69 0)
      (effects (font (size 1.27 1.27)) (justify left) hide)
    )
    (property "Footprint" "Capacitor_SMD:C_0402_1005Metric" (id 2) (at 102.5652 60.96 0)
      (effects (font (size 1.27 1.27)) hide)
    )
    (property "Datasheet" "~" (id 3) (at 101.6 57.15 0)
      (effects (font (size 1.27 1.27)) hide)
    )
    (property "DisplayValue" "0.1uF" (id 4) (at 105.41 58.4199 0)
      (effects (font (size 1.27 1.27)) (justify left))
    )
    (property "PartSpecification" "3000-0000000125" (id 5) (at 101.6 57.15 0)
      (effects (font (size 1.27 1.27)) hide)
    )
    (property "Voltage" "100V" (id 6) (at 101.6 57.15 0)
      (effects (font (size 1.27 1.27)) hide)
    )
    (pin "1" (uuid 8abe6522-4475-4292-92d2-afe0c94bb18f))
    (pin "2" (uuid b8df857f-4a3a-436a-8683-29fb6a02cb78))
  )

  (symbol (lib_id "Device:R") (at 168.91 87.63 90) (unit 1)
    (in_bom yes) (on_board yes)
    (uuid 5cec33f3-46e1-4e3d-b07a-4826bd1bee28)
    (property "Reference" "R607" (id 0) (at 168.91 85.09 90))
    (property "Value" "0" (id 1) (at 168.91 87.63 90))
    (property "Footprint" "Resistor_SMD:R_0402_1005Metric" (id 2) (at 168.91 89.408 90)
      (effects (font (size 1.27 1.27)) hide)
    )
    (property "Datasheet" "~" (id 3) (at 168.91 87.63 0)
      (effects (font (size 1.27 1.27)) hide)
    )
    (property "PartSpecification" "3000-0000000142" (id 4) (at 168.91 87.63 0)
      (effects (font (size 1.27 1.27)) hide)
    )
    (pin "1" (uuid 12f91e81-2978-42ea-a134-08f027681920))
    (pin "2" (uuid 1017970b-bd8f-4d50-9023-5ee168a04782))
  )

  (symbol (lib_id "Device:R") (at 158.75 90.17 90) (unit 1)
    (in_bom yes) (on_board yes)
    (uuid 694f890a-849e-4be4-8605-eb70d2e37266)
    (property "Reference" "R604" (id 0) (at 158.75 87.63 90))
    (property "Value" "0" (id 1) (at 158.75 90.17 90))
    (property "Footprint" "Resistor_SMD:R_0402_1005Metric" (id 2) (at 158.75 91.948 90)
      (effects (font (size 1.27 1.27)) hide)
    )
    (property "Datasheet" "~" (id 3) (at 158.75 90.17 0)
      (effects (font (size 1.27 1.27)) hide)
    )
    (property "PartSpecification" "3000-0000000142" (id 4) (at 158.75 90.17 0)
      (effects (font (size 1.27 1.27)) hide)
    )
    (pin "1" (uuid 3351c3fe-5a18-4acb-b298-c71f5e8958c6))
    (pin "2" (uuid b728b94c-a439-4250-b7da-b94ab7676882))
  )

  (symbol (lib_id "POWDER_Data_Converter:BH2226F") (at 114.3 88.9 0) (unit 1)
    (in_bom yes) (on_board yes) (fields_autoplaced)
    (uuid 7759603d-3868-493f-b225-2994d2e365f5)
    (property "Reference" "U601" (id 0) (at 116.3194 71.12 0)
      (effects (font (size 1.27 1.27)) (justify left))
    )
    (property "Value" "BH2226F" (id 1) (at 116.3194 73.66 0)
      (effects (font (size 1.27 1.27)) (justify left))
    )
    (property "Footprint" "Package_SO:SOP-16_4.4x10.4mm_P1.27mm" (id 2) (at 114.3 114.3 0)
      (effects (font (size 1.27 1.27)) hide)
    )
    (property "Datasheet" "" (id 3) (at 114.3 88.9 0)
      (effects (font (size 1.27 1.27)) hide)
    )
    (property "PartSpecification" "3000-0000001396" (id 4) (at 114.3 88.9 0)
      (effects (font (size 1.27 1.27)) hide)
    )
    (pin "1" (uuid b8af5461-cea0-427b-ae6a-495c2eafd63d))
    (pin "10" (uuid 9d61c3e9-0ef4-4a2b-b187-223930ce6134))
    (pin "11" (uuid 0b7b18e2-fd3e-4fd5-884e-21d7e0583dca))
    (pin "12" (uuid 5539188b-e1c7-43dd-8336-67a4427ec003))
    (pin "13" (uuid c6a4f1eb-9b57-4716-8fd6-2993e0cebf6b))
    (pin "14" (uuid a7002a43-85a2-444c-852b-2857552f860d))
    (pin "15" (uuid 9d7183fc-97cc-40d7-92a9-b8bd9ee6c3b5))
    (pin "16" (uuid 9f8bc171-2b1c-409a-9777-0feb0bfc066b))
    (pin "2" (uuid 0ef1f9b0-2e58-4a39-b404-3d31852cfd16))
    (pin "3" (uuid 9d57f00f-e53b-4011-9141-c25c771d6913))
    (pin "4" (uuid 27b7d626-f0b1-4b6e-b2d8-bf4e6937d6b4))
    (pin "5" (uuid ab96b83e-23a9-4ead-86ab-6765651640d2))
    (pin "6" (uuid 3ada00fb-1c14-4d54-b93b-447976bcfcc9))
    (pin "7" (uuid f1389335-9b04-4a6f-b1ea-9ae30043d755))
    (pin "8" (uuid 42ec173e-f215-44a4-857a-10f7a313fcef))
    (pin "9" (uuid 8cb1c5d0-6833-49fc-be6f-1e78c8cd491d))
  )

  (symbol (lib_id "power:GNDA") (at 114.3 106.68 0) (unit 1)
    (in_bom yes) (on_board yes) (fields_autoplaced)
    (uuid 7a50eeec-2a2b-41df-bea5-0250eea65ab2)
    (property "Reference" "#PWR0606" (id 0) (at 114.3 113.03 0)
      (effects (font (size 1.27 1.27)) hide)
    )
    (property "Value" "GNDA" (id 1) (at 114.3 111.76 0))
    (property "Footprint" "" (id 2) (at 114.3 106.68 0)
      (effects (font (size 1.27 1.27)) hide)
    )
    (property "Datasheet" "" (id 3) (at 114.3 106.68 0)
      (effects (font (size 1.27 1.27)) hide)
    )
    (pin "1" (uuid 454c35c2-0fd1-4b31-beb8-1332c390e82e))
  )

  (symbol (lib_id "Device:FerriteBead") (at 95.25 50.8 90) (unit 1)
    (in_bom yes) (on_board yes) (fields_autoplaced)
    (uuid 7dac43b1-d600-4940-bdc3-8cf4b39c4c54)
    (property "Reference" "FB601" (id 0) (at 95.1992 43.18 90))
    (property "Value" "FerriteBead" (id 1) (at 95.1992 45.72 90))
    (property "Footprint" "Inductor_SMD:L_0603_1608Metric" (id 2) (at 95.25 52.578 90)
      (effects (font (size 1.27 1.27)) hide)
    )
    (property "Datasheet" "~" (id 3) (at 95.25 50.8 0)
      (effects (font (size 1.27 1.27)) hide)
    )
    (property "PartSpecification" "3000-0000000091" (id 4) (at 95.25 50.8 90)
      (effects (font (size 1.27 1.27)) hide)
    )
    (pin "1" (uuid 1f1514e8-c33d-4251-9848-52a054b1b82b))
    (pin "2" (uuid f09926d4-641a-4d9e-9306-4eab7eb940ad))
  )

  (symbol (lib_id "power:GNDA") (at 96.52 106.68 0) (unit 1)
    (in_bom yes) (on_board yes) (fields_autoplaced)
    (uuid 81ac31ba-f169-4c58-aa07-7bcec490d5e9)
    (property "Reference" "#PWR0604" (id 0) (at 96.52 113.03 0)
      (effects (font (size 1.27 1.27)) hide)
    )
    (property "Value" "GNDA" (id 1) (at 96.52 111.76 0))
    (property "Footprint" "" (id 2) (at 96.52 106.68 0)
      (effects (font (size 1.27 1.27)) hide)
    )
    (property "Datasheet" "" (id 3) (at 96.52 106.68 0)
      (effects (font (size 1.27 1.27)) hide)
    )
    (pin "1" (uuid 78ca2751-82cf-4f46-9ab7-269014ddc724))
  )

  (symbol (lib_id "000_PreferredParts:C_0_1uF") (at 88.9 57.15 0) (unit 1)
    (in_bom yes) (on_board yes) (fields_autoplaced)
    (uuid 8c1837d8-4a07-4745-8503-a229466135e9)
    (property "Reference" "C601" (id 0) (at 92.71 55.8799 0)
      (effects (font (size 1.27 1.27)) (justify left))
    )
    (property "Value" "C_0_1uF" (id 1) (at 89.535 59.69 0)
      (effects (font (size 1.27 1.27)) (justify left) hide)
    )
    (property "Footprint" "Capacitor_SMD:C_0402_1005Metric" (id 2) (at 89.8652 60.96 0)
      (effects (font (size 1.27 1.27)) hide)
    )
    (property "Datasheet" "~" (id 3) (at 88.9 57.15 0)
      (effects (font (size 1.27 1.27)) hide)
    )
    (property "DisplayValue" "0.1uF" (id 4) (at 92.71 58.4199 0)
      (effects (font (size 1.27 1.27)) (justify left))
    )
    (property "PartSpecification" "3000-0000000125" (id 5) (at 88.9 57.15 0)
      (effects (font (size 1.27 1.27)) hide)
    )
    (property "Voltage" "100V" (id 6) (at 88.9 57.15 0)
      (effects (font (size 1.27 1.27)) hide)
    )
    (pin "1" (uuid f33c3eac-5c98-4654-9763-2944e306e568))
    (pin "2" (uuid 8023c29c-0405-40db-a7f2-492d0b94c82a))
  )

  (symbol (lib_id "Device:R") (at 158.75 80.01 90) (unit 1)
    (in_bom yes) (on_board yes)
    (uuid 90947b62-c31f-4f16-ad5e-289f6b70415b)
    (property "Reference" "R602" (id 0) (at 158.75 77.47 90))
    (property "Value" "0" (id 1) (at 158.75 80.01 90))
    (property "Footprint" "Resistor_SMD:R_0402_1005Metric" (id 2) (at 158.75 81.788 90)
      (effects (font (size 1.27 1.27)) hide)
    )
    (property "Datasheet" "~" (id 3) (at 158.75 80.01 0)
      (effects (font (size 1.27 1.27)) hide)
    )
    (property "PartSpecification" "3000-0000000142" (id 4) (at 158.75 80.01 0)
      (effects (font (size 1.27 1.27)) hide)
    )
    (pin "1" (uuid 66e5bba5-8285-45fb-86ef-8829f2c429a8))
    (pin "2" (uuid defd359b-95e5-4700-9764-b581b6b9d135))
  )

  (symbol (lib_id "Device:R") (at 88.9 100.33 0) (unit 1)
    (in_bom yes) (on_board yes) (fields_autoplaced)
    (uuid 966b823f-c286-4289-8d22-e0ce68b4c1f4)
    (property "Reference" "R601" (id 0) (at 91.44 99.0599 0)
      (effects (font (size 1.27 1.27)) (justify left))
    )
    (property "Value" "10k" (id 1) (at 91.44 101.5999 0)
      (effects (font (size 1.27 1.27)) (justify left))
    )
    (property "Footprint" "Resistor_SMD:R_0402_1005Metric" (id 2) (at 87.122 100.33 90)
      (effects (font (size 1.27 1.27)) hide)
    )
    (property "Datasheet" "~" (id 3) (at 88.9 100.33 0)
      (effects (font (size 1.27 1.27)) hide)
    )
    (pin "1" (uuid 4490cd57-f603-493e-98f7-cedb5b5e2faf))
    (pin "2" (uuid 53457d0a-fc85-47e6-8a09-c46517aa8e93))
  )

  (symbol (lib_id "Device:C") (at 222.25 120.65 0) (unit 1)
    (in_bom yes) (on_board yes) (fields_autoplaced)
    (uuid a35399bd-ee89-4718-aa5d-686a8c05540d)
    (property "Reference" "C612" (id 0) (at 226.06 119.3799 0)
      (effects (font (size 1.27 1.27)) (justify left))
    )
    (property "Value" "DNP" (id 1) (at 226.06 121.9199 0)
      (effects (font (size 1.27 1.27)) (justify left))
    )
    (property "Footprint" "Capacitor_SMD:C_0402_1005Metric" (id 2) (at 223.2152 124.46 0)
      (effects (font (size 1.27 1.27)) hide)
    )
    (property "Datasheet" "~" (id 3) (at 222.25 120.65 0)
      (effects (font (size 1.27 1.27)) hide)
    )
    (pin "1" (uuid ca8700e2-d379-4026-9fb5-974be72465eb))
    (pin "2" (uuid b6e7545d-523c-477c-b022-609d429c6da9))
  )

  (symbol (lib_id "Device:C") (at 184.15 120.65 0) (unit 1)
    (in_bom yes) (on_board yes) (fields_autoplaced)
    (uuid a51d4945-5605-4bce-8623-af72e5b9747a)
    (property "Reference" "C606" (id 0) (at 187.96 119.3799 0)
      (effects (font (size 1.27 1.27)) (justify left))
    )
    (property "Value" "DNP" (id 1) (at 187.96 121.9199 0)
      (effects (font (size 1.27 1.27)) (justify left))
    )
    (property "Footprint" "Capacitor_SMD:C_0402_1005Metric" (id 2) (at 185.1152 124.46 0)
      (effects (font (size 1.27 1.27)) hide)
    )
    (property "Datasheet" "~" (id 3) (at 184.15 120.65 0)
      (effects (font (size 1.27 1.27)) hide)
    )
    (pin "1" (uuid 7fbcb200-cb6e-48bb-8ded-d16a67891464))
    (pin "2" (uuid a2edf524-82f0-480e-b0e8-7fd56c67b268))
  )

  (symbol (lib_id "power:GNDA") (at 196.85 127 0) (unit 1)
    (in_bom yes) (on_board yes) (fields_autoplaced)
    (uuid aaf6338a-3f0e-4fd1-8413-90830605a148)
    (property "Reference" "#PWR0612" (id 0) (at 196.85 133.35 0)
      (effects (font (size 1.27 1.27)) hide)
    )
    (property "Value" "GNDA" (id 1) (at 196.85 132.08 0))
    (property "Footprint" "" (id 2) (at 196.85 127 0)
      (effects (font (size 1.27 1.27)) hide)
    )
    (property "Datasheet" "" (id 3) (at 196.85 127 0)
      (effects (font (size 1.27 1.27)) hide)
    )
    (pin "1" (uuid 19d49689-91c7-4132-a924-192dda662613))
  )

  (symbol (lib_id "power:+5V") (at 76.2 48.26 0) (unit 1)
    (in_bom yes) (on_board yes) (fields_autoplaced)
    (uuid ae1348eb-de98-48b9-a2d1-2f58cddbf8f4)
    (property "Reference" "#PWR0601" (id 0) (at 76.2 52.07 0)
      (effects (font (size 1.27 1.27)) hide)
    )
    (property "Value" "+5V" (id 1) (at 76.2 43.18 0))
    (property "Footprint" "" (id 2) (at 76.2 48.26 0)
      (effects (font (size 1.27 1.27)) hide)
    )
    (property "Datasheet" "" (id 3) (at 76.2 48.26 0)
      (effects (font (size 1.27 1.27)) hide)
    )
    (pin "1" (uuid 3dedff8d-4447-4a13-8977-0e40c2b80e2f))
  )

  (symbol (lib_id "power:GNDA") (at 190.5 127 0) (unit 1)
    (in_bom yes) (on_board yes) (fields_autoplaced)
    (uuid b7c25e9d-1d5f-4bfe-bd18-0c2fe98fe5eb)
    (property "Reference" "#PWR0611" (id 0) (at 190.5 133.35 0)
      (effects (font (size 1.27 1.27)) hide)
    )
    (property "Value" "GNDA" (id 1) (at 190.5 132.08 0))
    (property "Footprint" "" (id 2) (at 190.5 127 0)
      (effects (font (size 1.27 1.27)) hide)
    )
    (property "Datasheet" "" (id 3) (at 190.5 127 0)
      (effects (font (size 1.27 1.27)) hide)
    )
    (pin "1" (uuid 5ab25bf0-7460-4591-be03-b67e1c23db19))
  )

  (symbol (lib_id "Device:R") (at 168.91 97.79 90) (unit 1)
    (in_bom yes) (on_board yes)
    (uuid b9a45cd6-373a-455c-930f-0d8343352389)
    (property "Reference" "R609" (id 0) (at 168.91 95.25 90))
    (property "Value" "0" (id 1) (at 168.91 97.79 90))
    (property "Footprint" "Resistor_SMD:R_0402_1005Metric" (id 2) (at 168.91 99.568 90)
      (effects (font (size 1.27 1.27)) hide)
    )
    (property "Datasheet" "~" (id 3) (at 168.91 97.79 0)
      (effects (font (size 1.27 1.27)) hide)
    )
    (property "PartSpecification" "3000-0000000142" (id 4) (at 168.91 97.79 0)
      (effects (font (size 1.27 1.27)) hide)
    )
    (pin "1" (uuid 761301a9-8393-4cfb-89b6-9a075b0bb173))
    (pin "2" (uuid fb4f644c-c47c-4105-8bae-bd94c72b485b))
  )

  (symbol (lib_id "power:GNDA") (at 222.25 127 0) (unit 1)
    (in_bom yes) (on_board yes) (fields_autoplaced)
    (uuid ba0deac5-7282-44ba-a24e-b351fefd8b5a)
    (property "Reference" "#PWR0616" (id 0) (at 222.25 133.35 0)
      (effects (font (size 1.27 1.27)) hide)
    )
    (property "Value" "GNDA" (id 1) (at 222.25 132.08 0))
    (property "Footprint" "" (id 2) (at 222.25 127 0)
      (effects (font (size 1.27 1.27)) hide)
    )
    (property "Datasheet" "" (id 3) (at 222.25 127 0)
      (effects (font (size 1.27 1.27)) hide)
    )
    (pin "1" (uuid 3a2e9794-de4d-4afd-bc0f-205919e31aee))
  )

  (symbol (lib_id "Device:C") (at 177.8 107.95 0) (unit 1)
    (in_bom yes) (on_board yes) (fields_autoplaced)
    (uuid bc950edb-090e-4db4-9970-8bd6baa16ebe)
    (property "Reference" "C605" (id 0) (at 181.61 106.6799 0)
      (effects (font (size 1.27 1.27)) (justify left))
    )
    (property "Value" "DNP" (id 1) (at 181.61 109.2199 0)
      (effects (font (size 1.27 1.27)) (justify left))
    )
    (property "Footprint" "Capacitor_SMD:C_0402_1005Metric" (id 2) (at 178.7652 111.76 0)
      (effects (font (size 1.27 1.27)) hide)
    )
    (property "Datasheet" "~" (id 3) (at 177.8 107.95 0)
      (effects (font (size 1.27 1.27)) hide)
    )
    (pin "1" (uuid a480bc07-2548-4772-acdf-a198c2191e78))
    (pin "2" (uuid 26027b04-71b4-4d2a-ab01-8b49562cbc9d))
  )

  (symbol (lib_id "power:GNDA") (at 101.6 63.5 0) (unit 1)
    (in_bom yes) (on_board yes) (fields_autoplaced)
    (uuid c41404f6-a76e-49b2-88bc-df48ca5abdf3)
    (property "Reference" "#PWR0605" (id 0) (at 101.6 69.85 0)
      (effects (font (size 1.27 1.27)) hide)
    )
    (property "Value" "GNDA" (id 1) (at 101.6 68.58 0))
    (property "Footprint" "" (id 2) (at 101.6 63.5 0)
      (effects (font (size 1.27 1.27)) hide)
    )
    (property "Datasheet" "" (id 3) (at 101.6 63.5 0)
      (effects (font (size 1.27 1.27)) hide)
    )
    (pin "1" (uuid d1115141-2b90-4c04-a449-aa73f170b1bc))
  )

  (symbol (lib_id "Device:C") (at 196.85 120.65 0) (unit 1)
    (in_bom yes) (on_board yes) (fields_autoplaced)
    (uuid ceb7890a-c3c4-49d5-a1c5-518528fd96bc)
    (property "Reference" "C608" (id 0) (at 200.66 119.3799 0)
      (effects (font (size 1.27 1.27)) (justify left))
    )
    (property "Value" "DNP" (id 1) (at 200.66 121.9199 0)
      (effects (font (size 1.27 1.27)) (justify left))
    )
    (property "Footprint" "Capacitor_SMD:C_0402_1005Metric" (id 2) (at 197.8152 124.46 0)
      (effects (font (size 1.27 1.27)) hide)
    )
    (property "Datasheet" "~" (id 3) (at 196.85 120.65 0)
      (effects (font (size 1.27 1.27)) hide)
    )
    (pin "1" (uuid d121be7b-3316-4790-a04d-916ba3c6b607))
    (pin "2" (uuid 6367582f-2d3e-4000-ab9b-6bf5acc725c3))
  )

  (symbol (lib_id "Device:C") (at 209.55 120.65 0) (unit 1)
    (in_bom yes) (on_board yes) (fields_autoplaced)
    (uuid db1614a2-88ff-49de-8530-6e76f49d6f3d)
    (property "Reference" "C610" (id 0) (at 213.36 119.3799 0)
      (effects (font (size 1.27 1.27)) (justify left))
    )
    (property "Value" "DNP" (id 1) (at 213.36 121.9199 0)
      (effects (font (size 1.27 1.27)) (justify left))
    )
    (property "Footprint" "Capacitor_SMD:C_0402_1005Metric" (id 2) (at 210.5152 124.46 0)
      (effects (font (size 1.27 1.27)) hide)
    )
    (property "Datasheet" "~" (id 3) (at 209.55 120.65 0)
      (effects (font (size 1.27 1.27)) hide)
    )
    (pin "1" (uuid 375aa0c6-e09b-43eb-98b3-5007470da95f))
    (pin "2" (uuid e5820f32-c1c6-473d-91d2-f951d0fcac12))
  )

  (symbol (lib_id "Device:R") (at 168.91 92.71 90) (unit 1)
    (in_bom yes) (on_board yes)
    (uuid dffd51d6-3b96-4bb0-8dfc-64bad82d18fd)
    (property "Reference" "R608" (id 0) (at 168.91 90.17 90))
    (property "Value" "0" (id 1) (at 168.91 92.71 90))
    (property "Footprint" "Resistor_SMD:R_0402_1005Metric" (id 2) (at 168.91 94.488 90)
      (effects (font (size 1.27 1.27)) hide)
    )
    (property "Datasheet" "~" (id 3) (at 168.91 92.71 0)
      (effects (font (size 1.27 1.27)) hide)
    )
    (property "PartSpecification" "3000-0000000142" (id 4) (at 168.91 92.71 0)
      (effects (font (size 1.27 1.27)) hide)
    )
    (pin "1" (uuid c3b6cf50-3f56-4ec9-a6ea-000ae580ff56))
    (pin "2" (uuid bf46ca02-5094-43cc-858f-830c817bcaaf))
  )

  (symbol (lib_id "power:GNDA") (at 184.15 127 0) (unit 1)
    (in_bom yes) (on_board yes) (fields_autoplaced)
    (uuid eb073021-5a5e-4cd1-a192-c850ae8db330)
    (property "Reference" "#PWR0610" (id 0) (at 184.15 133.35 0)
      (effects (font (size 1.27 1.27)) hide)
    )
    (property "Value" "GNDA" (id 1) (at 184.15 132.08 0))
    (property "Footprint" "" (id 2) (at 184.15 127 0)
      (effects (font (size 1.27 1.27)) hide)
    )
    (property "Datasheet" "" (id 3) (at 184.15 127 0)
      (effects (font (size 1.27 1.27)) hide)
    )
    (pin "1" (uuid 6c922b28-f4e6-48ac-8c11-b99b1cd4d6e9))
  )

  (symbol (lib_id "000_PreferredParts:C_10pF") (at 133.35 57.15 0) (unit 1)
    (in_bom yes) (on_board yes) (fields_autoplaced)
    (uuid edfc8340-a4a6-4158-bcff-67c1e2b19dc8)
    (property "Reference" "C604" (id 0) (at 137.16 55.8799 0)
      (effects (font (size 1.27 1.27)) (justify left))
    )
    (property "Value" "C_10pF" (id 1) (at 137.16 58.4199 0)
      (effects (font (size 1.27 1.27)) (justify left))
    )
    (property "Footprint" "Capacitor_SMD:C_0402_1005Metric" (id 2) (at 134.3152 60.96 0)
      (effects (font (size 1.27 1.27)) hide)
    )
    (property "Datasheet" "~" (id 3) (at 133.35 57.15 0)
      (effects (font (size 1.27 1.27)) hide)
    )
    (property "PartSpecification" "3000-0000000582" (id 4) (at 133.35 57.15 0)
      (effects (font (size 1.27 1.27)) hide)
    )
    (pin "1" (uuid bc61c862-fd0c-4c5c-80bd-a49575c6fa62))
    (pin "2" (uuid 44388f55-80f4-43e2-80c1-a89603c26d3f))
  )

  (symbol (lib_id "power:GNDA") (at 133.35 63.5 0) (unit 1)
    (in_bom yes) (on_board yes) (fields_autoplaced)
    (uuid f00ca15f-25b5-4957-a13e-9ae9d0847448)
    (property "Reference" "#PWR0608" (id 0) (at 133.35 69.85 0)
      (effects (font (size 1.27 1.27)) hide)
    )
    (property "Value" "GNDA" (id 1) (at 133.35 68.58 0))
    (property "Footprint" "" (id 2) (at 133.35 63.5 0)
      (effects (font (size 1.27 1.27)) hide)
    )
    (property "Datasheet" "" (id 3) (at 133.35 63.5 0)
      (effects (font (size 1.27 1.27)) hide)
    )
    (pin "1" (uuid 035addab-aa20-4c58-9c1b-32b9e7a3ba8c))
  )

  (symbol (lib_id "power:GNDA") (at 209.55 127 0) (unit 1)
    (in_bom yes) (on_board yes) (fields_autoplaced)
    (uuid f2f7d071-d60a-4c65-aefc-4ffcbbfad453)
    (property "Reference" "#PWR0614" (id 0) (at 209.55 133.35 0)
      (effects (font (size 1.27 1.27)) hide)
    )
    (property "Value" "GNDA" (id 1) (at 209.55 132.08 0))
    (property "Footprint" "" (id 2) (at 209.55 127 0)
      (effects (font (size 1.27 1.27)) hide)
    )
    (property "Datasheet" "" (id 3) (at 209.55 127 0)
      (effects (font (size 1.27 1.27)) hide)
    )
    (pin "1" (uuid cd4b7792-f679-4425-8cd5-7dab3de88dfd))
  )

  (symbol (lib_id "power:GNDA") (at 177.8 127 0) (unit 1)
    (in_bom yes) (on_board yes) (fields_autoplaced)
    (uuid f342cf08-de45-4d06-8269-a3dd6f965d1e)
    (property "Reference" "#PWR0609" (id 0) (at 177.8 133.35 0)
      (effects (font (size 1.27 1.27)) hide)
    )
    (property "Value" "GNDA" (id 1) (at 177.8 132.08 0))
    (property "Footprint" "" (id 2) (at 177.8 127 0)
      (effects (font (size 1.27 1.27)) hide)
    )
    (property "Datasheet" "" (id 3) (at 177.8 127 0)
      (effects (font (size 1.27 1.27)) hide)
    )
    (pin "1" (uuid b75e0bb7-cc19-46ba-8dc4-e416332df79c))
  )
)
