EESchema Schematic File Version 4
EELAYER 30 0
EELAYER END
$Descr A4 11693 8268
encoding utf-8
Sheet 2 27
Title ""
Date ""
Rev ""
Comp ""
Comment1 ""
Comment2 ""
Comment3 ""
Comment4 ""
$EndDescr
Text HLabel 2000 1000 0    50   Input ~ 0
v_in
Text HLabel 7000 1000 2    50   Output ~ 0
v_out
Text HLabel 6800 5350 2    50   Output ~ 0
p_good
$Comp
L POWDER_Power:LM5060 U?
U 1 1 5E23E31F
P 5200 5100
AR Path="/5E23E31F" Ref="U?"  Part="1" 
AR Path="/5E177DA4/5E23E31F" Ref="U202"  Part="1" 
F 0 "U202" H 5650 5800 50  0000 C CNN
F 1 "LM5060" H 5200 5250 50  0000 C CNN
F 2 "Package_SO:VSSOP-10_3x3mm_P0.5mm" H 6050 6200 50  0001 C CNN
F 3 "" H 5450 5900 50  0001 C CNN
F 4 "3000-0000000462" H 5900 6350 50  0001 C CNN "PartSpecification"
	1    5200 5100
	1    0    0    -1  
$EndComp
$Comp
L POWDER_Power:CSD19536KTT U201
U 1 1 5E246C6F
P 5050 1050
F 0 "U201" H 4900 850 50  0000 C CNN
F 1 "CSD19536KTT" V 5200 1050 50  0000 C CNN
F 2 "Package_TO_SOT_SMD:TO-263-2" H 4800 750 50  0001 C CNN
F 3 "" H 5050 1050 50  0001 C CNN
F 4 "3000-0000000504" H 5050 1050 50  0001 C CNN "PartSpecification"
	1    5050 1050
	0    -1   -1   0   
$EndComp
$Comp
L POWDER_Power:CSD19536KTT U204
U 1 1 5E247887
P 6300 1050
F 0 "U204" H 6150 850 50  0000 C CNN
F 1 "CSD19536KTT" V 6450 1050 50  0000 C CNN
F 2 "Package_TO_SOT_SMD:TO-263-2" H 6050 750 50  0001 C CNN
F 3 "" H 6300 1050 50  0001 C CNN
F 4 "3000-0000000504" H 6300 1050 50  0001 C CNN "PartSpecification"
	1    6300 1050
	0    1    -1   0   
$EndComp
Wire Wire Line
	6100 1000 5600 1000
$Comp
L Device:R R209
U 1 1 5E249640
P 6050 5000
F 0 "R209" V 6130 5000 50  0000 C CNN
F 1 "100k" V 6050 5000 50  0000 C CNN
F 2 "Resistor_SMD:R_2512_6332Metric" V 5980 5000 50  0001 C CNN
F 3 "~" H 6050 5000 50  0001 C CNN
F 4 "3000-0000000545" H 6050 5000 50  0001 C CNN "PartSpecification"
	1    6050 5000
	1    0    0    -1  
$EndComp
Wire Wire Line
	6050 5250 6050 5150
Wire Wire Line
	5200 3950 5200 4350
Wire Wire Line
	5200 3650 4900 3650
Wire Wire Line
	4900 3650 4900 4100
Wire Wire Line
	5050 3950 5200 3950
$Comp
L Device:R R207
U 1 1 5E24F2B1
P 5050 3400
F 0 "R207" V 5130 3400 50  0000 C CNN
F 1 "3.9k" V 5050 3400 50  0000 C CNN
F 2 "Resistor_SMD:R_2512_6332Metric" V 4980 3400 50  0001 C CNN
F 3 "~" H 5050 3400 50  0001 C CNN
F 4 "" V 5050 3400 50  0001 C CNN "PartNumber"
F 5 "1W" V 5050 3400 50  0001 C CNN "Power"
F 6 "3000-0000000543" H 5050 3400 50  0001 C CNN "PartSpecification"
	1    5050 3400
	1    0    0    -1  
$EndComp
Wire Wire Line
	5050 3550 5050 3950
Wire Wire Line
	5050 3250 5050 3100
Wire Wire Line
	5050 3100 6300 3100
Wire Wire Line
	6300 3100 6300 1600
Connection ~ 5050 3100
Wire Wire Line
	5050 3100 5050 1250
Wire Wire Line
	4650 3250 4650 3100
Wire Wire Line
	4650 3100 5050 3100
Wire Wire Line
	4650 3950 5050 3950
Connection ~ 5050 3950
Wire Wire Line
	4650 3550 4650 3950
Wire Wire Line
	4300 4550 4300 4800
Wire Wire Line
	4300 4800 4700 4800
Wire Wire Line
	4300 1000 4300 4250
Wire Wire Line
	4300 1000 3800 1000
Connection ~ 4300 1000
Text Label 3800 1000 0    50   ~ 0
v_in
$Comp
L Device:R R203
U 1 1 5E257B42
P 3800 4700
F 0 "R203" V 3880 4700 50  0000 C CNN
F 1 "100k" V 3800 4700 50  0000 C CNN
F 2 "Resistor_SMD:R_2512_6332Metric" V 3730 4700 50  0001 C CNN
F 3 "~" H 3800 4700 50  0001 C CNN
F 4 "" V 3800 4700 50  0001 C CNN "PartNumber"
F 5 "3000-0000000545" H 3800 4700 50  0001 C CNN "PartSpecification"
	1    3800 4700
	1    0    0    -1  
$EndComp
$Comp
L Device:R R204
U 1 1 5E257E4D
P 3800 5250
F 0 "R204" V 3880 5250 50  0000 C CNN
F 1 "15.4k" V 3800 5250 50  0000 C CNN
F 2 "Resistor_SMD:R_0402_1005Metric" V 3730 5250 50  0001 C CNN
F 3 "~" H 3800 5250 50  0001 C CNN
F 4 "" V 3800 5250 50  0001 C CNN "PartNumber"
F 5 "3000-0000000568" H 3800 5250 50  0001 C CNN "PartSpecification"
	1    3800 5250
	1    0    0    -1  
$EndComp
Wire Wire Line
	3800 5100 4700 5100
$Comp
L Device:R R205
U 1 1 5E25895B
P 3800 5550
F 0 "R205" V 3880 5550 50  0000 C CNN
F 1 "4.02k" V 3800 5550 50  0000 C CNN
F 2 "Resistor_SMD:R_0402_1005Metric" V 3730 5550 50  0001 C CNN
F 3 "~" H 3800 5550 50  0001 C CNN
F 4 "" V 3800 5550 50  0001 C CNN "PartNumber"
F 5 "3000-0000000569" H 3800 5550 50  0001 C CNN "PartSpecification"
	1    3800 5550
	1    0    0    -1  
$EndComp
$Comp
L power:GND #PWR?
U 1 1 5E258CB7
P 3800 5950
F 0 "#PWR?" H 3800 5700 50  0001 C CNN
F 1 "GND" H 3800 5800 50  0000 C CNN
F 2 "" H 3800 5950 50  0001 C CNN
F 3 "" H 3800 5950 50  0001 C CNN
	1    3800 5950
	1    0    0    -1  
$EndComp
Wire Wire Line
	3800 5950 3800 5700
Wire Wire Line
	3800 5100 3800 4850
Connection ~ 3800 5100
Wire Wire Line
	3800 4550 3800 1000
Connection ~ 3800 1000
Wire Wire Line
	3800 1000 3300 1000
$Comp
L Device:D_Schottky D204
U 1 1 5E25CDCE
P 3300 3800
F 0 "D204" H 3300 3900 50  0000 C CNN
F 1 "D_Schottky" H 3300 3700 50  0000 C CNN
F 2 "POWDER_Power:SMP" H 3300 3800 50  0001 C CNN
F 3 "~" H 3300 3800 50  0001 C CNN
F 4 "V2PM10L" H 3300 3800 50  0001 C CNN "PartNumber"
F 5 "3000-0000000478" H 3300 3800 50  0001 C CNN "PartSpecification"
	1    3300 3800
	0    -1   -1   0   
$EndComp
$Comp
L power:GND #PWR?
U 1 1 5E25D569
P 3300 4050
F 0 "#PWR?" H 3300 3800 50  0001 C CNN
F 1 "GND" H 3300 3900 50  0000 C CNN
F 2 "" H 3300 4050 50  0001 C CNN
F 3 "" H 3300 4050 50  0001 C CNN
	1    3300 4050
	1    0    0    -1  
$EndComp
Wire Wire Line
	3300 4050 3300 3950
$Comp
L Device:D_Zener D203
U 1 1 5E25F039
P 3300 3300
F 0 "D203" H 3300 3400 50  0000 C CNN
F 1 "SMAJ60HR3G" H 3300 3200 50  0000 C CNN
F 2 "Diode_SMD:D_SMA" H 3300 3300 50  0001 C CNN
F 3 "~" H 3300 3300 50  0001 C CNN
F 4 "3000-0000000480" H 3300 3300 50  0001 C CNN "PartSpecification"
	1    3300 3300
	0    1    1    0   
$EndComp
Wire Wire Line
	3300 3450 3300 3650
Wire Wire Line
	3300 3150 3300 1000
Connection ~ 3300 1000
Wire Wire Line
	3300 1000 3000 1000
Wire Wire Line
	4700 5400 3800 5400
Connection ~ 3800 5400
$Comp
L 000_PreferredParts:C_100nF C203
U 1 1 5E2641DD
P 4300 5950
F 0 "C203" H 4325 6050 50  0000 L CNN
F 1 "C_100nF" H 4325 5850 50  0001 L CNN
F 2 "Capacitor_SMD:C_0402_1005Metric" H 4338 5800 50  0001 C CNN
F 3 "~" H 4300 5950 50  0001 C CNN
F 4 "100nF" H 4450 5850 50  0000 C CNN "DisplayValue"
F 5 "3000-0000000125" H 4300 5950 50  0001 C CNN "PartSpecification"
	1    4300 5950
	1    0    0    -1  
$EndComp
Wire Wire Line
	4300 5800 4300 4800
Connection ~ 4300 4800
$Comp
L power:GND #PWR?
U 1 1 5E2652F5
P 4300 6250
F 0 "#PWR?" H 4300 6000 50  0001 C CNN
F 1 "GND" H 4300 6100 50  0000 C CNN
F 2 "" H 4300 6250 50  0001 C CNN
F 3 "" H 4300 6250 50  0001 C CNN
	1    4300 6250
	1    0    0    -1  
$EndComp
Wire Wire Line
	4300 6250 4300 6100
$Comp
L Device:C C204
U 1 1 5E266894
P 5800 5800
F 0 "C204" H 5825 5900 50  0000 L CNN
F 1 "C" H 5825 5700 50  0000 L CNN
F 2 "Capacitor_SMD:C_0402_1005Metric" H 5838 5650 50  0001 C CNN
F 3 "~" H 5800 5800 50  0001 C CNN
	1    5800 5800
	1    0    0    -1  
$EndComp
Wire Wire Line
	5800 5650 5800 5550
Wire Wire Line
	5800 5550 5700 5550
$Comp
L power:GND #PWR?
U 1 1 5E267632
P 5800 6050
F 0 "#PWR?" H 5800 5800 50  0001 C CNN
F 1 "GND" H 5800 5900 50  0000 C CNN
F 2 "" H 5800 6050 50  0001 C CNN
F 3 "" H 5800 6050 50  0001 C CNN
	1    5800 6050
	1    0    0    -1  
$EndComp
Wire Wire Line
	5800 6050 5800 5950
$Comp
L power:GND #PWR?
U 1 1 5E269028
P 5200 6100
F 0 "#PWR?" H 5200 5850 50  0001 C CNN
F 1 "GND" H 5200 5950 50  0000 C CNN
F 2 "" H 5200 6100 50  0001 C CNN
F 3 "" H 5200 6100 50  0001 C CNN
	1    5200 6100
	1    0    0    -1  
$EndComp
Wire Wire Line
	5200 6100 5200 6000
$Comp
L Device:R R206
U 1 1 5E26AE0E
P 4450 3800
F 0 "R206" V 4530 3800 50  0000 C CNN
F 1 "10k" V 4450 3800 50  0000 C CNN
F 2 "Resistor_SMD:R_2512_6332Metric" V 4380 3800 50  0001 C CNN
F 3 "~" H 4450 3800 50  0001 C CNN
F 4 "" V 4450 3800 50  0001 C CNN "PartNumber"
F 5 "3000-0000000541" H 4450 3800 50  0001 C CNN "PartSpecification"
	1    4450 3800
	1    0    0    -1  
$EndComp
Wire Wire Line
	4300 1000 4450 1000
Wire Wire Line
	4450 3650 4450 1000
Connection ~ 4450 1000
Wire Wire Line
	4450 1000 4850 1000
Wire Wire Line
	4900 4100 4450 4100
Wire Wire Line
	4450 4100 4450 3950
Connection ~ 4900 4100
Wire Wire Line
	4900 4100 4900 4350
$Comp
L Device:Q_NPN_BCE Q201
U 1 1 5E26EF06
P 5800 1700
F 0 "Q201" H 6000 1750 50  0000 L CNN
F 1 "Q_NPN_BCE" H 6000 1650 50  0000 L CNN
F 2 "Package_TO_SOT_SMD:SOT-23" H 6000 1800 50  0001 C CNN
F 3 "~" H 5800 1700 50  0001 C CNN
F 4 "MMBT5551-FDICT-ND" H 5800 1700 50  0001 C CNN "PartNumber"
F 5 "3000-0000000495" H 5800 1700 50  0001 C CNN "PartSpecification"
	1    5800 1700
	0    1    -1   0   
$EndComp
$Comp
L Device:R R208
U 1 1 5E28D4E6
P 5800 2150
F 0 "R208" V 5880 2150 50  0000 C CNN
F 1 "10k" V 5800 2150 50  0000 C CNN
F 2 "Resistor_SMD:R_2512_6332Metric" V 5730 2150 50  0001 C CNN
F 3 "~" H 5800 2150 50  0001 C CNN
F 4 "" V 5800 2150 50  0001 C CNN "PartNumber"
F 5 "0.5W" V 5800 2150 50  0001 C CNN "Power"
F 6 "3000-0000000541" H 5800 2150 50  0001 C CNN "PartSpecification"
	1    5800 2150
	1    0    0    -1  
$EndComp
$Comp
L power:GND #PWR?
U 1 1 5E28D7DB
P 5800 2400
F 0 "#PWR?" H 5800 2150 50  0001 C CNN
F 1 "GND" H 5800 2250 50  0000 C CNN
F 2 "" H 5800 2400 50  0001 C CNN
F 3 "" H 5800 2400 50  0001 C CNN
	1    5800 2400
	1    0    0    -1  
$EndComp
Wire Wire Line
	5800 2400 5800 2300
Wire Wire Line
	5800 2000 5800 1950
Wire Wire Line
	6000 1600 6300 1600
Connection ~ 6300 1600
Wire Wire Line
	6300 1600 6300 1250
Wire Wire Line
	5600 1600 5600 1500
Connection ~ 5600 1000
Wire Wire Line
	5600 1000 5250 1000
Wire Wire Line
	5400 1650 5400 1500
Wire Wire Line
	5400 1500 5600 1500
Connection ~ 5600 1500
Wire Wire Line
	5600 1500 5600 1000
Wire Wire Line
	5800 1950 5400 1950
Connection ~ 5800 1950
Wire Wire Line
	5800 1950 5800 1900
Wire Wire Line
	7000 1000 6650 1000
$Comp
L Device:R R202
U 1 1 5E2A4796
P 3500 5200
F 0 "R202" V 3580 5200 50  0000 C CNN
F 1 "10k" V 3500 5200 50  0000 C CNN
F 2 "Resistor_SMD:R_2512_6332Metric" V 3430 5200 50  0001 C CNN
F 3 "~" H 3500 5200 50  0001 C CNN
F 4 "3000-0000000541" H 3500 5200 50  0001 C CNN "PartSpecification"
	1    3500 5200
	1    0    0    -1  
$EndComp
Wire Wire Line
	4700 5700 4000 5700
Wire Wire Line
	4000 5700 4000 5800
Wire Wire Line
	4000 5800 3500 5800
Wire Wire Line
	3500 5800 3500 5350
Wire Wire Line
	3500 5050 3500 4750
Text Label 3500 4900 1    50   ~ 0
v_in
$Comp
L Switch:SW_Push SW201
U 1 1 5E2A9CBA
P 3500 6100
F 0 "SW201" H 3550 6200 50  0000 L CNN
F 1 "SW_Push" H 3500 6040 50  0000 C CNN
F 2 "Button_Switch_SMD:SW_SPST_PTS645" H 3500 6300 50  0001 C CNN
F 3 "~" H 3500 6300 50  0001 C CNN
F 4 "3000-0000000176" H 3500 6100 50  0001 C CNN "PartSpecification"
	1    3500 6100
	0    1    1    0   
$EndComp
$Comp
L power:GND #PWR?
U 1 1 5E2AA131
P 3500 6500
F 0 "#PWR?" H 3500 6250 50  0001 C CNN
F 1 "GND" H 3500 6350 50  0000 C CNN
F 2 "" H 3500 6500 50  0001 C CNN
F 3 "" H 3500 6500 50  0001 C CNN
	1    3500 6500
	1    0    0    -1  
$EndComp
Wire Wire Line
	3500 6500 3500 6300
Wire Wire Line
	3500 5900 3500 5800
Connection ~ 3500 5800
$Comp
L POWDER_Power:EL3H7-G U203
U 1 1 5E1F4F3D
P 6250 5300
F 0 "U203" H 6200 5450 50  0000 C CNN
F 1 "EL3H7-G" H 6250 5150 50  0000 C CNN
F 2 "POWDER_Power:EL3H7-G" H 6250 5000 50  0001 C CNN
F 3 "" H 6250 5300 50  0001 C CNN
F 4 "3000-0000000432" H 6250 5300 50  0001 C CNN "PartSpecification"
	1    6250 5300
	1    0    0    -1  
$EndComp
Wire Wire Line
	5700 5350 6050 5350
Wire Wire Line
	6650 1000 6650 4200
Connection ~ 6650 1000
Wire Wire Line
	6650 1000 6500 1000
Connection ~ 5500 4200
Wire Wire Line
	5500 4200 5500 4350
Text Label 6000 4200 0    50   ~ 0
out
$Comp
L Device:R R210
U 1 1 5E21B681
P 6550 5600
F 0 "R210" V 6630 5600 50  0000 C CNN
F 1 "1M" V 6550 5600 50  0000 C CNN
F 2 "Resistor_SMD:R_2512_6332Metric" V 6480 5600 50  0001 C CNN
F 3 "~" H 6550 5600 50  0001 C CNN
F 4 "3000-0000000547" H 6550 5600 50  0001 C CNN "PartSpecification"
	1    6550 5600
	1    0    0    -1  
$EndComp
$Comp
L Device:D_Schottky D206
U 1 1 5ED962A7
P 4650 3400
F 0 "D206" H 4650 3500 50  0000 C CNN
F 1 "D_Schottky" H 4650 3300 50  0000 C CNN
F 2 "POWDER_Power:SMP" H 4650 3400 50  0001 C CNN
F 3 "~" H 4650 3400 50  0001 C CNN
F 4 "V2PM10L" H 4650 3400 50  0001 C CNN "PartNumber"
F 5 "3000-0000000478" H 4650 3400 50  0001 C CNN "PartSpecification"
	1    4650 3400
	0    -1   -1   0   
$EndComp
$Comp
L Device:D_Schottky D207
U 1 1 5ED972F2
P 5350 3650
F 0 "D207" H 5350 3750 50  0000 C CNN
F 1 "D_Schottky" H 5350 3550 50  0000 C CNN
F 2 "POWDER_Power:SMP" H 5350 3650 50  0001 C CNN
F 3 "~" H 5350 3650 50  0001 C CNN
F 4 "V2PM10L" H 5350 3650 50  0001 C CNN "PartNumber"
F 5 "3000-0000000478" H 5350 3650 50  0001 C CNN "PartSpecification"
	1    5350 3650
	1    0    0    -1  
$EndComp
Wire Wire Line
	5500 3650 5500 3950
$Comp
L Device:D_Schottky D208
U 1 1 5ED978BD
P 5350 3950
F 0 "D208" H 5350 4050 50  0000 C CNN
F 1 "D_Schottky" H 5350 3850 50  0000 C CNN
F 2 "POWDER_Power:SMP" H 5350 3950 50  0001 C CNN
F 3 "~" H 5350 3950 50  0001 C CNN
F 4 "V2PM10L" H 5350 3950 50  0001 C CNN "PartNumber"
F 5 "3000-0000000478" H 5350 3950 50  0001 C CNN "PartSpecification"
	1    5350 3950
	1    0    0    -1  
$EndComp
Connection ~ 5200 3950
Connection ~ 5500 3950
Wire Wire Line
	5500 3950 5500 4200
$Comp
L Device:D_Schottky D209
U 1 1 5ED97D5E
P 5400 1800
F 0 "D209" H 5400 1900 50  0000 C CNN
F 1 "D_Schottky" H 5400 1700 50  0000 C CNN
F 2 "POWDER_Power:SMP" H 5400 1800 50  0001 C CNN
F 3 "~" H 5400 1800 50  0001 C CNN
F 4 "V2PM10L" H 5400 1800 50  0001 C CNN "PartNumber"
F 5 "3000-0000000478" H 5400 1800 50  0001 C CNN "PartSpecification"
	1    5400 1800
	0    -1   -1   0   
$EndComp
$Comp
L Device:CP C202
U 1 1 5ED9CA60
P 3000 2000
F 0 "C202" H 3025 2100 50  0000 L CNN
F 1 "47uF" H 3025 1900 50  0000 L CNN
F 2 "Capacitor_SMD:CP_Elec_10x10" H 3038 1850 50  0001 C CNN
F 3 "~" H 3000 2000 50  0001 C CNN
F 4 "" H 3000 2000 50  0001 C CNN "PartNumber"
F 5 "80" H 3000 2000 50  0001 C CNN "Voltage"
F 6 "3000-0000000468" H 3000 2000 50  0001 C CNN "PartSpecification"
	1    3000 2000
	1    0    0    -1  
$EndComp
$Comp
L 000_PreferredParts:C_10uF_0603 C201
U 1 1 5ED9D1E7
P 2500 1250
F 0 "C201" H 2525 1350 50  0000 L CNN
F 1 "C_10uF_0603" H 2525 1150 50  0001 L CNN
F 2 "Capacitor_SMD:C_2220_5650Metric" H 2538 1100 50  0001 C CNN
F 3 "~" H 2500 1250 50  0001 C CNN
F 4 "10uF" H 2650 1150 50  0000 C CNN "DisplayValue"
F 5 "2220" H 2650 1050 50  0000 C CNN "DisplayFootprint"
F 6 "3000-0000000466" H 2500 1250 50  0001 C CNN "PartSpecification"
	1    2500 1250
	1    0    0    -1  
$EndComp
$Comp
L power:GND #PWR?
U 1 1 5ED9D642
P 2500 1500
F 0 "#PWR?" H 2500 1250 50  0001 C CNN
F 1 "GND" H 2500 1350 50  0000 C CNN
F 2 "" H 2500 1500 50  0001 C CNN
F 3 "" H 2500 1500 50  0001 C CNN
	1    2500 1500
	1    0    0    -1  
$EndComp
$Comp
L power:GND #PWR?
U 1 1 5ED9D90A
P 3000 2250
F 0 "#PWR?" H 3000 2000 50  0001 C CNN
F 1 "GND" H 3000 2100 50  0000 C CNN
F 2 "" H 3000 2250 50  0001 C CNN
F 3 "" H 3000 2250 50  0001 C CNN
	1    3000 2250
	1    0    0    -1  
$EndComp
Wire Wire Line
	3000 2250 3000 2150
Connection ~ 3000 1000
Wire Wire Line
	3000 1000 2500 1000
Wire Wire Line
	2500 1500 2500 1400
Wire Wire Line
	2500 1100 2500 1000
Connection ~ 2500 1000
Wire Wire Line
	2500 1000 2000 1000
$Comp
L Device:D_Schottky D205
U 1 1 5EDAD9E0
P 4300 4400
F 0 "D205" H 4300 4500 50  0000 C CNN
F 1 "D_Schottky" H 4300 4300 50  0000 C CNN
F 2 "POWDER_Power:SMP" H 4300 4400 50  0001 C CNN
F 3 "~" H 4300 4400 50  0001 C CNN
F 4 "V2PM10L" H 4300 4400 50  0001 C CNN "PartNumber"
F 5 "3000-0000000478" H 4300 4400 50  0001 C CNN "PartSpecification"
	1    4300 4400
	0    -1   -1   0   
$EndComp
Text Notes 750  1550 0    50   ~ 0
Designed to handle at least 25A coming\nthrough 18.1uH of input inductance. This\ncorresponds to 12 gauge wire 10mm\ncenter to center for 20m. Will not rise to\nmore than 60V starting from 50V.
Text Notes 7500 1500 0    50   ~ 0
Schottky diodes and the transistor are\n100V tolerant (reverse/off).
$Comp
L Device:D_Schottky D202
U 1 1 5EDE1B3E
P 3000 1550
F 0 "D202" H 3000 1650 50  0000 C CNN
F 1 "D_Schottky" H 3000 1450 50  0000 C CNN
F 2 "POWDER_Power:SMP" H 3000 1550 50  0001 C CNN
F 3 "~" H 3000 1550 50  0001 C CNN
F 4 "V2PM10L" H 3000 1550 50  0001 C CNN "PartNumber"
F 5 "3000-0000000478" H 3000 1550 50  0001 C CNN "PartSpecification"
	1    3000 1550
	0    -1   -1   0   
$EndComp
Wire Wire Line
	3000 1700 3000 1850
Wire Wire Line
	3000 1000 3000 1400
Text Notes 1300 4700 0    50   ~ 0
0402 resistors not used to make sure voltage handling\nof >30V maintains >0.6mm gaps.
$Comp
L Device:D_Zener D201
U 1 1 5EE03655
P 2750 2250
F 0 "D201" H 2750 2350 50  0000 C CNN
F 1 "SMAJ48AHR3G" H 2750 2150 50  0000 C CNN
F 2 "Diode_SMD:D_SMA" H 2750 2250 50  0001 C CNN
F 3 "~" H 2750 2250 50  0001 C CNN
F 4 "3000-0000000479" H 2750 2250 50  0001 C CNN "PartSpecification"
	1    2750 2250
	0    1    1    0   
$EndComp
$Comp
L power:GND #PWR?
U 1 1 5EE03AF9
P 2750 2500
F 0 "#PWR?" H 2750 2250 50  0001 C CNN
F 1 "GND" H 2750 2350 50  0000 C CNN
F 2 "" H 2750 2500 50  0001 C CNN
F 3 "" H 2750 2500 50  0001 C CNN
	1    2750 2500
	1    0    0    -1  
$EndComp
Wire Wire Line
	2750 2400 2750 2500
$Comp
L Device:R R201
U 1 1 5EE08842
P 2750 1850
F 0 "R201" V 2830 1850 50  0000 C CNN
F 1 "1k" V 2750 1850 50  0000 C CNN
F 2 "Resistor_SMD:R_2512_6332Metric" V 2680 1850 50  0001 C CNN
F 3 "~" H 2750 1850 50  0001 C CNN
F 4 "0.25W" V 2750 1850 50  0001 C CNN "Power"
F 5 "3000-0000000539" H 2750 1850 50  0001 C CNN "PartSpecification"
	1    2750 1850
	1    0    0    -1  
$EndComp
Wire Wire Line
	3000 1700 2750 1700
Connection ~ 3000 1700
Wire Wire Line
	2750 2000 2750 2100
Text Notes 2350 3650 0    50   ~ 0
Protect from input\ninductance on shutoff.
Text Label 4000 5100 0    50   ~ 0
UVLO
Text Label 4000 5400 0    50   ~ 0
OVP
Text Label 4050 5700 0    50   ~ 0
EN
Text Label 4500 4800 0    50   ~ 0
VIN
Text Label 5600 1000 0    50   ~ 0
MOS_MID
Text Label 5500 3100 0    50   ~ 0
GATE_R
Text Label 5200 4200 0    50   ~ 0
GATE
Text Label 4600 4100 0    50   ~ 0
SENSE
Text Label 2750 2050 0    50   ~ 0
BLEED
Text Label 3000 1800 0    50   ~ 0
STORE
Text Label 6050 5200 2    50   ~ 0
npg_pu
Wire Wire Line
	6050 4200 6050 4850
Connection ~ 6050 4200
Wire Wire Line
	6050 4200 5500 4200
Text Label 5800 1900 0    50   ~ 0
NPN
Text Label 5850 5350 0    50   ~ 0
npg
Text Label 5750 5550 0    50   ~ 0
timer
Text Label 3300 3550 0    50   ~ 0
IND_DUMP
Wire Wire Line
	6050 4200 6550 4200
Wire Wire Line
	6550 5450 6550 5350
Wire Wire Line
	6550 5350 6450 5350
$Comp
L power:GND #PWR?
U 1 1 5E5B40C6
P 6550 5850
F 0 "#PWR?" H 6550 5600 50  0001 C CNN
F 1 "GND" H 6550 5700 50  0000 C CNN
F 2 "" H 6550 5850 50  0001 C CNN
F 3 "" H 6550 5850 50  0001 C CNN
	1    6550 5850
	1    0    0    -1  
$EndComp
Wire Wire Line
	6550 5850 6550 5750
Connection ~ 6550 4200
Wire Wire Line
	6550 4200 6650 4200
Wire Wire Line
	6550 5250 6450 5250
Wire Wire Line
	6550 4200 6550 5250
Connection ~ 6550 5350
Wire Wire Line
	6550 5350 6800 5350
$EndSCHEMATC
