EESchema Schematic File Version 4
EELAYER 30 0
EELAYER END
$Descr A4 11693 8268
encoding utf-8
Sheet 1 1
Title ""
Date ""
Rev ""
Comp ""
Comment1 ""
Comment2 ""
Comment3 ""
Comment4 ""
$EndDescr
$Comp
L POWDER_Misc:TMP23x-Q1 U1
U 1 1 617996B2
P 3950 3850
F 0 "U1" H 3950 4165 50  0000 C CNN
F 1 "TMP23x-Q1" H 3950 4074 50  0000 C CNN
F 2 "Package_TO_SOT_SMD:SOT-23" H 4050 4500 50  0001 C CNN
F 3 "" H 4050 4500 50  0001 C CNN
	1    3950 3850
	1    0    0    -1  
$EndComp
$Comp
L power:+5V #PWR?
U 1 1 61799C2C
P 3100 3600
F 0 "#PWR?" H 3100 3450 50  0001 C CNN
F 1 "+5V" H 3115 3773 50  0000 C CNN
F 2 "" H 3100 3600 50  0001 C CNN
F 3 "" H 3100 3600 50  0001 C CNN
	1    3100 3600
	1    0    0    -1  
$EndComp
$Comp
L power:GND #PWR?
U 1 1 61799F51
P 3100 4100
F 0 "#PWR?" H 3100 3850 50  0001 C CNN
F 1 "GND" H 3105 3927 50  0000 C CNN
F 2 "" H 3100 4100 50  0001 C CNN
F 3 "" H 3100 4100 50  0001 C CNN
	1    3100 4100
	1    0    0    -1  
$EndComp
$Comp
L Device:C C1
U 1 1 6179A15F
P 3100 3850
F 0 "C1" H 3215 3896 50  0000 L CNN
F 1 "0.1u" H 3215 3805 50  0000 L CNN
F 2 "Capacitor_SMD:C_0603_1608Metric" H 3138 3700 50  0001 C CNN
F 3 "~" H 3100 3850 50  0001 C CNN
	1    3100 3850
	1    0    0    -1  
$EndComp
Wire Wire Line
	3100 3600 3100 3650
Wire Wire Line
	3100 4000 3100 4050
Wire Wire Line
	3100 3650 3400 3650
Wire Wire Line
	3400 3650 3400 3800
Wire Wire Line
	3400 3800 3600 3800
Connection ~ 3100 3650
Wire Wire Line
	3100 3650 3100 3700
Wire Wire Line
	3100 4050 3400 4050
Wire Wire Line
	3400 4050 3400 3900
Wire Wire Line
	3400 3900 3600 3900
Connection ~ 3100 4050
Wire Wire Line
	3100 4050 3100 4100
Text Label 4400 3850 0    50   ~ 0
temp
$Comp
L Connector_Generic:Conn_01x03 J1
U 1 1 6179BCC6
P 4900 3850
F 0 "J1" H 4980 3892 50  0000 L CNN
F 1 "Conn_01x03" H 4980 3801 50  0000 L CNN
F 2 "Connector_PinHeader_2.54mm:PinHeader_1x03_P2.54mm_Vertical_SMD_Pin1Left" H 4900 3850 50  0001 C CNN
F 3 "~" H 4900 3850 50  0001 C CNN
	1    4900 3850
	1    0    0    -1  
$EndComp
$Comp
L power:+5V #PWR?
U 1 1 6179CC6E
P 4600 3550
F 0 "#PWR?" H 4600 3400 50  0001 C CNN
F 1 "+5V" H 4615 3723 50  0000 C CNN
F 2 "" H 4600 3550 50  0001 C CNN
F 3 "" H 4600 3550 50  0001 C CNN
	1    4600 3550
	1    0    0    -1  
$EndComp
$Comp
L power:GND #PWR?
U 1 1 6179CE90
P 4600 4150
F 0 "#PWR?" H 4600 3900 50  0001 C CNN
F 1 "GND" H 4605 3977 50  0000 C CNN
F 2 "" H 4600 4150 50  0001 C CNN
F 3 "" H 4600 4150 50  0001 C CNN
	1    4600 4150
	1    0    0    -1  
$EndComp
Wire Wire Line
	4600 3550 4600 3750
Wire Wire Line
	4600 3750 4700 3750
Wire Wire Line
	4600 4150 4600 3950
Wire Wire Line
	4600 3950 4700 3950
Wire Wire Line
	4300 3850 4700 3850
$EndSCHEMATC
