EESchema Schematic File Version 4
EELAYER 30 0
EELAYER END
$Descr A4 11693 8268
encoding utf-8
Sheet 9 13
Title ""
Date ""
Rev ""
Comp ""
Comment1 ""
Comment2 ""
Comment3 ""
Comment4 ""
$EndDescr
$Comp
L Device:R R?
U 1 1 6147ABA3
P 4200 3050
AR Path="/6142C7A6/6147ABA3" Ref="R?"  Part="1" 
AR Path="/6142C7A6/61477C38/6147ABA3" Ref="R29"  Part="1" 
AR Path="/6142C7A6/61486372/6147ABA3" Ref="R37"  Part="1" 
F 0 "R37" V 4315 3050 50  0000 C CNN
F 1 "10k" V 4406 3050 50  0000 C CNN
F 2 "Resistor_SMD:R_0402_1005Metric" V 4130 3050 50  0001 C CNN
F 3 "~" H 4200 3050 50  0001 C CNN
	1    4200 3050
	0    1    1    0   
$EndComp
$Comp
L Device:R R?
U 1 1 6147ABAB
P 5100 2650
AR Path="/6142C7A6/6147ABAB" Ref="R?"  Part="1" 
AR Path="/6142C7A6/61477C38/6147ABAB" Ref="R32"  Part="1" 
AR Path="/6142C7A6/61486372/6147ABAB" Ref="R40"  Part="1" 
F 0 "R40" V 4893 2650 50  0000 C CNN
F 1 "1k" V 4984 2650 50  0000 C CNN
F 2 "Resistor_SMD:R_0402_1005Metric" V 5030 2650 50  0001 C CNN
F 3 "~" H 5100 2650 50  0001 C CNN
	1    5100 2650
	0    1    1    0   
$EndComp
$Comp
L power:+5V #PWR?
U 1 1 6147ABB1
P 5950 1750
AR Path="/6142C7A6/6147ABB1" Ref="#PWR?"  Part="1" 
AR Path="/6142C7A6/61477C38/6147ABB1" Ref="#PWR?"  Part="1" 
AR Path="/6142C7A6/61486372/6147ABB1" Ref="#PWR?"  Part="1" 
F 0 "#PWR?" H 5950 1600 50  0001 C CNN
F 1 "+5V" H 5965 1923 50  0000 C CNN
F 2 "" H 5950 1750 50  0001 C CNN
F 3 "" H 5950 1750 50  0001 C CNN
	1    5950 1750
	1    0    0    -1  
$EndComp
Wire Wire Line
	5950 2850 5950 3050
Wire Wire Line
	4850 3250 4850 3350
$Comp
L power:GND #PWR?
U 1 1 6147ABBA
P 4850 3350
AR Path="/6142C7A6/6147ABBA" Ref="#PWR?"  Part="1" 
AR Path="/6142C7A6/61477C38/6147ABBA" Ref="#PWR?"  Part="1" 
AR Path="/6142C7A6/61486372/6147ABBA" Ref="#PWR?"  Part="1" 
F 0 "#PWR?" H 4850 3100 50  0001 C CNN
F 1 "GND" H 4855 3177 50  0000 C CNN
F 2 "" H 4850 3350 50  0001 C CNN
F 3 "" H 4850 3350 50  0001 C CNN
	1    4850 3350
	1    0    0    -1  
$EndComp
$Comp
L Device:R R?
U 1 1 6147ABC2
P 5950 3200
AR Path="/6142C7A6/6147ABC2" Ref="R?"  Part="1" 
AR Path="/6142C7A6/61477C38/6147ABC2" Ref="R35"  Part="1" 
AR Path="/6142C7A6/61486372/6147ABC2" Ref="R43"  Part="1" 
F 0 "R43" H 5880 3154 50  0000 R CNN
F 1 "160" H 5880 3245 50  0000 R CNN
F 2 "Resistor_SMD:R_1206_3216Metric" V 5880 3200 50  0001 C CNN
F 3 "~" H 5950 3200 50  0001 C CNN
	1    5950 3200
	-1   0    0    1   
$EndComp
$Comp
L Device:R R?
U 1 1 6147ABCA
P 5100 4750
AR Path="/6142C7A6/6147ABCA" Ref="R?"  Part="1" 
AR Path="/6142C7A6/61477C38/6147ABCA" Ref="R33"  Part="1" 
AR Path="/6142C7A6/61486372/6147ABCA" Ref="R41"  Part="1" 
F 0 "R41" V 4893 4750 50  0000 C CNN
F 1 "100k" V 4984 4750 50  0000 C CNN
F 2 "Resistor_SMD:R_1206_3216Metric" V 5030 4750 50  0001 C CNN
F 3 "~" H 5100 4750 50  0001 C CNN
	1    5100 4750
	0    1    1    0   
$EndComp
Wire Wire Line
	4850 4550 4850 4750
Wire Wire Line
	5950 4550 5950 4350
$Comp
L Device:R R?
U 1 1 6147ABD5
P 5950 4200
AR Path="/6142C7A6/6147ABD5" Ref="R?"  Part="1" 
AR Path="/6142C7A6/61477C38/6147ABD5" Ref="R36"  Part="1" 
AR Path="/6142C7A6/61486372/6147ABD5" Ref="R44"  Part="1" 
F 0 "R44" H 6020 4246 50  0000 L CNN
F 1 "1k" H 6020 4155 50  0000 L CNN
F 2 "Resistor_SMD:R_1206_3216Metric" V 5880 4200 50  0001 C CNN
F 3 "~" H 5950 4200 50  0001 C CNN
	1    5950 4200
	1    0    0    -1  
$EndComp
$Comp
L Device:R R?
U 1 1 6147ABEC
P 5100 1850
AR Path="/6142C7A6/6147ABEC" Ref="R?"  Part="1" 
AR Path="/6142C7A6/61477C38/6147ABEC" Ref="R31"  Part="1" 
AR Path="/6142C7A6/61486372/6147ABEC" Ref="R39"  Part="1" 
F 0 "R39" V 4893 1850 50  0000 C CNN
F 1 "1k" V 4984 1850 50  0000 C CNN
F 2 "Resistor_SMD:R_0402_1005Metric" V 5030 1850 50  0001 C CNN
F 3 "~" H 5100 1850 50  0001 C CNN
	1    5100 1850
	0    1    1    0   
$EndComp
Wire Wire Line
	4850 3950 4850 4150
Wire Wire Line
	5950 4050 5950 3650
Wire Wire Line
	5950 3650 6500 3650
Connection ~ 5950 3650
Wire Wire Line
	5950 3650 5950 3350
$Comp
L Device:Q_NPN_BEC Q?
U 1 1 6147ABFE
P 4750 3050
AR Path="/6142C7A6/6147ABFE" Ref="Q?"  Part="1" 
AR Path="/6142C7A6/61477C38/6147ABFE" Ref="Q4"  Part="1" 
AR Path="/6142C7A6/61486372/6147ABFE" Ref="Q8"  Part="1" 
F 0 "Q8" H 4941 3096 50  0000 L CNN
F 1 "Q_NPN_BEC" H 4941 3005 50  0000 L CNN
F 2 "Package_TO_SOT_SMD:SOT-23" H 4950 3150 50  0001 C CNN
F 3 "~" H 4750 3050 50  0001 C CNN
	1    4750 3050
	1    0    0    -1  
$EndComp
$Comp
L Device:Q_PNP_BEC Q?
U 1 1 6147AC0A
P 5850 2650
AR Path="/6142C7A6/6147AC0A" Ref="Q?"  Part="1" 
AR Path="/6142C7A6/61477C38/6147AC0A" Ref="Q6"  Part="1" 
AR Path="/6142C7A6/61486372/6147AC0A" Ref="Q10"  Part="1" 
F 0 "Q10" H 6040 2604 50  0000 L CNN
F 1 "Q_PNP_BEC" H 6040 2695 50  0000 L CNN
F 2 "Package_TO_SOT_SMD:SOT-23" H 6050 2750 50  0001 C CNN
F 3 "~" H 5850 2650 50  0001 C CNN
	1    5850 2650
	1    0    0    1   
$EndComp
$Comp
L Device:Q_PNP_BEC Q?
U 1 1 6147AC10
P 4750 4350
AR Path="/6142C7A6/6147AC10" Ref="Q?"  Part="1" 
AR Path="/6142C7A6/61477C38/6147AC10" Ref="Q5"  Part="1" 
AR Path="/6142C7A6/61486372/6147AC10" Ref="Q9"  Part="1" 
F 0 "Q9" H 4940 4304 50  0000 L CNN
F 1 "Q_PNP_BEC" H 4940 4395 50  0000 L CNN
F 2 "Package_TO_SOT_SMD:SOT-23" H 4950 4450 50  0001 C CNN
F 3 "~" H 4750 4350 50  0001 C CNN
	1    4750 4350
	1    0    0    1   
$EndComp
$Comp
L Device:R R?
U 1 1 6147AC16
P 4200 4350
AR Path="/6142C7A6/6147AC16" Ref="R?"  Part="1" 
AR Path="/6142C7A6/61477C38/6147AC16" Ref="R30"  Part="1" 
AR Path="/6142C7A6/61486372/6147AC16" Ref="R38"  Part="1" 
F 0 "R38" V 4315 4350 50  0000 C CNN
F 1 "10k" V 4406 4350 50  0000 C CNN
F 2 "Resistor_SMD:R_0402_1005Metric" V 4130 4350 50  0001 C CNN
F 3 "~" H 4200 4350 50  0001 C CNN
	1    4200 4350
	0    1    1    0   
$EndComp
Wire Wire Line
	4350 4350 4450 4350
$Comp
L power:+3V3 #PWR?
U 1 1 6147AC1D
P 4850 3950
AR Path="/6142C7A6/6147AC1D" Ref="#PWR?"  Part="1" 
AR Path="/6142C7A6/61477C38/6147AC1D" Ref="#PWR?"  Part="1" 
AR Path="/6142C7A6/61486372/6147AC1D" Ref="#PWR?"  Part="1" 
F 0 "#PWR?" H 4850 3800 50  0001 C CNN
F 1 "+3V3" H 4865 4123 50  0000 C CNN
F 2 "" H 4850 3950 50  0001 C CNN
F 3 "" H 4850 3950 50  0001 C CNN
	1    4850 3950
	1    0    0    -1  
$EndComp
$Comp
L Device:D_Schottky D?
U 1 1 6147AC25
P 4200 4100
AR Path="/6142C7A6/6147AC25" Ref="D?"  Part="1" 
AR Path="/6142C7A6/61477C38/6147AC25" Ref="D9"  Part="1" 
AR Path="/6142C7A6/61486372/6147AC25" Ref="D12"  Part="1" 
F 0 "D12" H 4200 3883 50  0000 C CNN
F 1 "D_Schottky" H 4200 3974 50  0000 C CNN
F 2 "Diode_SMD:D_SOD-123F" H 4200 4100 50  0001 C CNN
F 3 "~" H 4200 4100 50  0001 C CNN
	1    4200 4100
	-1   0    0    1   
$EndComp
$Comp
L Device:D_Schottky D?
U 1 1 6147AC2B
P 4200 2800
AR Path="/6142C7A6/6147AC2B" Ref="D?"  Part="1" 
AR Path="/6142C7A6/61477C38/6147AC2B" Ref="D8"  Part="1" 
AR Path="/6142C7A6/61486372/6147AC2B" Ref="D11"  Part="1" 
F 0 "D11" H 4200 3017 50  0000 C CNN
F 1 "D_Schottky" H 4200 2926 50  0000 C CNN
F 2 "Diode_SMD:D_SOD-123F" H 4200 2800 50  0001 C CNN
F 3 "~" H 4200 2800 50  0001 C CNN
	1    4200 2800
	1    0    0    -1  
$EndComp
Wire Wire Line
	4050 2800 3950 2800
Wire Wire Line
	3950 2800 3950 3050
Connection ~ 3950 3050
Wire Wire Line
	3950 3050 4050 3050
Wire Wire Line
	4350 3050 4450 3050
Wire Wire Line
	4350 2800 4450 2800
Wire Wire Line
	4450 2800 4450 3050
Connection ~ 4450 3050
Wire Wire Line
	4450 3050 4550 3050
Wire Wire Line
	3550 3050 3950 3050
Wire Wire Line
	3550 4350 3950 4350
Wire Wire Line
	4050 4100 3950 4100
Wire Wire Line
	3950 4100 3950 4350
Connection ~ 3950 4350
Wire Wire Line
	3950 4350 4050 4350
Wire Wire Line
	4350 4100 4450 4100
Wire Wire Line
	4450 4100 4450 4350
Wire Wire Line
	4450 4350 4550 4350
Connection ~ 4450 4350
Text HLabel 3550 3050 0    50   Input ~ 0
bias_ctrl_a
Text HLabel 3550 4350 0    50   Input ~ 0
bias_ctrl_b
Text HLabel 6500 3650 2    50   Output ~ 0
bias_out
Wire Wire Line
	4850 4750 4950 4750
Wire Wire Line
	5250 4750 5350 4750
Wire Wire Line
	4950 2650 4850 2650
Wire Wire Line
	4850 2650 4850 2850
Wire Wire Line
	5250 2650 5350 2650
Connection ~ 5350 2650
$Comp
L Device:C C20
U 1 1 614B99FD
P 5100 5150
AR Path="/6142C7A6/61477C38/614B99FD" Ref="C20"  Part="1" 
AR Path="/6142C7A6/61486372/614B99FD" Ref="C22"  Part="1" 
F 0 "C22" V 5352 5150 50  0000 C CNN
F 1 "0.1u 100v" V 5261 5150 50  0000 C CNN
F 2 "Resistor_SMD:R_0603_1608Metric" H 5138 5000 50  0001 C CNN
F 3 "~" H 5100 5150 50  0001 C CNN
	1    5100 5150
	0    -1   -1   0   
$EndComp
Wire Wire Line
	4850 4750 4850 5150
Wire Wire Line
	4850 5150 4950 5150
Connection ~ 4850 4750
Wire Wire Line
	5350 5150 5250 5150
Wire Wire Line
	4850 2650 4850 2250
Wire Wire Line
	4850 2250 4950 2250
Connection ~ 4850 2650
Wire Wire Line
	5250 2250 5350 2250
Wire Wire Line
	5350 2250 5350 2650
$Comp
L Device:Q_NPN_BEC Q?
U 1 1 6147AC04
P 5850 4750
AR Path="/6142C7A6/6147AC04" Ref="Q?"  Part="1" 
AR Path="/6142C7A6/61477C38/6147AC04" Ref="Q7"  Part="1" 
AR Path="/6142C7A6/61486372/6147AC04" Ref="Q11"  Part="1" 
F 0 "Q11" H 6041 4796 50  0000 L CNN
F 1 "Q_NPN_BEC" H 6041 4705 50  0000 L CNN
F 2 "Package_TO_SOT_SMD:SOT-23" H 6050 4850 50  0001 C CNN
F 3 "~" H 5850 4750 50  0001 C CNN
	1    5850 4750
	1    0    0    -1  
$EndComp
$Comp
L Device:R R?
U 1 1 6147ABE2
P 5100 5550
AR Path="/6142C7A6/6147ABE2" Ref="R?"  Part="1" 
AR Path="/6142C7A6/61477C38/6147ABE2" Ref="R34"  Part="1" 
AR Path="/6142C7A6/61486372/6147ABE2" Ref="R42"  Part="1" 
F 0 "R42" V 4985 5550 50  0000 C CNN
F 1 "100k" V 4894 5550 50  0000 C CNN
F 2 "Resistor_SMD:R_1206_3216Metric" V 5030 5550 50  0001 C CNN
F 3 "~" H 5100 5550 50  0001 C CNN
	1    5100 5550
	0    -1   -1   0   
$EndComp
$Comp
L power:VEE #PWR?
U 1 1 6147ABDB
P 5950 5650
AR Path="/6142C7A6/6147ABDB" Ref="#PWR?"  Part="1" 
AR Path="/6142C7A6/61477C38/6147ABDB" Ref="#PWR?"  Part="1" 
AR Path="/6142C7A6/61486372/6147ABDB" Ref="#PWR?"  Part="1" 
F 0 "#PWR?" H 5950 5500 50  0001 C CNN
F 1 "VEE" H 5965 5823 50  0000 C CNN
F 2 "" H 5950 5650 50  0001 C CNN
F 3 "" H 5950 5650 50  0001 C CNN
	1    5950 5650
	-1   0    0    1   
$EndComp
Connection ~ 5350 4750
Wire Wire Line
	5350 4750 5350 5150
Wire Wire Line
	5350 2650 5650 2650
Wire Wire Line
	4950 1850 4850 1850
Wire Wire Line
	4850 1850 4850 2250
Connection ~ 4850 2250
Wire Wire Line
	5250 1850 5950 1850
Wire Wire Line
	5950 1750 5950 1850
Connection ~ 5950 1850
Wire Wire Line
	5950 1850 5950 2450
Wire Wire Line
	5350 4750 5550 4750
Wire Wire Line
	4950 5550 4850 5550
Wire Wire Line
	4850 5550 4850 5150
Connection ~ 4850 5150
Wire Wire Line
	5250 5550 5550 5550
Connection ~ 5950 5550
Wire Wire Line
	5950 5550 5950 5650
Wire Wire Line
	5950 4950 5950 5550
Wire Wire Line
	5550 5300 5550 5550
Connection ~ 5550 5550
Wire Wire Line
	5550 5550 5950 5550
Wire Wire Line
	5550 5000 5550 4750
Connection ~ 5550 4750
Wire Wire Line
	5550 4750 5650 4750
Text Label 5450 4750 0    50   ~ 0
neg_1
Text Label 4850 5350 0    50   ~ 0
neg_2
Text Label 5950 4450 0    50   ~ 0
neg_3
$Comp
L Device:C C19
U 1 1 614D4FDC
P 5100 2250
AR Path="/6142C7A6/61477C38/614D4FDC" Ref="C19"  Part="1" 
AR Path="/6142C7A6/61486372/614D4FDC" Ref="C21"  Part="1" 
F 0 "C21" V 4848 2250 50  0000 C CNN
F 1 "0.1u" V 4939 2250 50  0000 C CNN
F 2 "Capacitor_SMD:C_0402_1005Metric" H 5138 2100 50  0001 C CNN
F 3 "~" H 5100 2250 50  0001 C CNN
	1    5100 2250
	0    1    1    0   
$EndComp
Text Label 5950 2950 0    50   ~ 0
neg_4
$Comp
L Device:D_Schottky D?
U 1 1 6149B8AF
P 5550 5150
AR Path="/6142C7A6/6149B8AF" Ref="D?"  Part="1" 
AR Path="/6142C7A6/61477C38/6149B8AF" Ref="D10"  Part="1" 
AR Path="/6142C7A6/61486372/6149B8AF" Ref="D13"  Part="1" 
F 0 "D13" H 5550 4933 50  0000 C CNN
F 1 "D_Schottky" H 5550 5024 50  0000 C CNN
F 2 "Diode_SMD:D_SOD-123F" H 5550 5150 50  0001 C CNN
F 3 "~" H 5550 5150 50  0001 C CNN
	1    5550 5150
	0    -1   1    0   
$EndComp
$EndSCHEMATC
