EESchema Schematic File Version 4
LIBS:fdd_frontend_basestation-cache
EELAYER 30 0
EELAYER END
$Descr A4 11693 8268
encoding utf-8
Sheet 1 14
Title ""
Date ""
Rev ""
Comp ""
Comment1 ""
Comment2 ""
Comment3 ""
Comment4 ""
$EndDescr
$Comp
L POWDER_RF:Qorvo_QPQ1270 U102
U 1 1 5D1C07D9
P 5550 3700
F 0 "U102" H 5700 3950 50  0000 L CNN
F 1 "Qorvo_QPQ1270" H 4900 4000 50  0000 L CNN
F 2 "POWDER_RF:Qorvo_SMP" H 6100 3300 50  0001 C CNN
F 3 "" H 5550 3700 50  0001 C CNN
F 4 "Qorvo" H 5550 3700 50  0001 C CNN "Manufacturer"
F 5 "QPQ1270TR7 " H 5550 3700 50  0001 C CNN "PartNumber"
F 6 "3000-0000000078" H 5550 3700 50  0001 C CNN "PartSpecification"
	1    5550 3700
	-1   0    0    -1  
$EndComp
$Comp
L power:GND #PWR?
U 1 1 5D1CD94B
P 5300 4200
F 0 "#PWR?" H 5300 3950 50  0001 C CNN
F 1 "GND" H 5305 4027 50  0000 C CNN
F 2 "" H 5300 4200 50  0001 C CNN
F 3 "" H 5300 4200 50  0001 C CNN
	1    5300 4200
	1    0    0    -1  
$EndComp
Wire Wire Line
	5300 4050 5300 4200
$Comp
L power:GND #PWR?
U 1 1 5D1D3E09
P 5400 4200
F 0 "#PWR?" H 5400 3950 50  0001 C CNN
F 1 "GND" H 5405 4027 50  0000 C CNN
F 2 "" H 5400 4200 50  0001 C CNN
F 3 "" H 5400 4200 50  0001 C CNN
	1    5400 4200
	1    0    0    -1  
$EndComp
Wire Wire Line
	5400 4050 5400 4200
$Comp
L power:GND #PWR?
U 1 1 5D1D3F95
P 5500 4200
F 0 "#PWR?" H 5500 3950 50  0001 C CNN
F 1 "GND" H 5505 4027 50  0000 C CNN
F 2 "" H 5500 4200 50  0001 C CNN
F 3 "" H 5500 4200 50  0001 C CNN
	1    5500 4200
	1    0    0    -1  
$EndComp
Wire Wire Line
	5500 4050 5500 4200
$Comp
L power:GND #PWR?
U 1 1 5D1D41E3
P 5600 4200
F 0 "#PWR?" H 5600 3950 50  0001 C CNN
F 1 "GND" H 5605 4027 50  0000 C CNN
F 2 "" H 5600 4200 50  0001 C CNN
F 3 "" H 5600 4200 50  0001 C CNN
	1    5600 4200
	1    0    0    -1  
$EndComp
Wire Wire Line
	5600 4050 5600 4200
$Comp
L power:GND #PWR?
U 1 1 5D1D4556
P 5700 4200
F 0 "#PWR?" H 5700 3950 50  0001 C CNN
F 1 "GND" H 5705 4027 50  0000 C CNN
F 2 "" H 5700 4200 50  0001 C CNN
F 3 "" H 5700 4200 50  0001 C CNN
	1    5700 4200
	1    0    0    -1  
$EndComp
Wire Wire Line
	5700 4050 5700 4200
$Comp
L power:GND #PWR?
U 1 1 5D1D4955
P 5800 4200
F 0 "#PWR?" H 5800 3950 50  0001 C CNN
F 1 "GND" H 5805 4027 50  0000 C CNN
F 2 "" H 5800 4200 50  0001 C CNN
F 3 "" H 5800 4200 50  0001 C CNN
	1    5800 4200
	1    0    0    -1  
$EndComp
Wire Wire Line
	5800 4050 5800 4200
Wire Wire Line
	850  4050 950  4050
$Comp
L Connector:Conn_Coaxial J101
U 1 1 5D23A7CA
P 650 4050
F 0 "J101" H 578 4288 50  0000 C CNN
F 1 "Conn_Coaxial" H 500 4200 50  0000 C CNN
F 2 "POWDER_RF:SMA_EndLaunch_142-0761-881" H 650 4050 50  0001 C CNN
F 3 " ~" H 650 4050 50  0001 C CNN
F 4 "Cinch Connectivity Solutions Johnson" H 650 4050 50  0001 C CNN "Manufacturer"
F 5 "142-0761-881" H 650 4050 50  0001 C CNN "PartNumber"
F 6 "3000-0000000165" H 650 4050 50  0001 C CNN "PartSpecification"
	1    650  4050
	-1   0    0    -1  
$EndComp
$Comp
L power:GND #PWR?
U 1 1 5D23AFE1
P 650 4500
F 0 "#PWR?" H 650 4250 50  0001 C CNN
F 1 "GND" H 655 4327 50  0000 C CNN
F 2 "" H 650 4500 50  0001 C CNN
F 3 "" H 650 4500 50  0001 C CNN
	1    650  4500
	1    0    0    -1  
$EndComp
Wire Wire Line
	650  4500 650  4250
$Comp
L Connector:Conn_Coaxial J102
U 1 1 5D23FE0B
P 5550 2600
F 0 "J102" V 5800 2450 50  0000 L CNN
F 1 "Conn_Coaxial" V 5700 2200 50  0000 L CNN
F 2 "POWDER_RF:SMA_EndLaunch_142-0761-881" H 5550 2600 50  0001 C CNN
F 3 " ~" H 5550 2600 50  0001 C CNN
F 4 "Cinch Connectivity Solutions Johnson" H 5550 2600 50  0001 C CNN "Manufacturer"
F 5 "142-0761-881" H 5550 2600 50  0001 C CNN "PartNumber"
F 6 "3000-0000000165" H 5550 2600 50  0001 C CNN "PartSpecification"
	1    5550 2600
	0    -1   -1   0   
$EndComp
$Comp
L power:GND #PWR?
U 1 1 5D242F06
P 6050 2750
F 0 "#PWR?" H 6050 2500 50  0001 C CNN
F 1 "GND" H 6055 2577 50  0000 C CNN
F 2 "" H 6050 2750 50  0001 C CNN
F 3 "" H 6050 2750 50  0001 C CNN
	1    6050 2750
	1    0    0    -1  
$EndComp
Wire Wire Line
	6050 2750 6050 2600
$Comp
L Device:R R104
U 1 1 5D24D1B4
P 6300 3700
F 0 "R104" V 6093 3700 50  0000 C CNN
F 1 "0" V 6184 3700 50  0000 C CNN
F 2 "Resistor_SMD:R_0201_0603Metric" V 6230 3700 50  0001 C CNN
F 3 "~" H 6300 3700 50  0001 C CNN
F 4 "Delta Electronics/Cyntec" H 6300 3700 50  0001 C CNN "Manufacturer"
F 5 "PFR03S-000-XNH" H 6300 3700 50  0001 C CNN "PartNumber"
F 6 "3000-0000000141" H 6300 3700 50  0001 C CNN "PartSpecification"
	1    6300 3700
	0    1    1    0   
$EndComp
$Comp
L Device:R R103
U 1 1 5D253390
P 6050 3950
F 0 "R103" H 5980 3904 50  0000 R CNN
F 1 "DNP" H 5980 3995 50  0000 R CNN
F 2 "Resistor_SMD:R_0201_0603Metric" V 5980 3950 50  0001 C CNN
F 3 "~" H 6050 3950 50  0001 C CNN
	1    6050 3950
	-1   0    0    1   
$EndComp
Wire Wire Line
	5950 3700 6050 3700
Wire Wire Line
	6050 3700 6050 3800
Connection ~ 6050 3700
Wire Wire Line
	6050 3700 6150 3700
$Comp
L Device:R R105
U 1 1 5D25A0AE
P 6550 3950
F 0 "R105" H 6480 3904 50  0000 R CNN
F 1 "DNP" H 6480 3995 50  0000 R CNN
F 2 "Resistor_SMD:R_0201_0603Metric" V 6480 3950 50  0001 C CNN
F 3 "~" H 6550 3950 50  0001 C CNN
	1    6550 3950
	-1   0    0    1   
$EndComp
Wire Wire Line
	6550 3700 6550 3800
Connection ~ 6550 3700
Wire Wire Line
	6550 3700 6450 3700
$Comp
L power:GND #PWR?
U 1 1 5D25EBC3
P 6050 4200
F 0 "#PWR?" H 6050 3950 50  0001 C CNN
F 1 "GND" H 6055 4027 50  0000 C CNN
F 2 "" H 6050 4200 50  0001 C CNN
F 3 "" H 6050 4200 50  0001 C CNN
	1    6050 4200
	1    0    0    -1  
$EndComp
$Comp
L power:GND #PWR?
U 1 1 5D260511
P 6550 4200
F 0 "#PWR?" H 6550 3950 50  0001 C CNN
F 1 "GND" H 6555 4027 50  0000 C CNN
F 2 "" H 6550 4200 50  0001 C CNN
F 3 "" H 6550 4200 50  0001 C CNN
	1    6550 4200
	1    0    0    -1  
$EndComp
Wire Wire Line
	6550 4100 6550 4200
Wire Wire Line
	6050 4100 6050 4200
Wire Wire Line
	10900 4100 10750 4100
$Comp
L Connector:Conn_Coaxial J103
U 1 1 5D299CC6
P 11100 4100
F 0 "J103" H 11000 4350 50  0000 L CNN
F 1 "Conn_Coaxial" H 10700 4250 50  0000 L CNN
F 2 "POWDER_RF:SMA_EndLaunch_142-0761-881" H 11100 4100 50  0001 C CNN
F 3 " ~" H 11100 4100 50  0001 C CNN
F 4 "Cinch Connectivity Solutions Johnson" H 11100 4100 50  0001 C CNN "Manufacturer"
F 5 "142-0761-881" H 11100 4100 50  0001 C CNN "PartNumber"
F 6 "3000-0000000165" H 11100 4100 50  0001 C CNN "PartSpecification"
	1    11100 4100
	1    0    0    -1  
$EndComp
$Comp
L power:GND #PWR?
U 1 1 5D29D283
P 11100 4550
F 0 "#PWR?" H 11100 4300 50  0001 C CNN
F 1 "GND" H 11105 4377 50  0000 C CNN
F 2 "" H 11100 4550 50  0001 C CNN
F 3 "" H 11100 4550 50  0001 C CNN
	1    11100 4550
	1    0    0    -1  
$EndComp
Wire Wire Line
	11100 4550 11100 4300
Text Label 5550 3100 0    50   ~ 0
ant
Text Label 10700 4100 0    50   ~ 0
pa_in
Text Label 6700 3700 1    50   ~ 0
pa_out_att_1
Text Label 6150 3700 1    50   ~ 0
pa_out
Text Label 7300 5950 0    50   ~ 0
pa_en
Wire Wire Line
	7300 5950 7250 5950
$Sheet
S 3500 900  900  650 
U 5D562501
F0 "vreg_5_1" 50
F1 "voltage_regulator_5.sch" 50
F2 "EN" I L 3500 1200 50 
F3 "PS_SYNC" I L 3500 1500 50 
F4 "VSEL_1" I L 3500 1300 50 
F5 "V_12" I L 3500 1000 50 
F6 "V_OUT" O R 4400 1000 50 
F7 "DCDC_PG" O R 4400 1200 50 
F8 "LDO_PG" O R 4400 1300 50 
F9 "VSEL_2" I L 3500 1400 50 
$EndSheet
$Sheet
S 6250 1150 900  650 
U 5D587C46
F0 "vreg_5_2" 50
F1 "voltage_regulator_5.sch" 50
F2 "EN" I L 6250 1450 50 
F3 "PS_SYNC" I L 6250 1750 50 
F4 "VSEL_1" I L 6250 1550 50 
F5 "V_12" I L 6250 1250 50 
F6 "V_OUT" O R 7150 1250 50 
F7 "DCDC_PG" O R 7150 1450 50 
F8 "LDO_PG" O R 7150 1550 50 
F9 "VSEL_2" I L 6250 1650 50 
$EndSheet
$Sheet
S 1850 900  900  650 
U 5D591ABD
F0 "vreg_3_3_1" 50
F1 "voltage_regulator_3_3.sch" 50
F2 "PG" O R 2750 1200 50 
F3 "V_12" I L 1850 1000 50 
F4 "V_OUT" O R 2750 1000 50 
$EndSheet
$Comp
L power:+12V #PWR?
U 1 1 5D59A645
P 3250 800
F 0 "#PWR?" H 3250 650 50  0001 C CNN
F 1 "+12V" H 3265 973 50  0000 C CNN
F 2 "" H 3250 800 50  0001 C CNN
F 3 "" H 3250 800 50  0001 C CNN
	1    3250 800 
	1    0    0    -1  
$EndComp
Wire Wire Line
	3250 800  3250 1000
Wire Wire Line
	3250 1000 3500 1000
$Comp
L power:+12V #PWR?
U 1 1 5D5A301C
P 6000 1050
F 0 "#PWR?" H 6000 900 50  0001 C CNN
F 1 "+12V" H 6015 1223 50  0000 C CNN
F 2 "" H 6000 1050 50  0001 C CNN
F 3 "" H 6000 1050 50  0001 C CNN
	1    6000 1050
	1    0    0    -1  
$EndComp
Wire Wire Line
	6000 1050 6000 1250
Wire Wire Line
	6000 1250 6250 1250
$Comp
L power:+12V #PWR?
U 1 1 5D5ABD69
P 1600 800
F 0 "#PWR?" H 1600 650 50  0001 C CNN
F 1 "+12V" H 1615 973 50  0000 C CNN
F 2 "" H 1600 800 50  0001 C CNN
F 3 "" H 1600 800 50  0001 C CNN
	1    1600 800 
	1    0    0    -1  
$EndComp
Wire Wire Line
	1600 800  1600 1000
Wire Wire Line
	1600 1000 1850 1000
Text Label 4500 1000 0    50   ~ 0
VDD_LNA_REG
Text Label 7250 1250 0    50   ~ 0
VDD_PA
Wire Wire Line
	2750 1000 3000 1000
$Comp
L power:+3.3V #PWR?
U 1 1 5D5D9F95
P 3000 800
F 0 "#PWR?" H 3000 650 50  0001 C CNN
F 1 "+3.3V" H 3015 973 50  0000 C CNN
F 2 "" H 3000 800 50  0001 C CNN
F 3 "" H 3000 800 50  0001 C CNN
	1    3000 800 
	1    0    0    -1  
$EndComp
Wire Wire Line
	3000 800  3000 1000
$Sheet
S 1400 4900 2000 2700
U 5D67C7FD
F0 "microcontroller_gpio" 50
F1 "microcontroller_gpio.sch" 50
F2 "LINK_LED" O R 3400 5000 50 
F3 "ACT_LED" O R 3400 5100 50 
F4 "RST" O R 3400 5300 50 
F5 "PA0" B L 1400 5000 50 
F6 "PA1" B L 1400 5100 50 
F7 "PA2" B L 1400 5200 50 
F8 "PA3" B L 1400 5300 50 
F9 "PN0" B L 1400 7000 50 
F10 "PN1" B L 1400 7100 50 
F11 "PN2" B L 1400 7200 50 
F12 "PN3" B L 1400 7300 50 
F13 "PL0" B L 1400 5700 50 
F14 "PL1" B L 1400 5800 50 
F15 "PL2" B L 1400 5900 50 
F16 "PL3" B L 1400 6000 50 
F17 "PH0" B R 3400 5500 50 
F18 "PH1" B R 3400 5600 50 
F19 "PH2" B R 3400 5700 50 
F20 "PH3" B R 3400 5800 50 
F21 "PK0" B R 3400 6000 50 
F22 "PK1" B R 3400 6100 50 
F23 "PK2" B R 3400 6200 50 
F24 "PK3" B R 3400 6300 50 
F25 "PK4" B R 3400 6400 50 
F26 "PK5" B R 3400 6500 50 
F27 "PK6" B R 3400 6600 50 
F28 "PK7" B R 3400 6700 50 
F29 "ADC0" I L 1400 6200 50 
F30 "ADC1" I L 1400 6300 50 
F31 "ADC2" I L 1400 6400 50 
F32 "ADC3" I L 1400 6500 50 
F33 "ADC9" I L 1400 6800 50 
F34 "ADC8" I L 1400 6700 50 
F35 "PN4" B L 1400 7400 50 
F36 "PN5" B L 1400 7500 50 
F37 "PA4" B L 1400 5400 50 
F38 "PA5" B L 1400 5500 50 
F39 "SSI2RX" B R 3400 6900 50 
F40 "SSI2TX" B R 3400 7000 50 
F41 "SSI2Fss" B R 3400 7100 50 
F42 "SSI2Clk" B R 3400 7200 50 
F43 "SDR_GPIO[0..11]" B R 3400 7400 50 
F44 "ADC4" I L 1400 6600 50 
$EndSheet
$Sheet
S 3650 4900 650  500 
U 5D69D382
F0 "microcontroller_ethernet" 50
F1 "microcontroller_ethernet.sch" 50
F2 "G_LED" I L 3650 5000 50 
F3 "Y_LED" I L 3650 5100 50 
F4 "RST" I L 3650 5300 50 
$EndSheet
$Sheet
S 1000 2000 1000 850 
U 5D69DD47
F0 "microcontroller_power" 50
F1 "microcontroller_power.sch" 50
$EndSheet
$Comp
L Device:D_TVS D101
U 1 1 5D88D993
P 950 4300
F 0 "D101" V 904 4379 50  0000 L CNN
F 1 "D_TVS" V 995 4379 50  0000 L CNN
F 2 "Capacitor_SMD:C_0201_0603Metric" H 950 4300 50  0001 C CNN
F 3 "~" H 950 4300 50  0001 C CNN
F 4 "LXES03AAA1-134" V 950 4300 50  0001 C CNN "PartNumber"
F 5 "Murata Electronics" H 950 4300 50  0001 C CNN "Manufacturer"
F 6 "3000-0000000088" H 950 4300 50  0001 C CNN "PartSpecification"
	1    950  4300
	0    1    1    0   
$EndComp
$Comp
L power:GND #PWR?
U 1 1 5D8A2378
P 950 4500
F 0 "#PWR?" H 950 4250 50  0001 C CNN
F 1 "GND" H 955 4327 50  0000 C CNN
F 2 "" H 950 4500 50  0001 C CNN
F 3 "" H 950 4500 50  0001 C CNN
	1    950  4500
	1    0    0    -1  
$EndComp
Wire Wire Line
	950  4500 950  4450
Wire Wire Line
	950  4150 950  4050
$Comp
L Device:D_TVS D102
U 1 1 5D8B7F82
P 5850 3150
F 0 "D102" H 5850 2934 50  0000 C CNN
F 1 "D_TVS" H 5850 3025 50  0000 C CNN
F 2 "Capacitor_SMD:C_0201_0603Metric" H 5850 3150 50  0001 C CNN
F 3 "~" H 5850 3150 50  0001 C CNN
F 4 "LXES03AAA1-134" V 5850 3150 50  0001 C CNN "PartNumber"
F 5 "Murata Electronics" H 5850 3150 50  0001 C CNN "Manufacturer"
F 6 "3000-0000000088" H 5850 3150 50  0001 C CNN "PartSpecification"
	1    5850 3150
	-1   0    0    1   
$EndComp
Wire Wire Line
	5700 3150 5550 3150
Connection ~ 5550 3150
Wire Wire Line
	5550 3150 5550 3400
$Comp
L power:GND #PWR?
U 1 1 5D8C2D1F
P 6100 3150
F 0 "#PWR?" H 6100 2900 50  0001 C CNN
F 1 "GND" H 6105 2977 50  0000 C CNN
F 2 "" H 6100 3150 50  0001 C CNN
F 3 "" H 6100 3150 50  0001 C CNN
	1    6100 3150
	0    -1   -1   0   
$EndComp
Wire Wire Line
	6100 3150 6000 3150
$Comp
L Device:D_TVS D103
U 1 1 5D8CDC3E
P 10750 4350
F 0 "D103" V 10796 4271 50  0000 R CNN
F 1 "D_TVS" V 10705 4271 50  0000 R CNN
F 2 "Capacitor_SMD:C_0201_0603Metric" H 10750 4350 50  0001 C CNN
F 3 "~" H 10750 4350 50  0001 C CNN
F 4 "LXES03AAA1-134" V 10750 4350 50  0001 C CNN "PartNumber"
F 5 "Murata Electronics" H 10750 4350 50  0001 C CNN "Manufacturer"
F 6 "3000-0000000088" H 10750 4350 50  0001 C CNN "PartSpecification"
	1    10750 4350
	0    -1   -1   0   
$EndComp
Wire Wire Line
	10750 4200 10750 4100
$Comp
L power:GND #PWR?
U 1 1 5D8E3D8F
P 10750 4550
F 0 "#PWR?" H 10750 4300 50  0001 C CNN
F 1 "GND" H 10755 4377 50  0000 C CNN
F 2 "" H 10750 4550 50  0001 C CNN
F 3 "" H 10750 4550 50  0001 C CNN
	1    10750 4550
	1    0    0    -1  
$EndComp
Wire Wire Line
	10750 4550 10750 4500
Wire Wire Line
	3400 5000 3650 5000
Wire Wire Line
	3650 5100 3400 5100
Wire Wire Line
	3400 5300 3650 5300
Wire Wire Line
	3250 1200 3500 1200
Wire Wire Line
	3500 1300 3250 1300
Wire Wire Line
	3250 1400 3500 1400
Wire Wire Line
	1400 5000 1000 5000
Text Label 1050 5000 0    50   ~ 0
PA0
Wire Wire Line
	1400 5100 1000 5100
Text Label 1050 5100 0    50   ~ 0
PA1
Wire Wire Line
	1400 5200 1000 5200
Text Label 1050 5200 0    50   ~ 0
PA2
Wire Wire Line
	1400 5300 1000 5300
Text Label 1050 5300 0    50   ~ 0
PA3
Wire Wire Line
	1400 7000 1000 7000
Text Label 1050 7000 0    50   ~ 0
PN0
Wire Wire Line
	1400 7100 1000 7100
Text Label 1050 7100 0    50   ~ 0
PN1
Wire Wire Line
	1400 7200 1000 7200
Text Label 1050 7200 0    50   ~ 0
PN2
Wire Wire Line
	1400 7300 1000 7300
Text Label 1050 7300 0    50   ~ 0
PN3
Wire Wire Line
	1400 5700 1000 5700
Wire Wire Line
	1400 5800 1000 5800
Wire Wire Line
	1400 5900 1000 5900
Wire Wire Line
	1400 6000 1000 6000
Text Label 1050 6000 0    50   ~ 0
PG_3
Text Label 3300 1200 0    50   ~ 0
PA0
Text Label 3300 1300 0    50   ~ 0
PA1
Text Label 3300 1500 0    50   ~ 0
PA3
Wire Wire Line
	4700 1200 4400 1200
Text Label 3300 1400 0    50   ~ 0
PA2
Wire Wire Line
	6000 1450 6250 1450
Wire Wire Line
	6250 1550 6000 1550
Wire Wire Line
	6000 1650 6250 1650
Text Label 7250 1550 0    50   ~ 0
PN0
Text Label 6000 1650 0    50   ~ 0
PN1
Text Label 7250 1450 0    50   ~ 0
PN2
Text Label 6000 1750 0    50   ~ 0
PN3
Wire Wire Line
	7450 1450 7150 1450
Text Label 2850 1200 0    50   ~ 0
PG_3
Wire Wire Line
	3050 1200 2750 1200
Wire Wire Line
	3400 5500 6950 5500
$Comp
L Device:R R126
U 1 1 5DA747DB
P 6950 5750
F 0 "R126" H 6880 5704 50  0000 R CNN
F 1 "10k" H 6880 5795 50  0000 R CNN
F 2 "Resistor_SMD:R_0402_1005Metric" V 6880 5750 50  0001 C CNN
F 3 "~" H 6950 5750 50  0001 C CNN
F 4 "Delta Electronics/Cyntec" H 6950 5750 50  0001 C CNN "Manufacturer"
F 5 "PFR05S-103-FNH" H 6950 5750 50  0001 C CNN "PartNumber"
F 6 "3000-0000000131" H 6950 5750 50  0001 C CNN "PartSpecification"
	1    6950 5750
	-1   0    0    1   
$EndComp
Wire Wire Line
	6950 5600 6950 5500
$Comp
L Device:R R127
U 1 1 5DAAE07F
P 6950 6150
F 0 "R127" H 6880 6104 50  0000 R CNN
F 1 "10k" H 6880 6195 50  0000 R CNN
F 2 "Resistor_SMD:R_0402_1005Metric" V 6880 6150 50  0001 C CNN
F 3 "~" H 6950 6150 50  0001 C CNN
F 4 "Delta Electronics/Cyntec" H 6950 6150 50  0001 C CNN "Manufacturer"
F 5 "PFR05S-103-FNH" H 6950 6150 50  0001 C CNN "PartNumber"
F 6 "3000-0000000131" H 6950 6150 50  0001 C CNN "PartSpecification"
	1    6950 6150
	-1   0    0    1   
$EndComp
$Comp
L Device:R R128
U 1 1 5DAAE1A7
P 6950 6550
F 0 "R128" H 6880 6504 50  0000 R CNN
F 1 "10k" H 6880 6595 50  0000 R CNN
F 2 "Resistor_SMD:R_0402_1005Metric" V 6880 6550 50  0001 C CNN
F 3 "~" H 6950 6550 50  0001 C CNN
F 4 "Delta Electronics/Cyntec" H 6950 6550 50  0001 C CNN "Manufacturer"
F 5 "PFR05S-103-FNH" H 6950 6550 50  0001 C CNN "PartNumber"
F 6 "3000-0000000131" H 6950 6550 50  0001 C CNN "PartSpecification"
	1    6950 6550
	-1   0    0    1   
$EndComp
Wire Wire Line
	6950 5900 6950 5950
Wire Wire Line
	6950 6300 6950 6400
$Comp
L power:GND #PWR?
U 1 1 5DACB190
P 6950 6800
F 0 "#PWR?" H 6950 6550 50  0001 C CNN
F 1 "GND" H 6955 6627 50  0000 C CNN
F 2 "" H 6950 6800 50  0001 C CNN
F 3 "" H 6950 6800 50  0001 C CNN
	1    6950 6800
	1    0    0    -1  
$EndComp
Wire Wire Line
	6950 6800 6950 6700
Connection ~ 6950 5950
Wire Wire Line
	6950 5950 6950 6000
Wire Wire Line
	3400 6000 3800 6000
Wire Wire Line
	3400 6200 4800 6200
$Comp
L Device:R R112
U 1 1 5DB64C13
P 3950 6000
F 0 "R112" H 4020 6046 50  0000 L CNN
F 1 "402" H 4020 5955 50  0000 L CNN
F 2 "Resistor_SMD:R_0402_1005Metric" V 3880 6000 50  0001 C CNN
F 3 "~" H 3950 6000 50  0001 C CNN
F 4 "Stackpole Electronics Inc" H 3950 6000 50  0001 C CNN "Manufacturer"
F 5 "RMCF0402FT402R" H 3950 6000 50  0001 C CNN "PartNumber"
F 6 "3000-0000000159" H 3950 6000 50  0001 C CNN "PartSpecification"
	1    3950 6000
	0    1    1    0   
$EndComp
$Comp
L Device:R R114
U 1 1 5DB64E19
P 4250 6100
F 0 "R114" H 4320 6146 50  0000 L CNN
F 1 "402" H 4320 6055 50  0000 L CNN
F 2 "Resistor_SMD:R_0402_1005Metric" V 4180 6100 50  0001 C CNN
F 3 "~" H 4250 6100 50  0001 C CNN
F 4 "Stackpole Electronics Inc" H 4250 6100 50  0001 C CNN "Manufacturer"
F 5 "RMCF0402FT402R" H 4250 6100 50  0001 C CNN "PartNumber"
F 6 "3000-0000000159" H 4250 6100 50  0001 C CNN "PartSpecification"
	1    4250 6100
	0    1    1    0   
$EndComp
$Comp
L Device:R R118
U 1 1 5DB64EC1
P 4950 6200
F 0 "R118" H 5020 6246 50  0000 L CNN
F 1 "402" H 5020 6155 50  0000 L CNN
F 2 "Resistor_SMD:R_0402_1005Metric" V 4880 6200 50  0001 C CNN
F 3 "~" H 4950 6200 50  0001 C CNN
F 4 "Stackpole Electronics Inc" H 4950 6200 50  0001 C CNN "Manufacturer"
F 5 "RMCF0402FT402R" H 4950 6200 50  0001 C CNN "PartNumber"
F 6 "3000-0000000159" H 4950 6200 50  0001 C CNN "PartSpecification"
	1    4950 6200
	0    1    1    0   
$EndComp
Wire Wire Line
	3400 6300 3500 6300
Wire Wire Line
	3400 6100 4100 6100
Text Label 4650 6000 0    50   ~ 0
lna_v_bias
$Comp
L Device:R R116
U 1 1 5DC4EED3
P 4650 6100
F 0 "R116" H 4720 6146 50  0000 L CNN
F 1 "402" H 4720 6055 50  0000 L CNN
F 2 "Resistor_SMD:R_0402_1005Metric" V 4580 6100 50  0001 C CNN
F 3 "~" H 4650 6100 50  0001 C CNN
F 4 "Stackpole Electronics Inc" H 4650 6100 50  0001 C CNN "Manufacturer"
F 5 "RMCF0402FT402R" H 4650 6100 50  0001 C CNN "PartNumber"
F 6 "3000-0000000159" H 4650 6100 50  0001 C CNN "PartSpecification"
	1    4650 6100
	0    1    1    0   
$EndComp
$Comp
L Device:R R120
U 1 1 5DC5F017
P 5350 6200
F 0 "R120" H 5420 6246 50  0000 L CNN
F 1 "402" H 5420 6155 50  0000 L CNN
F 2 "Resistor_SMD:R_0402_1005Metric" V 5280 6200 50  0001 C CNN
F 3 "~" H 5350 6200 50  0001 C CNN
F 4 "Stackpole Electronics Inc" H 5350 6200 50  0001 C CNN "Manufacturer"
F 5 "RMCF0402FT402R" H 5350 6200 50  0001 C CNN "PartNumber"
F 6 "3000-0000000159" H 5350 6200 50  0001 C CNN "PartSpecification"
	1    5350 6200
	0    1    1    0   
$EndComp
$Comp
L Device:R R122
U 1 1 5DC5F0CB
P 5750 6200
F 0 "R122" H 5820 6246 50  0000 L CNN
F 1 "402" H 5820 6155 50  0000 L CNN
F 2 "Resistor_SMD:R_0402_1005Metric" V 5680 6200 50  0001 C CNN
F 3 "~" H 5750 6200 50  0001 C CNN
F 4 "Stackpole Electronics Inc" H 5750 6200 50  0001 C CNN "Manufacturer"
F 5 "RMCF0402FT402R" H 5750 6200 50  0001 C CNN "PartNumber"
F 6 "3000-0000000159" H 5750 6200 50  0001 C CNN "PartSpecification"
	1    5750 6200
	0    1    1    0   
$EndComp
$Comp
L Device:R R124
U 1 1 5DC5F18B
P 6150 6200
F 0 "R124" H 6220 6246 50  0000 L CNN
F 1 "402" H 6220 6155 50  0000 L CNN
F 2 "Resistor_SMD:R_0402_1005Metric" V 6080 6200 50  0001 C CNN
F 3 "~" H 6150 6200 50  0001 C CNN
F 4 "Stackpole Electronics Inc" H 6150 6200 50  0001 C CNN "Manufacturer"
F 5 "RMCF0402FT402R" H 6150 6200 50  0001 C CNN "PartNumber"
F 6 "3000-0000000159" H 6150 6200 50  0001 C CNN "PartSpecification"
	1    6150 6200
	0    1    1    0   
$EndComp
$Comp
L Device:R R125
U 1 1 5DC9DE68
P 6450 6400
F 0 "R125" H 6520 6446 50  0000 L CNN
F 1 "402" H 6520 6355 50  0000 L CNN
F 2 "Resistor_SMD:R_0402_1005Metric" V 6380 6400 50  0001 C CNN
F 3 "~" H 6450 6400 50  0001 C CNN
F 4 "Stackpole Electronics Inc" H 6450 6400 50  0001 C CNN "Manufacturer"
F 5 "RMCF0402FT402R" H 6450 6400 50  0001 C CNN "PartNumber"
F 6 "3000-0000000159" H 6450 6400 50  0001 C CNN "PartSpecification"
	1    6450 6400
	0    1    1    0   
$EndComp
Wire Wire Line
	3500 6400 3500 6300
Wire Wire Line
	3800 6400 3900 6400
Wire Wire Line
	4200 6400 4300 6400
Wire Wire Line
	6300 6400 6200 6400
Wire Wire Line
	6600 6400 6600 6000
Wire Wire Line
	4100 6000 4900 6000
Wire Wire Line
	4800 6100 4900 6100
Wire Wire Line
	4900 6100 4900 6000
Connection ~ 4900 6000
Wire Wire Line
	4900 6000 6400 6000
Wire Wire Line
	5100 6200 5200 6200
Wire Wire Line
	4500 6100 4400 6100
Wire Wire Line
	4700 6400 4600 6400
Wire Wire Line
	5000 6400 5100 6400
Wire Wire Line
	5400 6400 5500 6400
Wire Wire Line
	5600 6200 5500 6200
Wire Wire Line
	5900 6200 6000 6200
Wire Wire Line
	6300 6200 6400 6200
Wire Wire Line
	6400 6200 6400 6000
Connection ~ 6400 6000
Wire Wire Line
	6400 6000 6600 6000
Wire Wire Line
	5900 6400 5800 6400
$Comp
L Device:R R123
U 1 1 5DDA9600
P 6050 6400
F 0 "R123" H 6120 6446 50  0000 L CNN
F 1 "402" H 6120 6355 50  0000 L CNN
F 2 "Resistor_SMD:R_0402_1005Metric" V 5980 6400 50  0001 C CNN
F 3 "~" H 6050 6400 50  0001 C CNN
F 4 "Stackpole Electronics Inc" H 6050 6400 50  0001 C CNN "Manufacturer"
F 5 "RMCF0402FT402R" H 6050 6400 50  0001 C CNN "PartNumber"
F 6 "3000-0000000159" H 6050 6400 50  0001 C CNN "PartSpecification"
	1    6050 6400
	0    1    1    0   
$EndComp
$Comp
L Device:R R121
U 1 1 5DDA96BC
P 5650 6400
F 0 "R121" H 5720 6446 50  0000 L CNN
F 1 "402" H 5720 6355 50  0000 L CNN
F 2 "Resistor_SMD:R_0402_1005Metric" V 5580 6400 50  0001 C CNN
F 3 "~" H 5650 6400 50  0001 C CNN
F 4 "Stackpole Electronics Inc" H 5650 6400 50  0001 C CNN "Manufacturer"
F 5 "RMCF0402FT402R" H 5650 6400 50  0001 C CNN "PartNumber"
F 6 "3000-0000000159" H 5650 6400 50  0001 C CNN "PartSpecification"
	1    5650 6400
	0    1    1    0   
$EndComp
$Comp
L Device:R R119
U 1 1 5DDA977A
P 5250 6400
F 0 "R119" H 5320 6446 50  0000 L CNN
F 1 "402" H 5320 6355 50  0000 L CNN
F 2 "Resistor_SMD:R_0402_1005Metric" V 5180 6400 50  0001 C CNN
F 3 "~" H 5250 6400 50  0001 C CNN
F 4 "Stackpole Electronics Inc" H 5250 6400 50  0001 C CNN "Manufacturer"
F 5 "RMCF0402FT402R" H 5250 6400 50  0001 C CNN "PartNumber"
F 6 "3000-0000000159" H 5250 6400 50  0001 C CNN "PartSpecification"
	1    5250 6400
	0    1    1    0   
$EndComp
$Comp
L Device:R R117
U 1 1 5DDA982E
P 4850 6400
F 0 "R117" H 4920 6446 50  0000 L CNN
F 1 "402" H 4920 6355 50  0000 L CNN
F 2 "Resistor_SMD:R_0402_1005Metric" V 4780 6400 50  0001 C CNN
F 3 "~" H 4850 6400 50  0001 C CNN
F 4 "Stackpole Electronics Inc" H 4850 6400 50  0001 C CNN "Manufacturer"
F 5 "RMCF0402FT402R" H 4850 6400 50  0001 C CNN "PartNumber"
F 6 "3000-0000000159" H 4850 6400 50  0001 C CNN "PartSpecification"
	1    4850 6400
	0    1    1    0   
$EndComp
$Comp
L Device:R R115
U 1 1 5DDA98F0
P 4450 6400
F 0 "R115" H 4520 6446 50  0000 L CNN
F 1 "402" H 4520 6355 50  0000 L CNN
F 2 "Resistor_SMD:R_0402_1005Metric" V 4380 6400 50  0001 C CNN
F 3 "~" H 4450 6400 50  0001 C CNN
F 4 "Stackpole Electronics Inc" H 4450 6400 50  0001 C CNN "Manufacturer"
F 5 "RMCF0402FT402R" H 4450 6400 50  0001 C CNN "PartNumber"
F 6 "3000-0000000159" H 4450 6400 50  0001 C CNN "PartSpecification"
	1    4450 6400
	0    1    1    0   
$EndComp
$Comp
L Device:R R113
U 1 1 5DDA99B0
P 4050 6400
F 0 "R113" H 4120 6446 50  0000 L CNN
F 1 "402" H 4120 6355 50  0000 L CNN
F 2 "Resistor_SMD:R_0402_1005Metric" V 3980 6400 50  0001 C CNN
F 3 "~" H 4050 6400 50  0001 C CNN
F 4 "Stackpole Electronics Inc" H 4050 6400 50  0001 C CNN "Manufacturer"
F 5 "RMCF0402FT402R" H 4050 6400 50  0001 C CNN "PartNumber"
F 6 "3000-0000000159" H 4050 6400 50  0001 C CNN "PartSpecification"
	1    4050 6400
	0    1    1    0   
$EndComp
$Comp
L Device:R R111
U 1 1 5DDA9A6E
P 3650 6400
F 0 "R111" H 3720 6446 50  0000 L CNN
F 1 "402" H 3720 6355 50  0000 L CNN
F 2 "Resistor_SMD:R_0402_1005Metric" V 3580 6400 50  0001 C CNN
F 3 "~" H 3650 6400 50  0001 C CNN
F 4 "Stackpole Electronics Inc" H 3650 6400 50  0001 C CNN "Manufacturer"
F 5 "RMCF0402FT402R" H 3650 6400 50  0001 C CNN "PartNumber"
F 6 "3000-0000000159" H 3650 6400 50  0001 C CNN "PartSpecification"
	1    3650 6400
	0    1    1    0   
$EndComp
Wire Wire Line
	1400 6200 950  6200
Text Label 1050 6200 0    50   ~ 0
ADC0
Text Label 1050 6300 0    50   ~ 0
ADC1
Text Label 1050 6400 0    50   ~ 0
ADC2
Text Label 1050 6500 0    50   ~ 0
ADC3
Wire Wire Line
	850  6500 1400 6500
Wire Wire Line
	850  6300 1400 6300
Wire Wire Line
	750  6400 1400 6400
Text Label 3500 6000 0    50   ~ 0
lna_b0
Text Label 3500 6100 0    50   ~ 0
lna_b1
Text Label 3500 6200 0    50   ~ 0
lna_b2
Text Label 3500 6300 0    50   ~ 0
lna_b3
Text Label 4450 6100 1    50   ~ 0
lna_b1_1
Text Label 5150 6200 1    50   ~ 0
lba_b2_1
Text Label 5550 6200 1    50   ~ 0
lba_b2_2
Text Label 5950 6200 1    50   ~ 0
lba_b2_3
Text Label 3850 6400 3    50   ~ 0
lba_b3_1
Text Label 4250 6400 3    50   ~ 0
lba_b3_2
Text Label 4650 6400 3    50   ~ 0
lba_b3_3
Text Label 5050 6400 3    50   ~ 0
lba_b3_4
Text Label 5450 6400 3    50   ~ 0
lba_b3_5
Text Label 5850 6400 3    50   ~ 0
lba_b3_6
Text Label 6250 6400 3    50   ~ 0
lba_b3_7
Text Label 6950 6350 0    50   ~ 0
pa_en_half
$Comp
L Connector_Generic:Conn_01x02 J104
U 1 1 5D6B88F4
P 1300 1100
F 0 "J104" H 1380 1092 50  0000 L CNN
F 1 "Conn_01x02" H 1380 1001 50  0000 L CNN
F 2 "TerminalBlock:TerminalBlock_bornier-2_P5.08mm" H 1300 1100 50  0001 C CNN
F 3 "~" H 1300 1100 50  0001 C CNN
F 4 "Molex" H 1300 1100 50  0001 C CNN "Manufacturer"
F 5 "0398800302" H 1300 1100 50  0001 C CNN "PartNumber"
F 6 "3000-0000000184" H 1300 1100 50  0001 C CNN "PartSpecification"
	1    1300 1100
	1    0    0    -1  
$EndComp
$Comp
L power:+12V #PWR?
U 1 1 5D6B9142
P 1000 1000
F 0 "#PWR?" H 1000 850 50  0001 C CNN
F 1 "+12V" H 1015 1173 50  0000 C CNN
F 2 "" H 1000 1000 50  0001 C CNN
F 3 "" H 1000 1000 50  0001 C CNN
	1    1000 1000
	1    0    0    -1  
$EndComp
$Comp
L power:GND #PWR?
U 1 1 5D6B9F88
P 1000 1300
F 0 "#PWR?" H 1000 1050 50  0001 C CNN
F 1 "GND" H 1005 1127 50  0000 C CNN
F 2 "" H 1000 1300 50  0001 C CNN
F 3 "" H 1000 1300 50  0001 C CNN
	1    1000 1300
	1    0    0    -1  
$EndComp
Wire Wire Line
	1000 1300 1000 1200
Wire Wire Line
	1000 1200 1100 1200
Wire Wire Line
	1100 1100 1000 1100
Wire Wire Line
	1000 1100 1000 1000
$Comp
L Connector_Generic:Conn_01x03 J105
U 1 1 5D6E680F
P 8900 4700
F 0 "J105" H 8980 4742 50  0000 L CNN
F 1 "Conn_01x03" H 8980 4651 50  0000 L CNN
F 2 "Connector:FanPinHeader_1x03_P2.54mm_Vertical" H 8900 4700 50  0001 C CNN
F 3 "~" H 8900 4700 50  0001 C CNN
F 4 "Sullins Connector Solutions" H 8900 4700 50  0001 C CNN "Manufacturer"
F 5 "SWR25X-NRTC-S03-ST-BA" H 8900 4700 50  0001 C CNN "PartNumber"
F 6 "3000-0000000172" H 8900 4700 50  0001 C CNN "PartSpecification"
	1    8900 4700
	1    0    0    -1  
$EndComp
$Comp
L power:GND #PWR?
U 1 1 5D6E884B
P 7850 4800
F 0 "#PWR?" H 7850 4550 50  0001 C CNN
F 1 "GND" H 7855 4627 50  0000 C CNN
F 2 "" H 7850 4800 50  0001 C CNN
F 3 "" H 7850 4800 50  0001 C CNN
	1    7850 4800
	1    0    0    -1  
$EndComp
$Comp
L power:+12V #PWR?
U 1 1 5D6E909F
P 8100 4500
F 0 "#PWR?" H 8100 4350 50  0001 C CNN
F 1 "+12V" H 8115 4673 50  0000 C CNN
F 2 "" H 8100 4500 50  0001 C CNN
F 3 "" H 8100 4500 50  0001 C CNN
	1    8100 4500
	1    0    0    -1  
$EndComp
Wire Wire Line
	8700 4800 8600 4800
Text Label 1050 5900 0    50   ~ 0
fan_tach
$Comp
L Device:R R129
U 1 1 5D73A757
P 8100 4950
F 0 "R129" V 7893 4950 50  0000 C CNN
F 1 "10k" V 7984 4950 50  0000 C CNN
F 2 "Resistor_SMD:R_0402_1005Metric" V 8030 4950 50  0001 C CNN
F 3 "~" H 8100 4950 50  0001 C CNN
F 4 "Delta Electronics/Cyntec" H 8100 4950 50  0001 C CNN "Manufacturer"
F 5 "PFR05S-103-FNH" H 8100 4950 50  0001 C CNN "PartNumber"
F 6 "3000-0000000131" H 8100 4950 50  0001 C CNN "PartSpecification"
	1    8100 4950
	-1   0    0    1   
$EndComp
$Comp
L Device:R R130
U 1 1 5D73B5BF
P 8600 5350
F 0 "R130" V 8393 5350 50  0000 C CNN
F 1 "1k" V 8484 5350 50  0000 C CNN
F 2 "Resistor_SMD:R_0402_1005Metric" V 8530 5350 50  0001 C CNN
F 3 "~" H 8600 5350 50  0001 C CNN
F 4 "Delta Electronics/Cyntec" H 8600 5350 50  0001 C CNN "Manufacturer"
F 5 "PFR05S-102-FNH" H 8600 5350 50  0001 C CNN "PartNumber"
F 6 "3000-0000000156" H 8600 5350 50  0001 C CNN "PartSpecification"
	1    8600 5350
	-1   0    0    1   
$EndComp
Wire Wire Line
	8600 4800 8600 5150
$Comp
L Diode:BZX84Cxx D104
U 1 1 5D7C38DC
P 8600 6100
F 0 "D104" V 8554 6179 50  0000 L CNN
F 1 "BZX84Cxx" V 8645 6179 50  0000 L CNN
F 2 "Diode_SMD:D_SOT-23_ANK" H 8600 6100 50  0001 C CNN
F 3 "https://diotec.com/tl_files/diotec/files/pdf/datasheets/bzx84c2v4.pdf" H 8600 6100 50  0001 C CNN
F 4 "ON Semiconductor" H 8600 6100 50  0001 C CNN "Manufacturer"
F 5 "BZX84C2V7LT1G" H 8600 6100 50  0001 C CNN "PartNumber"
F 6 "3000-0000000084" H 8600 6100 50  0001 C CNN "PartSpecification"
	1    8600 6100
	0    1    1    0   
$EndComp
$Comp
L Device:R R131
U 1 1 5D7C3FC2
P 8600 5700
F 0 "R131" V 8393 5700 50  0000 C CNN
F 1 "1k" V 8484 5700 50  0000 C CNN
F 2 "Resistor_SMD:R_0402_1005Metric" V 8530 5700 50  0001 C CNN
F 3 "~" H 8600 5700 50  0001 C CNN
F 4 "Delta Electronics/Cyntec" H 8600 5700 50  0001 C CNN "Manufacturer"
F 5 "PFR05S-102-FNH" H 8600 5700 50  0001 C CNN "PartNumber"
F 6 "3000-0000000156" H 8600 5700 50  0001 C CNN "PartSpecification"
	1    8600 5700
	-1   0    0    1   
$EndComp
Wire Wire Line
	8600 5950 8600 5900
$Comp
L power:GND #PWR?
U 1 1 5D7F22B0
P 8600 6300
F 0 "#PWR?" H 8600 6050 50  0001 C CNN
F 1 "GND" H 8605 6127 50  0000 C CNN
F 2 "" H 8600 6300 50  0001 C CNN
F 3 "" H 8600 6300 50  0001 C CNN
	1    8600 6300
	1    0    0    -1  
$EndComp
Wire Wire Line
	8600 6300 8600 6250
Text Label 8750 5900 0    50   ~ 0
fan_tach
Text Label 8600 5000 0    50   ~ 0
fan_tach_in
Text Label 8600 5550 2    50   ~ 0
fan_tach_mid
$Sheet
S 6000 4800 750  400 
U 5D614D04
F0 "mounting_holes" 50
F1 "mounting_holes.sch" 50
$EndSheet
Connection ~ 10750 4100
$Sheet
S 6850 3300 1000 1000
U 5D96ADB0
F0 "PA" 50
F1 "PA.sch" 50
F2 "VBIAS" I R 7850 4250 50 
F3 "VCC3" I R 7850 4150 50 
F4 "VCC2" I R 7850 4050 50 
F5 "VCC1" I R 7850 3950 50 
F6 "RF_IN" I R 7850 3700 50 
F7 "RF_OUT" O L 6850 3700 50 
F8 "PA_EN" I L 6850 4200 50 
$EndSheet
Wire Wire Line
	6550 3700 6850 3700
Wire Wire Line
	8150 4150 7850 4150
Wire Wire Line
	8150 4050 7850 4050
Wire Wire Line
	8150 3950 7850 3950
Wire Wire Line
	7850 4250 8150 4250
Text Label 7850 4250 0    50   ~ 0
PA_VBIAS
Text Label 7850 4150 0    50   ~ 0
PA_VCC3
Text Label 7850 4050 0    50   ~ 0
PA_VCC2
Text Label 7850 3950 0    50   ~ 0
PA_VCC1
$Sheet
S 3700 3200 1000 1000
U 5E073A72
F0 "LNA" 50
F1 "LNA.sch" 50
F2 "VDD" I R 4700 3300 50 
F3 "VBIAS" I R 4700 4100 50 
F4 "RF_IN" I R 4700 3700 50 
F5 "RF_OUT" O L 3700 3700 50 
$EndSheet
$Comp
L Device:R R106
U 1 1 5E0C674E
P 5000 2800
AR Path="/5E0C674E" Ref="R106"  Part="1" 
AR Path="/5E073A72/5E0C674E" Ref="R?"  Part="1" 
F 0 "R106" H 4930 2754 50  0000 R CNN
F 1 "50m" H 4930 2845 50  0000 R CNN
F 2 "POWDER_Power:R_0508_1220Metric" V 4930 2800 50  0001 C CNN
F 3 "~" H 5000 2800 50  0001 C CNN
F 4 "" H 5000 2800 50  0001 C CNN "Manufacturer"
F 5 "" H 5000 2800 50  0001 C CNN "PartNumber"
F 6 "3000-0000000129" H 5000 2800 50  0001 C CNN "PartSpecification"
	1    5000 2800
	-1   0    0    1   
$EndComp
$Comp
L Connector:TestPoint TP103
U 1 1 5E0C6755
P 4450 2000
AR Path="/5E0C6755" Ref="TP103"  Part="1" 
AR Path="/5E073A72/5E0C6755" Ref="TP?"  Part="1" 
F 0 "TP103" H 4508 2118 50  0000 L CNN
F 1 "TestPoint" H 4508 2027 50  0000 L CNN
F 2 "TestPoint:TestPoint_Pad_D1.0mm" H 4650 2000 50  0001 C CNN
F 3 "~" H 4650 2000 50  0001 C CNN
	1    4450 2000
	1    0    0    -1  
$EndComp
Wire Wire Line
	4450 2000 5000 2000
Wire Wire Line
	5000 2000 5000 1000
Wire Wire Line
	4400 1000 5000 1000
Connection ~ 5000 2000
Wire Wire Line
	4700 3700 5150 3700
Wire Wire Line
	5000 3300 4700 3300
Wire Wire Line
	8100 4500 8100 4700
Wire Wire Line
	7850 4600 7850 4800
Wire Wire Line
	8700 4700 8100 4700
$Sheet
S 8250 3200 1000 950 
U 5E655037
F0 "TX_attenuator" 50
F1 "TX_attenuator.sch" 50
F2 "RF_IN" I R 9250 3700 50 
F3 "RF_OUT" O L 8250 3700 50 
F4 "VDD" I R 9250 3350 50 
F5 "LE" I R 9250 4050 50 
F6 "CLK" I R 9250 3950 50 
F7 "SI" I R 9250 3850 50 
$EndSheet
Wire Wire Line
	7850 3700 8250 3700
Wire Wire Line
	9250 3350 10950 3350
Wire Wire Line
	10950 3350 10950 2950
Text Label 7900 3700 0    50   ~ 0
pa_att_in
$Sheet
S 2300 3200 1000 1000
U 5E78F576
F0 "RX_attenuator" 50
F1 "RX_attenuator.sch" 50
F2 "RF_IN" I R 3300 3700 50 
F3 "RF_OUT" O L 2300 3700 50 
F4 "VDD" I R 3300 3350 50 
F5 "LE" I R 3300 4100 50 
F6 "CLK" I R 3300 4000 50 
F7 "SI" I R 3300 3900 50 
$EndSheet
Wire Wire Line
	4700 4100 5000 4100
Text Label 4750 4100 0    50   ~ 0
lna_v_bias
Wire Wire Line
	3500 3350 3300 3350
Wire Wire Line
	9250 3850 9450 3850
Wire Wire Line
	9250 3950 9450 3950
Wire Wire Line
	9450 4050 9250 4050
Text Label 9300 4050 0    50   ~ 0
ATT_LE
Text Label 9300 3950 0    50   ~ 0
ATT_CLK
Text Label 9300 3850 0    50   ~ 0
ATT_SI
Wire Wire Line
	3550 4100 3300 4100
Wire Wire Line
	3550 4000 3300 4000
Wire Wire Line
	3550 3900 3300 3900
Text Label 3350 4100 0    50   ~ 0
ATT_LE
Text Label 3350 4000 0    50   ~ 0
ATT_CLK
Text Label 3350 3900 0    50   ~ 0
ATT_SI
Wire Wire Line
	7850 4600 8700 4600
Wire Wire Line
	5550 2800 5550 3150
Text Label 4850 3700 0    50   ~ 0
lna_in
Text Label 3350 3700 0    50   ~ 0
lna_out
Text Label 1750 3700 0    50   ~ 0
lna_att_out
Wire Wire Line
	3500 1500 3250 1500
Wire Wire Line
	4400 1300 4700 1300
Text Label 4500 1200 0    50   ~ 0
PA4
Text Label 4500 1300 0    50   ~ 0
PA5
Wire Wire Line
	6250 1750 6000 1750
Wire Wire Line
	7150 1550 7450 1550
Text Label 6000 1550 0    50   ~ 0
PN4
Text Label 6000 1450 0    50   ~ 0
PN5
Connection ~ 10950 2950
Text Label 9650 2050 0    50   ~ 0
PA_VCC1
Text Label 9650 2350 0    50   ~ 0
PA_VCC2
Text Label 9650 2650 0    50   ~ 0
PA_VCC3
Text Label 9650 2950 0    50   ~ 0
PA_VBIAS
Connection ~ 10500 2050
Wire Wire Line
	10950 2050 10950 2350
Connection ~ 10950 2050
Wire Wire Line
	10850 2050 10950 2050
Wire Wire Line
	10950 2650 10950 2950
Connection ~ 10950 2650
Wire Wire Line
	10850 2650 10950 2650
Wire Wire Line
	10950 1250 10950 2050
Connection ~ 10950 1250
Wire Wire Line
	10950 2350 10950 2650
Connection ~ 10950 2350
Connection ~ 10500 2350
Connection ~ 10500 2950
Connection ~ 10500 2650
$Comp
L Connector:TestPoint TP111
U 1 1 5D715194
P 10500 2050
F 0 "TP111" H 10558 2168 50  0000 L CNN
F 1 "TestPoint" H 10558 2077 50  0000 L CNN
F 2 "TestPoint:TestPoint_Pad_D1.0mm" H 10700 2050 50  0001 C CNN
F 3 "~" H 10700 2050 50  0001 C CNN
	1    10500 2050
	-1   0    0    -1  
$EndComp
$Comp
L Connector:TestPoint TP110
U 1 1 5D714D69
P 10500 2350
F 0 "TP110" H 10558 2468 50  0000 L CNN
F 1 "TestPoint" H 10558 2377 50  0000 L CNN
F 2 "TestPoint:TestPoint_Pad_D1.0mm" H 10700 2350 50  0001 C CNN
F 3 "~" H 10700 2350 50  0001 C CNN
	1    10500 2350
	-1   0    0    -1  
$EndComp
$Comp
L Connector:TestPoint TP109
U 1 1 5D714A15
P 10500 2650
F 0 "TP109" H 10558 2768 50  0000 L CNN
F 1 "TestPoint" H 10558 2677 50  0000 L CNN
F 2 "TestPoint:TestPoint_Pad_D1.0mm" H 10700 2650 50  0001 C CNN
F 3 "~" H 10700 2650 50  0001 C CNN
	1    10500 2650
	-1   0    0    -1  
$EndComp
$Comp
L Connector:TestPoint TP108
U 1 1 5D714556
P 10500 2950
F 0 "TP108" H 10558 3068 50  0000 L CNN
F 1 "TestPoint" H 10558 2977 50  0000 L CNN
F 2 "TestPoint:TestPoint_Pad_D1.0mm" H 10700 2950 50  0001 C CNN
F 3 "~" H 10700 2950 50  0001 C CNN
	1    10500 2950
	-1   0    0    -1  
$EndComp
Wire Wire Line
	10550 2050 10500 2050
Wire Wire Line
	10550 2350 10500 2350
Wire Wire Line
	10550 2650 10500 2650
Wire Wire Line
	10550 2950 10500 2950
Wire Wire Line
	10950 1150 10950 1250
$Comp
L Connector:TestPoint TP107
U 1 1 5D6D7453
P 10950 1150
F 0 "TP107" H 11008 1268 50  0000 L CNN
F 1 "TestPoint" H 11008 1177 50  0000 L CNN
F 2 "TestPoint:TestPoint_Pad_D1.0mm" H 11150 1150 50  0001 C CNN
F 3 "~" H 11150 1150 50  0001 C CNN
	1    10950 1150
	-1   0    0    -1  
$EndComp
$Comp
L Device:R R133
U 1 1 5D6BA276
P 10700 2950
F 0 "R133" V 10493 2950 50  0000 C CNN
F 1 "50m" V 10584 2950 50  0000 C CNN
F 2 "POWDER_Power:R_0508_1220Metric" V 10630 2950 50  0001 C CNN
F 3 "~" H 10700 2950 50  0001 C CNN
F 4 "Panasonic Electronic Components" H 10700 2950 50  0001 C CNN "Manufacturer"
F 5 "ERJ-B2CFR05V" H 10700 2950 50  0001 C CNN "PartNumber"
F 6 "3000-0000000129" H 10700 2950 50  0001 C CNN "PartSpecification"
	1    10700 2950
	0    -1   1    0   
$EndComp
$Comp
L Device:R R134
U 1 1 5D6B9B01
P 10700 2650
F 0 "R134" V 10493 2650 50  0000 C CNN
F 1 "5m" V 10584 2650 50  0000 C CNN
F 2 "POWDER_Power:R_0508_1220Metric" V 10630 2650 50  0001 C CNN
F 3 "~" H 10700 2650 50  0001 C CNN
F 4 "Bourns Inc." H 10700 2650 50  0001 C CNN "Manufacturer"
F 5 "CFG0612-FX-R005ELF" H 10700 2650 50  0001 C CNN "PartNumber"
F 6 "3000-0000000127" H 10700 2650 50  0001 C CNN "PartSpecification"
	1    10700 2650
	0    -1   1    0   
$EndComp
$Comp
L Device:R R135
U 1 1 5D6B924F
P 10700 2350
F 0 "R135" V 10493 2350 50  0000 C CNN
F 1 "50m" V 10584 2350 50  0000 C CNN
F 2 "POWDER_Power:R_0508_1220Metric" V 10630 2350 50  0001 C CNN
F 3 "~" H 10700 2350 50  0001 C CNN
F 4 "Panasonic Electronic Components" H 10700 2350 50  0001 C CNN "Manufacturer"
F 5 "ERJ-B2CFR05V" H 10700 2350 50  0001 C CNN "PartNumber"
F 6 "3000-0000000129" H 10700 2350 50  0001 C CNN "PartSpecification"
	1    10700 2350
	0    -1   1    0   
$EndComp
Wire Wire Line
	10850 2950 10950 2950
Wire Wire Line
	10850 2350 10950 2350
$Comp
L Device:R R136
U 1 1 5D5FB67C
P 10700 2050
F 0 "R136" V 10493 2050 50  0000 C CNN
F 1 "50m" V 10584 2050 50  0000 C CNN
F 2 "POWDER_Power:R_0508_1220Metric" V 10630 2050 50  0001 C CNN
F 3 "~" H 10700 2050 50  0001 C CNN
F 4 "Panasonic Electronic Components" H 10700 2050 50  0001 C CNN "Manufacturer"
F 5 "ERJ-B2CFR05V" H 10700 2050 50  0001 C CNN "PartNumber"
F 6 "3000-0000000129" H 10700 2050 50  0001 C CNN "PartSpecification"
	1    10700 2050
	0    -1   1    0   
$EndComp
$Comp
L POWDER_Power:INA180-Q1 U103
U 1 1 5ED022B9
P 3550 2700
F 0 "U103" H 3700 3000 50  0000 L CNN
F 1 "INA180-Q1" H 3700 2450 50  0000 L CNN
F 2 "Package_TO_SOT_SMD:SOT-23-5" H 3700 3350 100 0001 C CNN
F 3 "" H 3800 3050 100 0001 C CNN
F 4 "3000-0000000197" H 3550 2700 50  0001 C CNN "PartSpecification"
	1    3550 2700
	-1   0    0    -1  
$EndComp
$Comp
L power:GND #PWR?
U 1 1 5ED2C263
P 3550 3100
F 0 "#PWR?" H 3550 2850 50  0001 C CNN
F 1 "GND" H 3555 2927 50  0000 C CNN
F 2 "" H 3550 3100 50  0001 C CNN
F 3 "" H 3550 3100 50  0001 C CNN
	1    3550 3100
	1    0    0    -1  
$EndComp
Wire Wire Line
	3550 3100 3550 3000
$Comp
L power:+3.3V #PWR?
U 1 1 5ED37543
P 3550 2250
F 0 "#PWR?" H 3550 2100 50  0001 C CNN
F 1 "+3.3V" H 3565 2423 50  0000 C CNN
F 2 "" H 3550 2250 50  0001 C CNN
F 3 "" H 3550 2250 50  0001 C CNN
	1    3550 2250
	1    0    0    -1  
$EndComp
Wire Wire Line
	3550 2250 3550 2300
Wire Wire Line
	1000 6700 1400 6700
Wire Wire Line
	1000 6800 1400 6800
Text Label 1050 6700 0    50   ~ 0
ADC8
Text Label 1050 6800 0    50   ~ 0
ADC9
Wire Wire Line
	3100 2700 2850 2700
Text Label 2850 2700 0    50   ~ 0
ADC8
Wire Wire Line
	1400 5400 1000 5400
Text Label 1050 5400 0    50   ~ 0
PA4
Wire Wire Line
	1400 5500 1000 5500
Text Label 1050 5500 0    50   ~ 0
PA5
Wire Wire Line
	8100 4800 8100 4700
Connection ~ 8100 4700
Wire Wire Line
	8100 5100 8100 5150
Wire Wire Line
	8100 5150 8600 5150
Wire Wire Line
	8600 5550 8600 5500
Wire Wire Line
	8600 5200 8600 5150
Connection ~ 8600 5150
Wire Wire Line
	8850 5900 8600 5900
Connection ~ 8600 5900
Wire Wire Line
	8600 5900 8600 5850
Wire Wire Line
	1400 7400 1000 7400
Text Label 1050 7400 0    50   ~ 0
PN4
Wire Wire Line
	1400 7500 1000 7500
Text Label 1050 7500 0    50   ~ 0
PN5
Wire Wire Line
	3400 7000 3650 7000
Wire Wire Line
	3400 7100 3650 7100
Wire Wire Line
	3650 7200 3400 7200
Text Label 3500 7100 0    50   ~ 0
ATT_LE
Text Label 3500 7200 0    50   ~ 0
ATT_CLK
Text Label 3500 7000 0    50   ~ 0
ATT_SI
$Sheet
S 8000 1600 1000 1000
U 5D949534
F0 "PA_power_monitor" 50
F1 "PA_power_monitor.sch" 50
F2 "OUT_1" O L 8000 1950 50 
F3 "OUT_2" O L 8000 2050 50 
F4 "OUT_3" O L 8000 2150 50 
F5 "OUT_4" O L 8000 2250 50 
F6 "IN_P" I R 9000 1850 50 
F7 "IN_M_1" I R 9000 2050 50 
F8 "IN_M_2" I R 9000 2150 50 
F9 "IN_M_3" I R 9000 2250 50 
F10 "IN_M_4" I R 9000 2350 50 
$EndSheet
Wire Wire Line
	7150 1250 7600 1250
Wire Wire Line
	9300 2950 10500 2950
Wire Wire Line
	9000 1850 9300 1850
Wire Wire Line
	9300 1850 9300 1250
Connection ~ 9300 1250
Wire Wire Line
	9300 1250 10950 1250
Wire Wire Line
	8000 1950 7750 1950
Wire Wire Line
	8000 2050 7750 2050
Wire Wire Line
	8000 2150 7750 2150
Wire Wire Line
	8000 2250 7750 2250
Text Label 7750 1950 0    50   ~ 0
ADC0
Text Label 7750 2050 0    50   ~ 0
ADC1
Text Label 7750 2150 0    50   ~ 0
ADC2
Text Label 7750 2250 0    50   ~ 0
ADC3
$Comp
L POWDER_RF:Qorvo_QPQ1270 U101
U 1 1 5DBC60F8
P 1600 4050
F 0 "U101" H 1750 4300 50  0000 L CNN
F 1 "Qorvo_QPQ1270" H 1750 4400 50  0000 L CNN
F 2 "POWDER_RF:Qorvo_SMP" H 2150 3650 50  0001 C CNN
F 3 "" H 1600 4050 50  0001 C CNN
F 4 "Qorvo" H 1600 4050 50  0001 C CNN "Manufacturer"
F 5 "QPQ1270TR7 " H 1600 4050 50  0001 C CNN "PartNumber"
F 6 "3000-0000000078" H 1600 4050 50  0001 C CNN "PartSpecification"
	1    1600 4050
	-1   0    0    -1  
$EndComp
$Comp
L power:GND #PWR?
U 1 1 5DBC6102
P 1350 4500
F 0 "#PWR?" H 1350 4250 50  0001 C CNN
F 1 "GND" H 1355 4327 50  0000 C CNN
F 2 "" H 1350 4500 50  0001 C CNN
F 3 "" H 1350 4500 50  0001 C CNN
	1    1350 4500
	1    0    0    -1  
$EndComp
Wire Wire Line
	1350 4400 1350 4500
$Comp
L power:GND #PWR?
U 1 1 5DBC610D
P 1450 4500
F 0 "#PWR?" H 1450 4250 50  0001 C CNN
F 1 "GND" H 1455 4327 50  0000 C CNN
F 2 "" H 1450 4500 50  0001 C CNN
F 3 "" H 1450 4500 50  0001 C CNN
	1    1450 4500
	1    0    0    -1  
$EndComp
Wire Wire Line
	1450 4400 1450 4500
$Comp
L power:GND #PWR?
U 1 1 5DBC6118
P 1550 4500
F 0 "#PWR?" H 1550 4250 50  0001 C CNN
F 1 "GND" H 1555 4327 50  0000 C CNN
F 2 "" H 1550 4500 50  0001 C CNN
F 3 "" H 1550 4500 50  0001 C CNN
	1    1550 4500
	1    0    0    -1  
$EndComp
Wire Wire Line
	1550 4400 1550 4500
$Comp
L power:GND #PWR?
U 1 1 5DBC6123
P 1650 4500
F 0 "#PWR?" H 1650 4250 50  0001 C CNN
F 1 "GND" H 1655 4327 50  0000 C CNN
F 2 "" H 1650 4500 50  0001 C CNN
F 3 "" H 1650 4500 50  0001 C CNN
	1    1650 4500
	1    0    0    -1  
$EndComp
Wire Wire Line
	1650 4400 1650 4500
$Comp
L power:GND #PWR?
U 1 1 5DBC612E
P 1750 4500
F 0 "#PWR?" H 1750 4250 50  0001 C CNN
F 1 "GND" H 1755 4327 50  0000 C CNN
F 2 "" H 1750 4500 50  0001 C CNN
F 3 "" H 1750 4500 50  0001 C CNN
	1    1750 4500
	1    0    0    -1  
$EndComp
Wire Wire Line
	1750 4400 1750 4500
$Comp
L power:GND #PWR?
U 1 1 5DBC6139
P 1850 4500
F 0 "#PWR?" H 1850 4250 50  0001 C CNN
F 1 "GND" H 1855 4327 50  0000 C CNN
F 2 "" H 1850 4500 50  0001 C CNN
F 3 "" H 1850 4500 50  0001 C CNN
	1    1850 4500
	1    0    0    -1  
$EndComp
Wire Wire Line
	1850 4400 1850 4500
Wire Wire Line
	1600 3700 1600 3750
$Comp
L Device:R R101
U 1 1 5DC1FA01
P 2100 4300
F 0 "R101" V 2180 4300 50  0000 C CNN
F 1 "49.9" V 2100 4300 50  0000 C CNN
F 2 "Resistor_SMD:R_0201_0603Metric" V 2030 4300 50  0001 C CNN
F 3 "~" H 2100 4300 50  0001 C CNN
F 4 "3000-0000000152" H 2100 4300 50  0001 C CNN "PartSpecification"
	1    2100 4300
	1    0    0    -1  
$EndComp
Wire Wire Line
	2000 4050 2100 4050
Wire Wire Line
	2100 4050 2100 4150
$Comp
L power:GND #PWR?
U 1 1 5DC2D5D6
P 2100 4500
F 0 "#PWR?" H 2100 4250 50  0001 C CNN
F 1 "GND" H 2105 4327 50  0000 C CNN
F 2 "" H 2100 4500 50  0001 C CNN
F 3 "" H 2100 4500 50  0001 C CNN
	1    2100 4500
	1    0    0    -1  
$EndComp
Wire Wire Line
	2100 4500 2100 4450
Wire Wire Line
	950  4050 1200 4050
Connection ~ 950  4050
Wire Wire Line
	3300 3700 3700 3700
$Comp
L POWDER_RF:Qorvo_QPQ1270 U104
U 1 1 5DCE87F8
P 10250 4100
F 0 "U104" H 10400 4350 50  0000 L CNN
F 1 "Qorvo_QPQ1270" H 9600 4350 50  0000 L CNN
F 2 "POWDER_RF:Qorvo_SMP" H 10800 3700 50  0001 C CNN
F 3 "" H 10250 4100 50  0001 C CNN
F 4 "Qorvo" H 10250 4100 50  0001 C CNN "Manufacturer"
F 5 "QPQ1270TR7 " H 10250 4100 50  0001 C CNN "PartNumber"
F 6 "3000-0000000078" H 10250 4100 50  0001 C CNN "PartSpecification"
	1    10250 4100
	-1   0    0    -1  
$EndComp
$Comp
L power:GND #PWR?
U 1 1 5DCE8802
P 10500 4550
F 0 "#PWR?" H 10500 4300 50  0001 C CNN
F 1 "GND" H 10505 4377 50  0000 C CNN
F 2 "" H 10500 4550 50  0001 C CNN
F 3 "" H 10500 4550 50  0001 C CNN
	1    10500 4550
	-1   0    0    -1  
$EndComp
Wire Wire Line
	10500 4450 10500 4550
$Comp
L power:GND #PWR?
U 1 1 5DCE880D
P 10400 4550
F 0 "#PWR?" H 10400 4300 50  0001 C CNN
F 1 "GND" H 10405 4377 50  0000 C CNN
F 2 "" H 10400 4550 50  0001 C CNN
F 3 "" H 10400 4550 50  0001 C CNN
	1    10400 4550
	-1   0    0    -1  
$EndComp
Wire Wire Line
	10400 4450 10400 4550
$Comp
L power:GND #PWR?
U 1 1 5DCE8818
P 10300 4550
F 0 "#PWR?" H 10300 4300 50  0001 C CNN
F 1 "GND" H 10305 4377 50  0000 C CNN
F 2 "" H 10300 4550 50  0001 C CNN
F 3 "" H 10300 4550 50  0001 C CNN
	1    10300 4550
	-1   0    0    -1  
$EndComp
Wire Wire Line
	10300 4450 10300 4550
$Comp
L power:GND #PWR?
U 1 1 5DCE8823
P 10200 4550
F 0 "#PWR?" H 10200 4300 50  0001 C CNN
F 1 "GND" H 10205 4377 50  0000 C CNN
F 2 "" H 10200 4550 50  0001 C CNN
F 3 "" H 10200 4550 50  0001 C CNN
	1    10200 4550
	-1   0    0    -1  
$EndComp
Wire Wire Line
	10200 4450 10200 4550
$Comp
L power:GND #PWR?
U 1 1 5DCE882E
P 10100 4550
F 0 "#PWR?" H 10100 4300 50  0001 C CNN
F 1 "GND" H 10105 4377 50  0000 C CNN
F 2 "" H 10100 4550 50  0001 C CNN
F 3 "" H 10100 4550 50  0001 C CNN
	1    10100 4550
	-1   0    0    -1  
$EndComp
Wire Wire Line
	10100 4450 10100 4550
$Comp
L power:GND #PWR?
U 1 1 5DCE8839
P 10000 4550
F 0 "#PWR?" H 10000 4300 50  0001 C CNN
F 1 "GND" H 10005 4377 50  0000 C CNN
F 2 "" H 10000 4550 50  0001 C CNN
F 3 "" H 10000 4550 50  0001 C CNN
	1    10000 4550
	-1   0    0    -1  
$EndComp
Wire Wire Line
	10000 4450 10000 4550
$Comp
L Device:R R107
U 1 1 5DCE8844
P 9750 4350
F 0 "R107" V 9830 4350 50  0000 C CNN
F 1 "49.9" V 9750 4350 50  0000 C CNN
F 2 "Resistor_SMD:R_0201_0603Metric" V 9680 4350 50  0001 C CNN
F 3 "~" H 9750 4350 50  0001 C CNN
F 4 "3000-0000000152" H 9750 4350 50  0001 C CNN "PartSpecification"
	1    9750 4350
	-1   0    0    -1  
$EndComp
Wire Wire Line
	9850 4100 9750 4100
Wire Wire Line
	9750 4100 9750 4200
$Comp
L power:GND #PWR?
U 1 1 5DCE8850
P 9750 4550
F 0 "#PWR?" H 9750 4300 50  0001 C CNN
F 1 "GND" H 9755 4377 50  0000 C CNN
F 2 "" H 9750 4550 50  0001 C CNN
F 3 "" H 9750 4550 50  0001 C CNN
	1    9750 4550
	-1   0    0    -1  
$EndComp
Wire Wire Line
	9750 4550 9750 4500
Wire Wire Line
	10650 4100 10750 4100
Wire Wire Line
	9250 3700 10250 3700
Wire Wire Line
	10250 3800 10250 3700
Wire Wire Line
	1600 3700 2300 3700
$Sheet
S 4500 7300 700  200 
U 5E243016
F0 "SDR_GPIO" 50
F1 "SDR_GPIO.sch" 50
F2 "SDR_GPIO[0..11]" B L 4500 7400 50 
$EndSheet
Wire Bus Line
	3400 7400 4500 7400
Text Label 900  4050 0    50   ~ 0
LNA_out_f
Text Label 2050 4050 0    50   ~ 0
unused_term
Text Label 9750 4150 1    50   ~ 0
unused_term_2
$Comp
L 000_PreferredParts:C_100nF C?
U 1 1 5E7A8B44
P 4300 2700
AR Path="/5D949534/5E7A8B44" Ref="C?"  Part="1" 
AR Path="/5E7A8B44" Ref="C101"  Part="1" 
F 0 "C101" H 4325 2800 50  0000 L CNN
F 1 "C_100nF" H 4325 2600 50  0001 L CNN
F 2 "Capacitor_SMD:C_0402_1005Metric" H 4338 2550 50  0001 C CNN
F 3 "~" H 4300 2700 50  0001 C CNN
F 4 "100nF" H 4450 2600 50  0000 C CNN "DisplayValue"
F 5 "3000-0000000125" H 0   0   50  0001 C CNN "PartSpecification"
	1    4300 2700
	-1   0    0    1   
$EndComp
$Comp
L Device:R R?
U 1 1 5E7A8B4C
P 4550 2850
AR Path="/5D69D382/5E7A8B4C" Ref="R?"  Part="1" 
AR Path="/5E7A8B4C" Ref="R108"  Part="1" 
AR Path="/5D949534/5E7A8B4C" Ref="R?"  Part="1" 
F 0 "R108" H 4620 2896 50  0000 L CNN
F 1 "100" H 4620 2805 50  0000 L CNN
F 2 "Resistor_SMD:R_0402_1005Metric" V 4480 2850 50  0001 C CNN
F 3 "~" H 4550 2850 50  0001 C CNN
F 4 "" H 4550 2850 50  0001 C CNN "Manufacturer"
F 5 "" H 4550 2850 50  0001 C CNN "PartNumber"
F 6 "3000-0000000149" H 4550 2850 50  0001 C CNN "PartSpecification"
	1    4550 2850
	0    1    1    0   
$EndComp
Wire Wire Line
	5000 2000 5000 2600
Wire Wire Line
	5000 2950 5000 3000
$Comp
L Device:R R?
U 1 1 5E7F6F10
P 4550 2550
AR Path="/5D69D382/5E7F6F10" Ref="R?"  Part="1" 
AR Path="/5E7F6F10" Ref="R102"  Part="1" 
AR Path="/5D949534/5E7F6F10" Ref="R?"  Part="1" 
F 0 "R102" H 4620 2596 50  0000 L CNN
F 1 "100" H 4620 2505 50  0000 L CNN
F 2 "Resistor_SMD:R_0402_1005Metric" V 4480 2550 50  0001 C CNN
F 3 "~" H 4550 2550 50  0001 C CNN
F 4 "" H 4550 2550 50  0001 C CNN "Manufacturer"
F 5 "" H 4550 2550 50  0001 C CNN "PartNumber"
F 6 "3000-0000000149" H 4550 2550 50  0001 C CNN "PartSpecification"
	1    4550 2550
	0    1    1    0   
$EndComp
Wire Wire Line
	4300 2550 4100 2550
Wire Wire Line
	4100 2550 4100 2650
Wire Wire Line
	4100 2650 4000 2650
Wire Wire Line
	4300 2850 4050 2850
Wire Wire Line
	4050 2850 4050 2750
Wire Wire Line
	4050 2750 4000 2750
Wire Wire Line
	4400 2850 4300 2850
Connection ~ 4300 2850
Wire Wire Line
	4400 2550 4300 2550
Connection ~ 4300 2550
Text Label 3350 3350 0    50   ~ 0
VDD_LNA_REG
Wire Wire Line
	4700 2550 4900 2550
Wire Wire Line
	4900 2550 4900 3000
Wire Wire Line
	4900 3000 5000 3000
Connection ~ 5000 3000
Wire Wire Line
	5000 3000 5000 3300
Wire Wire Line
	4700 2850 4800 2850
Wire Wire Line
	4800 2850 4800 2600
Wire Wire Line
	4800 2600 5000 2600
Connection ~ 5000 2600
Wire Wire Line
	5000 2600 5000 2650
Text Label 4100 2550 0    50   ~ 0
LNA_M_F
Text Label 4050 2800 3    50   ~ 0
LNA_P_F
Text Label 9350 3700 0    50   ~ 0
pa_in_f
Text Label 1050 6600 0    50   ~ 0
ADC4
Wire Wire Line
	1000 6600 1400 6600
$Comp
L Device:R R109
U 1 1 5EA4B85F
P 5350 1500
F 0 "R109" V 5430 1500 50  0000 C CNN
F 1 "10k" V 5350 1500 50  0000 C CNN
F 2 "Resistor_SMD:R_0402_1005Metric" V 5280 1500 50  0001 C CNN
F 3 "~" H 5350 1500 50  0001 C CNN
F 4 "3000-0000000131" H 5350 1500 50  0001 C CNN "PartSpecification"
	1    5350 1500
	1    0    0    -1  
$EndComp
Wire Wire Line
	6050 2600 5750 2600
$Comp
L Device:R R110
U 1 1 5EAB9E10
P 5350 1900
F 0 "R110" V 5430 1900 50  0000 C CNN
F 1 "4.87k" V 5350 1900 50  0000 C CNN
F 2 "Resistor_SMD:R_0402_1005Metric" V 5280 1900 50  0001 C CNN
F 3 "~" H 5350 1900 50  0001 C CNN
F 4 "3000-0000000133" H 5350 1900 50  0001 C CNN "PartSpecification"
	1    5350 1900
	1    0    0    -1  
$EndComp
$Comp
L power:GND #PWR?
U 1 1 5EABA402
P 5350 2150
F 0 "#PWR?" H 5350 1900 50  0001 C CNN
F 1 "GND" H 5355 1977 50  0000 C CNN
F 2 "" H 5350 2150 50  0001 C CNN
F 3 "" H 5350 2150 50  0001 C CNN
	1    5350 2150
	1    0    0    -1  
$EndComp
Text Label 4750 3300 0    50   ~ 0
VDD_LNA
Wire Wire Line
	5350 2050 5350 2150
Wire Wire Line
	5350 1750 5350 1700
Wire Wire Line
	5350 1150 5150 1150
Wire Wire Line
	5350 1150 5350 1350
Text Label 5250 1150 0    50   ~ 0
VNA_LNA
Wire Wire Line
	5350 1700 5550 1700
Connection ~ 5350 1700
Wire Wire Line
	5350 1700 5350 1650
Text Label 5450 1700 0    50   ~ 0
ADC9
$Comp
L Device:R R132
U 1 1 5EB52F8C
P 7600 2200
F 0 "R132" V 7680 2200 50  0000 C CNN
F 1 "10k" V 7600 2200 50  0000 C CNN
F 2 "Resistor_SMD:R_0402_1005Metric" V 7530 2200 50  0001 C CNN
F 3 "~" H 7600 2200 50  0001 C CNN
F 4 "3000-0000000131" H 7600 2200 50  0001 C CNN "PartSpecification"
	1    7600 2200
	1    0    0    -1  
$EndComp
$Comp
L Device:R R137
U 1 1 5EB52F96
P 7600 2600
F 0 "R137" V 7680 2600 50  0000 C CNN
F 1 "4.87k" V 7600 2600 50  0000 C CNN
F 2 "Resistor_SMD:R_0402_1005Metric" V 7530 2600 50  0001 C CNN
F 3 "~" H 7600 2600 50  0001 C CNN
F 4 "3000-0000000133" H 7600 2600 50  0001 C CNN "PartSpecification"
	1    7600 2600
	1    0    0    -1  
$EndComp
$Comp
L power:GND #PWR?
U 1 1 5EB52FA0
P 7600 2850
F 0 "#PWR?" H 7600 2600 50  0001 C CNN
F 1 "GND" H 7605 2677 50  0000 C CNN
F 2 "" H 7600 2850 50  0001 C CNN
F 3 "" H 7600 2850 50  0001 C CNN
	1    7600 2850
	1    0    0    -1  
$EndComp
Wire Wire Line
	7600 2750 7600 2850
Wire Wire Line
	7600 2450 7600 2400
Connection ~ 7600 2400
Wire Wire Line
	7600 2400 7600 2350
Connection ~ 7600 1250
Wire Wire Line
	7600 1250 9300 1250
Wire Wire Line
	7600 1250 7600 2050
Text Label 7850 2400 2    50   ~ 0
ADC4
Wire Wire Line
	7600 2400 7850 2400
Wire Wire Line
	9200 2350 9200 2050
Wire Wire Line
	9200 2050 10500 2050
Wire Wire Line
	9000 2350 9200 2350
Wire Wire Line
	9000 2250 9300 2250
Wire Wire Line
	9300 2250 9300 2950
Wire Wire Line
	9000 2050 9100 2050
Wire Wire Line
	9100 2050 9100 2650
Wire Wire Line
	9100 2650 10500 2650
Wire Wire Line
	9000 2150 9400 2150
Wire Wire Line
	9400 2150 9400 2350
Wire Wire Line
	9400 2350 10500 2350
Wire Wire Line
	6850 4200 6750 4200
Wire Wire Line
	6750 4200 6750 4500
Wire Wire Line
	6750 4500 7250 4500
Wire Wire Line
	7250 4500 7250 5950
Connection ~ 7250 5950
Wire Wire Line
	7250 5950 6950 5950
$Comp
L 000_PreferredParts:C_0_1uF C102
U 1 1 5ECD9D0F
P 3100 2100
F 0 "C102" H 3125 2200 50  0000 L CNN
F 1 "C_0_1uF" H 3125 2000 50  0001 L CNN
F 2 "Capacitor_SMD:C_0402_1005Metric" H 3138 1950 50  0001 C CNN
F 3 "~" H 3100 2100 50  0001 C CNN
F 4 "0.1uF" H 3250 2000 50  0000 C CNN "DisplayValue"
F 5 "3000-0000000125" H 0   0   50  0001 C CNN "PartSpecification"
	1    3100 2100
	1    0    0    -1  
$EndComp
$Comp
L power:GND #PWR?
U 1 1 5ECDA3DA
P 3100 2350
F 0 "#PWR?" H 3100 2100 50  0001 C CNN
F 1 "GND" H 3105 2177 50  0000 C CNN
F 2 "" H 3100 2350 50  0001 C CNN
F 3 "" H 3100 2350 50  0001 C CNN
	1    3100 2350
	1    0    0    -1  
$EndComp
Wire Wire Line
	3100 2350 3100 2250
Wire Wire Line
	3550 2300 3400 2300
Wire Wire Line
	3400 2300 3400 1900
Wire Wire Line
	3400 1900 3100 1900
Wire Wire Line
	3100 1900 3100 1950
Connection ~ 3550 2300
Wire Wire Line
	3550 2300 3550 2350
Text Notes 9000 5450 0    50   ~ 0
Attenuators have 0 DC because antenna ports are\nDC shorted to ground, LNA matching circuit has a\ncapacitor in line with it and PA datasheet states there\nis a DC blocking cap internal to the module.
$EndSCHEMATC
