EESchema Schematic File Version 4
LIBS:endpoint_shield-cache
EELAYER 29 0
EELAYER END
$Descr A4 11693 8268
encoding utf-8
Sheet 1 3
Title ""
Date ""
Rev ""
Comp ""
Comment1 ""
Comment2 ""
Comment3 ""
Comment4 ""
$EndDescr
$Comp
L Connector_Generic:Conn_01x03 J103
U 1 1 5C703EB6
P 7550 2950
F 0 "J103" H 7629 2992 50  0000 L CNN
F 1 "Humidity_Sensor" H 7629 2901 50  0000 L CNN
F 2 "Connector_PinHeader_2.54mm:PinHeader_1x03_P2.54mm_Vertical" H 7550 2950 50  0001 C CNN
F 3 "~" H 7550 2950 50  0001 C CNN
	1    7550 2950
	1    0    0    -1  
$EndComp
$Comp
L Connector_Generic:Conn_01x04 J104
U 1 1 5C703FDC
P 7550 4200
F 0 "J104" H 7629 4192 50  0000 L CNN
F 1 "MCP9808" H 7629 4101 50  0000 L CNN
F 2 "Connector_PinHeader_2.54mm:PinHeader_1x04_P2.54mm_Vertical" H 7550 4200 50  0001 C CNN
F 3 "~" H 7550 4200 50  0001 C CNN
	1    7550 4200
	1    0    0    -1  
$EndComp
$Comp
L Connector_Generic:Conn_01x03 J105
U 1 1 5C704120
P 7550 5550
F 0 "J105" H 7630 5592 50  0000 L CNN
F 1 "Moisture_Sensor" H 7630 5501 50  0000 L CNN
F 2 "Connector_PinHeader_2.54mm:PinHeader_1x03_P2.54mm_Vertical" H 7550 5550 50  0001 C CNN
F 3 "~" H 7550 5550 50  0001 C CNN
	1    7550 5550
	1    0    0    -1  
$EndComp
$Comp
L Connector_Generic:Conn_02x07_Odd_Even J107
U 1 1 5C7043B3
P 9500 3550
F 0 "J107" H 9550 4067 50  0000 C CNN
F 1 "Conn_02x07_Odd_Even" H 9550 3976 50  0000 C CNN
F 2 "Connector_PinHeader_2.54mm:PinHeader_2x07_P2.54mm_Vertical" H 9500 3550 50  0001 C CNN
F 3 "~" H 9500 3550 50  0001 C CNN
	1    9500 3550
	1    0    0    -1  
$EndComp
NoConn ~ 9300 3850
NoConn ~ 9800 3850
Text Label 9950 3250 0    50   ~ 0
Exp1_Disable
Text Label 9950 3350 0    50   ~ 0
IRIS_Disable
Text Label 9950 3450 0    50   ~ 0
Exp1_PWRGD
Text Label 9950 3550 0    50   ~ 0
IRIS_PWRGD
Text Label 9950 3650 0    50   ~ 0
Exp1_Current
Text Label 9150 3350 2    50   ~ 0
Exp2_Disable
Text Label 9150 3450 2    50   ~ 0
Control_PWRGD
Text Label 9150 3550 2    50   ~ 0
Exp2_PWRGD
Text Label 9150 3650 2    50   ~ 0
Control_Current
Text Label 9150 3750 2    50   ~ 0
Exp2_Current
$Comp
L power:GND #PWR?
U 1 1 5C705B69
P 8450 3950
F 0 "#PWR?" H 8450 3700 50  0001 C CNN
F 1 "GND" H 8455 3777 50  0000 C CNN
F 2 "" H 8450 3950 50  0001 C CNN
F 3 "" H 8450 3950 50  0001 C CNN
	1    8450 3950
	1    0    0    -1  
$EndComp
Wire Wire Line
	9150 3450 9300 3450
Wire Wire Line
	9300 3550 9150 3550
Wire Wire Line
	9150 3650 9300 3650
Wire Wire Line
	9300 3750 9150 3750
Wire Wire Line
	9800 3650 9950 3650
Wire Wire Line
	9950 3550 9800 3550
Wire Wire Line
	9800 3450 9950 3450
Wire Wire Line
	2700 2300 2850 2300
Wire Wire Line
	2700 2200 2850 2200
Text Label 2850 2300 0    50   ~ 0
Control_Current
Text Label 2850 2200 0    50   ~ 0
Exp1_Current
$Comp
L power:+3.3V #PWR?
U 1 1 5C70DCD8
P 2200 1000
F 0 "#PWR?" H 2200 850 50  0001 C CNN
F 1 "+3.3V" H 2215 1173 50  0000 C CNN
F 2 "" H 2200 1000 50  0001 C CNN
F 3 "" H 2200 1000 50  0001 C CNN
	1    2200 1000
	1    0    0    -1  
$EndComp
$Comp
L power:+5V #PWR?
U 1 1 5C70DDAF
P 2500 1000
F 0 "#PWR?" H 2500 850 50  0001 C CNN
F 1 "+5V" H 2515 1173 50  0000 C CNN
F 2 "" H 2500 1000 50  0001 C CNN
F 3 "" H 2500 1000 50  0001 C CNN
	1    2500 1000
	1    0    0    -1  
$EndComp
Wire Wire Line
	2400 1200 2400 1100
Wire Wire Line
	2400 1100 2500 1100
Wire Wire Line
	2500 1100 2500 1000
Wire Wire Line
	2300 1200 2300 1100
Wire Wire Line
	2200 1100 2200 1000
$Comp
L power:+5V #PWR?
U 1 1 5C7109F7
P 7250 5250
F 0 "#PWR?" H 7250 5100 50  0001 C CNN
F 1 "+5V" H 7265 5423 50  0000 C CNN
F 2 "" H 7250 5250 50  0001 C CNN
F 3 "" H 7250 5250 50  0001 C CNN
	1    7250 5250
	1    0    0    -1  
$EndComp
$Comp
L power:GND #PWR?
U 1 1 5C710A49
P 7250 5850
F 0 "#PWR?" H 7250 5600 50  0001 C CNN
F 1 "GND" H 7255 5677 50  0000 C CNN
F 2 "" H 7250 5850 50  0001 C CNN
F 3 "" H 7250 5850 50  0001 C CNN
	1    7250 5850
	1    0    0    -1  
$EndComp
Wire Wire Line
	7250 5850 7250 5650
Wire Wire Line
	7250 5650 7350 5650
Wire Wire Line
	7350 5550 7250 5550
Wire Wire Line
	7350 5450 7150 5450
Text Label 7150 5450 2    50   ~ 0
Moisture
Wire Wire Line
	2700 2500 2850 2500
Text Label 2850 2500 0    50   ~ 0
Moisture
Wire Wire Line
	7350 4200 7250 4200
Wire Wire Line
	7350 4100 7250 4100
Wire Wire Line
	7250 4100 7250 3900
$Comp
L power:GND #PWR?
U 1 1 5C71731B
P 7250 4600
F 0 "#PWR?" H 7250 4350 50  0001 C CNN
F 1 "GND" H 7255 4427 50  0000 C CNN
F 2 "" H 7250 4600 50  0001 C CNN
F 3 "" H 7250 4600 50  0001 C CNN
	1    7250 4600
	1    0    0    -1  
$EndComp
Wire Wire Line
	7350 4400 7150 4400
Wire Wire Line
	7350 4300 7150 4300
Text Label 7150 4400 2    50   ~ 0
SDA_2
Text Label 7150 4300 2    50   ~ 0
SCL_2
Wire Wire Line
	7350 2850 7250 2850
Wire Wire Line
	7250 2850 7250 2650
Wire Wire Line
	7350 3050 7250 3050
Wire Wire Line
	7250 3050 7250 3250
$Comp
L power:GND #PWR?
U 1 1 5C7205B9
P 7250 3250
F 0 "#PWR?" H 7250 3000 50  0001 C CNN
F 1 "GND" H 7255 3077 50  0000 C CNN
F 2 "" H 7250 3250 50  0001 C CNN
F 3 "" H 7250 3250 50  0001 C CNN
	1    7250 3250
	1    0    0    -1  
$EndComp
Wire Wire Line
	7350 2950 7150 2950
Text Label 7150 2950 2    50   ~ 0
Humidity
Text Label 1550 2600 2    50   ~ 0
Humidity
Wire Wire Line
	1700 1900 1550 1900
Wire Wire Line
	1550 2000 1700 2000
Wire Wire Line
	1700 2100 1550 2100
Wire Wire Line
	1700 2200 1550 2200
Wire Wire Line
	1700 2300 1550 2300
Wire Wire Line
	1700 2400 1550 2400
Wire Wire Line
	1550 2500 1700 2500
Text Label 1550 2000 2    50   ~ 0
Control_PWRGD
Text Label 1550 2100 2    50   ~ 0
Exp1_PWRGD
Text Label 1550 1800 2    50   ~ 0
Exp2_PWRGD
Text Label 1550 1900 2    50   ~ 0
IRIS_PWRGD
$Comp
L power:+3.3V #PWR?
U 1 1 5C844FE5
P 8950 4700
F 0 "#PWR?" H 8950 4550 50  0001 C CNN
F 1 "+3.3V" H 8965 4873 50  0000 C CNN
F 2 "" H 8950 4700 50  0001 C CNN
F 3 "" H 8950 4700 50  0001 C CNN
	1    8950 4700
	1    0    0    -1  
$EndComp
Text Label 8850 5000 2    50   ~ 0
SDA_2
Text Label 8850 5100 2    50   ~ 0
SCL_2
$Comp
L power:+5V #PWR?
U 1 1 5C8539AB
P 10050 4700
F 0 "#PWR?" H 10050 4550 50  0001 C CNN
F 1 "+5V" H 10065 4873 50  0000 C CNN
F 2 "" H 10050 4700 50  0001 C CNN
F 3 "" H 10050 4700 50  0001 C CNN
	1    10050 4700
	1    0    0    -1  
$EndComp
Wire Wire Line
	8850 5100 9250 5100
Wire Wire Line
	8850 5200 9250 5200
$Comp
L power:GND #PWR?
U 1 1 5C89805E
P 8950 5500
F 0 "#PWR?" H 8950 5250 50  0001 C CNN
F 1 "GND" H 8955 5327 50  0000 C CNN
F 2 "" H 8950 5500 50  0001 C CNN
F 3 "" H 8950 5500 50  0001 C CNN
	1    8950 5500
	1    0    0    -1  
$EndComp
Wire Wire Line
	9250 5300 8950 5300
Wire Wire Line
	8950 5300 8950 5500
Wire Wire Line
	9750 5300 10050 5300
Wire Wire Line
	10050 5300 10050 5500
$Comp
L power:GND #PWR?
U 1 1 5C8A4CBC
P 10050 5500
F 0 "#PWR?" H 10050 5250 50  0001 C CNN
F 1 "GND" H 10055 5327 50  0000 C CNN
F 2 "" H 10050 5500 50  0001 C CNN
F 3 "" H 10050 5500 50  0001 C CNN
	1    10050 5500
	1    0    0    -1  
$EndComp
Wire Wire Line
	9750 5000 10150 5000
Wire Wire Line
	2700 1600 2850 1600
Wire Wire Line
	2100 1200 2100 1100
Wire Wire Line
	1550 1100 2100 1100
Text Label 1550 1100 2    50   ~ 0
VIN
Text Label 2850 1600 0    50   ~ 0
Arduino_RESET
Text Label 8850 5200 2    50   ~ 0
VIN
Text Label 10150 5200 0    50   ~ 0
Arduino_RESET
Wire Wire Line
	10050 4700 10050 4900
Wire Wire Line
	9750 4900 10050 4900
Wire Wire Line
	9250 4900 8950 4900
Wire Wire Line
	8950 4700 8950 4900
Wire Wire Line
	9800 3750 9950 3750
Text Label 9950 3750 0    50   ~ 0
IRIS_Current
Wire Wire Line
	4750 2200 4950 2200
Wire Wire Line
	4750 2400 4950 2400
Text Label 4950 2200 0    50   ~ 0
IRIS_Current
Text Label 4950 2400 0    50   ~ 0
Exp2_Current
$Comp
L Connector_Generic:Conn_01x02 J101
U 1 1 5C7481F4
P 5250 3950
F 0 "J101" H 5330 3942 50  0000 L CNN
F 1 "Conn_01x02" H 5330 3851 50  0000 L CNN
F 2 "TerminalBlock:TerminalBlock_bornier-2_P5.08mm" H 5250 3950 50  0001 C CNN
F 3 "~" H 5250 3950 50  0001 C CNN
	1    5250 3950
	1    0    0    -1  
$EndComp
$Comp
L Device:R_Small R103
U 1 1 5C749944
P 4650 3950
F 0 "R103" V 4454 3950 50  0000 C CNN
F 1 "10k" V 4545 3950 50  0000 C CNN
F 2 "Resistor_SMD:R_0603_1608Metric_Pad1.05x0.95mm_HandSolder" H 4650 3950 50  0001 C CNN
F 3 "~" H 4650 3950 50  0001 C CNN
	1    4650 3950
	0    1    1    0   
$EndComp
Wire Wire Line
	4950 4050 4950 4250
$Comp
L power:GND #PWR?
U 1 1 5C7556C3
P 4950 4250
F 0 "#PWR?" H 4950 4000 50  0001 C CNN
F 1 "GND" H 4955 4077 50  0000 C CNN
F 2 "" H 4950 4250 50  0001 C CNN
F 3 "" H 4950 4250 50  0001 C CNN
	1    4950 4250
	1    0    0    -1  
$EndComp
$Comp
L power:+5V #PWR?
U 1 1 5C75B9CF
P 4450 3750
F 0 "#PWR?" H 4450 3600 50  0001 C CNN
F 1 "+5V" H 4465 3923 50  0000 C CNN
F 2 "" H 4450 3750 50  0001 C CNN
F 3 "" H 4450 3750 50  0001 C CNN
	1    4450 3750
	1    0    0    -1  
$EndComp
Wire Wire Line
	4550 3950 4450 3950
Wire Wire Line
	4450 3950 4450 3750
$Comp
L power:+5V #PWR?
U 1 1 5C762785
P 7250 3900
F 0 "#PWR?" H 7250 3750 50  0001 C CNN
F 1 "+5V" H 7265 4073 50  0000 C CNN
F 2 "" H 7250 3900 50  0001 C CNN
F 3 "" H 7250 3900 50  0001 C CNN
	1    7250 3900
	1    0    0    -1  
$EndComp
Wire Wire Line
	4750 3950 4850 3950
Wire Wire Line
	4850 3950 4850 4150
Wire Wire Line
	4850 4150 4450 4150
Connection ~ 4850 3950
Text Label 4450 4150 2    50   ~ 0
Cooler_Fault
Wire Wire Line
	4950 4050 5050 4050
Wire Wire Line
	4850 3950 5050 3950
Text Notes 4900 3700 0    50   ~ 0
Terminal block for TEC48VCNTLRN\ndry contact alarm.\nConnect to COM and NC.
Wire Wire Line
	7250 5250 7250 5550
Wire Wire Line
	7250 4200 7250 4600
$Comp
L power:+5V #PWR?
U 1 1 5C787F18
P 7250 2650
F 0 "#PWR?" H 7250 2500 50  0001 C CNN
F 1 "+5V" H 7265 2823 50  0000 C CNN
F 2 "" H 7250 2650 50  0001 C CNN
F 3 "" H 7250 2650 50  0001 C CNN
	1    7250 2650
	1    0    0    -1  
$EndComp
Wire Wire Line
	1700 1800 1550 1800
$Sheet
S 10000 700  950  500 
U 5C778BCF
F0 "NUC_Reset" 50
F1 "NUC_Reset.sch" 50
F2 "NUC_Reset" I L 10000 950 50 
$EndSheet
$Comp
L Connector_Generic:Conn_01x03 J102
U 1 1 5C8A1B8D
P 7550 1700
F 0 "J102" H 7629 1742 50  0000 L CNN
F 1 "DS18B20" H 7629 1651 50  0000 L CNN
F 2 "Connector_PinHeader_2.54mm:PinHeader_1x03_P2.54mm_Vertical" H 7550 1700 50  0001 C CNN
F 3 "~" H 7550 1700 50  0001 C CNN
	1    7550 1700
	1    0    0    -1  
$EndComp
$Comp
L Device:R_Small R107
U 1 1 5C946F2A
P 10600 3550
F 0 "R107" H 10659 3596 50  0000 L CNN
F 1 "10k" H 10659 3505 50  0000 L CNN
F 2 "Resistor_SMD:R_0603_1608Metric_Pad1.05x0.95mm_HandSolder" H 10600 3550 50  0001 C CNN
F 3 "~" H 10600 3550 50  0001 C CNN
	1    10600 3550
	1    0    0    -1  
$EndComp
Wire Wire Line
	10600 3350 10600 3450
Wire Wire Line
	9800 3350 10600 3350
$Comp
L Device:R_Small R108
U 1 1 5C95C09F
P 10900 3550
F 0 "R108" H 10959 3596 50  0000 L CNN
F 1 "10k" H 10959 3505 50  0000 L CNN
F 2 "Resistor_SMD:R_0603_1608Metric_Pad1.05x0.95mm_HandSolder" H 10900 3550 50  0001 C CNN
F 3 "~" H 10900 3550 50  0001 C CNN
	1    10900 3550
	1    0    0    -1  
$EndComp
Wire Wire Line
	10900 3250 10900 3450
Wire Wire Line
	9800 3250 10900 3250
Wire Wire Line
	8450 3250 9300 3250
$Comp
L Device:R_Small R106
U 1 1 5C9956EB
P 8150 3550
F 0 "R106" H 8209 3596 50  0000 L CNN
F 1 "10k" H 8209 3505 50  0000 L CNN
F 2 "Resistor_SMD:R_0603_1608Metric_Pad1.05x0.95mm_HandSolder" H 8150 3550 50  0001 C CNN
F 3 "~" H 8150 3550 50  0001 C CNN
	1    8150 3550
	1    0    0    -1  
$EndComp
Wire Wire Line
	8150 3350 8150 3450
Wire Wire Line
	8150 3350 9300 3350
Wire Wire Line
	8450 3250 8450 3750
Wire Wire Line
	8150 3650 8150 3750
Wire Wire Line
	8150 3750 8450 3750
Wire Wire Line
	8450 3750 8450 3950
Connection ~ 8450 3750
$Comp
L power:GND #PWR?
U 1 1 5C9B5490
P 10900 3950
F 0 "#PWR?" H 10900 3700 50  0001 C CNN
F 1 "GND" H 10905 3777 50  0000 C CNN
F 2 "" H 10900 3950 50  0001 C CNN
F 3 "" H 10900 3950 50  0001 C CNN
	1    10900 3950
	1    0    0    -1  
$EndComp
Wire Wire Line
	10600 3650 10600 3750
Wire Wire Line
	10600 3750 10900 3750
Wire Wire Line
	10900 3750 10900 3950
Wire Wire Line
	10900 3650 10900 3750
Connection ~ 10900 3750
Wire Wire Line
	10000 950  9800 950 
Text Label 9800 950  2    50   ~ 0
NUC_Reset
$Comp
L power:+5V #PWR?
U 1 1 5CA74CA7
P 7250 1400
F 0 "#PWR?" H 7250 1250 50  0001 C CNN
F 1 "+5V" H 7265 1573 50  0000 C CNN
F 2 "" H 7250 1400 50  0001 C CNN
F 3 "" H 7250 1400 50  0001 C CNN
	1    7250 1400
	1    0    0    -1  
$EndComp
$Comp
L power:GND #PWR?
U 1 1 5CA74D1A
P 7250 2000
F 0 "#PWR?" H 7250 1750 50  0001 C CNN
F 1 "GND" H 7255 1827 50  0000 C CNN
F 2 "" H 7250 2000 50  0001 C CNN
F 3 "" H 7250 2000 50  0001 C CNN
	1    7250 2000
	1    0    0    -1  
$EndComp
Wire Wire Line
	7250 2000 7250 1800
Wire Wire Line
	7250 1800 7350 1800
Wire Wire Line
	7350 1600 7250 1600
Wire Wire Line
	7250 1600 7250 1400
Wire Wire Line
	7350 1700 7150 1700
Text Label 7150 1700 2    50   ~ 0
Temp
Text Label 1550 2200 2    50   ~ 0
TCA_RESET_1
Text Label 1550 2500 2    50   ~ 0
Temp
Wire Wire Line
	9250 5000 8850 5000
Wire Wire Line
	2300 1100 2200 1100
NoConn ~ 1700 1600
NoConn ~ 1700 1700
NoConn ~ 2700 1800
$Comp
L Device:R_Small R104
U 1 1 5C85BA46
P 6100 1400
F 0 "R104" H 6159 1446 50  0000 L CNN
F 1 "4.7k" H 6159 1355 50  0000 L CNN
F 2 "Resistor_SMD:R_0603_1608Metric_Pad1.05x0.95mm_HandSolder" H 6100 1400 50  0001 C CNN
F 3 "~" H 6100 1400 50  0001 C CNN
	1    6100 1400
	1    0    0    -1  
$EndComp
$Comp
L Device:R_Small R105
U 1 1 5C85BAFE
P 6450 1400
F 0 "R105" H 6509 1446 50  0000 L CNN
F 1 "4.7k" H 6509 1355 50  0000 L CNN
F 2 "Resistor_SMD:R_0603_1608Metric_Pad1.05x0.95mm_HandSolder" H 6450 1400 50  0001 C CNN
F 3 "~" H 6450 1400 50  0001 C CNN
	1    6450 1400
	1    0    0    -1  
$EndComp
$Comp
L power:+5V #PWR?
U 1 1 5C85BFF8
P 6100 1100
F 0 "#PWR?" H 6100 950 50  0001 C CNN
F 1 "+5V" H 6115 1273 50  0000 C CNN
F 2 "" H 6100 1100 50  0001 C CNN
F 3 "" H 6100 1100 50  0001 C CNN
	1    6100 1100
	1    0    0    -1  
$EndComp
Wire Wire Line
	6100 1100 6100 1200
Wire Wire Line
	6100 1200 6450 1200
Wire Wire Line
	6450 1200 6450 1300
Wire Wire Line
	6100 1200 6100 1300
Connection ~ 6100 1200
Wire Wire Line
	6100 1500 6100 1600
Wire Wire Line
	6100 1600 5900 1600
Wire Wire Line
	6450 1500 6450 1700
Wire Wire Line
	6450 1700 5900 1700
Text Label 5900 1600 2    50   ~ 0
SDA_2
Text Label 5900 1700 2    50   ~ 0
SCL_2
Text Notes 5700 800  0    50   ~ 0
Optional pullup resistors in case\narduino I2C pullups aren't enough
$Sheet
S 10000 1500 950  500 
U 5C88CE2B
F0 "Front_End_Control" 50
F1 "Front_End_Control.sch" 50
F2 "SDA" I L 10000 1600 50 
F3 "SCL" I L 10000 1700 50 
F4 "TCA_RESET" I L 10000 1900 50 
$EndSheet
Wire Wire Line
	10000 1600 9800 1600
Wire Wire Line
	10000 1700 9800 1700
Text Label 9800 1600 2    50   ~ 0
SDA
Text Label 9800 1700 2    50   ~ 0
SCL
Wire Wire Line
	10000 1900 9800 1900
Text Label 9800 1900 2    50   ~ 0
TCA_RESET_1
$Comp
L POWDER_Digital:TCA9539-Q1 U101
U 1 1 5CEA5A4E
P 3250 6000
F 0 "U101" H 2800 6950 50  0000 C CNN
F 1 "TCA9539-Q1" H 3550 6950 50  0000 C CNN
F 2 "Package_SO:TSSOP-24_4.4x7.8mm_P0.65mm" H 4300 5000 50  0001 C CNN
F 3 "http://www.ti.com/lit/ds/symlink/tca9535.pdf" H 2750 6900 50  0001 C CNN
	1    3250 6000
	1    0    0    -1  
$EndComp
Wire Wire Line
	4150 5400 3950 5400
Wire Wire Line
	3950 5300 4150 5300
Wire Wire Line
	3950 5200 4150 5200
$Comp
L power:GND #PWR?
U 1 1 5CEA5A62
P 3250 7200
F 0 "#PWR?" H 3250 6950 50  0001 C CNN
F 1 "GND" H 3255 7027 50  0000 C CNN
F 2 "" H 3250 7200 50  0001 C CNN
F 3 "" H 3250 7200 50  0001 C CNN
	1    3250 7200
	1    0    0    -1  
$EndComp
Wire Wire Line
	3250 7100 3250 7200
$Comp
L power:GND #PWR?
U 1 1 5CEA5A69
P 2450 7200
F 0 "#PWR?" H 2450 6950 50  0001 C CNN
F 1 "GND" H 2455 7027 50  0000 C CNN
F 2 "" H 2450 7200 50  0001 C CNN
F 3 "" H 2450 7200 50  0001 C CNN
	1    2450 7200
	1    0    0    -1  
$EndComp
Wire Wire Line
	2450 6700 2550 6700
$Comp
L Device:C_Small C102
U 1 1 5CEA5A79
P 1950 6250
F 0 "C102" H 2042 6296 50  0000 L CNN
F 1 "10nF" H 2042 6205 50  0000 L CNN
F 2 "Capacitor_SMD:C_0603_1608Metric_Pad1.05x0.95mm_HandSolder" H 1950 6250 50  0001 C CNN
F 3 "~" H 1950 6250 50  0001 C CNN
	1    1950 6250
	1    0    0    -1  
$EndComp
$Comp
L Device:C_Small C101
U 1 1 5CEA5A7F
P 1550 6250
F 0 "C101" H 1642 6296 50  0000 L CNN
F 1 "1uF" H 1642 6205 50  0000 L CNN
F 2 "Capacitor_SMD:C_0603_1608Metric_Pad1.05x0.95mm_HandSolder" H 1550 6250 50  0001 C CNN
F 3 "~" H 1550 6250 50  0001 C CNN
	1    1550 6250
	1    0    0    -1  
$EndComp
Wire Wire Line
	3250 4800 3250 4900
Wire Wire Line
	1950 6150 1950 6050
Wire Wire Line
	1950 6050 1550 6050
Wire Wire Line
	1550 6050 1550 6150
Wire Wire Line
	1550 6350 1550 6450
Wire Wire Line
	1550 6450 1950 6450
Wire Wire Line
	1950 6450 1950 6350
Wire Wire Line
	1550 6450 1550 6550
Connection ~ 1550 6450
$Comp
L power:GND #PWR?
U 1 1 5CEA5A94
P 1550 6550
F 0 "#PWR?" H 1550 6300 50  0001 C CNN
F 1 "GND" H 1555 6377 50  0000 C CNN
F 2 "" H 1550 6550 50  0001 C CNN
F 3 "" H 1550 6550 50  0001 C CNN
	1    1550 6550
	1    0    0    -1  
$EndComp
Wire Wire Line
	1550 6050 1550 5950
Connection ~ 1550 6050
$Comp
L Device:R_Small R102
U 1 1 5CEA5AAB
P 2150 4950
F 0 "R102" H 2209 4996 50  0000 L CNN
F 1 "10k" H 2209 4905 50  0000 L CNN
F 2 "Resistor_SMD:R_0603_1608Metric_Pad1.05x0.95mm_HandSolder" H 2150 4950 50  0001 C CNN
F 3 "~" H 2150 4950 50  0001 C CNN
	1    2150 4950
	1    0    0    -1  
$EndComp
Wire Wire Line
	1750 5500 2150 5500
Wire Wire Line
	2150 5050 2150 5500
Connection ~ 2150 5500
Wire Wire Line
	2150 5500 2550 5500
$Comp
L power:+5V #PWR?
U 1 1 5CEA5AB7
P 2150 4750
F 0 "#PWR?" H 2150 4600 50  0001 C CNN
F 1 "+5V" H 2165 4923 50  0000 C CNN
F 2 "" H 2150 4750 50  0001 C CNN
F 3 "" H 2150 4750 50  0001 C CNN
	1    2150 4750
	1    0    0    -1  
$EndComp
Wire Wire Line
	2150 4750 2150 4850
Wire Wire Line
	1750 5200 2550 5200
Wire Wire Line
	1750 5300 2550 5300
$Comp
L POWDER_Digital:SN74LVC1G3157 U102
U 1 1 5CECB4ED
P 4400 2300
F 0 "U102" H 4200 2600 50  0000 C CNN
F 1 "SN74LVC1G3157" H 4750 2000 50  0000 C CNN
F 2 "Package_TO_SOT_SMD:SOT-23-6_Handsoldering" H 4400 2300 50  0001 C CNN
F 3 "" H 4400 2300 50  0001 C CNN
	1    4400 2300
	1    0    0    -1  
$EndComp
Wire Wire Line
	2700 2400 4050 2400
$Comp
L power:GND #PWR?
U 1 1 5CEF0F6E
P 4400 2750
F 0 "#PWR?" H 4400 2500 50  0001 C CNN
F 1 "GND" H 4405 2577 50  0000 C CNN
F 2 "" H 4400 2750 50  0001 C CNN
F 3 "" H 4400 2750 50  0001 C CNN
	1    4400 2750
	1    0    0    -1  
$EndComp
Wire Wire Line
	4400 2650 4400 2750
$Comp
L power:+5V #PWR?
U 1 1 5CEFA796
P 4400 1900
F 0 "#PWR?" H 4400 1750 50  0001 C CNN
F 1 "+5V" H 4415 2073 50  0000 C CNN
F 2 "" H 4400 1900 50  0001 C CNN
F 3 "" H 4400 1900 50  0001 C CNN
	1    4400 1900
	1    0    0    -1  
$EndComp
Wire Wire Line
	4400 1900 4400 1950
Wire Wire Line
	4050 2200 3900 2200
Wire Wire Line
	3900 2200 3900 1800
Text Label 3900 1800 1    50   ~ 0
Analog_Select
$Comp
L Device:C_Small C103
U 1 1 5CF0F54A
P 4850 1700
F 0 "C103" H 4942 1746 50  0000 L CNN
F 1 "0.1uF" H 4942 1655 50  0000 L CNN
F 2 "Capacitor_SMD:C_0603_1608Metric_Pad1.05x0.95mm_HandSolder" H 4850 1700 50  0001 C CNN
F 3 "~" H 4850 1700 50  0001 C CNN
	1    4850 1700
	1    0    0    -1  
$EndComp
$Comp
L power:+5V #PWR?
U 1 1 5CF103D4
P 4850 1550
F 0 "#PWR?" H 4850 1400 50  0001 C CNN
F 1 "+5V" H 4865 1723 50  0000 C CNN
F 2 "" H 4850 1550 50  0001 C CNN
F 3 "" H 4850 1550 50  0001 C CNN
	1    4850 1550
	1    0    0    -1  
$EndComp
Wire Wire Line
	4850 1550 4850 1600
$Comp
L power:GND #PWR?
U 1 1 5CF1A28D
P 4850 1850
F 0 "#PWR?" H 4850 1600 50  0001 C CNN
F 1 "GND" H 4855 1677 50  0000 C CNN
F 2 "" H 4850 1850 50  0001 C CNN
F 3 "" H 4850 1850 50  0001 C CNN
	1    4850 1850
	1    0    0    -1  
$EndComp
Wire Wire Line
	4850 1800 4850 1850
Text Label 1550 2300 2    50   ~ 0
Analog_Select
Wire Wire Line
	1700 2800 1550 2800
Wire Wire Line
	1700 2700 1550 2700
Wire Wire Line
	1700 2600 1550 2600
Text Notes 600  3350 0    50   ~ 0
Pin 13 is LED pin on UNO.\nMake sure this won't affect\nwhatever signal is used on\nthis pin.
Text Label 1550 2700 2    50   ~ 0
Cooler_Fault
Text Label 1550 2800 2    50   ~ 0
NUC_Reset
Text Label 4150 5200 0    50   ~ 0
IRIS_Disable
Text Label 4150 5400 0    50   ~ 0
Exp2_Disable
Text Label 4150 5300 0    50   ~ 0
Exp1_Disable
Text Label 2850 3000 0    50   ~ 0
SCL_2
Text Label 2850 2900 0    50   ~ 0
SDA_2
Wire Wire Line
	2700 3000 2850 3000
Wire Wire Line
	2700 2900 2850 2900
$Comp
L power:GND #PWR?
U 1 1 5C7083A1
P 2300 3600
F 0 "#PWR?" H 2300 3350 50  0001 C CNN
F 1 "GND" H 2305 3427 50  0000 C CNN
F 2 "" H 2300 3600 50  0001 C CNN
F 3 "" H 2300 3600 50  0001 C CNN
	1    2300 3600
	1    0    0    -1  
$EndComp
Wire Wire Line
	2300 3400 2300 3600
Wire Wire Line
	2200 3400 2300 3400
Wire Wire Line
	2200 3300 2200 3400
Connection ~ 2300 3400
Wire Wire Line
	2300 3400 2300 3300
Connection ~ 2200 3400
Wire Wire Line
	2100 3400 2200 3400
Wire Wire Line
	2100 3300 2100 3400
Text Notes 3150 4550 0    50   ~ 0
3.3 or 5?
Text Notes 9150 5600 0    50   ~ 0
Expansion Header?
NoConn ~ 3950 5700
NoConn ~ 3950 5800
NoConn ~ 3950 5900
NoConn ~ 3950 6300
NoConn ~ 3950 6600
NoConn ~ 3950 6700
NoConn ~ 3950 6800
$Comp
L MCU_Module:Arduino_UNO_R3 A101
U 1 1 5C703811
P 2200 2200
F 0 "A101" H 1850 3150 50  0000 C CNN
F 1 "Arduino_UNO_R3" H 2800 3150 50  0000 C CNN
F 2 "endpoint_shield:Arduino_UNO_R3" H 2350 1150 50  0001 L CNN
F 3 "https://www.arduino.cc/en/Main/arduinoBoardUno" H 2000 3250 50  0001 C CNN
	1    2200 2200
	1    0    0    -1  
$EndComp
NoConn ~ 1700 2900
$Comp
L power:+5V #PWR?
U 1 1 5CF39C8B
P 3250 4800
F 0 "#PWR?" H 3250 4650 50  0001 C CNN
F 1 "+5V" H 3265 4973 50  0000 C CNN
F 2 "" H 3250 4800 50  0001 C CNN
F 3 "" H 3250 4800 50  0001 C CNN
	1    3250 4800
	1    0    0    -1  
$EndComp
Wire Wire Line
	9750 5100 10150 5100
Wire Wire Line
	9750 5200 10150 5200
Text Label 10150 5000 0    50   ~ 0
Unused_0
Text Label 10150 5100 0    50   ~ 0
Unused_1
Wire Wire Line
	3950 6100 4150 6100
Wire Wire Line
	4150 6200 3950 6200
Text Label 4150 6100 0    50   ~ 0
Unused_0
Text Label 4150 6200 0    50   ~ 0
Unused_1
Text Label 1750 5200 2    50   ~ 0
SDA_2
Text Label 1750 5300 2    50   ~ 0
SCL_2
Text Label 1750 5500 2    50   ~ 0
TCA_RESET_0
Text Label 1550 2400 2    50   ~ 0
TCA_RESET_0
NoConn ~ 2700 2000
$Comp
L Connector_Generic:Conn_02x05_Odd_Even J106
U 1 1 5CF8E23C
P 9450 5100
F 0 "J106" H 9500 5517 50  0000 C CNN
F 1 "Conn_02x05_Odd_Even" H 9500 5426 50  0000 C CNN
F 2 "Connector_PinHeader_2.54mm:PinHeader_2x05_P2.54mm_Vertical" H 9450 5100 50  0001 C CNN
F 3 "~" H 9450 5100 50  0001 C CNN
	1    9450 5100
	1    0    0    -1  
$EndComp
NoConn ~ 2550 5400
Text Label 2850 2700 0    50   ~ 0
SCL
Text Label 2850 2600 0    50   ~ 0
SDA
Wire Wire Line
	2700 2700 2850 2700
Wire Wire Line
	2700 2600 2850 2600
$Comp
L power:+5V #PWR?
U 1 1 5D034F3A
P 1550 5950
F 0 "#PWR?" H 1550 5800 50  0001 C CNN
F 1 "+5V" H 1565 6123 50  0000 C CNN
F 2 "" H 1550 5950 50  0001 C CNN
F 3 "" H 1550 5950 50  0001 C CNN
	1    1550 5950
	1    0    0    -1  
$EndComp
NoConn ~ 3950 5500
NoConn ~ 3950 5600
NoConn ~ 3950 6400
NoConn ~ 3950 6500
Text Notes 2700 3300 0    50   ~ 0
SDA/SCL and SDA_2/SCL_2\nare connected on the Arduino side
Wire Wire Line
	2450 6700 2450 7200
Wire Wire Line
	2550 6800 2350 6800
Wire Wire Line
	2350 6800 2350 6500
$Comp
L power:+5V #PWR?
U 1 1 5CF7C726
P 2350 6500
F 0 "#PWR?" H 2350 6350 50  0001 C CNN
F 1 "+5V" H 2365 6673 50  0000 C CNN
F 2 "" H 2350 6500 50  0001 C CNN
F 3 "" H 2350 6500 50  0001 C CNN
	1    2350 6500
	1    0    0    -1  
$EndComp
$EndSCHEMATC
