EESchema Schematic File Version 4
EELAYER 30 0
EELAYER END
$Descr A4 11693 8268
encoding utf-8
Sheet 25 27
Title ""
Date ""
Rev ""
Comp ""
Comment1 ""
Comment2 ""
Comment3 ""
Comment4 ""
$EndDescr
$Comp
L Connector_Generic:Conn_01x03 J?
U 1 1 5E3D1070
P 5000 2350
AR Path="/5E179620/5E3D1070" Ref="J?"  Part="1" 
AR Path="/5E3A7260/5E3D1070" Ref="J2702"  Part="1" 
F 0 "J2702" H 5000 2550 50  0000 C CNN
F 1 "Conn_01x03" H 5000 2150 50  0000 C CNN
F 2 "Connector:FanPinHeader_1x03_P2.54mm_Vertical" H 5000 2350 50  0001 C CNN
F 3 "~" H 5000 2350 50  0001 C CNN
F 4 "3000-0000000172" H 5000 2350 50  0001 C CNN "PartSpecification"
	1    5000 2350
	1    0    0    -1  
$EndComp
$Comp
L power:GND #PWR?
U 1 1 5E3D1076
P 4300 2400
AR Path="/5E179620/5E3D1076" Ref="#PWR?"  Part="1" 
AR Path="/5E3A7260/5E3D1076" Ref="#PWR?"  Part="1" 
F 0 "#PWR?" H 4300 2150 50  0001 C CNN
F 1 "GND" H 4300 2250 50  0000 C CNN
F 2 "" H 4300 2400 50  0001 C CNN
F 3 "" H 4300 2400 50  0001 C CNN
	1    4300 2400
	1    0    0    -1  
$EndComp
Wire Wire Line
	4300 2400 4300 2250
Wire Wire Line
	4300 2250 4800 2250
Wire Wire Line
	4800 2450 4600 2450
Wire Wire Line
	4600 2450 4600 2650
Wire Wire Line
	4600 2650 5300 2650
Wire Wire Line
	4450 2350 4800 2350
$Comp
L Device:R R?
U 1 1 5E3D1083
P 5300 2350
AR Path="/5E179620/5E3D1083" Ref="R?"  Part="1" 
AR Path="/5E3A7260/5E3D1083" Ref="R2702"  Part="1" 
F 0 "R2702" V 5380 2350 50  0000 C CNN
F 1 "10k" V 5300 2350 50  0000 C CNN
F 2 "Resistor_SMD:R_0402_1005Metric" V 5230 2350 50  0001 C CNN
F 3 "~" H 5300 2350 50  0001 C CNN
F 4 "3000-0000000131" H 5300 2350 50  0001 C CNN "PartSpecification"
	1    5300 2350
	1    0    0    -1  
$EndComp
Wire Wire Line
	5300 2500 5300 2650
Connection ~ 5300 2650
Wire Wire Line
	5300 2200 5300 2000
Wire Wire Line
	5300 2000 4450 2000
Wire Wire Line
	4450 2000 4450 2350
Connection ~ 4450 2350
$Comp
L Connector_Generic:Conn_01x03 J?
U 1 1 5E3D108F
P 6800 2350
AR Path="/5E179620/5E3D108F" Ref="J?"  Part="1" 
AR Path="/5E3A7260/5E3D108F" Ref="J2704"  Part="1" 
F 0 "J2704" H 6800 2550 50  0000 C CNN
F 1 "Conn_01x03" H 6800 2150 50  0000 C CNN
F 2 "Connector:FanPinHeader_1x03_P2.54mm_Vertical" H 6800 2350 50  0001 C CNN
F 3 "~" H 6800 2350 50  0001 C CNN
F 4 "3000-0000000172" H 6800 2350 50  0001 C CNN "PartSpecification"
	1    6800 2350
	1    0    0    -1  
$EndComp
$Comp
L power:GND #PWR?
U 1 1 5E3D1095
P 6100 2400
AR Path="/5E179620/5E3D1095" Ref="#PWR?"  Part="1" 
AR Path="/5E3A7260/5E3D1095" Ref="#PWR?"  Part="1" 
F 0 "#PWR?" H 6100 2150 50  0001 C CNN
F 1 "GND" H 6100 2250 50  0000 C CNN
F 2 "" H 6100 2400 50  0001 C CNN
F 3 "" H 6100 2400 50  0001 C CNN
	1    6100 2400
	1    0    0    -1  
$EndComp
Wire Wire Line
	6100 2400 6100 2250
Wire Wire Line
	6100 2250 6600 2250
Wire Wire Line
	6600 2450 6400 2450
Wire Wire Line
	6400 2450 6400 2650
Wire Wire Line
	6400 2650 7100 2650
Text HLabel 8250 2100 2    50   Output ~ 0
fan_tach[0..4]
Wire Wire Line
	6250 2350 6600 2350
$Comp
L Device:R R?
U 1 1 5E3D10A2
P 7100 2350
AR Path="/5E179620/5E3D10A2" Ref="R?"  Part="1" 
AR Path="/5E3A7260/5E3D10A2" Ref="R2704"  Part="1" 
F 0 "R2704" V 7180 2350 50  0000 C CNN
F 1 "10k" V 7100 2350 50  0000 C CNN
F 2 "Resistor_SMD:R_0402_1005Metric" V 7030 2350 50  0001 C CNN
F 3 "~" H 7100 2350 50  0001 C CNN
F 4 "3000-0000000131" H 7100 2350 50  0001 C CNN "PartSpecification"
	1    7100 2350
	1    0    0    -1  
$EndComp
Wire Wire Line
	7100 2500 7100 2650
Connection ~ 7100 2650
Wire Wire Line
	7100 2200 7100 2000
Wire Wire Line
	7100 2000 6250 2000
Wire Wire Line
	6250 2000 6250 2350
$Comp
L Connector_Generic:Conn_01x03 J?
U 1 1 5E3D10AD
P 3050 2350
AR Path="/5E179620/5E3D10AD" Ref="J?"  Part="1" 
AR Path="/5E3A7260/5E3D10AD" Ref="J2701"  Part="1" 
F 0 "J2701" H 3050 2550 50  0000 C CNN
F 1 "Conn_01x03" H 3050 2150 50  0000 C CNN
F 2 "Connector:FanPinHeader_1x03_P2.54mm_Vertical" H 3050 2350 50  0001 C CNN
F 3 "~" H 3050 2350 50  0001 C CNN
F 4 "3000-0000000172" H 3050 2350 50  0001 C CNN "PartSpecification"
	1    3050 2350
	1    0    0    -1  
$EndComp
$Comp
L power:GND #PWR?
U 1 1 5E3D10B3
P 2350 2400
AR Path="/5E179620/5E3D10B3" Ref="#PWR?"  Part="1" 
AR Path="/5E3A7260/5E3D10B3" Ref="#PWR?"  Part="1" 
F 0 "#PWR?" H 2350 2150 50  0001 C CNN
F 1 "GND" H 2350 2250 50  0000 C CNN
F 2 "" H 2350 2400 50  0001 C CNN
F 3 "" H 2350 2400 50  0001 C CNN
	1    2350 2400
	1    0    0    -1  
$EndComp
Wire Wire Line
	2350 2400 2350 2250
Wire Wire Line
	2350 2250 2850 2250
Wire Wire Line
	2850 2450 2650 2450
Wire Wire Line
	2650 2450 2650 2650
Wire Wire Line
	2650 2650 3350 2650
Wire Wire Line
	2500 2350 2850 2350
$Comp
L Device:R R?
U 1 1 5E3D10BF
P 3350 2350
AR Path="/5E179620/5E3D10BF" Ref="R?"  Part="1" 
AR Path="/5E3A7260/5E3D10BF" Ref="R2701"  Part="1" 
F 0 "R2701" V 3430 2350 50  0000 C CNN
F 1 "10k" V 3350 2350 50  0000 C CNN
F 2 "Resistor_SMD:R_0402_1005Metric" V 3280 2350 50  0001 C CNN
F 3 "~" H 3350 2350 50  0001 C CNN
F 4 "3000-0000000131" H 3350 2350 50  0001 C CNN "PartSpecification"
	1    3350 2350
	1    0    0    -1  
$EndComp
Wire Wire Line
	3350 2500 3350 2650
Connection ~ 3350 2650
Wire Wire Line
	3350 2200 3350 2000
Wire Wire Line
	3350 2000 2500 2000
Wire Wire Line
	2500 2000 2500 2350
Wire Wire Line
	5300 2000 6250 2000
Connection ~ 5300 2000
Connection ~ 6250 2000
Text Label 5450 2650 0    50   ~ 0
fan_tach0
Wire Bus Line
	8250 2100 7750 2100
Wire Bus Line
	7750 1900 5950 1900
Wire Bus Line
	5950 1900 5950 2550
Entry Wire Line
	5950 2550 5850 2650
Wire Wire Line
	5300 2650 5850 2650
Entry Wire Line
	4000 2550 3900 2650
Entry Wire Line
	7750 2550 7650 2650
Wire Wire Line
	7100 2650 7650 2650
Wire Wire Line
	3350 2650 3900 2650
Text Label 7250 2650 0    50   ~ 0
fan_tach1
Text Label 3500 2650 0    50   ~ 0
fan_tach2
Wire Bus Line
	5950 1900 4000 1900
Connection ~ 5950 1900
Wire Bus Line
	4000 1900 4000 2550
Wire Wire Line
	4450 2000 3350 2000
Connection ~ 4450 2000
Connection ~ 3350 2000
Connection ~ 7750 2100
Wire Bus Line
	7750 2100 7750 1900
$Comp
L Connector_Generic:Conn_01x03 J?
U 1 1 5E3D3874
P 5000 3450
AR Path="/5E179620/5E3D3874" Ref="J?"  Part="1" 
AR Path="/5E3A7260/5E3D3874" Ref="J2703"  Part="1" 
F 0 "J2703" H 5000 3650 50  0000 C CNN
F 1 "Conn_01x03" H 5000 3250 50  0000 C CNN
F 2 "Connector:FanPinHeader_1x03_P2.54mm_Vertical" H 5000 3450 50  0001 C CNN
F 3 "~" H 5000 3450 50  0001 C CNN
F 4 "3000-0000000172" H 5000 3450 50  0001 C CNN "PartSpecification"
	1    5000 3450
	1    0    0    -1  
$EndComp
$Comp
L power:GND #PWR?
U 1 1 5E3D387A
P 4300 3500
AR Path="/5E179620/5E3D387A" Ref="#PWR?"  Part="1" 
AR Path="/5E3A7260/5E3D387A" Ref="#PWR?"  Part="1" 
F 0 "#PWR?" H 4300 3250 50  0001 C CNN
F 1 "GND" H 4300 3350 50  0000 C CNN
F 2 "" H 4300 3500 50  0001 C CNN
F 3 "" H 4300 3500 50  0001 C CNN
	1    4300 3500
	1    0    0    -1  
$EndComp
Wire Wire Line
	4300 3500 4300 3350
Wire Wire Line
	4300 3350 4800 3350
Wire Wire Line
	4800 3550 4600 3550
Wire Wire Line
	4600 3550 4600 3750
Wire Wire Line
	4600 3750 5300 3750
Wire Wire Line
	4450 3450 4800 3450
$Comp
L Device:R R?
U 1 1 5E3D3887
P 5300 3450
AR Path="/5E179620/5E3D3887" Ref="R?"  Part="1" 
AR Path="/5E3A7260/5E3D3887" Ref="R2703"  Part="1" 
F 0 "R2703" V 5380 3450 50  0000 C CNN
F 1 "10k" V 5300 3450 50  0000 C CNN
F 2 "Resistor_SMD:R_0402_1005Metric" V 5230 3450 50  0001 C CNN
F 3 "~" H 5300 3450 50  0001 C CNN
F 4 "3000-0000000131" H 5300 3450 50  0001 C CNN "PartSpecification"
	1    5300 3450
	1    0    0    -1  
$EndComp
Wire Wire Line
	5300 3600 5300 3750
Connection ~ 5300 3750
Wire Wire Line
	5300 3300 5300 3100
Wire Wire Line
	5300 3100 4450 3100
Wire Wire Line
	4450 3100 4450 3450
$Comp
L Connector_Generic:Conn_01x03 J?
U 1 1 5E3D3893
P 6800 3450
AR Path="/5E179620/5E3D3893" Ref="J?"  Part="1" 
AR Path="/5E3A7260/5E3D3893" Ref="J2705"  Part="1" 
F 0 "J2705" H 6800 3650 50  0000 C CNN
F 1 "Conn_01x03" H 6800 3250 50  0000 C CNN
F 2 "Connector:FanPinHeader_1x03_P2.54mm_Vertical" H 6800 3450 50  0001 C CNN
F 3 "~" H 6800 3450 50  0001 C CNN
F 4 "3000-0000000172" H 6800 3450 50  0001 C CNN "PartSpecification"
	1    6800 3450
	1    0    0    -1  
$EndComp
$Comp
L power:GND #PWR?
U 1 1 5E3D3899
P 6100 3500
AR Path="/5E179620/5E3D3899" Ref="#PWR?"  Part="1" 
AR Path="/5E3A7260/5E3D3899" Ref="#PWR?"  Part="1" 
F 0 "#PWR?" H 6100 3250 50  0001 C CNN
F 1 "GND" H 6100 3350 50  0000 C CNN
F 2 "" H 6100 3500 50  0001 C CNN
F 3 "" H 6100 3500 50  0001 C CNN
	1    6100 3500
	1    0    0    -1  
$EndComp
Wire Wire Line
	6100 3500 6100 3350
Wire Wire Line
	6100 3350 6600 3350
Wire Wire Line
	6600 3550 6400 3550
Wire Wire Line
	6400 3550 6400 3750
Wire Wire Line
	6400 3750 7100 3750
Wire Wire Line
	6250 3450 6600 3450
$Comp
L Device:R R?
U 1 1 5E3D38A5
P 7100 3450
AR Path="/5E179620/5E3D38A5" Ref="R?"  Part="1" 
AR Path="/5E3A7260/5E3D38A5" Ref="R2705"  Part="1" 
F 0 "R2705" V 7180 3450 50  0000 C CNN
F 1 "10k" V 7100 3450 50  0000 C CNN
F 2 "Resistor_SMD:R_0402_1005Metric" V 7030 3450 50  0001 C CNN
F 3 "~" H 7100 3450 50  0001 C CNN
F 4 "3000-0000000131" H 7100 3450 50  0001 C CNN "PartSpecification"
	1    7100 3450
	1    0    0    -1  
$EndComp
Wire Wire Line
	7100 3600 7100 3750
Connection ~ 7100 3750
Wire Wire Line
	7100 3300 7100 3100
Wire Wire Line
	7100 3100 6250 3100
Wire Wire Line
	6250 3100 6250 3450
Wire Wire Line
	5300 3100 6250 3100
Connection ~ 5300 3100
Connection ~ 6250 3100
Text Label 5450 3750 0    50   ~ 0
fan_tach3
Wire Bus Line
	7750 3000 5950 3000
Wire Bus Line
	5950 3000 5950 3650
Entry Wire Line
	5950 3650 5850 3750
Wire Wire Line
	5300 3750 5850 3750
Entry Wire Line
	7750 3650 7650 3750
Wire Wire Line
	7100 3750 7650 3750
Text Label 7250 3750 0    50   ~ 0
fan_tach4
Connection ~ 7750 3000
Wire Bus Line
	7750 3000 7750 3650
Wire Wire Line
	4450 2350 4450 3100
Connection ~ 4450 3100
Wire Wire Line
	2500 2000 2000 2000
Connection ~ 2500 2000
Text HLabel 2000 2000 0    50   Input ~ 0
v_12
Wire Bus Line
	7750 2100 7750 3000
$EndSCHEMATC
