EESchema Schematic File Version 4
EELAYER 30 0
EELAYER END
$Descr A4 11693 8268
encoding utf-8
Sheet 7 27
Title ""
Date ""
Rev ""
Comp ""
Comment1 ""
Comment2 ""
Comment3 ""
Comment4 ""
$EndDescr
Text HLabel 800  1050 0    50   Input ~ 0
v_in
Text HLabel 10950 750  2    50   Output ~ 0
v_out
Text HLabel 5450 5850 2    50   Output ~ 0
p_good
Text HLabel 3100 2600 0    50   Input ~ 0
sync
$Comp
L POWDER_Power:LM5176_QFN U?
U 1 1 5F8BE3F2
P 6000 2800
AR Path="/5E179620/5E179864/5F8BE3F2" Ref="U?"  Part="1" 
AR Path="/5E182A9D/5F8A93F2/5F8BE3F2" Ref="U602"  Part="1" 
AR Path="/5E182A9D/5F8F0FFE/5F8BE3F2" Ref="U702"  Part="1" 
AR Path="/5E182A9D/5F8F1079/5F8BE3F2" Ref="U802"  Part="1" 
AR Path="/5E182A9D/5F8F10F2/5F8BE3F2" Ref="U902"  Part="1" 
F 0 "U802" H 5500 3750 50  0000 L CNN
F 1 "LM5176_QFN" H 5500 3650 50  0000 L CNN
F 2 "POWDER_Power:LM5176_QFN" H 6700 3650 50  0001 L CNN
F 3 "" H 8000 2350 50  0001 C CNN
F 4 "3000-0000000511" H 6000 2800 50  0001 C CNN "PartSpecification"
	1    6000 2800
	1    0    0    -1  
$EndComp
$Comp
L Device:CP C?
U 1 1 5F8BE3FB
P 1800 1300
AR Path="/5E179620/5E179864/5F8BE3FB" Ref="C?"  Part="1" 
AR Path="/5E182A9D/5F8A93F2/5F8BE3FB" Ref="C602"  Part="1" 
AR Path="/5E182A9D/5F8F0FFE/5F8BE3FB" Ref="C702"  Part="1" 
AR Path="/5E182A9D/5F8F1079/5F8BE3FB" Ref="C802"  Part="1" 
AR Path="/5E182A9D/5F8F10F2/5F8BE3FB" Ref="C902"  Part="1" 
F 0 "C802" H 1825 1400 50  0000 L CNN
F 1 "82uF" H 1825 1200 50  0000 L CNN
F 2 "Capacitor_SMD:CP_Elec_10x10" H 1838 1150 50  0001 C CNN
F 3 "~" H 1800 1300 50  0001 C CNN
F 4 "" H 1800 1300 50  0001 C CNN "PartNumber"
F 5 "63V" H 1800 1300 50  0001 C CNN "Voltage"
F 6 "1.4A" H 1800 1300 50  0001 C CNN "Ripple current"
F 7 "3000-0000000470" H 1800 1300 50  0001 C CNN "PartSpecification"
	1    1800 1300
	1    0    0    -1  
$EndComp
$Comp
L power:GND #PWR?
U 1 1 5F8BE40A
P 2100 1550
AR Path="/5E179620/5E179864/5F8BE40A" Ref="#PWR?"  Part="1" 
AR Path="/5E182A9D/5F8A93F2/5F8BE40A" Ref="#PWR?"  Part="1" 
AR Path="/5E182A9D/5F8F0FFE/5F8BE40A" Ref="#PWR?"  Part="1" 
AR Path="/5E182A9D/5F8F1079/5F8BE40A" Ref="#PWR?"  Part="1" 
AR Path="/5E182A9D/5F8F10F2/5F8BE40A" Ref="#PWR?"  Part="1" 
F 0 "#PWR?" H 2100 1300 50  0001 C CNN
F 1 "GND" H 2100 1400 50  0000 C CNN
F 2 "" H 2100 1550 50  0001 C CNN
F 3 "" H 2100 1550 50  0001 C CNN
	1    2100 1550
	1    0    0    -1  
$EndComp
$Comp
L power:GND #PWR?
U 1 1 5F8BE410
P 1800 1550
AR Path="/5E179620/5E179864/5F8BE410" Ref="#PWR?"  Part="1" 
AR Path="/5E182A9D/5F8A93F2/5F8BE410" Ref="#PWR?"  Part="1" 
AR Path="/5E182A9D/5F8F0FFE/5F8BE410" Ref="#PWR?"  Part="1" 
AR Path="/5E182A9D/5F8F1079/5F8BE410" Ref="#PWR?"  Part="1" 
AR Path="/5E182A9D/5F8F10F2/5F8BE410" Ref="#PWR?"  Part="1" 
F 0 "#PWR?" H 1800 1300 50  0001 C CNN
F 1 "GND" H 1800 1400 50  0000 C CNN
F 2 "" H 1800 1550 50  0001 C CNN
F 3 "" H 1800 1550 50  0001 C CNN
	1    1800 1550
	1    0    0    -1  
$EndComp
Wire Wire Line
	1800 1450 1800 1550
Wire Wire Line
	2100 1550 2100 1450
Wire Wire Line
	1800 1150 1800 1050
Connection ~ 1800 1050
Wire Wire Line
	1800 1050 2100 1050
Wire Wire Line
	2100 1150 2100 1050
Connection ~ 2100 1050
Wire Wire Line
	2100 1050 2350 1050
$Comp
L 000_PreferredDiodes:D_Schottky_60V_1A D?
U 1 1 5F8BE42C
P 2500 1300
AR Path="/5E179620/5E179864/5F8BE42C" Ref="D?"  Part="1" 
AR Path="/5E182A9D/5F8A93F2/5F8BE42C" Ref="D601"  Part="1" 
AR Path="/5E182A9D/5F8F0FFE/5F8BE42C" Ref="D701"  Part="1" 
AR Path="/5E182A9D/5F8F1079/5F8BE42C" Ref="D801"  Part="1" 
AR Path="/5E182A9D/5F8F10F2/5F8BE42C" Ref="D901"  Part="1" 
F 0 "D801" H 2500 1400 50  0000 C CNN
F 1 "D_Schottky_60V_1A" H 2500 1200 50  0001 C CNN
F 2 "Diode_SMD:D_SOD-123F" H 2500 1300 50  0001 C CNN
F 3 "~" H 2500 1300 50  0001 C CNN
F 4 "DSS16UTR" H 2500 1300 50  0001 C CNN "PartNumber"
F 5 "Schottky" H 2500 1200 50  0000 C CNN "DisplayValue"
F 6 "60V_1A" H 2500 1100 50  0000 C CNN "DisplayValue2"
F 7 "3000-0000000481" H 2500 1300 50  0001 C CNN "PartSpecification"
	1    2500 1300
	0    -1   -1   0   
$EndComp
$Comp
L Device:R R?
U 1 1 5F8BE432
P 2950 2300
AR Path="/5E179620/5E179864/5F8BE432" Ref="R?"  Part="1" 
AR Path="/5E182A9D/5F8A93F2/5F8BE432" Ref="R607"  Part="1" 
AR Path="/5E182A9D/5F8F0FFE/5F8BE432" Ref="R707"  Part="1" 
AR Path="/5E182A9D/5F8F1079/5F8BE432" Ref="R807"  Part="1" 
AR Path="/5E182A9D/5F8F10F2/5F8BE432" Ref="R907"  Part="1" 
F 0 "R807" V 3030 2300 50  0000 C CNN
F 1 "2k" V 2950 2300 50  0000 C CNN
F 2 "Resistor_SMD:R_0603_1608Metric" V 2880 2300 50  0001 C CNN
F 3 "~" H 2950 2300 50  0001 C CNN
F 4 "3000-0000000553" H 2950 2300 50  0001 C CNN "PartSpecification"
	1    2950 2300
	0    1    1    0   
$EndComp
Wire Wire Line
	3100 2300 5300 2300
Wire Wire Line
	2800 2300 2350 2300
Wire Wire Line
	2350 2300 2350 1050
Connection ~ 2350 1050
Wire Wire Line
	2350 1050 2500 1050
$Comp
L Device:R R?
U 1 1 5F8BE43D
P 2500 1700
AR Path="/5E179620/5E179864/5F8BE43D" Ref="R?"  Part="1" 
AR Path="/5E182A9D/5F8A93F2/5F8BE43D" Ref="R604"  Part="1" 
AR Path="/5E182A9D/5F8F0FFE/5F8BE43D" Ref="R704"  Part="1" 
AR Path="/5E182A9D/5F8F1079/5F8BE43D" Ref="R804"  Part="1" 
AR Path="/5E182A9D/5F8F10F2/5F8BE43D" Ref="R904"  Part="1" 
F 0 "R804" V 2580 1700 50  0000 C CNN
F 1 "10" V 2500 1700 50  0000 C CNN
F 2 "Resistor_SMD:R_0603_1608Metric" V 2430 1700 50  0001 C CNN
F 3 "~" H 2500 1700 50  0001 C CNN
F 4 "3000-0000000551" H 2500 1700 50  0001 C CNN "PartSpecification"
	1    2500 1700
	-1   0    0    1   
$EndComp
$Comp
L 000_PreferredParts:C_0_1uF C?
U 1 1 5F8BE445
P 2550 2500
AR Path="/5E179620/5E179864/5F8BE445" Ref="C?"  Part="1" 
AR Path="/5E182A9D/5F8A93F2/5F8BE445" Ref="C604"  Part="1" 
AR Path="/5E182A9D/5F8F0FFE/5F8BE445" Ref="C704"  Part="1" 
AR Path="/5E182A9D/5F8F1079/5F8BE445" Ref="C804"  Part="1" 
AR Path="/5E182A9D/5F8F10F2/5F8BE445" Ref="C904"  Part="1" 
F 0 "C804" H 2575 2600 50  0000 L CNN
F 1 "C_0_1uF" H 2575 2400 50  0001 L CNN
F 2 "Capacitor_SMD:C_0402_1005Metric" H 2588 2350 50  0001 C CNN
F 3 "~" H 2550 2500 50  0001 C CNN
F 4 "0.1uF" H 2700 2400 50  0000 C CNN "DisplayValue"
F 5 "3000-0000000125" H 2550 2500 50  0001 C CNN "PartSpecification"
	1    2550 2500
	1    0    0    -1  
$EndComp
Wire Wire Line
	2550 2350 2550 2100
Wire Wire Line
	2550 2100 2500 2100
Wire Wire Line
	2550 2100 5300 2100
Connection ~ 2550 2100
Wire Wire Line
	2500 1150 2500 1050
Connection ~ 2500 1050
$Comp
L power:GND #PWR?
U 1 1 5F8BE451
P 2550 2750
AR Path="/5E179620/5E179864/5F8BE451" Ref="#PWR?"  Part="1" 
AR Path="/5E182A9D/5F8A93F2/5F8BE451" Ref="#PWR?"  Part="1" 
AR Path="/5E182A9D/5F8F0FFE/5F8BE451" Ref="#PWR?"  Part="1" 
AR Path="/5E182A9D/5F8F1079/5F8BE451" Ref="#PWR?"  Part="1" 
AR Path="/5E182A9D/5F8F10F2/5F8BE451" Ref="#PWR?"  Part="1" 
F 0 "#PWR?" H 2550 2500 50  0001 C CNN
F 1 "GND" H 2550 2600 50  0000 C CNN
F 2 "" H 2550 2750 50  0001 C CNN
F 3 "" H 2550 2750 50  0001 C CNN
	1    2550 2750
	1    0    0    -1  
$EndComp
Wire Wire Line
	2550 2750 2550 2650
$Comp
L 000_PreferredParts:C_1uF C?
U 1 1 5F8BE459
P 6400 1550
AR Path="/5E179620/5E179864/5F8BE459" Ref="C?"  Part="1" 
AR Path="/5E182A9D/5F8A93F2/5F8BE459" Ref="C611"  Part="1" 
AR Path="/5E182A9D/5F8F0FFE/5F8BE459" Ref="C711"  Part="1" 
AR Path="/5E182A9D/5F8F1079/5F8BE459" Ref="C811"  Part="1" 
AR Path="/5E182A9D/5F8F10F2/5F8BE459" Ref="C911"  Part="1" 
F 0 "C811" H 6425 1650 50  0000 L CNN
F 1 "C_1uF" H 6425 1450 50  0000 L CNN
F 2 "Capacitor_SMD:C_0603_1608Metric" H 6438 1400 50  0001 C CNN
F 3 "~" H 6400 1550 50  0001 C CNN
F 4 "3000-0000000136" H 6400 1550 50  0001 C CNN "PartSpecification"
	1    6400 1550
	1    0    0    -1  
$EndComp
$Comp
L power:GND #PWR?
U 1 1 5F8BE45F
P 6400 1800
AR Path="/5E179620/5E179864/5F8BE45F" Ref="#PWR?"  Part="1" 
AR Path="/5E182A9D/5F8A93F2/5F8BE45F" Ref="#PWR?"  Part="1" 
AR Path="/5E182A9D/5F8F0FFE/5F8BE45F" Ref="#PWR?"  Part="1" 
AR Path="/5E182A9D/5F8F1079/5F8BE45F" Ref="#PWR?"  Part="1" 
AR Path="/5E182A9D/5F8F10F2/5F8BE45F" Ref="#PWR?"  Part="1" 
F 0 "#PWR?" H 6400 1550 50  0001 C CNN
F 1 "GND" H 6400 1650 50  0000 C CNN
F 2 "" H 6400 1800 50  0001 C CNN
F 3 "" H 6400 1800 50  0001 C CNN
	1    6400 1800
	1    0    0    -1  
$EndComp
Wire Wire Line
	6400 1800 6400 1700
Wire Wire Line
	6400 1400 6100 1400
Wire Wire Line
	6100 1400 6100 1800
Text HLabel 3100 2500 0    50   Input ~ 0
en
Wire Wire Line
	3100 2500 5300 2500
$Comp
L Device:R R?
U 1 1 5F8BE46A
P 3600 2850
AR Path="/5E179620/5E179864/5F8BE46A" Ref="R?"  Part="1" 
AR Path="/5E182A9D/5F8A93F2/5F8BE46A" Ref="R610"  Part="1" 
AR Path="/5E182A9D/5F8F0FFE/5F8BE46A" Ref="R710"  Part="1" 
AR Path="/5E182A9D/5F8F1079/5F8BE46A" Ref="R810"  Part="1" 
AR Path="/5E182A9D/5F8F10F2/5F8BE46A" Ref="R910"  Part="1" 
F 0 "R810" V 3680 2850 50  0000 C CNN
F 1 "14.036k" V 3600 2850 50  0000 C CNN
F 2 "Resistor_SMD:R_0402_1005Metric" V 3530 2850 50  0001 C CNN
F 3 "~" H 3600 2850 50  0001 C CNN
F 4 "3000-0000000571" H 3600 2850 50  0001 C CNN "PartSpecification"
	1    3600 2850
	1    0    0    -1  
$EndComp
Wire Wire Line
	3600 2700 3600 2600
Wire Wire Line
	3600 2600 5300 2600
$Comp
L power:GND #PWR?
U 1 1 5F8BE472
P 3600 3100
AR Path="/5E179620/5E179864/5F8BE472" Ref="#PWR?"  Part="1" 
AR Path="/5E182A9D/5F8A93F2/5F8BE472" Ref="#PWR?"  Part="1" 
AR Path="/5E182A9D/5F8F0FFE/5F8BE472" Ref="#PWR?"  Part="1" 
AR Path="/5E182A9D/5F8F1079/5F8BE472" Ref="#PWR?"  Part="1" 
AR Path="/5E182A9D/5F8F10F2/5F8BE472" Ref="#PWR?"  Part="1" 
F 0 "#PWR?" H 3600 2850 50  0001 C CNN
F 1 "GND" H 3600 2950 50  0000 C CNN
F 2 "" H 3600 3100 50  0001 C CNN
F 3 "" H 3600 3100 50  0001 C CNN
	1    3600 3100
	1    0    0    -1  
$EndComp
Wire Wire Line
	3600 3100 3600 3000
$Comp
L 000_PreferredParts:C_1nF C?
U 1 1 5F8BE47A
P 3350 2600
AR Path="/5E179620/5E179864/5F8BE47A" Ref="C?"  Part="1" 
AR Path="/5E182A9D/5F8A93F2/5F8BE47A" Ref="C605"  Part="1" 
AR Path="/5E182A9D/5F8F0FFE/5F8BE47A" Ref="C705"  Part="1" 
AR Path="/5E182A9D/5F8F1079/5F8BE47A" Ref="C805"  Part="1" 
AR Path="/5E182A9D/5F8F10F2/5F8BE47A" Ref="C905"  Part="1" 
F 0 "C805" H 3375 2700 50  0000 L CNN
F 1 "C_1nF" H 3375 2500 50  0000 L CNN
F 2 "Capacitor_SMD:C_0402_1005Metric" H 3388 2450 50  0001 C CNN
F 3 "~" H 3350 2600 50  0001 C CNN
F 4 "3000-0000000128" H 3350 2600 50  0001 C CNN "PartSpecification"
	1    3350 2600
	0    1    1    0   
$EndComp
Wire Wire Line
	3100 2600 3200 2600
Connection ~ 3600 2600
Wire Wire Line
	3500 2600 3600 2600
$Comp
L 000_PreferredParts:C_0_1uF C?
U 1 1 5F8BE486
P 4200 2950
AR Path="/5E179620/5E179864/5F8BE486" Ref="C?"  Part="1" 
AR Path="/5E182A9D/5F8A93F2/5F8BE486" Ref="C608"  Part="1" 
AR Path="/5E182A9D/5F8F0FFE/5F8BE486" Ref="C708"  Part="1" 
AR Path="/5E182A9D/5F8F1079/5F8BE486" Ref="C808"  Part="1" 
AR Path="/5E182A9D/5F8F10F2/5F8BE486" Ref="C908"  Part="1" 
F 0 "C808" H 4225 3050 50  0000 L CNN
F 1 "C_0_1uF" H 4225 2850 50  0001 L CNN
F 2 "Capacitor_SMD:C_0402_1005Metric" H 4238 2800 50  0001 C CNN
F 3 "~" H 4200 2950 50  0001 C CNN
F 4 "0.1uF" H 4350 2850 50  0000 C CNN "DisplayValue"
F 5 "3000-0000000125" H 4200 2950 50  0001 C CNN "PartSpecification"
F 6 "100V" H 4200 2950 50  0001 C CNN "Voltage"
	1    4200 2950
	1    0    0    -1  
$EndComp
Wire Wire Line
	4200 2800 5300 2800
$Comp
L power:GND #PWR?
U 1 1 5F8BE48D
P 4200 3200
AR Path="/5E179620/5E179864/5F8BE48D" Ref="#PWR?"  Part="1" 
AR Path="/5E182A9D/5F8A93F2/5F8BE48D" Ref="#PWR?"  Part="1" 
AR Path="/5E182A9D/5F8F0FFE/5F8BE48D" Ref="#PWR?"  Part="1" 
AR Path="/5E182A9D/5F8F1079/5F8BE48D" Ref="#PWR?"  Part="1" 
AR Path="/5E182A9D/5F8F10F2/5F8BE48D" Ref="#PWR?"  Part="1" 
F 0 "#PWR?" H 4200 2950 50  0001 C CNN
F 1 "GND" H 4200 3050 50  0000 C CNN
F 2 "" H 4200 3200 50  0001 C CNN
F 3 "" H 4200 3200 50  0001 C CNN
	1    4200 3200
	1    0    0    -1  
$EndComp
Wire Wire Line
	4200 3200 4200 3100
$Comp
L Device:R R?
U 1 1 5F8BE494
P 3900 2950
AR Path="/5E179620/5E179864/5F8BE494" Ref="R?"  Part="1" 
AR Path="/5E182A9D/5F8A93F2/5F8BE494" Ref="R612"  Part="1" 
AR Path="/5E182A9D/5F8F0FFE/5F8BE494" Ref="R712"  Part="1" 
AR Path="/5E182A9D/5F8F1079/5F8BE494" Ref="R812"  Part="1" 
AR Path="/5E182A9D/5F8F10F2/5F8BE494" Ref="R912"  Part="1" 
F 0 "R812" V 3980 2950 50  0000 C CNN
F 1 "93.1k" V 3900 2950 50  0000 C CNN
F 2 "Resistor_SMD:R_0402_1005Metric" V 3830 2950 50  0001 C CNN
F 3 "~" H 3900 2950 50  0001 C CNN
F 4 "3000-0000000572" H 3900 2950 50  0001 C CNN "PartSpecification"
	1    3900 2950
	1    0    0    -1  
$EndComp
$Comp
L power:GND #PWR?
U 1 1 5F8BE49A
P 3900 3200
AR Path="/5E179620/5E179864/5F8BE49A" Ref="#PWR?"  Part="1" 
AR Path="/5E182A9D/5F8A93F2/5F8BE49A" Ref="#PWR?"  Part="1" 
AR Path="/5E182A9D/5F8F0FFE/5F8BE49A" Ref="#PWR?"  Part="1" 
AR Path="/5E182A9D/5F8F1079/5F8BE49A" Ref="#PWR?"  Part="1" 
AR Path="/5E182A9D/5F8F10F2/5F8BE49A" Ref="#PWR?"  Part="1" 
F 0 "#PWR?" H 3900 2950 50  0001 C CNN
F 1 "GND" H 3900 3050 50  0000 C CNN
F 2 "" H 3900 3200 50  0001 C CNN
F 3 "" H 3900 3200 50  0001 C CNN
	1    3900 3200
	1    0    0    -1  
$EndComp
Wire Wire Line
	3900 3200 3900 3100
Wire Wire Line
	3900 2800 3900 2700
Wire Wire Line
	3900 2700 5300 2700
$Comp
L power:GND #PWR?
U 1 1 5F8BE4A3
P 4500 3000
AR Path="/5E179620/5E179864/5F8BE4A3" Ref="#PWR?"  Part="1" 
AR Path="/5E182A9D/5F8A93F2/5F8BE4A3" Ref="#PWR?"  Part="1" 
AR Path="/5E182A9D/5F8F0FFE/5F8BE4A3" Ref="#PWR?"  Part="1" 
AR Path="/5E182A9D/5F8F1079/5F8BE4A3" Ref="#PWR?"  Part="1" 
AR Path="/5E182A9D/5F8F10F2/5F8BE4A3" Ref="#PWR?"  Part="1" 
F 0 "#PWR?" H 4500 2750 50  0001 C CNN
F 1 "GND" H 4500 2850 50  0000 C CNN
F 2 "" H 4500 3000 50  0001 C CNN
F 3 "" H 4500 3000 50  0001 C CNN
	1    4500 3000
	1    0    0    -1  
$EndComp
Wire Wire Line
	4500 3000 4500 2900
Wire Wire Line
	4500 2900 5300 2900
$Comp
L Device:L L?
U 1 1 5F8BE4AC
P 8250 2500
AR Path="/5E179620/5E179864/5F8BE4AC" Ref="L?"  Part="1" 
AR Path="/5E182A9D/5F8A93F2/5F8BE4AC" Ref="L601"  Part="1" 
AR Path="/5E182A9D/5F8F0FFE/5F8BE4AC" Ref="L701"  Part="1" 
AR Path="/5E182A9D/5F8F1079/5F8BE4AC" Ref="L801"  Part="1" 
AR Path="/5E182A9D/5F8F10F2/5F8BE4AC" Ref="L901"  Part="1" 
F 0 "L801" V 8200 2500 50  0000 C CNN
F 1 "10uH" V 8325 2500 50  0000 C CNN
F 2 "POWDER_Power:PQ2614BxA" H 8250 2500 50  0001 C CNN
F 3 "~" H 8250 2500 50  0001 C CNN
F 4 "CDEP15D90T150NP-100MC-125" V 8250 2500 50  0001 C CNN "PartNumber"
F 5 "3000-0000000493" H 8250 2500 50  0001 C CNN "PartSpecification"
	1    8250 2500
	0    -1   -1   0   
$EndComp
$Comp
L POWDER_Power:CSD18531Q5A U?
U 1 1 5F8BE4B2
P 7750 2100
AR Path="/5E179620/5E179864/5F8BE4B2" Ref="U?"  Part="1" 
AR Path="/5E182A9D/5F8A93F2/5F8BE4B2" Ref="U603"  Part="1" 
AR Path="/5E182A9D/5F8F0FFE/5F8BE4B2" Ref="U703"  Part="1" 
AR Path="/5E182A9D/5F8F1079/5F8BE4B2" Ref="U803"  Part="1" 
AR Path="/5E182A9D/5F8F10F2/5F8BE4B2" Ref="U903"  Part="1" 
F 0 "U803" H 7750 1800 50  0000 C CNN
F 1 "CSD18531Q5A" H 7750 2400 50  0000 C CNN
F 2 "POWDER_Power:CSD16321Q5" H 7650 1700 50  0001 C CNN
F 3 "" H 7750 2100 50  0001 C CNN
F 4 "3000-0000000512" H 7750 2100 50  0001 C CNN "PartSpecification"
	1    7750 2100
	1    0    0    -1  
$EndComp
Wire Wire Line
	7500 2100 6700 2100
Wire Wire Line
	6700 2500 6850 2500
Wire Wire Line
	7900 2500 7900 2300
Wire Wire Line
	8100 2500 7900 2500
Connection ~ 7900 2500
$Comp
L POWDER_Power:CSD18531Q5A U?
U 1 1 5F8BE4BD
P 7750 2900
AR Path="/5E179620/5E179864/5F8BE4BD" Ref="U?"  Part="1" 
AR Path="/5E182A9D/5F8A93F2/5F8BE4BD" Ref="U604"  Part="1" 
AR Path="/5E182A9D/5F8F0FFE/5F8BE4BD" Ref="U704"  Part="1" 
AR Path="/5E182A9D/5F8F1079/5F8BE4BD" Ref="U804"  Part="1" 
AR Path="/5E182A9D/5F8F10F2/5F8BE4BD" Ref="U904"  Part="1" 
F 0 "U804" H 7750 2600 50  0000 C CNN
F 1 "CSD18531Q5A" H 7750 3200 50  0000 C CNN
F 2 "POWDER_Power:CSD16321Q5" H 7650 2500 50  0001 C CNN
F 3 "" H 7750 2900 50  0001 C CNN
F 4 "3000-0000000512" H 7750 2900 50  0001 C CNN "PartSpecification"
	1    7750 2900
	1    0    0    -1  
$EndComp
Wire Wire Line
	6700 2600 7400 2600
Wire Wire Line
	7400 2600 7400 2900
Wire Wire Line
	7400 2900 7500 2900
Wire Wire Line
	7700 2700 7800 2700
Wire Wire Line
	7900 2700 7800 2700
Connection ~ 7800 2700
Wire Wire Line
	7900 2700 8000 2700
Connection ~ 7900 2700
Wire Wire Line
	7900 2700 7900 2500
Wire Wire Line
	7700 2300 7800 2300
Wire Wire Line
	7800 2300 7900 2300
Connection ~ 7800 2300
Connection ~ 7900 2300
Wire Wire Line
	7700 3100 7800 3100
Wire Wire Line
	7800 3100 7900 3100
Connection ~ 7800 3100
$Comp
L POWDER_Power:CSD18531Q5A U?
U 1 1 5F8BE4D3
P 8750 2100
AR Path="/5E179620/5E179864/5F8BE4D3" Ref="U?"  Part="1" 
AR Path="/5E182A9D/5F8A93F2/5F8BE4D3" Ref="U605"  Part="1" 
AR Path="/5E182A9D/5F8F0FFE/5F8BE4D3" Ref="U705"  Part="1" 
AR Path="/5E182A9D/5F8F1079/5F8BE4D3" Ref="U805"  Part="1" 
AR Path="/5E182A9D/5F8F10F2/5F8BE4D3" Ref="U905"  Part="1" 
F 0 "U805" H 8750 1800 50  0000 C CNN
F 1 "CSD18531Q5A" H 8750 2400 50  0000 C CNN
F 2 "POWDER_Power:CSD16321Q5" H 8650 1700 50  0001 C CNN
F 3 "" H 8750 2100 50  0001 C CNN
F 4 "3000-0000000512" H 8750 2100 50  0001 C CNN "PartSpecification"
	1    8750 2100
	-1   0    0    -1  
$EndComp
Wire Wire Line
	8600 2500 8600 2300
Connection ~ 8600 2500
$Comp
L POWDER_Power:CSD18531Q5A U?
U 1 1 5F8BE4DB
P 8750 2900
AR Path="/5E179620/5E179864/5F8BE4DB" Ref="U?"  Part="1" 
AR Path="/5E182A9D/5F8A93F2/5F8BE4DB" Ref="U606"  Part="1" 
AR Path="/5E182A9D/5F8F0FFE/5F8BE4DB" Ref="U706"  Part="1" 
AR Path="/5E182A9D/5F8F1079/5F8BE4DB" Ref="U806"  Part="1" 
AR Path="/5E182A9D/5F8F10F2/5F8BE4DB" Ref="U906"  Part="1" 
F 0 "U806" H 8750 2600 50  0000 C CNN
F 1 "CSD18531Q5A" H 8750 3200 50  0000 C CNN
F 2 "POWDER_Power:CSD16321Q5" H 8650 2500 50  0001 C CNN
F 3 "" H 8750 2900 50  0001 C CNN
F 4 "3000-0000000512" H 8750 2900 50  0001 C CNN "PartSpecification"
	1    8750 2900
	-1   0    0    -1  
$EndComp
Wire Wire Line
	9100 2900 9000 2900
Wire Wire Line
	8800 2700 8700 2700
Wire Wire Line
	8600 2700 8700 2700
Connection ~ 8700 2700
Wire Wire Line
	8600 2700 8500 2700
Connection ~ 8600 2700
Wire Wire Line
	8600 2700 8600 2500
Wire Wire Line
	8800 2300 8700 2300
Wire Wire Line
	8700 2300 8600 2300
Connection ~ 8700 2300
Connection ~ 8600 2300
Wire Wire Line
	8800 3100 8700 3100
Wire Wire Line
	8700 3100 8600 3100
Connection ~ 8700 3100
$Comp
L Device:CP C?
U 1 1 5F8BE4F2
P 10450 1000
AR Path="/5E179620/5E179864/5F8BE4F2" Ref="C?"  Part="1" 
AR Path="/5E182A9D/5F8A93F2/5F8BE4F2" Ref="C624"  Part="1" 
AR Path="/5E182A9D/5F8F0FFE/5F8BE4F2" Ref="C724"  Part="1" 
AR Path="/5E182A9D/5F8F1079/5F8BE4F2" Ref="C824"  Part="1" 
AR Path="/5E182A9D/5F8F10F2/5F8BE4F2" Ref="C924"  Part="1" 
F 0 "C824" H 10475 1100 50  0000 L CNN
F 1 "82uF" H 10475 900 50  0000 L CNN
F 2 "Capacitor_SMD:CP_Elec_10x10" H 10488 850 50  0001 C CNN
F 3 "~" H 10450 1000 50  0001 C CNN
F 4 "" H 10450 1000 50  0001 C CNN "PartNumber"
F 5 "63V" H 10450 1000 50  0001 C CNN "Voltage"
F 6 "1.4A" H 10450 1000 50  0001 C CNN "Ripple current"
F 7 "3000-0000000470" H 10450 1000 50  0001 C CNN "PartSpecification"
	1    10450 1000
	1    0    0    -1  
$EndComp
$Comp
L Device:CP C?
U 1 1 5F8BE4FB
P 10150 1000
AR Path="/5E179620/5E179864/5F8BE4FB" Ref="C?"  Part="1" 
AR Path="/5E182A9D/5F8A93F2/5F8BE4FB" Ref="C621"  Part="1" 
AR Path="/5E182A9D/5F8F0FFE/5F8BE4FB" Ref="C721"  Part="1" 
AR Path="/5E182A9D/5F8F1079/5F8BE4FB" Ref="C821"  Part="1" 
AR Path="/5E182A9D/5F8F10F2/5F8BE4FB" Ref="C921"  Part="1" 
F 0 "C821" H 10175 1100 50  0000 L CNN
F 1 "82uF" H 10175 900 50  0000 L CNN
F 2 "Capacitor_SMD:CP_Elec_10x10" H 10188 850 50  0001 C CNN
F 3 "~" H 10150 1000 50  0001 C CNN
F 4 "" H 10150 1000 50  0001 C CNN "PartNumber"
F 5 "63V" H 10150 1000 50  0001 C CNN "Voltage"
F 6 "1.4A" H 10150 1000 50  0001 C CNN "Ripple current"
F 7 "3000-0000000470" H 10150 1000 50  0001 C CNN "PartSpecification"
	1    10150 1000
	1    0    0    -1  
$EndComp
$Comp
L power:GND #PWR?
U 1 1 5F8BE501
P 10450 1250
AR Path="/5E179620/5E179864/5F8BE501" Ref="#PWR?"  Part="1" 
AR Path="/5E182A9D/5F8A93F2/5F8BE501" Ref="#PWR?"  Part="1" 
AR Path="/5E182A9D/5F8F0FFE/5F8BE501" Ref="#PWR?"  Part="1" 
AR Path="/5E182A9D/5F8F1079/5F8BE501" Ref="#PWR?"  Part="1" 
AR Path="/5E182A9D/5F8F10F2/5F8BE501" Ref="#PWR?"  Part="1" 
F 0 "#PWR?" H 10450 1000 50  0001 C CNN
F 1 "GND" H 10450 1100 50  0000 C CNN
F 2 "" H 10450 1250 50  0001 C CNN
F 3 "" H 10450 1250 50  0001 C CNN
	1    10450 1250
	1    0    0    -1  
$EndComp
$Comp
L power:GND #PWR?
U 1 1 5F8BE507
P 10150 1250
AR Path="/5E179620/5E179864/5F8BE507" Ref="#PWR?"  Part="1" 
AR Path="/5E182A9D/5F8A93F2/5F8BE507" Ref="#PWR?"  Part="1" 
AR Path="/5E182A9D/5F8F0FFE/5F8BE507" Ref="#PWR?"  Part="1" 
AR Path="/5E182A9D/5F8F1079/5F8BE507" Ref="#PWR?"  Part="1" 
AR Path="/5E182A9D/5F8F10F2/5F8BE507" Ref="#PWR?"  Part="1" 
F 0 "#PWR?" H 10150 1000 50  0001 C CNN
F 1 "GND" H 10150 1100 50  0000 C CNN
F 2 "" H 10150 1250 50  0001 C CNN
F 3 "" H 10150 1250 50  0001 C CNN
	1    10150 1250
	1    0    0    -1  
$EndComp
Wire Wire Line
	10150 1250 10150 1150
Wire Wire Line
	10450 1150 10450 1250
Wire Wire Line
	10150 850  10150 750 
Wire Wire Line
	10450 850  10450 750 
$Comp
L Device:CP C?
U 1 1 5F8BE514
P 9850 1000
AR Path="/5E179620/5E179864/5F8BE514" Ref="C?"  Part="1" 
AR Path="/5E182A9D/5F8A93F2/5F8BE514" Ref="C619"  Part="1" 
AR Path="/5E182A9D/5F8F0FFE/5F8BE514" Ref="C719"  Part="1" 
AR Path="/5E182A9D/5F8F1079/5F8BE514" Ref="C819"  Part="1" 
AR Path="/5E182A9D/5F8F10F2/5F8BE514" Ref="C919"  Part="1" 
F 0 "C819" H 9875 1100 50  0000 L CNN
F 1 "82uF" H 9875 900 50  0000 L CNN
F 2 "Capacitor_SMD:CP_Elec_10x10" H 9888 850 50  0001 C CNN
F 3 "~" H 9850 1000 50  0001 C CNN
F 4 "" H 9850 1000 50  0001 C CNN "PartNumber"
F 5 "63V" H 9850 1000 50  0001 C CNN "Voltage"
F 6 "1.4A" H 9850 1000 50  0001 C CNN "Ripple current"
F 7 "3000-0000000470" H 9850 1000 50  0001 C CNN "PartSpecification"
	1    9850 1000
	1    0    0    -1  
$EndComp
$Comp
L Device:CP C?
U 1 1 5F8BE51D
P 9550 1000
AR Path="/5E179620/5E179864/5F8BE51D" Ref="C?"  Part="1" 
AR Path="/5E182A9D/5F8A93F2/5F8BE51D" Ref="C616"  Part="1" 
AR Path="/5E182A9D/5F8F0FFE/5F8BE51D" Ref="C716"  Part="1" 
AR Path="/5E182A9D/5F8F1079/5F8BE51D" Ref="C816"  Part="1" 
AR Path="/5E182A9D/5F8F10F2/5F8BE51D" Ref="C916"  Part="1" 
F 0 "C816" H 9575 1100 50  0000 L CNN
F 1 "82uF" H 9575 900 50  0000 L CNN
F 2 "Capacitor_SMD:CP_Elec_10x10" H 9588 850 50  0001 C CNN
F 3 "~" H 9550 1000 50  0001 C CNN
F 4 "" H 9550 1000 50  0001 C CNN "PartNumber"
F 5 "63V" H 9550 1000 50  0001 C CNN "Voltage"
F 6 "1.4A" H 9550 1000 50  0001 C CNN "Ripple current"
F 7 "3000-0000000470" H 9550 1000 50  0001 C CNN "PartSpecification"
	1    9550 1000
	1    0    0    -1  
$EndComp
$Comp
L power:GND #PWR?
U 1 1 5F8BE523
P 9850 1250
AR Path="/5E179620/5E179864/5F8BE523" Ref="#PWR?"  Part="1" 
AR Path="/5E182A9D/5F8A93F2/5F8BE523" Ref="#PWR?"  Part="1" 
AR Path="/5E182A9D/5F8F0FFE/5F8BE523" Ref="#PWR?"  Part="1" 
AR Path="/5E182A9D/5F8F1079/5F8BE523" Ref="#PWR?"  Part="1" 
AR Path="/5E182A9D/5F8F10F2/5F8BE523" Ref="#PWR?"  Part="1" 
F 0 "#PWR?" H 9850 1000 50  0001 C CNN
F 1 "GND" H 9850 1100 50  0000 C CNN
F 2 "" H 9850 1250 50  0001 C CNN
F 3 "" H 9850 1250 50  0001 C CNN
	1    9850 1250
	1    0    0    -1  
$EndComp
$Comp
L power:GND #PWR?
U 1 1 5F8BE529
P 9550 1250
AR Path="/5E179620/5E179864/5F8BE529" Ref="#PWR?"  Part="1" 
AR Path="/5E182A9D/5F8A93F2/5F8BE529" Ref="#PWR?"  Part="1" 
AR Path="/5E182A9D/5F8F0FFE/5F8BE529" Ref="#PWR?"  Part="1" 
AR Path="/5E182A9D/5F8F1079/5F8BE529" Ref="#PWR?"  Part="1" 
AR Path="/5E182A9D/5F8F10F2/5F8BE529" Ref="#PWR?"  Part="1" 
F 0 "#PWR?" H 9550 1000 50  0001 C CNN
F 1 "GND" H 9550 1100 50  0000 C CNN
F 2 "" H 9550 1250 50  0001 C CNN
F 3 "" H 9550 1250 50  0001 C CNN
	1    9550 1250
	1    0    0    -1  
$EndComp
Wire Wire Line
	9550 1250 9550 1150
Wire Wire Line
	9850 1150 9850 1250
Wire Wire Line
	9550 850  9550 750 
Wire Wire Line
	9850 850  9850 750 
Wire Wire Line
	9550 750  9850 750 
Connection ~ 9850 750 
Connection ~ 10150 750 
Wire Wire Line
	10150 750  10450 750 
Connection ~ 10450 750 
Wire Wire Line
	9300 2100 9000 2100
Wire Wire Line
	8400 2500 8600 2500
$Comp
L Device:R R?
U 1 1 5F8BE53A
P 8250 3400
AR Path="/5E179620/5E179864/5F8BE53A" Ref="R?"  Part="1" 
AR Path="/5E182A9D/5F8A93F2/5F8BE53A" Ref="R624"  Part="1" 
AR Path="/5E182A9D/5F8F0FFE/5F8BE53A" Ref="R724"  Part="1" 
AR Path="/5E182A9D/5F8F1079/5F8BE53A" Ref="R824"  Part="1" 
AR Path="/5E182A9D/5F8F10F2/5F8BE53A" Ref="R924"  Part="1" 
F 0 "R824" V 8330 3400 50  0000 C CNN
F 1 "R" V 8250 3400 50  0000 C CNN
F 2 "Resistor_SMD:R_2512_6332Metric" V 8180 3400 50  0001 C CNN
F 3 "~" H 8250 3400 50  0001 C CNN
	1    8250 3400
	1    0    0    -1  
$EndComp
Wire Wire Line
	8250 3250 8250 3200
Wire Wire Line
	8250 3150 7900 3150
Wire Wire Line
	7900 3150 7900 3100
Connection ~ 7900 3100
Wire Wire Line
	8250 3150 8600 3150
Wire Wire Line
	8600 3150 8600 3100
Connection ~ 8250 3150
Connection ~ 8600 3100
$Comp
L power:GND #PWR?
U 1 1 5F8BE548
P 8600 3650
AR Path="/5E179620/5E179864/5F8BE548" Ref="#PWR?"  Part="1" 
AR Path="/5E182A9D/5F8A93F2/5F8BE548" Ref="#PWR?"  Part="1" 
AR Path="/5E182A9D/5F8F0FFE/5F8BE548" Ref="#PWR?"  Part="1" 
AR Path="/5E182A9D/5F8F1079/5F8BE548" Ref="#PWR?"  Part="1" 
AR Path="/5E182A9D/5F8F10F2/5F8BE548" Ref="#PWR?"  Part="1" 
F 0 "#PWR?" H 8600 3400 50  0001 C CNN
F 1 "GND" H 8600 3500 50  0000 C CNN
F 2 "" H 8600 3650 50  0001 C CNN
F 3 "" H 8600 3650 50  0001 C CNN
	1    8600 3650
	1    0    0    -1  
$EndComp
Wire Wire Line
	8250 3650 8250 3600
Wire Wire Line
	9100 2900 9100 3900
Wire Wire Line
	6700 3900 9100 3900
Wire Wire Line
	6700 4000 6850 4000
Wire Wire Line
	9200 4000 9200 2500
Wire Wire Line
	9200 2500 8600 2500
Wire Wire Line
	6700 4400 9300 4400
Wire Wire Line
	9300 4400 9300 2100
$Comp
L Device:C C?
U 1 1 5F8BE557
P 2100 1300
AR Path="/5E179620/5E179864/5F8BE557" Ref="C?"  Part="1" 
AR Path="/5E182A9D/5F8A93F2/5F8BE557" Ref="C603"  Part="1" 
AR Path="/5E182A9D/5F8F0FFE/5F8BE557" Ref="C703"  Part="1" 
AR Path="/5E182A9D/5F8F1079/5F8BE557" Ref="C803"  Part="1" 
AR Path="/5E182A9D/5F8F10F2/5F8BE557" Ref="C903"  Part="1" 
F 0 "C803" H 2125 1400 50  0000 L CNN
F 1 "10uF" H 2125 1200 50  0000 L CNN
F 2 "Capacitor_SMD:C_1210_3225Metric" H 2138 1150 50  0001 C CNN
F 3 "~" H 2100 1300 50  0001 C CNN
F 4 "60" H 2100 1300 50  0001 C CNN "Voltage"
F 5 "3000-0000000472" H 2100 1300 50  0001 C CNN "PartSpecification"
	1    2100 1300
	1    0    0    -1  
$EndComp
$Comp
L Device:R R?
U 1 1 5F8BE55D
P 7200 3600
AR Path="/5E179620/5E179864/5F8BE55D" Ref="R?"  Part="1" 
AR Path="/5E182A9D/5F8A93F2/5F8BE55D" Ref="R621"  Part="1" 
AR Path="/5E182A9D/5F8F0FFE/5F8BE55D" Ref="R721"  Part="1" 
AR Path="/5E182A9D/5F8F1079/5F8BE55D" Ref="R821"  Part="1" 
AR Path="/5E182A9D/5F8F10F2/5F8BE55D" Ref="R921"  Part="1" 
F 0 "R821" V 7280 3600 50  0000 C CNN
F 1 "100" V 7200 3600 50  0000 C CNN
F 2 "Resistor_SMD:R_0402_1005Metric" V 7130 3600 50  0001 C CNN
F 3 "~" H 7200 3600 50  0001 C CNN
F 4 "3000-0000000149" H 7200 3600 50  0001 C CNN "PartSpecification"
	1    7200 3600
	0    1    1    0   
$EndComp
$Comp
L Device:R R?
U 1 1 5F8BE563
P 7200 3200
AR Path="/5E179620/5E179864/5F8BE563" Ref="R?"  Part="1" 
AR Path="/5E182A9D/5F8A93F2/5F8BE563" Ref="R620"  Part="1" 
AR Path="/5E182A9D/5F8F0FFE/5F8BE563" Ref="R720"  Part="1" 
AR Path="/5E182A9D/5F8F1079/5F8BE563" Ref="R820"  Part="1" 
AR Path="/5E182A9D/5F8F10F2/5F8BE563" Ref="R920"  Part="1" 
F 0 "R820" V 7280 3200 50  0000 C CNN
F 1 "100" V 7200 3200 50  0000 C CNN
F 2 "Resistor_SMD:R_0402_1005Metric" V 7130 3200 50  0001 C CNN
F 3 "~" H 7200 3200 50  0001 C CNN
F 4 "3000-0000000149" H 7200 3200 50  0001 C CNN "PartSpecification"
	1    7200 3200
	0    1    1    0   
$EndComp
$Comp
L Device:C C?
U 1 1 5F8BE569
P 6850 3400
AR Path="/5E179620/5E179864/5F8BE569" Ref="C?"  Part="1" 
AR Path="/5E182A9D/5F8A93F2/5F8BE569" Ref="C613"  Part="1" 
AR Path="/5E182A9D/5F8F0FFE/5F8BE569" Ref="C713"  Part="1" 
AR Path="/5E182A9D/5F8F1079/5F8BE569" Ref="C813"  Part="1" 
AR Path="/5E182A9D/5F8F10F2/5F8BE569" Ref="C913"  Part="1" 
F 0 "C813" H 6875 3500 50  0000 L CNN
F 1 "C" H 6875 3300 50  0000 L CNN
F 2 "Capacitor_SMD:C_0402_1005Metric" H 6888 3250 50  0001 C CNN
F 3 "~" H 6850 3400 50  0001 C CNN
	1    6850 3400
	1    0    0    -1  
$EndComp
Wire Wire Line
	7050 3600 6850 3600
Wire Wire Line
	6850 3550 6850 3600
Connection ~ 6850 3600
Wire Wire Line
	6850 3600 6700 3600
Wire Wire Line
	7050 3200 6850 3200
Wire Wire Line
	6850 3250 6850 3200
Connection ~ 6850 3200
Wire Wire Line
	6850 3200 6700 3200
Wire Wire Line
	7350 3200 8250 3200
Connection ~ 8250 3200
Wire Wire Line
	8250 3200 8250 3150
Wire Wire Line
	7350 3600 8250 3600
Connection ~ 8250 3600
Wire Wire Line
	8250 3600 8250 3550
$Comp
L 000_PreferredParts:C_0_1uF C?
U 1 1 5F8BE580
P 6850 2350
AR Path="/5E179620/5E179864/5F8BE580" Ref="C?"  Part="1" 
AR Path="/5E182A9D/5F8A93F2/5F8BE580" Ref="C612"  Part="1" 
AR Path="/5E182A9D/5F8F0FFE/5F8BE580" Ref="C712"  Part="1" 
AR Path="/5E182A9D/5F8F1079/5F8BE580" Ref="C812"  Part="1" 
AR Path="/5E182A9D/5F8F10F2/5F8BE580" Ref="C912"  Part="1" 
F 0 "C812" H 6875 2450 50  0000 L CNN
F 1 "C_0_1uF" H 6875 2250 50  0001 L CNN
F 2 "Capacitor_SMD:C_0402_1005Metric" H 6888 2200 50  0001 C CNN
F 3 "~" H 6850 2350 50  0001 C CNN
F 4 "0.1uF" H 7000 2250 50  0000 C CNN "DisplayValue"
F 5 "3000-0000000125" H 6850 2350 50  0001 C CNN "PartSpecification"
F 6 "100V" H 6850 2350 50  0001 C CNN "Voltage"
	1    6850 2350
	1    0    0    -1  
$EndComp
Connection ~ 6850 2500
Wire Wire Line
	6850 2500 7900 2500
Wire Wire Line
	6850 2200 6700 2200
$Comp
L 000_PreferredDiodes:D_Schottky_60V_1A D?
U 1 1 5F8BE58C
P 6850 1850
AR Path="/5E179620/5E179864/5F8BE58C" Ref="D?"  Part="1" 
AR Path="/5E182A9D/5F8A93F2/5F8BE58C" Ref="D602"  Part="1" 
AR Path="/5E182A9D/5F8F0FFE/5F8BE58C" Ref="D702"  Part="1" 
AR Path="/5E182A9D/5F8F1079/5F8BE58C" Ref="D802"  Part="1" 
AR Path="/5E182A9D/5F8F10F2/5F8BE58C" Ref="D902"  Part="1" 
F 0 "D802" H 6850 1950 50  0000 C CNN
F 1 "D_Schottky_60V_1A" H 6850 1750 50  0001 C CNN
F 2 "Diode_SMD:D_SOD-123F" H 6850 1850 50  0001 C CNN
F 3 "~" H 6850 1850 50  0001 C CNN
F 4 "DSS16UTR" H 6850 1850 50  0001 C CNN "PartNumber"
F 5 "Schottky" H 6850 1750 50  0000 C CNN "DisplayValue"
F 6 "60V_1A" H 6850 1650 50  0000 C CNN "DisplayValue2"
F 7 "3000-0000000481" H 6850 1850 50  0001 C CNN "PartSpecification"
	1    6850 1850
	0    -1   -1   0   
$EndComp
Wire Wire Line
	6850 2000 6850 2200
Connection ~ 6850 2200
Wire Wire Line
	6850 1400 6400 1400
Connection ~ 6400 1400
Wire Wire Line
	6850 1400 6850 1700
$Comp
L 000_PreferredParts:C_0_1uF C?
U 1 1 5F8BE59A
P 6850 4150
AR Path="/5E179620/5E179864/5F8BE59A" Ref="C?"  Part="1" 
AR Path="/5E182A9D/5F8A93F2/5F8BE59A" Ref="C614"  Part="1" 
AR Path="/5E182A9D/5F8F0FFE/5F8BE59A" Ref="C714"  Part="1" 
AR Path="/5E182A9D/5F8F1079/5F8BE59A" Ref="C814"  Part="1" 
AR Path="/5E182A9D/5F8F10F2/5F8BE59A" Ref="C914"  Part="1" 
F 0 "C814" H 6875 4250 50  0000 L CNN
F 1 "C_0_1uF" H 6875 4050 50  0001 L CNN
F 2 "Capacitor_SMD:C_0402_1005Metric" H 6888 4000 50  0001 C CNN
F 3 "~" H 6850 4150 50  0001 C CNN
F 4 "0.1uF" H 7000 4050 50  0000 C CNN "DisplayValue"
F 5 "3000-0000000125" H 6850 4150 50  0001 C CNN "PartSpecification"
F 6 "100V" H 6850 4150 50  0001 C CNN "Voltage"
	1    6850 4150
	1    0    0    -1  
$EndComp
Connection ~ 6850 4000
Wire Wire Line
	6850 4000 9200 4000
Wire Wire Line
	6700 4300 6850 4300
$Comp
L 000_PreferredDiodes:D_Schottky_60V_1A D?
U 1 1 5F8BE5A6
P 7150 4300
AR Path="/5E179620/5E179864/5F8BE5A6" Ref="D?"  Part="1" 
AR Path="/5E182A9D/5F8A93F2/5F8BE5A6" Ref="D603"  Part="1" 
AR Path="/5E182A9D/5F8F0FFE/5F8BE5A6" Ref="D703"  Part="1" 
AR Path="/5E182A9D/5F8F1079/5F8BE5A6" Ref="D803"  Part="1" 
AR Path="/5E182A9D/5F8F10F2/5F8BE5A6" Ref="D903"  Part="1" 
F 0 "D803" H 7150 4400 50  0000 C CNN
F 1 "D_Schottky_60V_1A" H 7150 4200 50  0001 C CNN
F 2 "Diode_SMD:D_SOD-123F" H 7150 4300 50  0001 C CNN
F 3 "~" H 7150 4300 50  0001 C CNN
F 4 "DSS16UTR" H 7150 4300 50  0001 C CNN "PartNumber"
F 5 "Schottky" H 7150 4200 50  0000 C CNN "DisplayValue"
F 6 "60V_1A" H 7150 4100 50  0000 C CNN "DisplayValue2"
F 7 "3000-0000000481" H 7150 4300 50  0001 C CNN "PartSpecification"
	1    7150 4300
	1    0    0    -1  
$EndComp
Wire Wire Line
	7000 4300 6850 4300
Connection ~ 6850 4300
Wire Wire Line
	6850 1400 7200 1400
Connection ~ 6850 1400
Text Label 7200 1400 0    50   ~ 0
VCC
Text Label 7400 4300 0    50   ~ 0
VCC
Wire Wire Line
	7400 4300 7300 4300
Wire Wire Line
	7700 1900 7800 1900
Connection ~ 7800 1900
Wire Wire Line
	7800 1900 7900 1900
Connection ~ 7900 1900
Wire Wire Line
	7900 1900 8000 1900
Wire Wire Line
	8000 1900 8000 1050
Wire Wire Line
	2500 1050 7500 1050
Connection ~ 8000 1900
Wire Wire Line
	8500 1900 8600 1900
Connection ~ 8600 1900
Wire Wire Line
	8600 1900 8700 1900
Connection ~ 8700 1900
Wire Wire Line
	8700 1900 8800 1900
Connection ~ 8800 1900
Wire Wire Line
	8800 1900 9400 1900
Wire Wire Line
	9850 750  10150 750 
Wire Wire Line
	10450 750  10850 750 
Wire Wire Line
	10850 1900 10850 750 
Connection ~ 10850 750 
Wire Wire Line
	10850 750  10950 750 
$Comp
L Device:C C?
U 1 1 5F8BE5D1
P 4700 3150
AR Path="/5E179620/5E179864/5F8BE5D1" Ref="C?"  Part="1" 
AR Path="/5E182A9D/5F8A93F2/5F8BE5D1" Ref="C610"  Part="1" 
AR Path="/5E182A9D/5F8F0FFE/5F8BE5D1" Ref="C710"  Part="1" 
AR Path="/5E182A9D/5F8F1079/5F8BE5D1" Ref="C810"  Part="1" 
AR Path="/5E182A9D/5F8F10F2/5F8BE5D1" Ref="C910"  Part="1" 
F 0 "C810" H 4725 3250 50  0000 L CNN
F 1 "C" H 4725 3050 50  0000 L CNN
F 2 "Capacitor_SMD:C_0402_1005Metric" H 4738 3000 50  0001 C CNN
F 3 "~" H 4700 3150 50  0001 C CNN
	1    4700 3150
	1    0    0    -1  
$EndComp
Wire Wire Line
	5300 3000 4700 3000
$Comp
L power:GND #PWR?
U 1 1 5F8BE5D8
P 4700 3400
AR Path="/5E179620/5E179864/5F8BE5D8" Ref="#PWR?"  Part="1" 
AR Path="/5E182A9D/5F8A93F2/5F8BE5D8" Ref="#PWR?"  Part="1" 
AR Path="/5E182A9D/5F8F0FFE/5F8BE5D8" Ref="#PWR?"  Part="1" 
AR Path="/5E182A9D/5F8F1079/5F8BE5D8" Ref="#PWR?"  Part="1" 
AR Path="/5E182A9D/5F8F10F2/5F8BE5D8" Ref="#PWR?"  Part="1" 
F 0 "#PWR?" H 4700 3150 50  0001 C CNN
F 1 "GND" H 4700 3250 50  0000 C CNN
F 2 "" H 4700 3400 50  0001 C CNN
F 3 "" H 4700 3400 50  0001 C CNN
	1    4700 3400
	1    0    0    -1  
$EndComp
Wire Wire Line
	4700 3400 4700 3300
$Comp
L Device:R R?
U 1 1 5F8BE5DF
P 5200 1800
AR Path="/5E179620/5E179864/5F8BE5DF" Ref="R?"  Part="1" 
AR Path="/5E182A9D/5F8A93F2/5F8BE5DF" Ref="R618"  Part="1" 
AR Path="/5E182A9D/5F8F0FFE/5F8BE5DF" Ref="R718"  Part="1" 
AR Path="/5E182A9D/5F8F1079/5F8BE5DF" Ref="R818"  Part="1" 
AR Path="/5E182A9D/5F8F10F2/5F8BE5DF" Ref="R918"  Part="1" 
F 0 "R818" V 5280 1800 50  0000 C CNN
F 1 "10k" V 5200 1800 50  0000 C CNN
F 2 "Resistor_SMD:R_0402_1005Metric" V 5130 1800 50  0001 C CNN
F 3 "~" H 5200 1800 50  0001 C CNN
F 4 "3000-0000000131" H 5200 1800 50  0001 C CNN "PartSpecification"
	1    5200 1800
	1    0    0    -1  
$EndComp
Wire Wire Line
	5200 1950 5200 3300
Wire Wire Line
	5200 3300 5300 3300
Connection ~ 5200 3300
Wire Wire Line
	5200 1400 5200 1650
Wire Wire Line
	5200 1400 6100 1400
Connection ~ 6100 1400
$Comp
L Device:C C?
U 1 1 5F8BE5EC
P 4000 4450
AR Path="/5E179620/5E179864/5F8BE5EC" Ref="C?"  Part="1" 
AR Path="/5E182A9D/5F8A93F2/5F8BE5EC" Ref="C607"  Part="1" 
AR Path="/5E182A9D/5F8F0FFE/5F8BE5EC" Ref="C707"  Part="1" 
AR Path="/5E182A9D/5F8F1079/5F8BE5EC" Ref="C807"  Part="1" 
AR Path="/5E182A9D/5F8F10F2/5F8BE5EC" Ref="C907"  Part="1" 
F 0 "C807" H 4025 4550 50  0000 L CNN
F 1 "C" H 4025 4350 50  0000 L CNN
F 2 "Capacitor_SMD:C_0402_1005Metric" H 4038 4300 50  0001 C CNN
F 3 "~" H 4000 4450 50  0001 C CNN
	1    4000 4450
	1    0    0    -1  
$EndComp
$Comp
L Device:C C?
U 1 1 5F8BE5F2
P 4500 4450
AR Path="/5E179620/5E179864/5F8BE5F2" Ref="C?"  Part="1" 
AR Path="/5E182A9D/5F8A93F2/5F8BE5F2" Ref="C609"  Part="1" 
AR Path="/5E182A9D/5F8F0FFE/5F8BE5F2" Ref="C709"  Part="1" 
AR Path="/5E182A9D/5F8F1079/5F8BE5F2" Ref="C809"  Part="1" 
AR Path="/5E182A9D/5F8F10F2/5F8BE5F2" Ref="C909"  Part="1" 
F 0 "C809" H 4525 4550 50  0000 L CNN
F 1 "C" H 4525 4350 50  0000 L CNN
F 2 "Capacitor_SMD:C_0402_1005Metric" H 4538 4300 50  0001 C CNN
F 3 "~" H 4500 4450 50  0001 C CNN
	1    4500 4450
	1    0    0    -1  
$EndComp
$Comp
L Device:R R?
U 1 1 5F8BE5F8
P 4500 4950
AR Path="/5E179620/5E179864/5F8BE5F8" Ref="R?"  Part="1" 
AR Path="/5E182A9D/5F8A93F2/5F8BE5F8" Ref="R614"  Part="1" 
AR Path="/5E182A9D/5F8F0FFE/5F8BE5F8" Ref="R714"  Part="1" 
AR Path="/5E182A9D/5F8F1079/5F8BE5F8" Ref="R814"  Part="1" 
AR Path="/5E182A9D/5F8F10F2/5F8BE5F8" Ref="R914"  Part="1" 
F 0 "R814" V 4580 4950 50  0000 C CNN
F 1 "R" V 4500 4950 50  0000 C CNN
F 2 "Resistor_SMD:R_0402_1005Metric" V 4430 4950 50  0001 C CNN
F 3 "~" H 4500 4950 50  0001 C CNN
	1    4500 4950
	1    0    0    -1  
$EndComp
$Comp
L power:GND #PWR?
U 1 1 5F8BE5FE
P 4000 4700
AR Path="/5E179620/5E179864/5F8BE5FE" Ref="#PWR?"  Part="1" 
AR Path="/5E182A9D/5F8A93F2/5F8BE5FE" Ref="#PWR?"  Part="1" 
AR Path="/5E182A9D/5F8F0FFE/5F8BE5FE" Ref="#PWR?"  Part="1" 
AR Path="/5E182A9D/5F8F1079/5F8BE5FE" Ref="#PWR?"  Part="1" 
AR Path="/5E182A9D/5F8F10F2/5F8BE5FE" Ref="#PWR?"  Part="1" 
F 0 "#PWR?" H 4000 4450 50  0001 C CNN
F 1 "GND" H 4000 4550 50  0000 C CNN
F 2 "" H 4000 4700 50  0001 C CNN
F 3 "" H 4000 4700 50  0001 C CNN
	1    4000 4700
	1    0    0    -1  
$EndComp
$Comp
L power:GND #PWR?
U 1 1 5F8BE604
P 4500 5200
AR Path="/5E179620/5E179864/5F8BE604" Ref="#PWR?"  Part="1" 
AR Path="/5E182A9D/5F8A93F2/5F8BE604" Ref="#PWR?"  Part="1" 
AR Path="/5E182A9D/5F8F0FFE/5F8BE604" Ref="#PWR?"  Part="1" 
AR Path="/5E182A9D/5F8F1079/5F8BE604" Ref="#PWR?"  Part="1" 
AR Path="/5E182A9D/5F8F10F2/5F8BE604" Ref="#PWR?"  Part="1" 
F 0 "#PWR?" H 4500 4950 50  0001 C CNN
F 1 "GND" H 4500 5050 50  0000 C CNN
F 2 "" H 4500 5200 50  0001 C CNN
F 3 "" H 4500 5200 50  0001 C CNN
	1    4500 5200
	1    0    0    -1  
$EndComp
Wire Wire Line
	4500 5200 4500 5100
Wire Wire Line
	4500 4800 4500 4600
Wire Wire Line
	4000 4700 4000 4600
Wire Wire Line
	4000 4300 4000 4200
Wire Wire Line
	4000 4200 4500 4200
Wire Wire Line
	4500 4200 4500 4300
Wire Wire Line
	4500 4200 4500 3800
Wire Wire Line
	4500 3800 5300 3800
Connection ~ 4500 4200
$Comp
L power:GND #PWR?
U 1 1 5F8BE613
P 5900 5850
AR Path="/5E179620/5E179864/5F8BE613" Ref="#PWR?"  Part="1" 
AR Path="/5E182A9D/5F8A93F2/5F8BE613" Ref="#PWR?"  Part="1" 
AR Path="/5E182A9D/5F8F0FFE/5F8BE613" Ref="#PWR?"  Part="1" 
AR Path="/5E182A9D/5F8F1079/5F8BE613" Ref="#PWR?"  Part="1" 
AR Path="/5E182A9D/5F8F10F2/5F8BE613" Ref="#PWR?"  Part="1" 
F 0 "#PWR?" H 5900 5600 50  0001 C CNN
F 1 "GND" H 5900 5700 50  0000 C CNN
F 2 "" H 5900 5850 50  0001 C CNN
F 3 "" H 5900 5850 50  0001 C CNN
	1    5900 5850
	1    0    0    -1  
$EndComp
$Comp
L power:GND #PWR?
U 1 1 5F8BE619
P 6000 5850
AR Path="/5E179620/5E179864/5F8BE619" Ref="#PWR?"  Part="1" 
AR Path="/5E182A9D/5F8A93F2/5F8BE619" Ref="#PWR?"  Part="1" 
AR Path="/5E182A9D/5F8F0FFE/5F8BE619" Ref="#PWR?"  Part="1" 
AR Path="/5E182A9D/5F8F1079/5F8BE619" Ref="#PWR?"  Part="1" 
AR Path="/5E182A9D/5F8F10F2/5F8BE619" Ref="#PWR?"  Part="1" 
F 0 "#PWR?" H 6000 5600 50  0001 C CNN
F 1 "GND" H 6000 5700 50  0000 C CNN
F 2 "" H 6000 5850 50  0001 C CNN
F 3 "" H 6000 5850 50  0001 C CNN
	1    6000 5850
	1    0    0    -1  
$EndComp
$Comp
L power:GND #PWR?
U 1 1 5F8BE61F
P 6100 5850
AR Path="/5E179620/5E179864/5F8BE61F" Ref="#PWR?"  Part="1" 
AR Path="/5E182A9D/5F8A93F2/5F8BE61F" Ref="#PWR?"  Part="1" 
AR Path="/5E182A9D/5F8F0FFE/5F8BE61F" Ref="#PWR?"  Part="1" 
AR Path="/5E182A9D/5F8F1079/5F8BE61F" Ref="#PWR?"  Part="1" 
AR Path="/5E182A9D/5F8F10F2/5F8BE61F" Ref="#PWR?"  Part="1" 
F 0 "#PWR?" H 6100 5600 50  0001 C CNN
F 1 "GND" H 6100 5700 50  0000 C CNN
F 2 "" H 6100 5850 50  0001 C CNN
F 3 "" H 6100 5850 50  0001 C CNN
	1    6100 5850
	1    0    0    -1  
$EndComp
Connection ~ 10850 1900
Wire Wire Line
	10850 1900 10850 4600
$Comp
L 000_PreferredParts:C_0_1uF C?
U 1 1 5F8BE645
P 3700 3850
AR Path="/5E179620/5E179864/5F8BE645" Ref="C?"  Part="1" 
AR Path="/5E182A9D/5F8A93F2/5F8BE645" Ref="C606"  Part="1" 
AR Path="/5E182A9D/5F8F0FFE/5F8BE645" Ref="C706"  Part="1" 
AR Path="/5E182A9D/5F8F1079/5F8BE645" Ref="C806"  Part="1" 
AR Path="/5E182A9D/5F8F10F2/5F8BE645" Ref="C906"  Part="1" 
F 0 "C806" H 3725 3950 50  0000 L CNN
F 1 "C_0_1uF" H 3725 3750 50  0001 L CNN
F 2 "Capacitor_SMD:C_0402_1005Metric" H 3738 3700 50  0001 C CNN
F 3 "~" H 3700 3850 50  0001 C CNN
F 4 "0.1uF" H 3850 3750 50  0000 C CNN "DisplayValue"
F 5 "3000-0000000125" H 3700 3850 50  0001 C CNN "PartSpecification"
F 6 "100V" H 3700 3850 50  0001 C CNN "Voltage"
	1    3700 3850
	1    0    0    -1  
$EndComp
Wire Wire Line
	3700 3700 3700 3600
Wire Wire Line
	3700 3600 5300 3600
$Comp
L power:GND #PWR?
U 1 1 5F8BE64D
P 3700 4100
AR Path="/5E179620/5E179864/5F8BE64D" Ref="#PWR?"  Part="1" 
AR Path="/5E182A9D/5F8A93F2/5F8BE64D" Ref="#PWR?"  Part="1" 
AR Path="/5E182A9D/5F8F0FFE/5F8BE64D" Ref="#PWR?"  Part="1" 
AR Path="/5E182A9D/5F8F1079/5F8BE64D" Ref="#PWR?"  Part="1" 
AR Path="/5E182A9D/5F8F10F2/5F8BE64D" Ref="#PWR?"  Part="1" 
F 0 "#PWR?" H 3700 3850 50  0001 C CNN
F 1 "GND" H 3700 3950 50  0000 C CNN
F 2 "" H 3700 4100 50  0001 C CNN
F 3 "" H 3700 4100 50  0001 C CNN
	1    3700 4100
	1    0    0    -1  
$EndComp
Wire Wire Line
	3700 4100 3700 4000
Wire Wire Line
	6700 4600 7650 4600
$Comp
L Device:R R?
U 1 1 5F8BE657
P 7650 4750
AR Path="/5E179620/5E179864/5F8BE657" Ref="R?"  Part="1" 
AR Path="/5E182A9D/5F8A93F2/5F8BE657" Ref="R622"  Part="1" 
AR Path="/5E182A9D/5F8F0FFE/5F8BE657" Ref="R722"  Part="1" 
AR Path="/5E182A9D/5F8F1079/5F8BE657" Ref="R822"  Part="1" 
AR Path="/5E182A9D/5F8F10F2/5F8BE657" Ref="R922"  Part="1" 
F 0 "R822" V 7730 4750 50  0000 C CNN
F 1 "11.3k" V 7650 4750 50  0000 C CNN
F 2 "Resistor_SMD:R_0402_1005Metric" V 7580 4750 50  0001 C CNN
F 3 "~" H 7650 4750 50  0001 C CNN
F 4 "3000-0000000576" H 7650 4750 50  0001 C CNN "PartSpecification"
	1    7650 4750
	-1   0    0    1   
$EndComp
Connection ~ 7650 4600
Wire Wire Line
	7650 4600 10500 4600
Wire Wire Line
	6700 4900 7650 4900
$Comp
L Device:R R?
U 1 1 5F8BE660
P 7650 5750
AR Path="/5E179620/5E179864/5F8BE660" Ref="R?"  Part="1" 
AR Path="/5E182A9D/5F8A93F2/5F8BE660" Ref="R623"  Part="1" 
AR Path="/5E182A9D/5F8F0FFE/5F8BE660" Ref="R723"  Part="1" 
AR Path="/5E182A9D/5F8F1079/5F8BE660" Ref="R823"  Part="1" 
AR Path="/5E182A9D/5F8F10F2/5F8BE660" Ref="R923"  Part="1" 
F 0 "R823" V 7730 5750 50  0000 C CNN
F 1 "100k" V 7650 5750 50  0000 C CNN
F 2 "Resistor_SMD:R_0402_1005Metric" V 7580 5750 50  0001 C CNN
F 3 "~" H 7650 5750 50  0001 C CNN
F 4 "3000-0000000575" H 7650 5750 50  0001 C CNN "PartSpecification"
	1    7650 5750
	-1   0    0    1   
$EndComp
Connection ~ 7650 4900
$Comp
L power:GND #PWR?
U 1 1 5F8BE668
P 7650 6000
AR Path="/5E179620/5E179864/5F8BE668" Ref="#PWR?"  Part="1" 
AR Path="/5E182A9D/5F8A93F2/5F8BE668" Ref="#PWR?"  Part="1" 
AR Path="/5E182A9D/5F8F0FFE/5F8BE668" Ref="#PWR?"  Part="1" 
AR Path="/5E182A9D/5F8F1079/5F8BE668" Ref="#PWR?"  Part="1" 
AR Path="/5E182A9D/5F8F10F2/5F8BE668" Ref="#PWR?"  Part="1" 
F 0 "#PWR?" H 7650 5750 50  0001 C CNN
F 1 "GND" H 7650 5850 50  0000 C CNN
F 2 "" H 7650 6000 50  0001 C CNN
F 3 "" H 7650 6000 50  0001 C CNN
	1    7650 6000
	1    0    0    -1  
$EndComp
Wire Wire Line
	7650 6000 7650 5900
Wire Wire Line
	6100 5850 6100 5750
Wire Wire Line
	6000 5750 6000 5850
Wire Wire Line
	5900 5750 5900 5850
$Comp
L 000_PreferredParts:C_10uF_0805 C?
U 1 1 5F8BE675
P 9400 2150
AR Path="/5E179620/5E179864/5F8BE675" Ref="C?"  Part="1" 
AR Path="/5E182A9D/5F8A93F2/5F8BE675" Ref="C615"  Part="1" 
AR Path="/5E182A9D/5F8F0FFE/5F8BE675" Ref="C715"  Part="1" 
AR Path="/5E182A9D/5F8F1079/5F8BE675" Ref="C815"  Part="1" 
AR Path="/5E182A9D/5F8F10F2/5F8BE675" Ref="C915"  Part="1" 
F 0 "C815" H 9425 2250 50  0000 L CNN
F 1 "C_10uF_0805" H 9425 2050 50  0001 L CNN
F 2 "Capacitor_SMD:C_0805_2012Metric" H 9438 2000 50  0001 C CNN
F 3 "~" H 9400 2150 50  0001 C CNN
F 4 "10uF" H 9550 2050 50  0000 C CNN "DisplayValue"
F 5 "0805" H 9550 1950 50  0000 C CNN "DisplayFootprint"
F 6 "3000-0000000134" H 9400 2150 50  0001 C CNN "PartSpecification"
	1    9400 2150
	1    0    0    -1  
$EndComp
$Comp
L 000_PreferredParts:C_10uF_0805 C?
U 1 1 5F8BE67E
P 9600 2150
AR Path="/5E179620/5E179864/5F8BE67E" Ref="C?"  Part="1" 
AR Path="/5E182A9D/5F8A93F2/5F8BE67E" Ref="C617"  Part="1" 
AR Path="/5E182A9D/5F8F0FFE/5F8BE67E" Ref="C717"  Part="1" 
AR Path="/5E182A9D/5F8F1079/5F8BE67E" Ref="C817"  Part="1" 
AR Path="/5E182A9D/5F8F10F2/5F8BE67E" Ref="C917"  Part="1" 
F 0 "C817" H 9625 2250 50  0000 L CNN
F 1 "C_10uF_0805" H 9625 2050 50  0001 L CNN
F 2 "Capacitor_SMD:C_0805_2012Metric" H 9638 2000 50  0001 C CNN
F 3 "~" H 9600 2150 50  0001 C CNN
F 4 "10uF" H 9750 2050 50  0000 C CNN "DisplayValue"
F 5 "0805" H 9750 1950 50  0000 C CNN "DisplayFootprint"
F 6 "3000-0000000134" H 9600 2150 50  0001 C CNN "PartSpecification"
	1    9600 2150
	1    0    0    -1  
$EndComp
$Comp
L 000_PreferredParts:C_10uF_0805 C?
U 1 1 5F8BE687
P 9800 2150
AR Path="/5E179620/5E179864/5F8BE687" Ref="C?"  Part="1" 
AR Path="/5E182A9D/5F8A93F2/5F8BE687" Ref="C618"  Part="1" 
AR Path="/5E182A9D/5F8F0FFE/5F8BE687" Ref="C718"  Part="1" 
AR Path="/5E182A9D/5F8F1079/5F8BE687" Ref="C818"  Part="1" 
AR Path="/5E182A9D/5F8F10F2/5F8BE687" Ref="C918"  Part="1" 
F 0 "C818" H 9825 2250 50  0000 L CNN
F 1 "C_10uF_0805" H 9825 2050 50  0001 L CNN
F 2 "Capacitor_SMD:C_0805_2012Metric" H 9838 2000 50  0001 C CNN
F 3 "~" H 9800 2150 50  0001 C CNN
F 4 "10uF" H 9950 2050 50  0000 C CNN "DisplayValue"
F 5 "0805" H 9950 1950 50  0000 C CNN "DisplayFootprint"
F 6 "3000-0000000134" H 9800 2150 50  0001 C CNN "PartSpecification"
	1    9800 2150
	1    0    0    -1  
$EndComp
$Comp
L 000_PreferredParts:C_10uF_0805 C?
U 1 1 5F8BE690
P 10000 2150
AR Path="/5E179620/5E179864/5F8BE690" Ref="C?"  Part="1" 
AR Path="/5E182A9D/5F8A93F2/5F8BE690" Ref="C620"  Part="1" 
AR Path="/5E182A9D/5F8F0FFE/5F8BE690" Ref="C720"  Part="1" 
AR Path="/5E182A9D/5F8F1079/5F8BE690" Ref="C820"  Part="1" 
AR Path="/5E182A9D/5F8F10F2/5F8BE690" Ref="C920"  Part="1" 
F 0 "C820" H 10025 2250 50  0000 L CNN
F 1 "C_10uF_0805" H 10025 2050 50  0001 L CNN
F 2 "Capacitor_SMD:C_0805_2012Metric" H 10038 2000 50  0001 C CNN
F 3 "~" H 10000 2150 50  0001 C CNN
F 4 "10uF" H 10150 2050 50  0000 C CNN "DisplayValue"
F 5 "0805" H 10150 1950 50  0000 C CNN "DisplayFootprint"
F 6 "3000-0000000134" H 10000 2150 50  0001 C CNN "PartSpecification"
	1    10000 2150
	1    0    0    -1  
$EndComp
$Comp
L 000_PreferredParts:C_10uF_0805 C?
U 1 1 5F8BE699
P 10200 2150
AR Path="/5E179620/5E179864/5F8BE699" Ref="C?"  Part="1" 
AR Path="/5E182A9D/5F8A93F2/5F8BE699" Ref="C623"  Part="1" 
AR Path="/5E182A9D/5F8F0FFE/5F8BE699" Ref="C723"  Part="1" 
AR Path="/5E182A9D/5F8F1079/5F8BE699" Ref="C823"  Part="1" 
AR Path="/5E182A9D/5F8F10F2/5F8BE699" Ref="C923"  Part="1" 
F 0 "C823" H 10225 2250 50  0000 L CNN
F 1 "C_10uF_0805" H 10225 2050 50  0001 L CNN
F 2 "Capacitor_SMD:C_0805_2012Metric" H 10238 2000 50  0001 C CNN
F 3 "~" H 10200 2150 50  0001 C CNN
F 4 "10uF" H 10350 2050 50  0000 C CNN "DisplayValue"
F 5 "0805" H 10350 1950 50  0000 C CNN "DisplayFootprint"
F 6 "3000-0000000134" H 10200 2150 50  0001 C CNN "PartSpecification"
	1    10200 2150
	1    0    0    -1  
$EndComp
$Comp
L power:GND #PWR?
U 1 1 5F8BE69F
P 9800 2500
AR Path="/5E179620/5E179864/5F8BE69F" Ref="#PWR?"  Part="1" 
AR Path="/5E182A9D/5F8A93F2/5F8BE69F" Ref="#PWR?"  Part="1" 
AR Path="/5E182A9D/5F8F0FFE/5F8BE69F" Ref="#PWR?"  Part="1" 
AR Path="/5E182A9D/5F8F1079/5F8BE69F" Ref="#PWR?"  Part="1" 
AR Path="/5E182A9D/5F8F10F2/5F8BE69F" Ref="#PWR?"  Part="1" 
F 0 "#PWR?" H 9800 2250 50  0001 C CNN
F 1 "GND" H 9800 2350 50  0000 C CNN
F 2 "" H 9800 2500 50  0001 C CNN
F 3 "" H 9800 2500 50  0001 C CNN
	1    9800 2500
	1    0    0    -1  
$EndComp
Wire Wire Line
	9800 2500 9800 2400
Wire Wire Line
	9800 2400 10000 2400
Wire Wire Line
	10200 2400 10200 2300
Connection ~ 9800 2400
Wire Wire Line
	9800 2400 9800 2300
Wire Wire Line
	10000 2300 10000 2400
Connection ~ 10000 2400
Wire Wire Line
	10000 2400 10200 2400
Wire Wire Line
	9400 2400 9400 2300
Wire Wire Line
	9600 2300 9600 2400
Connection ~ 9600 2400
Wire Wire Line
	9600 2400 9400 2400
Wire Wire Line
	9600 2400 9800 2400
Wire Wire Line
	9400 2000 9400 1900
Connection ~ 9400 1900
Wire Wire Line
	9400 1900 9600 1900
Wire Wire Line
	9600 1900 9600 2000
Connection ~ 9600 1900
Wire Wire Line
	9600 1900 9800 1900
Wire Wire Line
	9800 2000 9800 1900
Connection ~ 9800 1900
Wire Wire Line
	9800 1900 10000 1900
Wire Wire Line
	10000 1900 10000 2000
Connection ~ 10000 1900
Wire Wire Line
	10000 1900 10200 1900
Wire Wire Line
	10200 2000 10200 1900
Connection ~ 10200 1900
Wire Wire Line
	2500 1550 2500 1450
Wire Wire Line
	2500 2100 2500 1850
$Comp
L Switch:SW_DIP_x08 SW?
U 1 1 5F8CA795
P 6600 6900
AR Path="/5F8CA795" Ref="SW?"  Part="1" 
AR Path="/5E182A9D/5F8CA795" Ref="SW?"  Part="1" 
AR Path="/5E182A9D/5F8A93F2/5F8CA795" Ref="SW601"  Part="1" 
AR Path="/5E182A9D/5F8F0FFE/5F8CA795" Ref="SW701"  Part="1" 
AR Path="/5E182A9D/5F8F1079/5F8CA795" Ref="SW801"  Part="1" 
AR Path="/5E182A9D/5F8F10F2/5F8CA795" Ref="SW901"  Part="1" 
F 0 "SW801" H 6600 7450 50  0000 C CNN
F 1 "SW_DIP_x08" H 6600 6450 50  0000 C CNN
F 2 "Package_DIP:SMDIP-16_W7.62mm" H 6600 6900 50  0001 C CNN
F 3 "~" H 6600 6900 50  0001 C CNN
F 4 "CT2198LPST-ND" H 6600 6900 50  0001 C CNN "PartNumber"
F 5 "3000-0000000501" H 6600 6900 50  0001 C CNN "PartSpecification"
	1    6600 6900
	-1   0    0    -1  
$EndComp
$Comp
L power:GND #PWR?
U 1 1 5E573A85
P 6800 5550
AR Path="/5E179620/5E179864/5E573A85" Ref="#PWR?"  Part="1" 
AR Path="/5E182A9D/5F8A93F2/5E573A85" Ref="#PWR?"  Part="1" 
AR Path="/5E182A9D/5F8F0FFE/5E573A85" Ref="#PWR?"  Part="1" 
AR Path="/5E182A9D/5F8F1079/5E573A85" Ref="#PWR?"  Part="1" 
AR Path="/5E182A9D/5F8F10F2/5E573A85" Ref="#PWR?"  Part="1" 
F 0 "#PWR?" H 6800 5300 50  0001 C CNN
F 1 "GND" H 6800 5400 50  0000 C CNN
F 2 "" H 6800 5550 50  0001 C CNN
F 3 "" H 6800 5550 50  0001 C CNN
	1    6800 5550
	1    0    0    -1  
$EndComp
Wire Wire Line
	6800 5550 6800 5450
Wire Wire Line
	6800 5150 6700 5150
Wire Wire Line
	6700 5450 6800 5450
Connection ~ 6800 5450
Wire Wire Line
	6800 5450 6800 5150
Wire Wire Line
	10200 1900 10850 1900
$Comp
L Device:R R?
U 1 1 5E730894
P 10500 5450
AR Path="/5E179620/5E730894" Ref="R?"  Part="1" 
AR Path="/5E182A9D/5F8F0FFE/5E730894" Ref="R726"  Part="1" 
AR Path="/5E182A9D/5F8A93F2/5E730894" Ref="R626"  Part="1" 
AR Path="/5E182A9D/5F8F1079/5E730894" Ref="R826"  Part="1" 
AR Path="/5E182A9D/5F8F10F2/5E730894" Ref="R926"  Part="1" 
F 0 "R826" V 10580 5450 50  0000 C CNN
F 1 "R" V 10500 5450 50  0000 C CNN
F 2 "Resistor_SMD:R_0402_1005Metric" V 10430 5450 50  0001 C CNN
F 3 "~" H 10500 5450 50  0001 C CNN
	1    10500 5450
	1    0    0    -1  
$EndComp
$Comp
L Device:R R?
U 1 1 5E73089A
P 10500 5050
AR Path="/5E179620/5E73089A" Ref="R?"  Part="1" 
AR Path="/5E182A9D/5F8F0FFE/5E73089A" Ref="R725"  Part="1" 
AR Path="/5E182A9D/5F8A93F2/5E73089A" Ref="R625"  Part="1" 
AR Path="/5E182A9D/5F8F1079/5E73089A" Ref="R825"  Part="1" 
AR Path="/5E182A9D/5F8F10F2/5E73089A" Ref="R925"  Part="1" 
F 0 "R825" V 10580 5050 50  0000 C CNN
F 1 "R" V 10500 5050 50  0000 C CNN
F 2 "Resistor_SMD:R_0402_1005Metric" V 10430 5050 50  0001 C CNN
F 3 "~" H 10500 5050 50  0001 C CNN
	1    10500 5050
	1    0    0    -1  
$EndComp
Wire Wire Line
	10500 5200 10500 5250
$Comp
L power:GND #PWR?
U 1 1 5E7308A1
P 10500 5700
AR Path="/5E179620/5E7308A1" Ref="#PWR?"  Part="1" 
AR Path="/5E182A9D/5F8F0FFE/5E7308A1" Ref="#PWR?"  Part="1" 
AR Path="/5E182A9D/5F8A93F2/5E7308A1" Ref="#PWR?"  Part="1" 
AR Path="/5E182A9D/5F8F1079/5E7308A1" Ref="#PWR?"  Part="1" 
AR Path="/5E182A9D/5F8F10F2/5E7308A1" Ref="#PWR?"  Part="1" 
F 0 "#PWR?" H 10500 5450 50  0001 C CNN
F 1 "GND" H 10500 5550 50  0000 C CNN
F 2 "" H 10500 5700 50  0001 C CNN
F 3 "" H 10500 5700 50  0001 C CNN
	1    10500 5700
	1    0    0    -1  
$EndComp
Wire Wire Line
	10500 5700 10500 5600
Wire Wire Line
	10150 5250 10500 5250
Connection ~ 10500 5250
Wire Wire Line
	10500 5250 10500 5300
Text HLabel 10650 5250 2    50   Output ~ 0
v_sense
Wire Wire Line
	10650 5250 10500 5250
Wire Wire Line
	10500 4900 10500 4600
Connection ~ 10500 4600
Wire Wire Line
	10500 4600 10850 4600
$Comp
L POWDER_Power:EL3H7-G U?
U 1 1 5EB4F49E
P 5150 5750
AR Path="/5E179620/5E2CF5EB/5EB4F49E" Ref="U?"  Part="1" 
AR Path="/5E179620/5EB4F49E" Ref="U?"  Part="1" 
AR Path="/5E182A9D/5F8A93F2/5EB4F49E" Ref="U601"  Part="1" 
AR Path="/5E182A9D/5F8F0FFE/5EB4F49E" Ref="U701"  Part="1" 
AR Path="/5E182A9D/5F8F1079/5EB4F49E" Ref="U801"  Part="1" 
AR Path="/5E182A9D/5F8F10F2/5EB4F49E" Ref="U901"  Part="1" 
F 0 "U801" H 5100 5900 50  0000 C CNN
F 1 "EL3H7-G" H 5150 5600 50  0000 C CNN
F 2 "POWDER_Power:EL3H7-G" H 5150 5450 50  0001 C CNN
F 3 "" H 5150 5750 50  0001 C CNN
F 4 "3000-0000000432" H 5150 5750 50  0001 C CNN "PartSpecification"
	1    5150 5750
	1    0    0    -1  
$EndComp
$Comp
L power:GND #PWR?
U 1 1 5EB4F4A4
P 4950 5900
AR Path="/5E179620/5E2CEBB7/5EB4F4A4" Ref="#PWR?"  Part="1" 
AR Path="/5E179620/5E2CF5EB/5EB4F4A4" Ref="#PWR?"  Part="1" 
AR Path="/5E179620/5EB4F4A4" Ref="#PWR?"  Part="1" 
AR Path="/5E182A9D/5F8A93F2/5EB4F4A4" Ref="#PWR?"  Part="1" 
AR Path="/5E182A9D/5F8F0FFE/5EB4F4A4" Ref="#PWR?"  Part="1" 
AR Path="/5E182A9D/5F8F1079/5EB4F4A4" Ref="#PWR?"  Part="1" 
AR Path="/5E182A9D/5F8F10F2/5EB4F4A4" Ref="#PWR?"  Part="1" 
F 0 "#PWR?" H 4950 5650 50  0001 C CNN
F 1 "GND" H 4950 5750 50  0000 C CNN
F 2 "" H 4950 5900 50  0001 C CNN
F 3 "" H 4950 5900 50  0001 C CNN
	1    4950 5900
	1    0    0    -1  
$EndComp
Wire Wire Line
	4950 5900 4950 5800
$Comp
L Device:R R?
U 1 1 5EB4F4AB
P 5350 6050
AR Path="/5E179620/5E2CEBB7/5EB4F4AB" Ref="R?"  Part="1" 
AR Path="/5E179620/5E2CF5EB/5EB4F4AB" Ref="R?"  Part="1" 
AR Path="/5E179620/5EB4F4AB" Ref="R?"  Part="1" 
AR Path="/5E182A9D/5F8A93F2/5EB4F4AB" Ref="R619"  Part="1" 
AR Path="/5E182A9D/5F8F0FFE/5EB4F4AB" Ref="R719"  Part="1" 
AR Path="/5E182A9D/5F8F1079/5EB4F4AB" Ref="R819"  Part="1" 
AR Path="/5E182A9D/5F8F10F2/5EB4F4AB" Ref="R919"  Part="1" 
F 0 "R819" V 5430 6050 50  0000 C CNN
F 1 "100k" V 5350 6050 50  0000 C CNN
F 2 "Resistor_SMD:R_0402_1005Metric" V 5280 6050 50  0001 C CNN
F 3 "~" H 5350 6050 50  0001 C CNN
F 4 "3000-0000000575" H 5350 6050 50  0001 C CNN "PartSpecification"
	1    5350 6050
	-1   0    0    1   
$EndComp
$Comp
L power:+3.3V #PWR?
U 1 1 5EB4F4B1
P 5350 5650
AR Path="/5E179620/5E2CF5EB/5EB4F4B1" Ref="#PWR?"  Part="1" 
AR Path="/5E179620/5EB4F4B1" Ref="#PWR?"  Part="1" 
AR Path="/5E182A9D/5F8A93F2/5EB4F4B1" Ref="#PWR?"  Part="1" 
AR Path="/5E182A9D/5F8F0FFE/5EB4F4B1" Ref="#PWR?"  Part="1" 
AR Path="/5E182A9D/5F8F1079/5EB4F4B1" Ref="#PWR?"  Part="1" 
AR Path="/5E182A9D/5F8F10F2/5EB4F4B1" Ref="#PWR?"  Part="1" 
F 0 "#PWR?" H 5350 5500 50  0001 C CNN
F 1 "+3.3V" H 5350 5790 50  0000 C CNN
F 2 "" H 5350 5650 50  0001 C CNN
F 3 "" H 5350 5650 50  0001 C CNN
	1    5350 5650
	1    0    0    -1  
$EndComp
$Comp
L power:GND #PWR?
U 1 1 5EB4F4B8
P 5350 6300
AR Path="/5E179620/5E2CEBB7/5EB4F4B8" Ref="#PWR?"  Part="1" 
AR Path="/5E179620/5E2CF5EB/5EB4F4B8" Ref="#PWR?"  Part="1" 
AR Path="/5E179620/5EB4F4B8" Ref="#PWR?"  Part="1" 
AR Path="/5E182A9D/5F8A93F2/5EB4F4B8" Ref="#PWR?"  Part="1" 
AR Path="/5E182A9D/5F8F0FFE/5EB4F4B8" Ref="#PWR?"  Part="1" 
AR Path="/5E182A9D/5F8F1079/5EB4F4B8" Ref="#PWR?"  Part="1" 
AR Path="/5E182A9D/5F8F10F2/5EB4F4B8" Ref="#PWR?"  Part="1" 
F 0 "#PWR?" H 5350 6050 50  0001 C CNN
F 1 "GND" H 5350 6150 50  0000 C CNN
F 2 "" H 5350 6300 50  0001 C CNN
F 3 "" H 5350 6300 50  0001 C CNN
	1    5350 6300
	1    0    0    -1  
$EndComp
Wire Wire Line
	5350 5900 5350 5850
Wire Wire Line
	5350 5650 5350 5700
Wire Wire Line
	4950 3300 4950 5700
Wire Wire Line
	5450 5850 5350 5850
Wire Wire Line
	4950 3300 5200 3300
$Comp
L power:+3.3V #PWR?
U 1 1 5EB92CB8
P 10150 4850
AR Path="/5EB92CB8" Ref="#PWR?"  Part="1" 
AR Path="/5E182A9D/5F8A93F2/5EB92CB8" Ref="#PWR?"  Part="1" 
AR Path="/5E182A9D/5F8F0FFE/5EB92CB8" Ref="#PWR?"  Part="1" 
AR Path="/5E182A9D/5F8F1079/5EB92CB8" Ref="#PWR?"  Part="1" 
AR Path="/5E182A9D/5F8F10F2/5EB92CB8" Ref="#PWR?"  Part="1" 
F 0 "#PWR?" H 10150 4700 50  0001 C CNN
F 1 "+3.3V" H 10150 4990 50  0000 C CNN
F 2 "" H 10150 4850 50  0001 C CNN
F 3 "" H 10150 4850 50  0001 C CNN
	1    10150 4850
	1    0    0    -1  
$EndComp
Wire Wire Line
	10150 4850 10150 4900
Wire Wire Line
	10150 5200 10150 5250
Wire Wire Line
	7650 4900 7650 5500
$Comp
L Device:R R?
U 1 1 5ED70174
P 1500 6750
AR Path="/5E179620/5E179864/5ED70174" Ref="R?"  Part="1" 
AR Path="/5E182A9D/5F8A93F2/5ED70174" Ref="R601"  Part="1" 
AR Path="/5E182A9D/5F8F0FFE/5ED70174" Ref="R701"  Part="1" 
AR Path="/5E182A9D/5F8F1079/5ED70174" Ref="R801"  Part="1" 
AR Path="/5E182A9D/5F8F10F2/5ED70174" Ref="R901"  Part="1" 
F 0 "R801" V 1580 6750 50  0000 C CNN
F 1 "100k" V 1500 6750 50  0000 C CNN
F 2 "Resistor_SMD:R_0402_1005Metric" V 1430 6750 50  0001 C CNN
F 3 "~" H 1500 6750 50  0001 C CNN
F 4 "3000-0000000575" H 1500 6750 50  0001 C CNN "PartSpecification"
	1    1500 6750
	1    0    0    1   
$EndComp
$Comp
L power:GND #PWR?
U 1 1 5ED7017A
P 1500 7000
AR Path="/5E179620/5E179864/5ED7017A" Ref="#PWR?"  Part="1" 
AR Path="/5E182A9D/5F8A93F2/5ED7017A" Ref="#PWR?"  Part="1" 
AR Path="/5E182A9D/5F8F0FFE/5ED7017A" Ref="#PWR?"  Part="1" 
AR Path="/5E182A9D/5F8F1079/5ED7017A" Ref="#PWR?"  Part="1" 
AR Path="/5E182A9D/5F8F10F2/5ED7017A" Ref="#PWR?"  Part="1" 
F 0 "#PWR?" H 1500 6750 50  0001 C CNN
F 1 "GND" H 1500 6850 50  0000 C CNN
F 2 "" H 1500 7000 50  0001 C CNN
F 3 "" H 1500 7000 50  0001 C CNN
	1    1500 7000
	-1   0    0    -1  
$EndComp
Wire Wire Line
	1500 7000 1500 6900
Wire Wire Line
	1500 6600 1500 6500
Wire Wire Line
	1500 6500 6300 6500
Wire Wire Line
	6900 7200 6900 7100
Wire Wire Line
	6900 7000 6900 7100
Connection ~ 6900 7100
Wire Wire Line
	6900 6500 6900 6600
Connection ~ 6900 7000
Connection ~ 6900 6600
Wire Wire Line
	6900 6600 6900 6700
Connection ~ 6900 6700
Wire Wire Line
	6900 6700 6900 6800
Connection ~ 6900 6800
Wire Wire Line
	6900 6800 6900 6900
Connection ~ 6900 6900
Wire Wire Line
	6900 6900 6900 7000
Wire Wire Line
	6900 6500 6900 5500
Wire Wire Line
	6900 5500 7650 5500
Connection ~ 6900 6500
Connection ~ 7650 5500
Wire Wire Line
	7650 5500 7650 5600
$Comp
L Device:R R?
U 1 1 5EDE9DDF
P 1750 6850
AR Path="/5E179620/5E179864/5EDE9DDF" Ref="R?"  Part="1" 
AR Path="/5E182A9D/5F8A93F2/5EDE9DDF" Ref="R602"  Part="1" 
AR Path="/5E182A9D/5F8F0FFE/5EDE9DDF" Ref="R702"  Part="1" 
AR Path="/5E182A9D/5F8F1079/5EDE9DDF" Ref="R802"  Part="1" 
AR Path="/5E182A9D/5F8F10F2/5EDE9DDF" Ref="R902"  Part="1" 
F 0 "R802" V 1830 6850 50  0000 C CNN
F 1 "100k" V 1750 6850 50  0000 C CNN
F 2 "Resistor_SMD:R_0402_1005Metric" V 1680 6850 50  0001 C CNN
F 3 "~" H 1750 6850 50  0001 C CNN
F 4 "3000-0000000575" H 1750 6850 50  0001 C CNN "PartSpecification"
	1    1750 6850
	1    0    0    1   
$EndComp
$Comp
L power:GND #PWR?
U 1 1 5EDE9DE5
P 1750 7100
AR Path="/5E179620/5E179864/5EDE9DE5" Ref="#PWR?"  Part="1" 
AR Path="/5E182A9D/5F8A93F2/5EDE9DE5" Ref="#PWR?"  Part="1" 
AR Path="/5E182A9D/5F8F0FFE/5EDE9DE5" Ref="#PWR?"  Part="1" 
AR Path="/5E182A9D/5F8F1079/5EDE9DE5" Ref="#PWR?"  Part="1" 
AR Path="/5E182A9D/5F8F10F2/5EDE9DE5" Ref="#PWR?"  Part="1" 
F 0 "#PWR?" H 1750 6850 50  0001 C CNN
F 1 "GND" H 1750 6950 50  0000 C CNN
F 2 "" H 1750 7100 50  0001 C CNN
F 3 "" H 1750 7100 50  0001 C CNN
	1    1750 7100
	-1   0    0    -1  
$EndComp
Wire Wire Line
	1750 7100 1750 7000
Wire Wire Line
	1750 6700 1750 6600
$Comp
L Device:R R?
U 1 1 5EDF47B0
P 2000 6850
AR Path="/5E179620/5E179864/5EDF47B0" Ref="R?"  Part="1" 
AR Path="/5E182A9D/5F8A93F2/5EDF47B0" Ref="R603"  Part="1" 
AR Path="/5E182A9D/5F8F0FFE/5EDF47B0" Ref="R703"  Part="1" 
AR Path="/5E182A9D/5F8F1079/5EDF47B0" Ref="R803"  Part="1" 
AR Path="/5E182A9D/5F8F10F2/5EDF47B0" Ref="R903"  Part="1" 
F 0 "R803" V 2080 6850 50  0000 C CNN
F 1 "100k" V 2000 6850 50  0000 C CNN
F 2 "Resistor_SMD:R_0402_1005Metric" V 1930 6850 50  0001 C CNN
F 3 "~" H 2000 6850 50  0001 C CNN
F 4 "3000-0000000575" H 2000 6850 50  0001 C CNN "PartSpecification"
	1    2000 6850
	1    0    0    1   
$EndComp
$Comp
L power:GND #PWR?
U 1 1 5EDF47B6
P 2000 7100
AR Path="/5E179620/5E179864/5EDF47B6" Ref="#PWR?"  Part="1" 
AR Path="/5E182A9D/5F8A93F2/5EDF47B6" Ref="#PWR?"  Part="1" 
AR Path="/5E182A9D/5F8F0FFE/5EDF47B6" Ref="#PWR?"  Part="1" 
AR Path="/5E182A9D/5F8F1079/5EDF47B6" Ref="#PWR?"  Part="1" 
AR Path="/5E182A9D/5F8F10F2/5EDF47B6" Ref="#PWR?"  Part="1" 
F 0 "#PWR?" H 2000 6850 50  0001 C CNN
F 1 "GND" H 2000 6950 50  0000 C CNN
F 2 "" H 2000 7100 50  0001 C CNN
F 3 "" H 2000 7100 50  0001 C CNN
	1    2000 7100
	-1   0    0    -1  
$EndComp
Wire Wire Line
	2000 7100 2000 7000
Wire Wire Line
	2000 6700 2000 6600
Wire Wire Line
	1750 6600 2000 6600
Connection ~ 2000 6600
Wire Wire Line
	2000 6600 6300 6600
$Comp
L Device:R R?
U 1 1 5EE0D184
P 2500 6950
AR Path="/5E179620/5E179864/5EE0D184" Ref="R?"  Part="1" 
AR Path="/5E182A9D/5F8A93F2/5EE0D184" Ref="R605"  Part="1" 
AR Path="/5E182A9D/5F8F0FFE/5EE0D184" Ref="R705"  Part="1" 
AR Path="/5E182A9D/5F8F1079/5EE0D184" Ref="R805"  Part="1" 
AR Path="/5E182A9D/5F8F10F2/5EE0D184" Ref="R905"  Part="1" 
F 0 "R805" V 2580 6950 50  0000 C CNN
F 1 "24.9k" V 2500 6950 50  0000 C CNN
F 2 "Resistor_SMD:R_0402_1005Metric" V 2430 6950 50  0001 C CNN
F 3 "~" H 2500 6950 50  0001 C CNN
F 4 "3000-0000000570" H 2500 6950 50  0001 C CNN "PartSpecification"
	1    2500 6950
	1    0    0    1   
$EndComp
$Comp
L power:GND #PWR?
U 1 1 5EE0D18A
P 2500 7200
AR Path="/5E179620/5E179864/5EE0D18A" Ref="#PWR?"  Part="1" 
AR Path="/5E182A9D/5F8A93F2/5EE0D18A" Ref="#PWR?"  Part="1" 
AR Path="/5E182A9D/5F8F0FFE/5EE0D18A" Ref="#PWR?"  Part="1" 
AR Path="/5E182A9D/5F8F1079/5EE0D18A" Ref="#PWR?"  Part="1" 
AR Path="/5E182A9D/5F8F10F2/5EE0D18A" Ref="#PWR?"  Part="1" 
F 0 "#PWR?" H 2500 6950 50  0001 C CNN
F 1 "GND" H 2500 7050 50  0000 C CNN
F 2 "" H 2500 7200 50  0001 C CNN
F 3 "" H 2500 7200 50  0001 C CNN
	1    2500 7200
	-1   0    0    -1  
$EndComp
Wire Wire Line
	2500 7200 2500 7100
Wire Wire Line
	2500 6800 2500 6700
Wire Wire Line
	2500 6700 6300 6700
$Comp
L Device:R R?
U 1 1 5EE0D193
P 2750 7050
AR Path="/5E179620/5E179864/5EE0D193" Ref="R?"  Part="1" 
AR Path="/5E182A9D/5F8A93F2/5EE0D193" Ref="R606"  Part="1" 
AR Path="/5E182A9D/5F8F0FFE/5EE0D193" Ref="R706"  Part="1" 
AR Path="/5E182A9D/5F8F1079/5EE0D193" Ref="R806"  Part="1" 
AR Path="/5E182A9D/5F8F10F2/5EE0D193" Ref="R906"  Part="1" 
F 0 "R806" V 2830 7050 50  0000 C CNN
F 1 "24.9k" V 2750 7050 50  0000 C CNN
F 2 "Resistor_SMD:R_0402_1005Metric" V 2680 7050 50  0001 C CNN
F 3 "~" H 2750 7050 50  0001 C CNN
F 4 "3000-0000000570" H 2750 7050 50  0001 C CNN "PartSpecification"
	1    2750 7050
	1    0    0    1   
$EndComp
$Comp
L power:GND #PWR?
U 1 1 5EE0D199
P 2750 7300
AR Path="/5E179620/5E179864/5EE0D199" Ref="#PWR?"  Part="1" 
AR Path="/5E182A9D/5F8A93F2/5EE0D199" Ref="#PWR?"  Part="1" 
AR Path="/5E182A9D/5F8F0FFE/5EE0D199" Ref="#PWR?"  Part="1" 
AR Path="/5E182A9D/5F8F1079/5EE0D199" Ref="#PWR?"  Part="1" 
AR Path="/5E182A9D/5F8F10F2/5EE0D199" Ref="#PWR?"  Part="1" 
F 0 "#PWR?" H 2750 7050 50  0001 C CNN
F 1 "GND" H 2750 7150 50  0000 C CNN
F 2 "" H 2750 7300 50  0001 C CNN
F 3 "" H 2750 7300 50  0001 C CNN
	1    2750 7300
	-1   0    0    -1  
$EndComp
Wire Wire Line
	2750 7300 2750 7200
Wire Wire Line
	2750 6900 2750 6800
$Comp
L Device:R R?
U 1 1 5EE0D1A1
P 3000 7050
AR Path="/5E179620/5E179864/5EE0D1A1" Ref="R?"  Part="1" 
AR Path="/5E182A9D/5F8A93F2/5EE0D1A1" Ref="R608"  Part="1" 
AR Path="/5E182A9D/5F8F0FFE/5EE0D1A1" Ref="R708"  Part="1" 
AR Path="/5E182A9D/5F8F1079/5EE0D1A1" Ref="R808"  Part="1" 
AR Path="/5E182A9D/5F8F10F2/5EE0D1A1" Ref="R908"  Part="1" 
F 0 "R808" V 3080 7050 50  0000 C CNN
F 1 "24.9k" V 3000 7050 50  0000 C CNN
F 2 "Resistor_SMD:R_0402_1005Metric" V 2930 7050 50  0001 C CNN
F 3 "~" H 3000 7050 50  0001 C CNN
F 4 "3000-0000000570" H 3000 7050 50  0001 C CNN "PartSpecification"
	1    3000 7050
	1    0    0    1   
$EndComp
$Comp
L power:GND #PWR?
U 1 1 5EE0D1A7
P 3000 7300
AR Path="/5E179620/5E179864/5EE0D1A7" Ref="#PWR?"  Part="1" 
AR Path="/5E182A9D/5F8A93F2/5EE0D1A7" Ref="#PWR?"  Part="1" 
AR Path="/5E182A9D/5F8F0FFE/5EE0D1A7" Ref="#PWR?"  Part="1" 
AR Path="/5E182A9D/5F8F1079/5EE0D1A7" Ref="#PWR?"  Part="1" 
AR Path="/5E182A9D/5F8F10F2/5EE0D1A7" Ref="#PWR?"  Part="1" 
F 0 "#PWR?" H 3000 7050 50  0001 C CNN
F 1 "GND" H 3000 7150 50  0000 C CNN
F 2 "" H 3000 7300 50  0001 C CNN
F 3 "" H 3000 7300 50  0001 C CNN
	1    3000 7300
	-1   0    0    -1  
$EndComp
Wire Wire Line
	3000 7300 3000 7200
Wire Wire Line
	3000 6900 3000 6800
Wire Wire Line
	2750 6800 3000 6800
Connection ~ 3000 6800
Wire Wire Line
	3000 6800 6300 6800
$Comp
L Device:R R?
U 1 1 5EE6A5F2
P 3500 7150
AR Path="/5E179620/5E179864/5EE6A5F2" Ref="R?"  Part="1" 
AR Path="/5E182A9D/5F8A93F2/5EE6A5F2" Ref="R609"  Part="1" 
AR Path="/5E182A9D/5F8F0FFE/5EE6A5F2" Ref="R709"  Part="1" 
AR Path="/5E182A9D/5F8F1079/5EE6A5F2" Ref="R809"  Part="1" 
AR Path="/5E182A9D/5F8F10F2/5EE6A5F2" Ref="R909"  Part="1" 
F 0 "R809" V 3580 7150 50  0000 C CNN
F 1 "6.2k" V 3500 7150 50  0000 C CNN
F 2 "Resistor_SMD:R_0402_1005Metric" V 3430 7150 50  0001 C CNN
F 3 "~" H 3500 7150 50  0001 C CNN
F 4 "3000-0000000573" H 3500 7150 50  0001 C CNN "PartSpecification"
	1    3500 7150
	1    0    0    1   
$EndComp
$Comp
L power:GND #PWR?
U 1 1 5EE6A5F8
P 3500 7400
AR Path="/5E179620/5E179864/5EE6A5F8" Ref="#PWR?"  Part="1" 
AR Path="/5E182A9D/5F8A93F2/5EE6A5F8" Ref="#PWR?"  Part="1" 
AR Path="/5E182A9D/5F8F0FFE/5EE6A5F8" Ref="#PWR?"  Part="1" 
AR Path="/5E182A9D/5F8F1079/5EE6A5F8" Ref="#PWR?"  Part="1" 
AR Path="/5E182A9D/5F8F10F2/5EE6A5F8" Ref="#PWR?"  Part="1" 
F 0 "#PWR?" H 3500 7150 50  0001 C CNN
F 1 "GND" H 3500 7250 50  0000 C CNN
F 2 "" H 3500 7400 50  0001 C CNN
F 3 "" H 3500 7400 50  0001 C CNN
	1    3500 7400
	-1   0    0    -1  
$EndComp
Wire Wire Line
	3500 7400 3500 7300
Wire Wire Line
	3500 7000 3500 6900
Wire Wire Line
	3500 6900 6300 6900
$Comp
L Device:R R?
U 1 1 5EE6A601
P 3750 7250
AR Path="/5E179620/5E179864/5EE6A601" Ref="R?"  Part="1" 
AR Path="/5E182A9D/5F8A93F2/5EE6A601" Ref="R611"  Part="1" 
AR Path="/5E182A9D/5F8F0FFE/5EE6A601" Ref="R711"  Part="1" 
AR Path="/5E182A9D/5F8F1079/5EE6A601" Ref="R811"  Part="1" 
AR Path="/5E182A9D/5F8F10F2/5EE6A601" Ref="R911"  Part="1" 
F 0 "R811" V 3830 7250 50  0000 C CNN
F 1 "6.2k" V 3750 7250 50  0000 C CNN
F 2 "Resistor_SMD:R_0402_1005Metric" V 3680 7250 50  0001 C CNN
F 3 "~" H 3750 7250 50  0001 C CNN
F 4 "3000-0000000573" H 3750 7250 50  0001 C CNN "PartSpecification"
	1    3750 7250
	1    0    0    1   
$EndComp
$Comp
L power:GND #PWR?
U 1 1 5EE6A607
P 3750 7500
AR Path="/5E179620/5E179864/5EE6A607" Ref="#PWR?"  Part="1" 
AR Path="/5E182A9D/5F8A93F2/5EE6A607" Ref="#PWR?"  Part="1" 
AR Path="/5E182A9D/5F8F0FFE/5EE6A607" Ref="#PWR?"  Part="1" 
AR Path="/5E182A9D/5F8F1079/5EE6A607" Ref="#PWR?"  Part="1" 
AR Path="/5E182A9D/5F8F10F2/5EE6A607" Ref="#PWR?"  Part="1" 
F 0 "#PWR?" H 3750 7250 50  0001 C CNN
F 1 "GND" H 3750 7350 50  0000 C CNN
F 2 "" H 3750 7500 50  0001 C CNN
F 3 "" H 3750 7500 50  0001 C CNN
	1    3750 7500
	-1   0    0    -1  
$EndComp
Wire Wire Line
	3750 7500 3750 7400
Wire Wire Line
	3750 7100 3750 7000
$Comp
L Device:R R?
U 1 1 5EE6A60F
P 4000 7250
AR Path="/5E179620/5E179864/5EE6A60F" Ref="R?"  Part="1" 
AR Path="/5E182A9D/5F8A93F2/5EE6A60F" Ref="R613"  Part="1" 
AR Path="/5E182A9D/5F8F0FFE/5EE6A60F" Ref="R713"  Part="1" 
AR Path="/5E182A9D/5F8F1079/5EE6A60F" Ref="R813"  Part="1" 
AR Path="/5E182A9D/5F8F10F2/5EE6A60F" Ref="R913"  Part="1" 
F 0 "R813" V 4080 7250 50  0000 C CNN
F 1 "6.2k" V 4000 7250 50  0000 C CNN
F 2 "Resistor_SMD:R_0402_1005Metric" V 3930 7250 50  0001 C CNN
F 3 "~" H 4000 7250 50  0001 C CNN
F 4 "3000-0000000573" H 4000 7250 50  0001 C CNN "PartSpecification"
	1    4000 7250
	1    0    0    1   
$EndComp
$Comp
L power:GND #PWR?
U 1 1 5EE6A615
P 4000 7500
AR Path="/5E179620/5E179864/5EE6A615" Ref="#PWR?"  Part="1" 
AR Path="/5E182A9D/5F8A93F2/5EE6A615" Ref="#PWR?"  Part="1" 
AR Path="/5E182A9D/5F8F0FFE/5EE6A615" Ref="#PWR?"  Part="1" 
AR Path="/5E182A9D/5F8F1079/5EE6A615" Ref="#PWR?"  Part="1" 
AR Path="/5E182A9D/5F8F10F2/5EE6A615" Ref="#PWR?"  Part="1" 
F 0 "#PWR?" H 4000 7250 50  0001 C CNN
F 1 "GND" H 4000 7350 50  0000 C CNN
F 2 "" H 4000 7500 50  0001 C CNN
F 3 "" H 4000 7500 50  0001 C CNN
	1    4000 7500
	-1   0    0    -1  
$EndComp
Wire Wire Line
	4000 7500 4000 7400
Wire Wire Line
	4000 7100 4000 7000
Wire Wire Line
	3750 7000 4000 7000
Connection ~ 4000 7000
Wire Wire Line
	4000 7000 6300 7000
$Comp
L Device:R R?
U 1 1 5EE9CDC7
P 4500 7350
AR Path="/5E179620/5E179864/5EE9CDC7" Ref="R?"  Part="1" 
AR Path="/5E182A9D/5F8A93F2/5EE9CDC7" Ref="R615"  Part="1" 
AR Path="/5E182A9D/5F8F0FFE/5EE9CDC7" Ref="R715"  Part="1" 
AR Path="/5E182A9D/5F8F1079/5EE9CDC7" Ref="R815"  Part="1" 
AR Path="/5E182A9D/5F8F10F2/5EE9CDC7" Ref="R915"  Part="1" 
F 0 "R815" V 4580 7350 50  0000 C CNN
F 1 "1.54k" V 4500 7350 50  0000 C CNN
F 2 "Resistor_SMD:R_0402_1005Metric" V 4430 7350 50  0001 C CNN
F 3 "~" H 4500 7350 50  0001 C CNN
F 4 "3000-0000000574" H 4500 7350 50  0001 C CNN "PartSpecification"
	1    4500 7350
	1    0    0    1   
$EndComp
$Comp
L power:GND #PWR?
U 1 1 5EE9CDCD
P 4500 7600
AR Path="/5E179620/5E179864/5EE9CDCD" Ref="#PWR?"  Part="1" 
AR Path="/5E182A9D/5F8A93F2/5EE9CDCD" Ref="#PWR?"  Part="1" 
AR Path="/5E182A9D/5F8F0FFE/5EE9CDCD" Ref="#PWR?"  Part="1" 
AR Path="/5E182A9D/5F8F1079/5EE9CDCD" Ref="#PWR?"  Part="1" 
AR Path="/5E182A9D/5F8F10F2/5EE9CDCD" Ref="#PWR?"  Part="1" 
F 0 "#PWR?" H 4500 7350 50  0001 C CNN
F 1 "GND" H 4500 7450 50  0000 C CNN
F 2 "" H 4500 7600 50  0001 C CNN
F 3 "" H 4500 7600 50  0001 C CNN
	1    4500 7600
	-1   0    0    -1  
$EndComp
Wire Wire Line
	4500 7600 4500 7500
Wire Wire Line
	4500 7200 4500 7100
Wire Wire Line
	4500 7100 6300 7100
$Comp
L Device:R R?
U 1 1 5EE9CDD6
P 4750 7450
AR Path="/5E179620/5E179864/5EE9CDD6" Ref="R?"  Part="1" 
AR Path="/5E182A9D/5F8A93F2/5EE9CDD6" Ref="R616"  Part="1" 
AR Path="/5E182A9D/5F8F0FFE/5EE9CDD6" Ref="R716"  Part="1" 
AR Path="/5E182A9D/5F8F1079/5EE9CDD6" Ref="R816"  Part="1" 
AR Path="/5E182A9D/5F8F10F2/5EE9CDD6" Ref="R916"  Part="1" 
F 0 "R816" V 4830 7450 50  0000 C CNN
F 1 "1.54k" V 4750 7450 50  0000 C CNN
F 2 "Resistor_SMD:R_0402_1005Metric" V 4680 7450 50  0001 C CNN
F 3 "~" H 4750 7450 50  0001 C CNN
F 4 "3000-0000000574" H 4750 7450 50  0001 C CNN "PartSpecification"
	1    4750 7450
	1    0    0    1   
$EndComp
$Comp
L power:GND #PWR?
U 1 1 5EE9CDDC
P 4750 7700
AR Path="/5E179620/5E179864/5EE9CDDC" Ref="#PWR?"  Part="1" 
AR Path="/5E182A9D/5F8A93F2/5EE9CDDC" Ref="#PWR?"  Part="1" 
AR Path="/5E182A9D/5F8F0FFE/5EE9CDDC" Ref="#PWR?"  Part="1" 
AR Path="/5E182A9D/5F8F1079/5EE9CDDC" Ref="#PWR?"  Part="1" 
AR Path="/5E182A9D/5F8F10F2/5EE9CDDC" Ref="#PWR?"  Part="1" 
F 0 "#PWR?" H 4750 7450 50  0001 C CNN
F 1 "GND" H 4750 7550 50  0000 C CNN
F 2 "" H 4750 7700 50  0001 C CNN
F 3 "" H 4750 7700 50  0001 C CNN
	1    4750 7700
	-1   0    0    -1  
$EndComp
Wire Wire Line
	4750 7700 4750 7600
Wire Wire Line
	4750 7300 4750 7200
$Comp
L Device:R R?
U 1 1 5EE9CDE4
P 5000 7450
AR Path="/5E179620/5E179864/5EE9CDE4" Ref="R?"  Part="1" 
AR Path="/5E182A9D/5F8A93F2/5EE9CDE4" Ref="R617"  Part="1" 
AR Path="/5E182A9D/5F8F0FFE/5EE9CDE4" Ref="R717"  Part="1" 
AR Path="/5E182A9D/5F8F1079/5EE9CDE4" Ref="R817"  Part="1" 
AR Path="/5E182A9D/5F8F10F2/5EE9CDE4" Ref="R917"  Part="1" 
F 0 "R817" V 5080 7450 50  0000 C CNN
F 1 "1.54k" V 5000 7450 50  0000 C CNN
F 2 "Resistor_SMD:R_0402_1005Metric" V 4930 7450 50  0001 C CNN
F 3 "~" H 5000 7450 50  0001 C CNN
F 4 "3000-0000000574" H 5000 7450 50  0001 C CNN "PartSpecification"
	1    5000 7450
	1    0    0    1   
$EndComp
$Comp
L power:GND #PWR?
U 1 1 5EE9CDEA
P 5000 7700
AR Path="/5E179620/5E179864/5EE9CDEA" Ref="#PWR?"  Part="1" 
AR Path="/5E182A9D/5F8A93F2/5EE9CDEA" Ref="#PWR?"  Part="1" 
AR Path="/5E182A9D/5F8F0FFE/5EE9CDEA" Ref="#PWR?"  Part="1" 
AR Path="/5E182A9D/5F8F1079/5EE9CDEA" Ref="#PWR?"  Part="1" 
AR Path="/5E182A9D/5F8F10F2/5EE9CDEA" Ref="#PWR?"  Part="1" 
F 0 "#PWR?" H 5000 7450 50  0001 C CNN
F 1 "GND" H 5000 7550 50  0000 C CNN
F 2 "" H 5000 7700 50  0001 C CNN
F 3 "" H 5000 7700 50  0001 C CNN
	1    5000 7700
	-1   0    0    -1  
$EndComp
Wire Wire Line
	5000 7700 5000 7600
Wire Wire Line
	5000 7300 5000 7200
Wire Wire Line
	4750 7200 5000 7200
Connection ~ 5000 7200
Wire Wire Line
	5000 7200 6300 7200
Wire Wire Line
	800  1050 1800 1050
Wire Wire Line
	5350 6300 5350 6200
Connection ~ 5350 5850
Wire Wire Line
	5350 5850 5350 5800
$Comp
L power:GND #PWR?
U 1 1 5F7A46A2
P 7500 1550
AR Path="/5E179620/5E179864/5F7A46A2" Ref="#PWR?"  Part="1" 
AR Path="/5E182A9D/5F8A93F2/5F7A46A2" Ref="#PWR?"  Part="1" 
AR Path="/5E182A9D/5F8F0FFE/5F7A46A2" Ref="#PWR?"  Part="1" 
AR Path="/5E182A9D/5F8F1079/5F7A46A2" Ref="#PWR?"  Part="1" 
AR Path="/5E182A9D/5F8F10F2/5F7A46A2" Ref="#PWR?"  Part="1" 
F 0 "#PWR?" H 7500 1300 50  0001 C CNN
F 1 "GND" H 7500 1400 50  0000 C CNN
F 2 "" H 7500 1550 50  0001 C CNN
F 3 "" H 7500 1550 50  0001 C CNN
	1    7500 1550
	1    0    0    -1  
$EndComp
Wire Wire Line
	7500 1550 7500 1450
Wire Wire Line
	7500 1150 7500 1050
$Comp
L Device:C C?
U 1 1 5F7A46AB
P 7500 1300
AR Path="/5E179620/5E179864/5F7A46AB" Ref="C?"  Part="1" 
AR Path="/5E182A9D/5F8A93F2/5F7A46AB" Ref="C601"  Part="1" 
AR Path="/5E182A9D/5F8F0FFE/5F7A46AB" Ref="C701"  Part="1" 
AR Path="/5E182A9D/5F8F1079/5F7A46AB" Ref="C801"  Part="1" 
AR Path="/5E182A9D/5F8F10F2/5F7A46AB" Ref="C901"  Part="1" 
F 0 "C801" H 7525 1400 50  0000 L CNN
F 1 "10uF" H 7525 1200 50  0000 L CNN
F 2 "Capacitor_SMD:C_1210_3225Metric" H 7538 1150 50  0001 C CNN
F 3 "~" H 7500 1300 50  0001 C CNN
F 4 "60" H 7500 1300 50  0001 C CNN "Voltage"
F 5 "3000-0000000472" H 7500 1300 50  0001 C CNN "PartSpecification"
	1    7500 1300
	1    0    0    -1  
$EndComp
$Comp
L power:GND #PWR?
U 1 1 5F7B3BA6
P 7750 1550
AR Path="/5E179620/5E179864/5F7B3BA6" Ref="#PWR?"  Part="1" 
AR Path="/5E182A9D/5F8A93F2/5F7B3BA6" Ref="#PWR?"  Part="1" 
AR Path="/5E182A9D/5F8F0FFE/5F7B3BA6" Ref="#PWR?"  Part="1" 
AR Path="/5E182A9D/5F8F1079/5F7B3BA6" Ref="#PWR?"  Part="1" 
AR Path="/5E182A9D/5F8F10F2/5F7B3BA6" Ref="#PWR?"  Part="1" 
F 0 "#PWR?" H 7750 1300 50  0001 C CNN
F 1 "GND" H 7750 1400 50  0000 C CNN
F 2 "" H 7750 1550 50  0001 C CNN
F 3 "" H 7750 1550 50  0001 C CNN
	1    7750 1550
	1    0    0    -1  
$EndComp
Wire Wire Line
	7750 1550 7750 1450
Wire Wire Line
	7750 1150 7750 1050
$Comp
L Device:C C?
U 1 1 5F7B3BAF
P 7750 1300
AR Path="/5E179620/5E179864/5F7B3BAF" Ref="C?"  Part="1" 
AR Path="/5E182A9D/5F8A93F2/5F7B3BAF" Ref="C625"  Part="1" 
AR Path="/5E182A9D/5F8F0FFE/5F7B3BAF" Ref="C725"  Part="1" 
AR Path="/5E182A9D/5F8F1079/5F7B3BAF" Ref="C825"  Part="1" 
AR Path="/5E182A9D/5F8F10F2/5F7B3BAF" Ref="C925"  Part="1" 
F 0 "C825" H 7775 1400 50  0000 L CNN
F 1 "10uF" H 7775 1200 50  0000 L CNN
F 2 "Capacitor_SMD:C_1210_3225Metric" H 7788 1150 50  0001 C CNN
F 3 "~" H 7750 1300 50  0001 C CNN
F 4 "60" H 7750 1300 50  0001 C CNN "Voltage"
F 5 "3000-0000000472" H 7750 1300 50  0001 C CNN "PartSpecification"
	1    7750 1300
	1    0    0    -1  
$EndComp
Connection ~ 7750 1050
Wire Wire Line
	7750 1050 8000 1050
Connection ~ 7500 1050
Wire Wire Line
	7500 1050 7750 1050
$Comp
L 000_PreferredDiodes:D_Schottky_60V_1A D604
U 1 1 5F9760EF
P 10150 5050
AR Path="/5E182A9D/5F8A93F2/5F9760EF" Ref="D604"  Part="1" 
AR Path="/5E182A9D/5F8F0FFE/5F9760EF" Ref="D704"  Part="1" 
AR Path="/5E182A9D/5F8F1079/5F9760EF" Ref="D804"  Part="1" 
AR Path="/5E182A9D/5F8F10F2/5F9760EF" Ref="D904"  Part="1" 
F 0 "D804" H 10150 5150 50  0000 C CNN
F 1 "D_Schottky_60V_1A" H 10150 4950 50  0001 C CNN
F 2 "Diode_SMD:D_SOD-123F" H 10150 5050 50  0001 C CNN
F 3 "~" H 10150 5050 50  0001 C CNN
F 4 "DSS16UTR" H 10150 5050 50  0001 C CNN "PartNumber"
F 5 "Schottky" H 10150 4950 50  0000 C CNN "DisplayValue"
F 6 "60V_1A" H 10150 4850 50  0000 C CNN "DisplayValue2"
F 7 "3000-0000000481" H 10150 5050 50  0001 C CNN "PartSpecification"
	1    10150 5050
	0    1    1    0   
$EndComp
Text Label 7950 2500 0    50   ~ 0
L_in
Text Label 8650 2500 0    50   ~ 0
L_out
Text Label 7150 2100 0    50   ~ 0
G_HIGH_IN
Text Label 7150 2600 0    50   ~ 0
G_LOW_IN
Text Label 7700 3900 0    50   ~ 0
G_LOW_OUT
Text Label 7700 4400 0    50   ~ 0
G_HIGH_OUT
Text Label 6900 3200 0    50   ~ 0
CS_IC
Text Label 6900 3600 0    50   ~ 0
CSG_IC
$Comp
L Device:Net-Tie_2 NT901
U 1 1 5E507B8F
P 8350 3650
AR Path="/5E182A9D/5F8F10F2/5E507B8F" Ref="NT901"  Part="1" 
AR Path="/5E182A9D/5F8A93F2/5E507B8F" Ref="NT601"  Part="1" 
AR Path="/5E182A9D/5F8F0FFE/5E507B8F" Ref="NT701"  Part="1" 
AR Path="/5E182A9D/5F8F1079/5E507B8F" Ref="NT801"  Part="1" 
F 0 "NT801" H 8350 3700 50  0000 C CNN
F 1 "Net-Tie_2" H 8350 3600 50  0000 C CNN
F 2 "NetTie:NetTie-2_SMD_Pad2.0mm" H 8350 3650 50  0001 C CNN
F 3 "~" H 8350 3650 50  0001 C CNN
	1    8350 3650
	1    0    0    -1  
$EndComp
Wire Wire Line
	8450 3650 8600 3650
Text Label 7900 3600 0    50   ~ 0
CSG
Text Label 7950 3200 0    50   ~ 0
CS
Text Label 6700 4300 0    50   ~ 0
BOOT_OUT
Text Label 6750 2200 0    50   ~ 0
BOOT_IN
Text Label 4950 5200 0    50   ~ 0
pg
Text Label 4650 3800 0    50   ~ 0
COMP
Text Label 4500 4700 0    50   ~ 0
COMP_MID
Text Label 4800 3000 0    50   ~ 0
SLOPE
Text Label 4800 2800 0    50   ~ 0
SS
Text Label 4800 2700 0    50   ~ 0
MODE
Text Label 4800 2600 0    50   ~ 0
SYNC_IC
Text Label 4800 2300 0    50   ~ 0
VISNS
Text Label 2650 2100 0    50   ~ 0
VIN_IC
Text Label 2500 1500 0    50   ~ 0
VIN_D
Text Label 7250 5500 0    50   ~ 0
FB
Text Label 6150 6500 0    50   ~ 0
FB_0
Text Label 6150 6600 0    50   ~ 0
FB_1
Text Label 6150 6700 0    50   ~ 0
FB_2
Text Label 6150 6800 0    50   ~ 0
FB_3
Text Label 6150 6900 0    50   ~ 0
FB_4
Text Label 6150 7000 0    50   ~ 0
FB_5
Text Label 6150 7100 0    50   ~ 0
FB_6
Text Label 6150 7200 0    50   ~ 0
FB_7
Text Label 4250 3600 0    50   ~ 0
BIAS
$EndSCHEMATC
