EESchema Schematic File Version 4
EELAYER 30 0
EELAYER END
$Descr A4 11693 8268
encoding utf-8
Sheet 26 39
Title ""
Date ""
Rev ""
Comp ""
Comment1 ""
Comment2 ""
Comment3 ""
Comment4 ""
$EndDescr
$Comp
L POWDER_Digital:10M50DAF256 U2201
U 3 1 5F996BB5
P 4750 3350
F 0 "U2201" H 4750 3500 50  0000 C CNN
F 1 "‎10M08DAF256C8G" H 4750 3350 50  0000 C CNN
F 2 "Package_BGA:BGA-256_17.0x17.0mm_Layout16x16_P1.0mm_Ball0.5mm_Pad0.4mm_NSMD" H 4750 3350 50  0001 C CNN
F 3 "" H 4750 3350 50  0001 C CNN
F 4 "3000-0000001300" H 4750 3350 50  0001 C CNN "PartSpecification"
	3    4750 3350
	1    0    0    -1  
$EndComp
$Comp
L 000_PreferredParts:C_1nF C?
U 1 1 5FB9CEA2
P 5050 2000
AR Path="/5F8E5420/5F971A6D/5FB9CEA2" Ref="C?"  Part="1" 
AR Path="/5F8E5420/5F989551/5FB9CEA2" Ref="C603"  Part="1" 
AR Path="/605746B5/5F8E5420/5F989551/5FB9CEA2" Ref="C2603"  Part="1" 
F 0 "C2603" H 5075 2100 50  0000 L CNN
F 1 "C_1nF" H 5075 1900 50  0000 L CNN
F 2 "Capacitor_SMD:C_0402_1005Metric" H 5088 1850 50  0001 C CNN
F 3 "~" H 5050 2000 50  0001 C CNN
F 4 "3000-0000000128" H 5050 2000 50  0001 C CNN "PartSpecification"
	1    5050 2000
	1    0    0    -1  
$EndComp
$Comp
L 000_PreferredParts:C_1nF C?
U 1 1 5FB9CEA9
P 4000 2000
AR Path="/5F8E5420/5F971A6D/5FB9CEA9" Ref="C?"  Part="1" 
AR Path="/5F8E5420/5F989551/5FB9CEA9" Ref="C601"  Part="1" 
AR Path="/605746B5/5F8E5420/5F989551/5FB9CEA9" Ref="C2601"  Part="1" 
F 0 "C2601" H 4025 2100 50  0000 L CNN
F 1 "C_1nF" H 4025 1900 50  0000 L CNN
F 2 "Capacitor_SMD:C_0402_1005Metric" H 4038 1850 50  0001 C CNN
F 3 "~" H 4000 2000 50  0001 C CNN
F 4 "3000-0000000128" H 4000 2000 50  0001 C CNN "PartSpecification"
	1    4000 2000
	1    0    0    -1  
$EndComp
$Comp
L 000_PreferredParts:C_0_1uF C?
U 1 1 5FB9CEB2
P 5400 2000
AR Path="/5F8E5420/5F971A6D/5FB9CEB2" Ref="C?"  Part="1" 
AR Path="/5F8E5420/5F989551/5FB9CEB2" Ref="C604"  Part="1" 
AR Path="/605746B5/5F8E5420/5F989551/5FB9CEB2" Ref="C2604"  Part="1" 
F 0 "C2604" H 5425 2100 50  0000 L CNN
F 1 "C_0_1uF" H 5425 1900 50  0001 L CNN
F 2 "Capacitor_SMD:C_0402_1005Metric" H 5438 1850 50  0001 C CNN
F 3 "~" H 5400 2000 50  0001 C CNN
F 4 "0.1uF" H 5550 1900 50  0000 C CNN "DisplayValue"
F 5 "3000-0000000125" H 5400 2000 50  0001 C CNN "PartSpecification"
F 6 "100V" H 5400 2000 50  0001 C CNN "Voltage"
	1    5400 2000
	1    0    0    -1  
$EndComp
$Comp
L power:GND #PWR?
U 1 1 5FB9CEBE
P 5750 2200
AR Path="/5F8E5420/5F971A6D/5FB9CEBE" Ref="#PWR?"  Part="1" 
AR Path="/5F8E5420/5F989551/5FB9CEBE" Ref="#PWR?"  Part="1" 
AR Path="/605746B5/5F8E5420/5F989551/5FB9CEBE" Ref="#PWR?"  Part="1" 
F 0 "#PWR?" H 5750 1950 50  0001 C CNN
F 1 "GND" H 5750 2050 50  0000 C CNN
F 2 "" H 5750 2200 50  0001 C CNN
F 3 "" H 5750 2200 50  0001 C CNN
	1    5750 2200
	1    0    0    -1  
$EndComp
Wire Wire Line
	5050 2150 5050 2200
Wire Wire Line
	5050 2200 5400 2200
Wire Wire Line
	5400 2200 5400 2150
Connection ~ 5400 2200
Wire Wire Line
	5400 2200 5750 2200
Wire Wire Line
	4850 2350 4850 1750
Wire Wire Line
	4850 1750 5050 1750
Wire Wire Line
	5400 1850 5400 1750
Wire Wire Line
	5050 1850 5050 1750
Connection ~ 5050 1750
Wire Wire Line
	5050 1750 5400 1750
$Comp
L power:GND #PWR?
U 1 1 5FB9CED4
P 4000 2200
AR Path="/5F8E5420/5F971A6D/5FB9CED4" Ref="#PWR?"  Part="1" 
AR Path="/5F8E5420/5F989551/5FB9CED4" Ref="#PWR?"  Part="1" 
AR Path="/605746B5/5F8E5420/5F989551/5FB9CED4" Ref="#PWR?"  Part="1" 
F 0 "#PWR?" H 4000 1950 50  0001 C CNN
F 1 "GND" H 4000 2050 50  0000 C CNN
F 2 "" H 4000 2200 50  0001 C CNN
F 3 "" H 4000 2200 50  0001 C CNN
	1    4000 2200
	1    0    0    -1  
$EndComp
Wire Wire Line
	4000 2200 4000 2150
Wire Wire Line
	4000 1850 4000 1750
Wire Wire Line
	4000 1750 4750 1750
Wire Wire Line
	4750 1750 4750 2350
Wire Wire Line
	4750 1750 4750 1650
Wire Wire Line
	4750 1650 4850 1650
Wire Wire Line
	4850 1650 4850 1750
Connection ~ 4750 1750
Connection ~ 4850 1750
$Comp
L 000_PreferredParts:C_1nF C?
U 1 1 5FB9DD56
P 4350 2000
AR Path="/5F8E5420/5F971A6D/5FB9DD56" Ref="C?"  Part="1" 
AR Path="/5F8E5420/5F989551/5FB9DD56" Ref="C602"  Part="1" 
AR Path="/605746B5/5F8E5420/5F989551/5FB9DD56" Ref="C2602"  Part="1" 
F 0 "C2602" H 4375 2100 50  0000 L CNN
F 1 "C_1nF" H 4375 1900 50  0000 L CNN
F 2 "Capacitor_SMD:C_0402_1005Metric" H 4388 1850 50  0001 C CNN
F 3 "~" H 4350 2000 50  0001 C CNN
F 4 "3000-0000000128" H 4350 2000 50  0001 C CNN "PartSpecification"
	1    4350 2000
	1    0    0    -1  
$EndComp
$Comp
L power:GND #PWR?
U 1 1 5FB9DD5C
P 4350 2200
AR Path="/5F8E5420/5F971A6D/5FB9DD5C" Ref="#PWR?"  Part="1" 
AR Path="/5F8E5420/5F989551/5FB9DD5C" Ref="#PWR?"  Part="1" 
AR Path="/605746B5/5F8E5420/5F989551/5FB9DD5C" Ref="#PWR?"  Part="1" 
F 0 "#PWR?" H 4350 1950 50  0001 C CNN
F 1 "GND" H 4350 2050 50  0000 C CNN
F 2 "" H 4350 2200 50  0001 C CNN
F 3 "" H 4350 2200 50  0001 C CNN
	1    4350 2200
	1    0    0    -1  
$EndComp
Wire Wire Line
	4350 2200 4350 2150
Wire Wire Line
	4350 1850 4650 1850
Wire Wire Line
	4650 1850 4650 2350
Wire Wire Line
	4650 1850 4650 1650
Wire Wire Line
	4650 1650 4750 1650
Connection ~ 4650 1850
Connection ~ 4750 1650
Wire Wire Line
	6900 3200 6250 3200
Wire Wire Line
	2600 2800 3250 2800
Wire Wire Line
	6900 3400 6250 3400
Wire Wire Line
	2600 3800 3250 3800
Wire Wire Line
	2600 2900 3250 2900
Wire Wire Line
	6900 3700 6250 3700
Wire Wire Line
	2600 3700 3250 3700
Wire Wire Line
	6900 3600 6250 3600
Wire Wire Line
	6900 3300 6250 3300
Wire Wire Line
	6250 4000 6900 4000
Wire Wire Line
	6900 3500 6250 3500
Text HLabel 2000 2000 0    50   BiDi ~ 0
MCU_IO[0..27]
Wire Wire Line
	4750 1500 4750 1650
$Comp
L power:+3.3V #PWR?
U 1 1 60DFAB6C
P 4750 1500
F 0 "#PWR?" H 4750 1350 50  0001 C CNN
F 1 "+3.3V" H 4765 1673 50  0000 C CNN
F 2 "" H 4750 1500 50  0001 C CNN
F 3 "" H 4750 1500 50  0001 C CNN
	1    4750 1500
	1    0    0    -1  
$EndComp
Wire Bus Line
	2000 2000 2500 2000
Entry Wire Line
	7000 3000 6900 3100
Entry Wire Line
	7000 3700 6900 3800
Entry Wire Line
	7000 2900 6900 3000
Entry Wire Line
	7000 2800 6900 2900
Entry Wire Line
	2500 2900 2600 3000
Entry Wire Line
	2500 3500 2600 3600
Entry Wire Line
	2500 3900 2600 4000
Entry Wire Line
	2500 3800 2600 3900
Entry Wire Line
	2500 2500 2600 2600
Entry Wire Line
	2500 3300 2600 3400
Entry Wire Line
	2500 4000 2600 4100
Entry Wire Line
	2500 3000 2600 3100
Entry Wire Line
	2500 3400 2600 3500
Entry Wire Line
	2500 3200 2600 3300
Wire Wire Line
	2600 3300 3250 3300
Wire Wire Line
	2600 3500 3250 3500
Wire Wire Line
	2600 3100 3250 3100
Text Label 2700 3300 0    50   ~ 0
MCU_IO0
Text Label 2700 3500 0    50   ~ 0
MCU_IO1
Text Label 2700 3100 0    50   ~ 0
MCU_IO2
Text Label 2700 4100 0    50   ~ 0
MCU_IO3
Text Label 2700 3400 0    50   ~ 0
MCU_IO5
Text Label 2700 2600 0    50   ~ 0
MCU_IO6
Text Label 2700 3900 0    50   ~ 0
MCU_IO7
Text Label 2700 4000 0    50   ~ 0
MCU_IO8
Text Label 2700 3600 0    50   ~ 0
MCU_IO9
Text Label 2700 3000 0    50   ~ 0
MCU_IO10
Text Label 6450 2900 0    50   ~ 0
MCU_IO11
Text Label 6450 3000 0    50   ~ 0
MCU_IO13
Text Label 6450 3800 0    50   ~ 0
MCU_IO14
Text Label 6450 3100 0    50   ~ 0
MCU_IO15
Wire Wire Line
	6900 3800 6250 3800
Wire Wire Line
	6900 3100 6250 3100
Wire Wire Line
	6900 3000 6250 3000
Wire Wire Line
	6900 2900 6250 2900
Wire Wire Line
	2600 3000 3250 3000
Wire Wire Line
	2600 3600 3250 3600
Wire Wire Line
	2600 4000 3250 4000
Wire Wire Line
	2600 2600 3250 2600
Wire Wire Line
	2600 3900 3250 3900
Wire Wire Line
	2600 3400 3250 3400
Wire Wire Line
	2600 4100 3250 4100
NoConn ~ 6250 2700
Text Label 6450 3300 0    50   ~ 0
MCU_IO16
Text Label 6450 3600 0    50   ~ 0
MCU_IO17
Text Label 6450 3500 0    50   ~ 0
MCU_IO18
Text Label 6450 3700 0    50   ~ 0
MCU_IO19
Text Label 2700 2700 0    50   ~ 0
MCU_IO20
Text Label 2700 2900 0    50   ~ 0
MCU_IO21
Text Label 2700 3700 0    50   ~ 0
MCU_IO22
Text Label 2700 2800 0    50   ~ 0
MCU_IO23
Text Label 2700 3800 0    50   ~ 0
MCU_IO24
Text Label 6450 3200 0    50   ~ 0
MCU_IO25
Text Label 6450 3400 0    50   ~ 0
MCU_IO26
Text Label 6450 4000 0    50   ~ 0
MCU_IO27
NoConn ~ 6250 3900
NoConn ~ 6250 2800
NoConn ~ 6250 4100
Wire Bus Line
	2500 4500 7000 4500
Entry Wire Line
	7000 3200 6900 3300
Entry Wire Line
	7000 3500 6900 3600
Entry Wire Line
	7000 3400 6900 3500
Entry Wire Line
	7000 3600 6900 3700
Entry Wire Line
	2500 2600 2600 2700
Entry Wire Line
	7000 3900 6900 4000
Entry Wire Line
	7000 3300 6900 3400
Entry Wire Line
	7000 3100 6900 3200
Entry Wire Line
	2500 3700 2600 3800
Entry Wire Line
	2500 2700 2600 2800
Entry Wire Line
	2500 3600 2600 3700
Entry Wire Line
	2500 2800 2600 2900
Wire Wire Line
	2600 2700 3250 2700
Wire Wire Line
	2600 3200 3250 3200
Text Label 2700 3200 0    50   ~ 0
MCU_IO4
Entry Wire Line
	2500 3100 2600 3200
Wire Wire Line
	6900 2600 6250 2600
Text Label 6450 2600 0    50   ~ 0
MCU_IO12
Entry Wire Line
	7000 2500 6900 2600
Wire Bus Line
	7000 2500 7000 4500
Wire Bus Line
	2500 2000 2500 4500
$EndSCHEMATC
