EESchema Schematic File Version 4
EELAYER 30 0
EELAYER END
$Descr A4 11693 8268
encoding utf-8
Sheet 1 1
Title ""
Date ""
Rev ""
Comp ""
Comment1 ""
Comment2 ""
Comment3 ""
Comment4 ""
$EndDescr
$Comp
L Device:C C103
U 1 1 5E8CC045
P 1500 1150
F 0 "C103" H 1525 1250 50  0000 L CNN
F 1 "10uF" H 1525 1050 50  0000 L CNN
F 2 "Capacitor_SMD:C_1210_3225Metric" H 1538 1000 50  0001 C CNN
F 3 "~" H 1500 1150 50  0001 C CNN
F 4 "3000-0000000472" H 1500 1150 50  0001 C CNN "PartSpecification"
	1    1500 1150
	1    0    0    -1  
$EndComp
$Comp
L Device:CP C102
U 1 1 5E8CCA5E
P 1250 1150
F 0 "C102" H 1275 1250 50  0000 L CNN
F 1 "82uF" H 1275 1050 50  0000 L CNN
F 2 "Capacitor_SMD:CP_Elec_10x10" H 1288 1000 50  0001 C CNN
F 3 "~" H 1250 1150 50  0001 C CNN
F 4 "3000-0000000470" H 1250 1150 50  0001 C CNN "PartSpecification"
	1    1250 1150
	1    0    0    -1  
$EndComp
$Comp
L power:GND #PWR?
U 1 1 5E8CD934
P 1250 2000
F 0 "#PWR?" H 1250 1750 50  0001 C CNN
F 1 "GND" H 1250 1850 50  0000 C CNN
F 2 "" H 1250 2000 50  0001 C CNN
F 3 "" H 1250 2000 50  0001 C CNN
	1    1250 2000
	1    0    0    -1  
$EndComp
$Comp
L power:GND #PWR?
U 1 1 5E8CDE66
P 1500 2000
F 0 "#PWR?" H 1500 1750 50  0001 C CNN
F 1 "GND" H 1500 1850 50  0000 C CNN
F 2 "" H 1500 2000 50  0001 C CNN
F 3 "" H 1500 2000 50  0001 C CNN
	1    1500 2000
	1    0    0    -1  
$EndComp
Wire Wire Line
	1500 2000 1500 1300
Wire Wire Line
	1250 1300 1250 2000
Wire Wire Line
	1500 1000 1500 900 
Wire Wire Line
	1750 900  1500 900 
Wire Wire Line
	1250 1000 1250 900 
Connection ~ 1250 900 
Wire Wire Line
	1250 900  900  900 
$Comp
L Connector:Screw_Terminal_01x02 J101
U 1 1 5E8CE88A
P 700 1000
F 0 "J101" H 700 1100 50  0000 C CNN
F 1 "Screw_Terminal_01x02" H 400 750 50  0000 C CNN
F 2 "TerminalBlock:TerminalBlock_bornier-2_P5.08mm" H 700 1000 50  0001 C CNN
F 3 "~" H 700 1000 50  0001 C CNN
F 4 "3000-0000000184" H 700 1000 50  0001 C CNN "PartSpecification"
	1    700  1000
	-1   0    0    1   
$EndComp
Text Label 1400 900  0    50   ~ 0
v_in
$Comp
L power:GND #PWR?
U 1 1 5E8CFB00
P 1000 1150
F 0 "#PWR?" H 1000 900 50  0001 C CNN
F 1 "GND" H 1000 1000 50  0000 C CNN
F 2 "" H 1000 1150 50  0001 C CNN
F 3 "" H 1000 1150 50  0001 C CNN
	1    1000 1150
	1    0    0    -1  
$EndComp
Wire Wire Line
	1000 1150 1000 1000
Wire Wire Line
	1000 1000 900  1000
$Comp
L 000_PreferredDiodes:D_Schottky_60V_1A D101
U 1 1 5E8D026C
P 2400 1150
F 0 "D101" H 2400 1250 50  0000 C CNN
F 1 "D_Schottky_60V_1A" H 2400 1050 50  0001 C CNN
F 2 "Diode_SMD:D_SOD-123F" H 2400 1150 50  0001 C CNN
F 3 "~" H 2400 1150 50  0001 C CNN
F 4 "DSS16UTR" H 2400 1150 50  0001 C CNN "PartNumber"
F 5 "Schottky" H 2400 1050 50  0000 C CNN "DisplayValue"
F 6 "60V_1A" H 2400 950 50  0000 C CNN "DisplayValue2"
F 7 "3000-0000000481" H 2400 1150 50  0001 C CNN "PartSpecification"
	1    2400 1150
	0    -1   -1   0   
$EndComp
$Comp
L Device:R R103
U 1 1 5E8D0C4C
P 2400 2150
F 0 "R103" V 2480 2150 50  0000 C CNN
F 1 "10" V 2400 2150 50  0000 C CNN
F 2 "Resistor_SMD:R_0603_1608Metric" V 2330 2150 50  0001 C CNN
F 3 "~" H 2400 2150 50  0001 C CNN
	1    2400 2150
	1    0    0    -1  
$EndComp
$Comp
L Device:R R104
U 1 1 5E8D13F1
P 2950 2800
F 0 "R104" V 3030 2800 50  0000 C CNN
F 1 "2k" V 2950 2800 50  0000 C CNN
F 2 "Resistor_SMD:R_0603_1608Metric" V 2880 2800 50  0001 C CNN
F 3 "~" H 2950 2800 50  0001 C CNN
	1    2950 2800
	0    1    1    0   
$EndComp
$Comp
L 000_PreferredParts:C_1nF C105
U 1 1 5E8D1ADE
P 2400 3100
F 0 "C105" H 2425 3200 50  0000 L CNN
F 1 "C_1nF" H 2425 3000 50  0000 L CNN
F 2 "Capacitor_SMD:C_0402_1005Metric" H 2438 2950 50  0001 C CNN
F 3 "~" H 2400 3100 50  0001 C CNN
F 4 "3000-0000000128" H 2400 3100 50  0001 C CNN "PartSpecification"
	1    2400 3100
	0    1    1    0   
$EndComp
$Comp
L POWDER_Power:LM5176_QFN U102
U 1 1 5E8D2498
P 5200 3300
F 0 "U102" H 5600 4150 50  0000 L CNN
F 1 "LM5176_QFN" H 4700 4150 50  0000 L CNN
F 2 "POWDER_Power:LM5176_QFN" H 5900 4150 50  0001 L CNN
F 3 "" H 5950 3650 50  0001 C CNN
F 4 "3000-0000000988" H 5200 3300 50  0001 C CNN "PartSpecification"
	1    5200 3300
	1    0    0    -1  
$EndComp
Wire Wire Line
	2400 2000 2400 1300
Wire Wire Line
	2400 1000 2400 900 
Wire Wire Line
	2400 900  2000 900 
Connection ~ 1750 900 
Wire Wire Line
	4500 2600 2400 2600
Wire Wire Line
	2400 2600 2400 2300
$Comp
L 000_PreferredParts:C_0_1uF C101
U 1 1 5E8D656F
P 900 2800
F 0 "C101" H 925 2900 50  0000 L CNN
F 1 "C_0_1uF" H 925 2700 50  0001 L CNN
F 2 "Capacitor_SMD:C_0402_1005Metric" H 938 2650 50  0001 C CNN
F 3 "~" H 900 2800 50  0001 C CNN
F 4 "0.1uF" H 1050 2700 50  0000 C CNN "DisplayValue"
F 5 "3000-0000000125" H 900 2800 50  0001 C CNN "PartSpecification"
F 6 "100V" H 900 2800 50  0001 C CNN "Voltage"
	1    900  2800
	1    0    0    -1  
$EndComp
$Comp
L power:GND #PWR?
U 1 1 5E8D6C84
P 900 3000
F 0 "#PWR?" H 900 2750 50  0001 C CNN
F 1 "GND" H 900 2850 50  0000 C CNN
F 2 "" H 900 3000 50  0001 C CNN
F 3 "" H 900 3000 50  0001 C CNN
	1    900  3000
	1    0    0    -1  
$EndComp
Wire Wire Line
	900  3000 900  2950
Wire Wire Line
	900  2650 900  2600
Wire Wire Line
	3100 2800 3250 2800
Wire Wire Line
	2800 2800 2700 2800
Wire Wire Line
	2700 2800 2700 900 
Wire Wire Line
	2700 900  2400 900 
Connection ~ 2400 900 
Wire Wire Line
	1900 3000 4500 3000
$Comp
L Device:R R101
U 1 1 5E8DC36E
P 2650 3350
F 0 "R101" V 2730 3350 50  0000 C CNN
F 1 "45.3k" V 2650 3350 50  0000 C CNN
F 2 "Resistor_SMD:R_0402_1005Metric" V 2580 3350 50  0001 C CNN
F 3 "~" H 2650 3350 50  0001 C CNN
	1    2650 3350
	1    0    0    -1  
$EndComp
$Comp
L Device:R R102
U 1 1 5E8DC826
P 2900 3450
F 0 "R102" V 2980 3450 50  0000 C CNN
F 1 "93.1k" V 2900 3450 50  0000 C CNN
F 2 "Resistor_SMD:R_0402_1005Metric" V 2830 3450 50  0001 C CNN
F 3 "~" H 2900 3450 50  0001 C CNN
F 4 "3000-0000000572" H 2900 3450 50  0001 C CNN "PartSpecification"
	1    2900 3450
	1    0    0    -1  
$EndComp
Wire Wire Line
	2900 3200 2900 3300
Wire Wire Line
	2650 3100 2650 3200
Wire Wire Line
	2650 3100 2550 3100
Connection ~ 2650 3100
Wire Wire Line
	2250 3100 1900 3100
$Comp
L power:GND #PWR?
U 1 1 5E8DDEFC
P 2650 3600
F 0 "#PWR?" H 2650 3350 50  0001 C CNN
F 1 "GND" H 2650 3450 50  0000 C CNN
F 2 "" H 2650 3600 50  0001 C CNN
F 3 "" H 2650 3600 50  0001 C CNN
	1    2650 3600
	1    0    0    -1  
$EndComp
$Comp
L power:GND #PWR?
U 1 1 5E8DE345
P 2900 3700
F 0 "#PWR?" H 2900 3450 50  0001 C CNN
F 1 "GND" H 2900 3550 50  0000 C CNN
F 2 "" H 2900 3700 50  0001 C CNN
F 3 "" H 2900 3700 50  0001 C CNN
	1    2900 3700
	1    0    0    -1  
$EndComp
Wire Wire Line
	2900 3700 2900 3600
Wire Wire Line
	2650 3600 2650 3500
$Comp
L 000_PreferredParts:C_0_1uF C107
U 1 1 5E8DEFBE
P 3200 3550
F 0 "C107" H 3225 3650 50  0000 L CNN
F 1 "C_0_1uF" H 3225 3450 50  0001 L CNN
F 2 "Capacitor_SMD:C_0402_1005Metric" H 3238 3400 50  0001 C CNN
F 3 "~" H 3200 3550 50  0001 C CNN
F 4 "0.1uF" H 3350 3450 50  0000 C CNN "DisplayValue"
F 5 "3000-0000000125" H 3200 3550 50  0001 C CNN "PartSpecification"
F 6 "100V" H 3200 3550 50  0001 C CNN "Voltage"
	1    3200 3550
	1    0    0    -1  
$EndComp
Wire Wire Line
	3200 3400 3200 3300
Wire Wire Line
	3200 3300 4500 3300
$Comp
L power:GND #PWR?
U 1 1 5E8E0394
P 3200 3800
F 0 "#PWR?" H 3200 3550 50  0001 C CNN
F 1 "GND" H 3200 3650 50  0000 C CNN
F 2 "" H 3200 3800 50  0001 C CNN
F 3 "" H 3200 3800 50  0001 C CNN
	1    3200 3800
	1    0    0    -1  
$EndComp
Wire Wire Line
	3200 3800 3200 3700
$Comp
L power:GND #PWR?
U 1 1 5E8E0B56
P 3500 3500
F 0 "#PWR?" H 3500 3250 50  0001 C CNN
F 1 "GND" H 3500 3350 50  0000 C CNN
F 2 "" H 3500 3500 50  0001 C CNN
F 3 "" H 3500 3500 50  0001 C CNN
	1    3500 3500
	1    0    0    -1  
$EndComp
Wire Wire Line
	3500 3400 3500 3500
$Comp
L Device:C C108
U 1 1 5E8E1823
P 3700 3750
F 0 "C108" H 3725 3850 50  0000 L CNN
F 1 "533pF" H 3725 3650 50  0000 L CNN
F 2 "Capacitor_SMD:C_0402_1005Metric" H 3738 3600 50  0001 C CNN
F 3 "~" H 3700 3750 50  0001 C CNN
	1    3700 3750
	1    0    0    -1  
$EndComp
Wire Wire Line
	3700 3600 3700 3500
Wire Wire Line
	3700 3500 4500 3500
$Comp
L power:GND #PWR?
U 1 1 5E8E2BF8
P 3700 4000
F 0 "#PWR?" H 3700 3750 50  0001 C CNN
F 1 "GND" H 3700 3850 50  0000 C CNN
F 2 "" H 3700 4000 50  0001 C CNN
F 3 "" H 3700 4000 50  0001 C CNN
	1    3700 4000
	1    0    0    -1  
$EndComp
Wire Wire Line
	3700 4000 3700 3900
$Comp
L POWDER_Power:EL3H7-G U101
U 1 1 5E8E37E8
P 3000 4850
F 0 "U101" H 2950 5000 50  0000 C CNN
F 1 "EL3H7-G" H 3000 4700 50  0000 C CNN
F 2 "POWDER_Power:EL3H7-G" H 3000 4550 50  0001 C CNN
F 3 "" H 3000 4850 50  0001 C CNN
F 4 "3000-0000000432" H 3000 4850 50  0001 C CNN "PartSpecification"
	1    3000 4850
	-1   0    0    -1  
$EndComp
$Comp
L 000_PreferredParts:C_0_1uF C109
U 1 1 5E8E4EBC
P 3500 5700
F 0 "C109" H 3525 5800 50  0000 L CNN
F 1 "C_0_1uF" H 3525 5600 50  0001 L CNN
F 2 "Capacitor_SMD:C_0402_1005Metric" H 3538 5550 50  0001 C CNN
F 3 "~" H 3500 5700 50  0001 C CNN
F 4 "0.1uF" H 3650 5600 50  0000 C CNN "DisplayValue"
F 5 "3000-0000000125" H 3500 5700 50  0001 C CNN "PartSpecification"
F 6 "100V" H 3500 5700 50  0001 C CNN "Voltage"
	1    3500 5700
	1    0    0    -1  
$EndComp
$Comp
L power:GND #PWR?
U 1 1 5E8EA5C5
P 3300 5000
F 0 "#PWR?" H 3300 4750 50  0001 C CNN
F 1 "GND" H 3300 4850 50  0000 C CNN
F 2 "" H 3300 5000 50  0001 C CNN
F 3 "" H 3300 5000 50  0001 C CNN
	1    3300 5000
	1    0    0    -1  
$EndComp
Wire Wire Line
	3300 5000 3300 4900
Wire Wire Line
	3300 4900 3200 4900
Wire Wire Line
	3500 5550 3500 5450
Wire Wire Line
	3500 5450 4500 5450
$Comp
L power:GND #PWR?
U 1 1 5E8EC707
P 3500 5950
F 0 "#PWR?" H 3500 5700 50  0001 C CNN
F 1 "GND" H 3500 5800 50  0000 C CNN
F 2 "" H 3500 5950 50  0001 C CNN
F 3 "" H 3500 5950 50  0001 C CNN
	1    3500 5950
	1    0    0    -1  
$EndComp
Wire Wire Line
	3500 5850 3500 5950
$Comp
L Device:C C111
U 1 1 5E8EFB76
P 4200 6000
F 0 "C111" H 4225 6100 50  0000 L CNN
F 1 "3.56nF" H 4225 5900 50  0000 L CNN
F 2 "Capacitor_SMD:C_0402_1005Metric" H 4238 5850 50  0001 C CNN
F 3 "~" H 4200 6000 50  0001 C CNN
	1    4200 6000
	1    0    0    -1  
$EndComp
$Comp
L Device:C C110
U 1 1 5E8F094B
P 3900 6000
F 0 "C110" H 3925 6100 50  0000 L CNN
F 1 "100pF" H 3925 5900 50  0000 L CNN
F 2 "Capacitor_SMD:C_0402_1005Metric" H 3938 5850 50  0001 C CNN
F 3 "~" H 3900 6000 50  0001 C CNN
F 4 "3000-0000000474" H 3900 6000 50  0001 C CNN "PartSpecification"
	1    3900 6000
	1    0    0    -1  
$EndComp
$Comp
L Device:R R106
U 1 1 5E8F0F1D
P 4200 6400
F 0 "R106" V 4280 6400 50  0000 C CNN
F 1 "14.892k" V 4200 6400 50  0000 C CNN
F 2 "Resistor_SMD:R_0402_1005Metric" V 4130 6400 50  0001 C CNN
F 3 "~" H 4200 6400 50  0001 C CNN
	1    4200 6400
	1    0    0    -1  
$EndComp
$Comp
L power:GND #PWR?
U 1 1 5E8F144D
P 4200 6650
F 0 "#PWR?" H 4200 6400 50  0001 C CNN
F 1 "GND" H 4200 6500 50  0000 C CNN
F 2 "" H 4200 6650 50  0001 C CNN
F 3 "" H 4200 6650 50  0001 C CNN
	1    4200 6650
	1    0    0    -1  
$EndComp
$Comp
L power:GND #PWR?
U 1 1 5E8F181D
P 5100 6350
F 0 "#PWR?" H 5100 6100 50  0001 C CNN
F 1 "GND" H 5100 6200 50  0000 C CNN
F 2 "" H 5100 6350 50  0001 C CNN
F 3 "" H 5100 6350 50  0001 C CNN
	1    5100 6350
	1    0    0    -1  
$EndComp
$Comp
L power:GND #PWR?
U 1 1 5E8F1FC6
P 5200 6350
F 0 "#PWR?" H 5200 6100 50  0001 C CNN
F 1 "GND" H 5200 6200 50  0000 C CNN
F 2 "" H 5200 6350 50  0001 C CNN
F 3 "" H 5200 6350 50  0001 C CNN
	1    5200 6350
	1    0    0    -1  
$EndComp
$Comp
L power:GND #PWR?
U 1 1 5E8F20C8
P 5300 6350
F 0 "#PWR?" H 5300 6100 50  0001 C CNN
F 1 "GND" H 5300 6200 50  0000 C CNN
F 2 "" H 5300 6350 50  0001 C CNN
F 3 "" H 5300 6350 50  0001 C CNN
	1    5300 6350
	1    0    0    -1  
$EndComp
Wire Wire Line
	5300 6350 5300 6250
Wire Wire Line
	5200 6350 5200 6250
Wire Wire Line
	5100 6250 5100 6350
Wire Wire Line
	4200 5850 4200 5650
Wire Wire Line
	4200 5650 4500 5650
Wire Wire Line
	4200 5650 3900 5650
Wire Wire Line
	3900 5650 3900 5850
Connection ~ 4200 5650
$Comp
L power:GND #PWR?
U 1 1 5E8F5501
P 3900 6250
F 0 "#PWR?" H 3900 6000 50  0001 C CNN
F 1 "GND" H 3900 6100 50  0000 C CNN
F 2 "" H 3900 6250 50  0001 C CNN
F 3 "" H 3900 6250 50  0001 C CNN
	1    3900 6250
	1    0    0    -1  
$EndComp
Wire Wire Line
	3900 6250 3900 6150
Wire Wire Line
	4200 6150 4200 6250
Wire Wire Line
	4200 6550 4200 6650
$Comp
L 000_PreferredParts:C_1uF C112
U 1 1 5E8F7B02
P 5500 1300
F 0 "C112" H 5525 1400 50  0000 L CNN
F 1 "C_1uF" H 5525 1200 50  0000 L CNN
F 2 "Capacitor_SMD:C_0603_1608Metric" H 5538 1150 50  0001 C CNN
F 3 "~" H 5500 1300 50  0001 C CNN
F 4 "3000-0000000136" H 5500 1300 50  0001 C CNN "PartSpecification"
	1    5500 1300
	1    0    0    -1  
$EndComp
$Comp
L power:GND #PWR?
U 1 1 5E8F895F
P 5500 2150
F 0 "#PWR?" H 5500 1900 50  0001 C CNN
F 1 "GND" H 5500 2000 50  0000 C CNN
F 2 "" H 5500 2150 50  0001 C CNN
F 3 "" H 5500 2150 50  0001 C CNN
	1    5500 2150
	1    0    0    -1  
$EndComp
Wire Wire Line
	5500 2150 5500 1450
Wire Wire Line
	5300 2300 5300 1050
Wire Wire Line
	5300 1050 5500 1050
Wire Wire Line
	5500 1050 5500 1150
$Comp
L Device:R R105
U 1 1 5E8FC035
P 4400 2250
F 0 "R105" V 4480 2250 50  0000 C CNN
F 1 "10k" V 4400 2250 50  0000 C CNN
F 2 "Resistor_SMD:R_0402_1005Metric" V 4330 2250 50  0001 C CNN
F 3 "~" H 4400 2250 50  0001 C CNN
	1    4400 2250
	1    0    0    -1  
$EndComp
Connection ~ 5300 1050
Wire Wire Line
	4400 1050 4400 2100
$Comp
L POWDER_Power:CSD18531Q5A U103
U 1 1 5E8FF4C4
P 6700 2600
F 0 "U103" H 6700 2300 50  0000 C CNN
F 1 "CSD18531Q5A" H 6700 2900 50  0000 C CNN
F 2 "POWDER_Power:CSD16321Q5" H 6600 2200 50  0001 C CNN
F 3 "" H 6700 2600 50  0001 C CNN
	1    6700 2600
	1    0    0    -1  
$EndComp
$Comp
L Device:C C104
U 1 1 5E904148
P 1750 1150
F 0 "C104" H 1775 1250 50  0000 L CNN
F 1 "10uF" H 1775 1050 50  0000 L CNN
F 2 "Capacitor_SMD:C_1210_3225Metric" H 1788 1000 50  0001 C CNN
F 3 "~" H 1750 1150 50  0001 C CNN
F 4 "3000-0000000472" H 1750 1150 50  0001 C CNN "PartSpecification"
	1    1750 1150
	1    0    0    -1  
$EndComp
$Comp
L power:GND #PWR?
U 1 1 5E90414E
P 1750 2000
F 0 "#PWR?" H 1750 1750 50  0001 C CNN
F 1 "GND" H 1750 1850 50  0000 C CNN
F 2 "" H 1750 2000 50  0001 C CNN
F 3 "" H 1750 2000 50  0001 C CNN
	1    1750 2000
	1    0    0    -1  
$EndComp
Wire Wire Line
	1750 2000 1750 1300
Wire Wire Line
	1750 1000 1750 900 
Connection ~ 1500 900 
Wire Wire Line
	1500 900  1250 900 
$Comp
L Device:C C106
U 1 1 5E9081E1
P 2000 1150
F 0 "C106" H 2025 1250 50  0000 L CNN
F 1 "10uF" H 2025 1050 50  0000 L CNN
F 2 "Capacitor_SMD:C_1210_3225Metric" H 2038 1000 50  0001 C CNN
F 3 "~" H 2000 1150 50  0001 C CNN
F 4 "3000-0000000472" H 2000 1150 50  0001 C CNN "PartSpecification"
	1    2000 1150
	1    0    0    -1  
$EndComp
$Comp
L power:GND #PWR?
U 1 1 5E9081E7
P 2000 2000
F 0 "#PWR?" H 2000 1750 50  0001 C CNN
F 1 "GND" H 2000 1850 50  0000 C CNN
F 2 "" H 2000 2000 50  0001 C CNN
F 3 "" H 2000 2000 50  0001 C CNN
	1    2000 2000
	1    0    0    -1  
$EndComp
Wire Wire Line
	2000 2000 2000 1300
Wire Wire Line
	2000 1000 2000 900 
Connection ~ 2000 900 
Wire Wire Line
	2000 900  1750 900 
Connection ~ 2700 900 
$Comp
L 000_PreferredParts:C_0_1uF C113
U 1 1 5E90AD8E
P 6000 2850
F 0 "C113" H 6025 2950 50  0000 L CNN
F 1 "C_0_1uF" H 6025 2750 50  0001 L CNN
F 2 "Capacitor_SMD:C_0402_1005Metric" H 6038 2700 50  0001 C CNN
F 3 "~" H 6000 2850 50  0001 C CNN
F 4 "0.1uF" H 6150 2750 50  0000 C CNN "DisplayValue"
F 5 "3000-0000000125" H 6000 2850 50  0001 C CNN "PartSpecification"
F 6 "100V" H 6000 2850 50  0001 C CNN "Voltage"
	1    6000 2850
	1    0    0    -1  
$EndComp
Wire Wire Line
	6000 3000 5900 3000
Wire Wire Line
	6000 2700 5900 2700
$Comp
L 000_PreferredDiodes:D_Schottky_60V_1A D102
U 1 1 5E90E13A
P 6000 1900
F 0 "D102" H 6000 2000 50  0000 C CNN
F 1 "D_Schottky_60V_1A" H 6000 1800 50  0001 C CNN
F 2 "Diode_SMD:D_SOD-123F" H 6000 1900 50  0001 C CNN
F 3 "~" H 6000 1900 50  0001 C CNN
F 4 "DSS16UTR" H 6000 1900 50  0001 C CNN "PartNumber"
F 5 "Schottky" H 6000 1800 50  0000 C CNN "DisplayValue"
F 6 "60V_1A" H 6000 1700 50  0000 C CNN "DisplayValue2"
F 7 "3000-0000000481" H 6000 1900 50  0001 C CNN "PartSpecification"
	1    6000 1900
	0    -1   -1   0   
$EndComp
Wire Wire Line
	6000 2050 6000 2700
Connection ~ 6000 2700
Text Label 5050 1050 0    50   ~ 0
VCC
$Comp
L POWDER_Power:CSD18531Q5A U105
U 1 1 5E913A7C
P 8200 2600
F 0 "U105" H 8200 2300 50  0000 C CNN
F 1 "CSD18531Q5A" H 8200 2900 50  0000 C CNN
F 2 "POWDER_Power:CSD16321Q5" H 8100 2200 50  0001 C CNN
F 3 "" H 8200 2600 50  0001 C CNN
	1    8200 2600
	-1   0    0    -1  
$EndComp
$Comp
L POWDER_Power:CSD18531Q5A U104
U 1 1 5E917C3D
P 6700 3400
F 0 "U104" H 6700 3100 50  0000 C CNN
F 1 "CSD18531Q5A" H 6700 3700 50  0000 C CNN
F 2 "POWDER_Power:CSD16321Q5" H 6600 3000 50  0001 C CNN
F 3 "" H 6700 3400 50  0001 C CNN
	1    6700 3400
	1    0    0    -1  
$EndComp
$Comp
L POWDER_Power:CSD18531Q5A U106
U 1 1 5E917C43
P 8200 3400
F 0 "U106" H 8200 3100 50  0000 C CNN
F 1 "CSD18531Q5A" H 8200 3700 50  0000 C CNN
F 2 "POWDER_Power:CSD16321Q5" H 8100 3000 50  0001 C CNN
F 3 "" H 8200 3400 50  0001 C CNN
	1    8200 3400
	-1   0    0    -1  
$EndComp
$Comp
L Device:L L101
U 1 1 5E919A15
P 7400 3000
F 0 "L101" V 7350 3000 50  0000 C CNN
F 1 "10uH" V 7475 3000 50  0000 C CNN
F 2 "POWDER_Power:PQ2614BxA" H 7400 3000 50  0001 C CNN
F 3 "~" H 7400 3000 50  0001 C CNN
F 4 "3000-0000000493" H 7400 3000 50  0001 C CNN "PartSpecification"
	1    7400 3000
	0    -1   -1   0   
$EndComp
Wire Wire Line
	6650 2400 6750 2400
Connection ~ 6750 2400
Wire Wire Line
	6750 2400 6850 2400
Connection ~ 6850 2400
Wire Wire Line
	6850 2400 6950 2400
Wire Wire Line
	6950 900  6950 2400
Wire Wire Line
	2700 900  6950 900 
Wire Wire Line
	6000 3000 6850 3000
Wire Wire Line
	6850 3000 6850 2800
Connection ~ 6000 3000
Wire Wire Line
	6850 2800 6750 2800
Connection ~ 6850 2800
Connection ~ 6750 2800
Wire Wire Line
	6750 2800 6650 2800
Wire Wire Line
	6950 3200 6850 3200
Connection ~ 6750 3200
Wire Wire Line
	6750 3200 6650 3200
Connection ~ 6850 3200
Wire Wire Line
	6850 3200 6750 3200
Wire Wire Line
	6850 3200 6850 3000
Connection ~ 6850 3000
Wire Wire Line
	6200 3100 5900 3100
Wire Wire Line
	6200 3400 6450 3400
$Comp
L Device:R R113
U 1 1 5E92F66D
P 7350 3850
F 0 "R113" V 7430 3850 50  0000 C CNN
F 1 "5m" V 7350 3850 50  0000 C CNN
F 2 "Resistor_SMD:R_0612_1632Metric" V 7280 3850 50  0001 C CNN
F 3 "~" H 7350 3850 50  0001 C CNN
	1    7350 3850
	1    0    0    -1  
$EndComp
$Comp
L Device:R R114
U 1 1 5E9300DE
P 7650 3850
F 0 "R114" V 7730 3850 50  0000 C CNN
F 1 "DNP" V 7650 3850 50  0000 C CNN
F 2 "Resistor_SMD:R_0612_1632Metric" V 7580 3850 50  0001 C CNN
F 3 "~" H 7650 3850 50  0001 C CNN
	1    7650 3850
	1    0    0    -1  
$EndComp
Wire Wire Line
	6650 3600 6750 3600
Connection ~ 6750 3600
Wire Wire Line
	6750 3600 6850 3600
Connection ~ 6850 3600
Wire Wire Line
	7350 3700 7350 3600
$Comp
L power:GND #PWR?
U 1 1 5E934401
P 8150 4150
F 0 "#PWR?" H 8150 3900 50  0001 C CNN
F 1 "GND" H 8150 4000 50  0000 C CNN
F 2 "" H 8150 4150 50  0001 C CNN
F 3 "" H 8150 4150 50  0001 C CNN
	1    8150 4150
	1    0    0    -1  
$EndComp
Wire Wire Line
	7650 4000 7650 4100
Wire Wire Line
	7350 4100 7350 4000
$Comp
L 000_PreferredParts:C_100pF C114
U 1 1 5E93C378
P 6000 3900
F 0 "C114" H 6025 4000 50  0000 L CNN
F 1 "C_100pF" H 6025 3800 50  0001 L CNN
F 2 "Capacitor_SMD:C_0402_1005Metric" H 6038 3750 50  0001 C CNN
F 3 "~" H 6000 3900 50  0001 C CNN
F 4 "100pF" H 6150 3800 50  0000 C CNN "DisplayValue"
F 5 "3000-0000000474" H 6000 3900 50  0001 C CNN "PartSpecification"
	1    6000 3900
	1    0    0    -1  
$EndComp
Wire Wire Line
	5900 4100 6000 4100
$Comp
L Device:R R110
U 1 1 5E93F9CD
P 6250 4100
F 0 "R110" V 6330 4100 50  0000 C CNN
F 1 "100" V 6250 4100 50  0000 C CNN
F 2 "Resistor_SMD:R_0402_1005Metric" V 6180 4100 50  0001 C CNN
F 3 "~" H 6250 4100 50  0001 C CNN
	1    6250 4100
	0    1    1    0   
$EndComp
$Comp
L Device:R R109
U 1 1 5E940044
P 6250 3700
F 0 "R109" V 6330 3700 50  0000 C CNN
F 1 "100" V 6250 3700 50  0000 C CNN
F 2 "Resistor_SMD:R_0402_1005Metric" V 6180 3700 50  0001 C CNN
F 3 "~" H 6250 3700 50  0001 C CNN
	1    6250 3700
	0    1    1    0   
$EndComp
Wire Wire Line
	6100 3700 6000 3700
Wire Wire Line
	6000 3750 6000 3700
Connection ~ 6000 3700
Wire Wire Line
	6000 3700 5900 3700
Wire Wire Line
	6000 4050 6000 4100
Connection ~ 6000 4100
Wire Wire Line
	6000 4100 6100 4100
Connection ~ 7350 3700
$Comp
L Device:Net-Tie_2 NT101
U 1 1 5E94BD52
P 8000 4100
F 0 "NT101" H 8000 4150 50  0000 C CNN
F 1 "Net-Tie_2" H 8000 4050 50  0000 C CNN
F 2 "Resistor_SMD:R_0805_2012Metric" H 8000 4100 50  0001 C CNN
F 3 "~" H 8000 4100 50  0001 C CNN
	1    8000 4100
	-1   0    0    1   
$EndComp
Connection ~ 8050 3600
Wire Wire Line
	8050 3600 8150 3600
Connection ~ 8150 3600
Wire Wire Line
	8150 3600 8250 3600
Wire Wire Line
	8250 3200 8150 3200
Connection ~ 8050 3200
Wire Wire Line
	8050 3200 7950 3200
Connection ~ 8150 3200
Wire Wire Line
	8150 3200 8050 3200
Wire Wire Line
	8250 2400 8150 2400
Connection ~ 8050 2400
Wire Wire Line
	8050 2400 7950 2400
Connection ~ 8150 2400
Wire Wire Line
	8150 2400 8050 2400
Wire Wire Line
	8050 2800 8150 2800
Connection ~ 8150 2800
Wire Wire Line
	8150 2800 8250 2800
Wire Wire Line
	8050 2800 8050 3000
Connection ~ 8050 2800
Wire Wire Line
	8050 3000 7650 3000
Connection ~ 8050 3000
Wire Wire Line
	8050 3000 8050 3200
Wire Wire Line
	7250 3000 7150 3000
Wire Wire Line
	7900 4100 7650 4100
Wire Wire Line
	8150 4150 8150 4100
Wire Wire Line
	8150 4100 8100 4100
$Comp
L 000_PreferredDiodes:D_Schottky_60V_1A D103
U 1 1 5E96F094
P 6600 4800
F 0 "D103" H 6600 4900 50  0000 C CNN
F 1 "D_Schottky_60V_1A" H 6600 4700 50  0001 C CNN
F 2 "Diode_SMD:D_SOD-123F" H 6600 4800 50  0001 C CNN
F 3 "~" H 6600 4800 50  0001 C CNN
F 4 "DSS16UTR" H 6600 4800 50  0001 C CNN "PartNumber"
F 5 "Schottky" H 6600 4700 50  0000 C CNN "DisplayValue"
F 6 "60V_1A" H 6600 4600 50  0000 C CNN "DisplayValue2"
F 7 "3000-0000000481" H 6600 4800 50  0001 C CNN "PartSpecification"
	1    6600 4800
	1    0    0    -1  
$EndComp
$Comp
L 000_PreferredParts:C_0_1uF C115
U 1 1 5E96FD61
P 6000 4650
F 0 "C115" H 6025 4750 50  0000 L CNN
F 1 "C_0_1uF" H 6025 4550 50  0001 L CNN
F 2 "Capacitor_SMD:C_0402_1005Metric" H 6038 4500 50  0001 C CNN
F 3 "~" H 6000 4650 50  0001 C CNN
F 4 "0.1uF" H 6150 4550 50  0000 C CNN "DisplayValue"
F 5 "3000-0000000125" H 6000 4650 50  0001 C CNN "PartSpecification"
F 6 "100V" H 6000 4650 50  0001 C CNN "Voltage"
	1    6000 4650
	1    0    0    -1  
$EndComp
Wire Wire Line
	5900 4800 6000 4800
Wire Wire Line
	5900 4500 6000 4500
Wire Wire Line
	6000 4800 6450 4800
Wire Wire Line
	6750 4800 6950 4800
Text Label 7400 4800 0    50   ~ 0
VCC_BRANCH
Wire Wire Line
	8550 4400 8550 3400
Wire Wire Line
	8550 3400 8450 3400
Wire Wire Line
	8750 4900 8750 2600
Wire Wire Line
	8750 2600 8450 2600
Connection ~ 6000 4800
Wire Wire Line
	6000 4500 8650 4500
Wire Wire Line
	8650 4500 8650 3000
Wire Wire Line
	8650 3000 8050 3000
Connection ~ 6000 4500
Connection ~ 8250 2400
$Comp
L Device:R R107
U 1 1 5E9966DD
P 6150 5650
F 0 "R107" V 6230 5650 50  0000 C CNN
F 1 "0" V 6150 5650 50  0000 C CNN
F 2 "Resistor_SMD:R_0402_1005Metric" V 6080 5650 50  0001 C CNN
F 3 "~" H 6150 5650 50  0001 C CNN
	1    6150 5650
	0    1    1    0   
$EndComp
$Comp
L Device:R R108
U 1 1 5E996FB7
P 6150 5950
F 0 "R108" V 6230 5950 50  0000 C CNN
F 1 "0" V 6150 5950 50  0000 C CNN
F 2 "Resistor_SMD:R_0402_1005Metric" V 6080 5950 50  0001 C CNN
F 3 "~" H 6150 5950 50  0001 C CNN
	1    6150 5950
	0    1    1    0   
$EndComp
$Comp
L Device:R R112
U 1 1 5E997458
P 8000 5650
F 0 "R112" V 8080 5650 50  0000 C CNN
F 1 "1.657k" V 8000 5650 50  0000 C CNN
F 2 "Resistor_SMD:R_0402_1005Metric" V 7930 5650 50  0001 C CNN
F 3 "~" H 8000 5650 50  0001 C CNN
	1    8000 5650
	-1   0    0    1   
$EndComp
$Comp
L Device:R R111
U 1 1 5E997BB8
P 8000 5250
F 0 "R111" V 8080 5250 50  0000 C CNN
F 1 "23.2k" V 8000 5250 50  0000 C CNN
F 2 "Resistor_SMD:R_0603_1608Metric" V 7930 5250 50  0001 C CNN
F 3 "~" H 8000 5250 50  0001 C CNN
	1    8000 5250
	-1   0    0    1   
$EndComp
Wire Wire Line
	5900 5400 8000 5400
Wire Wire Line
	8000 5400 8000 5500
Connection ~ 8000 5400
$Comp
L power:GND #PWR?
U 1 1 5E9A1934
P 8000 5900
F 0 "#PWR?" H 8000 5650 50  0001 C CNN
F 1 "GND" H 8000 5750 50  0000 C CNN
F 2 "" H 8000 5900 50  0001 C CNN
F 3 "" H 8000 5900 50  0001 C CNN
	1    8000 5900
	1    0    0    -1  
$EndComp
Wire Wire Line
	8000 5900 8000 5800
$Comp
L power:GND #PWR?
U 1 1 5E9A6B4C
P 6350 6050
F 0 "#PWR?" H 6350 5800 50  0001 C CNN
F 1 "GND" H 6350 5900 50  0000 C CNN
F 2 "" H 6350 6050 50  0001 C CNN
F 3 "" H 6350 6050 50  0001 C CNN
	1    6350 6050
	1    0    0    -1  
$EndComp
Wire Wire Line
	6350 6050 6350 5950
Wire Wire Line
	6350 5650 6300 5650
Wire Wire Line
	6300 5950 6350 5950
Connection ~ 6350 5950
Wire Wire Line
	6350 5950 6350 5650
Wire Wire Line
	6000 5950 5900 5950
Wire Wire Line
	5900 5650 6000 5650
Wire Wire Line
	2400 2600 900  2600
Connection ~ 2400 2600
$Comp
L Device:C C116
U 1 1 5E9E8DF6
P 9350 2750
F 0 "C116" H 9375 2850 50  0000 L CNN
F 1 "10uF" H 9375 2650 50  0000 L CNN
F 2 "Capacitor_SMD:C_1210_3225Metric" H 9388 2600 50  0001 C CNN
F 3 "~" H 9350 2750 50  0001 C CNN
F 4 "3000-0000000472" H 9350 2750 50  0001 C CNN "PartSpecification"
	1    9350 2750
	1    0    0    -1  
$EndComp
$Comp
L Device:C C118
U 1 1 5E9EA244
P 9600 2750
F 0 "C118" H 9625 2850 50  0000 L CNN
F 1 "10uF" H 9625 2650 50  0000 L CNN
F 2 "Capacitor_SMD:C_1210_3225Metric" H 9638 2600 50  0001 C CNN
F 3 "~" H 9600 2750 50  0001 C CNN
F 4 "3000-0000000472" H 9600 2750 50  0001 C CNN "PartSpecification"
	1    9600 2750
	1    0    0    -1  
$EndComp
$Comp
L Device:C C120
U 1 1 5E9EA550
P 9850 2750
F 0 "C120" H 9875 2850 50  0000 L CNN
F 1 "10uF" H 9875 2650 50  0000 L CNN
F 2 "Capacitor_SMD:C_1210_3225Metric" H 9888 2600 50  0001 C CNN
F 3 "~" H 9850 2750 50  0001 C CNN
F 4 "3000-0000000472" H 9850 2750 50  0001 C CNN "PartSpecification"
	1    9850 2750
	1    0    0    -1  
$EndComp
$Comp
L Device:C C122
U 1 1 5E9EA888
P 10100 2750
F 0 "C122" H 10125 2850 50  0000 L CNN
F 1 "10uF" H 10125 2650 50  0000 L CNN
F 2 "Capacitor_SMD:C_1210_3225Metric" H 10138 2600 50  0001 C CNN
F 3 "~" H 10100 2750 50  0001 C CNN
F 4 "3000-0000000472" H 10100 2750 50  0001 C CNN "PartSpecification"
	1    10100 2750
	1    0    0    -1  
$EndComp
$Comp
L Device:C C124
U 1 1 5E9EADB9
P 10350 2750
F 0 "C124" H 10375 2850 50  0000 L CNN
F 1 "10uF" H 10375 2650 50  0000 L CNN
F 2 "Capacitor_SMD:C_1210_3225Metric" H 10388 2600 50  0001 C CNN
F 3 "~" H 10350 2750 50  0001 C CNN
F 4 "3000-0000000472" H 10350 2750 50  0001 C CNN "PartSpecification"
	1    10350 2750
	1    0    0    -1  
$EndComp
$Comp
L power:GND #PWR?
U 1 1 5E9EB0B4
P 9350 3000
F 0 "#PWR?" H 9350 2750 50  0001 C CNN
F 1 "GND" H 9350 2850 50  0000 C CNN
F 2 "" H 9350 3000 50  0001 C CNN
F 3 "" H 9350 3000 50  0001 C CNN
	1    9350 3000
	1    0    0    -1  
$EndComp
$Comp
L power:GND #PWR?
U 1 1 5E9EB4C9
P 9600 3000
F 0 "#PWR?" H 9600 2750 50  0001 C CNN
F 1 "GND" H 9600 2850 50  0000 C CNN
F 2 "" H 9600 3000 50  0001 C CNN
F 3 "" H 9600 3000 50  0001 C CNN
	1    9600 3000
	1    0    0    -1  
$EndComp
$Comp
L power:GND #PWR?
U 1 1 5E9EB64E
P 9850 3000
F 0 "#PWR?" H 9850 2750 50  0001 C CNN
F 1 "GND" H 9850 2850 50  0000 C CNN
F 2 "" H 9850 3000 50  0001 C CNN
F 3 "" H 9850 3000 50  0001 C CNN
	1    9850 3000
	1    0    0    -1  
$EndComp
$Comp
L power:GND #PWR?
U 1 1 5E9EB875
P 10100 3000
F 0 "#PWR?" H 10100 2750 50  0001 C CNN
F 1 "GND" H 10100 2850 50  0000 C CNN
F 2 "" H 10100 3000 50  0001 C CNN
F 3 "" H 10100 3000 50  0001 C CNN
	1    10100 3000
	1    0    0    -1  
$EndComp
$Comp
L power:GND #PWR?
U 1 1 5E9EBB26
P 10350 3000
F 0 "#PWR?" H 10350 2750 50  0001 C CNN
F 1 "GND" H 10350 2850 50  0000 C CNN
F 2 "" H 10350 3000 50  0001 C CNN
F 3 "" H 10350 3000 50  0001 C CNN
	1    10350 3000
	1    0    0    -1  
$EndComp
Wire Wire Line
	10350 3000 10350 2900
Wire Wire Line
	10100 3000 10100 2900
Wire Wire Line
	9850 3000 9850 2900
Wire Wire Line
	9600 3000 9600 2900
Wire Wire Line
	9350 3000 9350 2900
Wire Wire Line
	10350 2600 10350 2400
Wire Wire Line
	10100 2600 10100 2400
Wire Wire Line
	9850 2600 9850 2400
Wire Wire Line
	9600 2600 9600 2400
Wire Wire Line
	9350 2600 9350 2400
$Comp
L Device:CP C123
U 1 1 5EA1EC91
P 10350 1750
F 0 "C123" H 10375 1850 50  0000 L CNN
F 1 "82uF" H 10375 1650 50  0000 L CNN
F 2 "Capacitor_SMD:CP_Elec_10x10" H 10388 1600 50  0001 C CNN
F 3 "~" H 10350 1750 50  0001 C CNN
F 4 "3000-0000000470" H 10350 1750 50  0001 C CNN "PartSpecification"
	1    10350 1750
	1    0    0    -1  
$EndComp
$Comp
L Device:CP C121
U 1 1 5EA1FADE
P 10100 1750
F 0 "C121" H 10125 1850 50  0000 L CNN
F 1 "82uF" H 10125 1650 50  0000 L CNN
F 2 "Capacitor_SMD:CP_Elec_10x10" H 10138 1600 50  0001 C CNN
F 3 "~" H 10100 1750 50  0001 C CNN
F 4 "3000-0000000470" H 10100 1750 50  0001 C CNN "PartSpecification"
	1    10100 1750
	1    0    0    -1  
$EndComp
$Comp
L Device:CP C119
U 1 1 5EA20C0D
P 9850 1750
F 0 "C119" H 9875 1850 50  0000 L CNN
F 1 "82uF" H 9875 1650 50  0000 L CNN
F 2 "Capacitor_SMD:CP_Elec_10x10" H 9888 1600 50  0001 C CNN
F 3 "~" H 9850 1750 50  0001 C CNN
F 4 "3000-0000000470" H 9850 1750 50  0001 C CNN "PartSpecification"
	1    9850 1750
	1    0    0    -1  
$EndComp
$Comp
L Device:CP C117
U 1 1 5EA20C13
P 9600 1750
F 0 "C117" H 9625 1850 50  0000 L CNN
F 1 "82uF" H 9625 1650 50  0000 L CNN
F 2 "Capacitor_SMD:CP_Elec_10x10" H 9638 1600 50  0001 C CNN
F 3 "~" H 9600 1750 50  0001 C CNN
F 4 "3000-0000000470" H 9600 1750 50  0001 C CNN "PartSpecification"
	1    9600 1750
	1    0    0    -1  
$EndComp
$Comp
L power:GND #PWR?
U 1 1 5EA26974
P 10350 2000
F 0 "#PWR?" H 10350 1750 50  0001 C CNN
F 1 "GND" H 10350 1850 50  0000 C CNN
F 2 "" H 10350 2000 50  0001 C CNN
F 3 "" H 10350 2000 50  0001 C CNN
	1    10350 2000
	1    0    0    -1  
$EndComp
$Comp
L power:GND #PWR?
U 1 1 5EA26C8A
P 10100 2000
F 0 "#PWR?" H 10100 1750 50  0001 C CNN
F 1 "GND" H 10100 1850 50  0000 C CNN
F 2 "" H 10100 2000 50  0001 C CNN
F 3 "" H 10100 2000 50  0001 C CNN
	1    10100 2000
	1    0    0    -1  
$EndComp
$Comp
L power:GND #PWR?
U 1 1 5EA26F01
P 9850 2000
F 0 "#PWR?" H 9850 1750 50  0001 C CNN
F 1 "GND" H 9850 1850 50  0000 C CNN
F 2 "" H 9850 2000 50  0001 C CNN
F 3 "" H 9850 2000 50  0001 C CNN
	1    9850 2000
	1    0    0    -1  
$EndComp
$Comp
L power:GND #PWR?
U 1 1 5EA27071
P 9600 2000
F 0 "#PWR?" H 9600 1750 50  0001 C CNN
F 1 "GND" H 9600 1850 50  0000 C CNN
F 2 "" H 9600 2000 50  0001 C CNN
F 3 "" H 9600 2000 50  0001 C CNN
	1    9600 2000
	1    0    0    -1  
$EndComp
Wire Wire Line
	9600 2000 9600 1900
Wire Wire Line
	9850 1900 9850 2000
Wire Wire Line
	10350 2400 10600 2400
Wire Wire Line
	10600 2400 10600 1500
Wire Wire Line
	10600 1500 10350 1500
Wire Wire Line
	9600 1500 9600 1600
Connection ~ 10350 2400
Wire Wire Line
	9850 1500 9850 1600
Connection ~ 9850 1500
Wire Wire Line
	9850 1500 9600 1500
Wire Wire Line
	10100 1500 10100 1600
Connection ~ 10100 1500
Wire Wire Line
	10100 1500 9850 1500
Wire Wire Line
	10350 1500 10350 1600
Connection ~ 10350 1500
Wire Wire Line
	10350 1500 10100 1500
Wire Wire Line
	10350 1900 10350 2000
Wire Wire Line
	10100 2000 10100 1900
$Comp
L Connector:Screw_Terminal_01x02 J102
U 1 1 5EA5CBF4
P 10800 4700
F 0 "J102" H 10800 4800 50  0000 C CNN
F 1 "Screw_Terminal_01x02" V 10950 4600 50  0000 C CNN
F 2 "TerminalBlock:TerminalBlock_bornier-2_P5.08mm" H 10800 4700 50  0001 C CNN
F 3 "~" H 10800 4700 50  0001 C CNN
F 4 "3000-0000000184" H 10800 4700 50  0001 C CNN "PartSpecification"
	1    10800 4700
	1    0    0    1   
$EndComp
$Comp
L power:GND #PWR?
U 1 1 5EA5DBDC
P 10600 4800
F 0 "#PWR?" H 10600 4550 50  0001 C CNN
F 1 "GND" H 10600 4650 50  0000 C CNN
F 2 "" H 10600 4800 50  0001 C CNN
F 3 "" H 10600 4800 50  0001 C CNN
	1    10600 4800
	1    0    0    -1  
$EndComp
Wire Wire Line
	10600 4800 10600 4700
Text Label 6450 3000 0    50   ~ 0
L_IN
Text Label 8200 3000 0    50   ~ 0
L_OUT
Text Label 5950 2600 1    50   ~ 0
G_H_IN
Text Label 8000 4900 0    50   ~ 0
G_H_OUT
Text Label 5950 3100 0    50   ~ 0
G_L_IN
Text Label 7700 4400 0    50   ~ 0
G_L_OUT
Text Label 6000 3700 1    50   ~ 0
CS_IC
Text Label 6000 4100 3    50   ~ 0
CSG_IC
Text Label 6450 3700 0    50   ~ 0
CS
Text Label 6450 4100 0    50   ~ 0
CSG
Text Label 4000 3000 0    50   ~ 0
EN
Text Label 4000 3100 0    50   ~ 0
RT_SYNC
Text Label 1950 3100 0    50   ~ 0
SYNC
$Comp
L Connector:Screw_Terminal_01x02 J103
U 1 1 5EA8375C
P 1700 3100
F 0 "J103" H 1700 3200 50  0000 C CNN
F 1 "Screw_Terminal_01x02" H 1700 2900 50  0000 C CNN
F 2 "TerminalBlock:TerminalBlock_bornier-2_P5.08mm" H 1700 3100 50  0001 C CNN
F 3 "~" H 1700 3100 50  0001 C CNN
F 4 "3000-0000000184" H 1700 3100 50  0001 C CNN "PartSpecification"
	1    1700 3100
	-1   0    0    1   
$EndComp
Text Label 4000 3200 0    50   ~ 0
MODE
Text Label 4000 3300 0    50   ~ 0
SS
Text Label 4000 3400 0    50   ~ 0
DITH
Text Label 4000 3500 0    50   ~ 0
SLOPE
Text Label 3500 4800 0    50   ~ 0
PGOOD
Text Label 4050 5450 0    50   ~ 0
BIAS
Text Label 4050 5650 0    50   ~ 0
COMP
Text Label 4200 6200 0    50   ~ 0
COMP_MID
Text Label 5950 5650 1    50   ~ 0
ISNS_P
Text Label 5950 5950 1    50   ~ 0
ISNS_N
Text Label 6150 5400 0    50   ~ 0
FB
Text Label 10200 2400 0    50   ~ 0
V_OUT
Connection ~ 9350 2400
Wire Wire Line
	9350 2400 9600 2400
Connection ~ 10100 2400
Wire Wire Line
	10100 2400 10350 2400
Connection ~ 9600 2400
Wire Wire Line
	9600 2400 9850 2400
Connection ~ 9850 2400
Wire Wire Line
	9850 2400 10100 2400
$Comp
L Device:R R115
U 1 1 5EAF309B
P 3850 3400
F 0 "R115" V 3930 3400 50  0000 C CNN
F 1 "0" V 3850 3400 50  0000 C CNN
F 2 "Resistor_SMD:R_0402_1005Metric" V 3780 3400 50  0001 C CNN
F 3 "~" H 3850 3400 50  0001 C CNN
	1    3850 3400
	0    1    1    0   
$EndComp
Wire Wire Line
	3700 3400 3500 3400
$Comp
L Device:C C126
U 1 1 5EC766CB
P 8250 5650
F 0 "C126" H 8365 5696 50  0000 L CNN
F 1 "100p" H 8365 5605 50  0000 L CNN
F 2 "Capacitor_SMD:C_0402_1005Metric" H 8288 5500 50  0001 C CNN
F 3 "~" H 8250 5650 50  0001 C CNN
	1    8250 5650
	1    0    0    -1  
$EndComp
$Comp
L Device:C C125
U 1 1 5EC769AD
P 8250 5250
F 0 "C125" H 8365 5296 50  0000 L CNN
F 1 "DNP" H 8365 5205 50  0000 L CNN
F 2 "Capacitor_SMD:C_0402_1005Metric" H 8288 5100 50  0001 C CNN
F 3 "~" H 8250 5250 50  0001 C CNN
	1    8250 5250
	1    0    0    -1  
$EndComp
Connection ~ 8250 5100
Wire Wire Line
	8250 5100 8000 5100
Wire Wire Line
	8000 5400 8250 5400
Wire Wire Line
	8250 5500 8250 5400
Connection ~ 8250 5400
$Comp
L power:GND #PWR?
U 1 1 5EC8668C
P 8250 5900
F 0 "#PWR?" H 8250 5650 50  0001 C CNN
F 1 "GND" H 8250 5750 50  0000 C CNN
F 2 "" H 8250 5900 50  0001 C CNN
F 3 "" H 8250 5900 50  0001 C CNN
	1    8250 5900
	1    0    0    -1  
$EndComp
Wire Wire Line
	8250 5800 8250 5900
Wire Wire Line
	8250 2400 8950 2400
$Comp
L Device:L L102
U 1 1 5ECA7DDB
P 10600 2700
F 0 "L102" H 10653 2746 50  0000 L CNN
F 1 "1.5uH" H 10653 2655 50  0000 L CNN
F 2 "Inductor_SMD:L_Vishay_IHLP-4040" H 10600 2700 50  0001 C CNN
F 3 "~" H 10600 2700 50  0001 C CNN
	1    10600 2700
	1    0    0    -1  
$EndComp
$Comp
L Device:C C129
U 1 1 5ECB5B61
P 9350 4500
F 0 "C129" H 9375 4600 50  0000 L CNN
F 1 "10uF" H 9375 4400 50  0000 L CNN
F 2 "Capacitor_SMD:C_1210_3225Metric" H 9388 4350 50  0001 C CNN
F 3 "~" H 9350 4500 50  0001 C CNN
F 4 "3000-0000000472" H 9350 4500 50  0001 C CNN "PartSpecification"
	1    9350 4500
	1    0    0    -1  
$EndComp
$Comp
L Device:C C131
U 1 1 5ECB5B67
P 9600 4500
F 0 "C131" H 9625 4600 50  0000 L CNN
F 1 "10uF" H 9625 4400 50  0000 L CNN
F 2 "Capacitor_SMD:C_1210_3225Metric" H 9638 4350 50  0001 C CNN
F 3 "~" H 9600 4500 50  0001 C CNN
F 4 "3000-0000000472" H 9600 4500 50  0001 C CNN "PartSpecification"
	1    9600 4500
	1    0    0    -1  
$EndComp
$Comp
L Device:C C133
U 1 1 5ECB5B6D
P 9850 4500
F 0 "C133" H 9875 4600 50  0000 L CNN
F 1 "10uF" H 9875 4400 50  0000 L CNN
F 2 "Capacitor_SMD:C_1210_3225Metric" H 9888 4350 50  0001 C CNN
F 3 "~" H 9850 4500 50  0001 C CNN
F 4 "3000-0000000472" H 9850 4500 50  0001 C CNN "PartSpecification"
	1    9850 4500
	1    0    0    -1  
$EndComp
$Comp
L Device:C C135
U 1 1 5ECB5B73
P 10100 4500
F 0 "C135" H 10125 4600 50  0000 L CNN
F 1 "10uF" H 10125 4400 50  0000 L CNN
F 2 "Capacitor_SMD:C_1210_3225Metric" H 10138 4350 50  0001 C CNN
F 3 "~" H 10100 4500 50  0001 C CNN
F 4 "3000-0000000472" H 10100 4500 50  0001 C CNN "PartSpecification"
	1    10100 4500
	1    0    0    -1  
$EndComp
$Comp
L Device:C C137
U 1 1 5ECB5B79
P 10350 4500
F 0 "C137" H 10375 4600 50  0000 L CNN
F 1 "10uF" H 10375 4400 50  0000 L CNN
F 2 "Capacitor_SMD:C_1210_3225Metric" H 10388 4350 50  0001 C CNN
F 3 "~" H 10350 4500 50  0001 C CNN
F 4 "3000-0000000472" H 10350 4500 50  0001 C CNN "PartSpecification"
	1    10350 4500
	1    0    0    -1  
$EndComp
$Comp
L power:GND #PWR?
U 1 1 5ECB5B7F
P 9350 4750
F 0 "#PWR?" H 9350 4500 50  0001 C CNN
F 1 "GND" H 9350 4600 50  0000 C CNN
F 2 "" H 9350 4750 50  0001 C CNN
F 3 "" H 9350 4750 50  0001 C CNN
	1    9350 4750
	1    0    0    -1  
$EndComp
$Comp
L power:GND #PWR?
U 1 1 5ECB5B85
P 9600 4750
F 0 "#PWR?" H 9600 4500 50  0001 C CNN
F 1 "GND" H 9600 4600 50  0000 C CNN
F 2 "" H 9600 4750 50  0001 C CNN
F 3 "" H 9600 4750 50  0001 C CNN
	1    9600 4750
	1    0    0    -1  
$EndComp
$Comp
L power:GND #PWR?
U 1 1 5ECB5B8B
P 9850 4750
F 0 "#PWR?" H 9850 4500 50  0001 C CNN
F 1 "GND" H 9850 4600 50  0000 C CNN
F 2 "" H 9850 4750 50  0001 C CNN
F 3 "" H 9850 4750 50  0001 C CNN
	1    9850 4750
	1    0    0    -1  
$EndComp
$Comp
L power:GND #PWR?
U 1 1 5ECB5B91
P 10100 4750
F 0 "#PWR?" H 10100 4500 50  0001 C CNN
F 1 "GND" H 10100 4600 50  0000 C CNN
F 2 "" H 10100 4750 50  0001 C CNN
F 3 "" H 10100 4750 50  0001 C CNN
	1    10100 4750
	1    0    0    -1  
$EndComp
$Comp
L power:GND #PWR?
U 1 1 5ECB5B97
P 10350 4750
F 0 "#PWR?" H 10350 4500 50  0001 C CNN
F 1 "GND" H 10350 4600 50  0000 C CNN
F 2 "" H 10350 4750 50  0001 C CNN
F 3 "" H 10350 4750 50  0001 C CNN
	1    10350 4750
	1    0    0    -1  
$EndComp
Wire Wire Line
	10350 4750 10350 4650
Wire Wire Line
	10100 4750 10100 4650
Wire Wire Line
	9850 4750 9850 4650
Wire Wire Line
	9600 4750 9600 4650
Wire Wire Line
	9350 4750 9350 4650
Wire Wire Line
	10350 4350 10350 4150
Wire Wire Line
	10100 4350 10100 4150
Wire Wire Line
	9850 4350 9850 4150
Wire Wire Line
	9600 4350 9600 4150
$Comp
L Device:CP C136
U 1 1 5ECB5BA7
P 10350 3500
F 0 "C136" H 10375 3600 50  0000 L CNN
F 1 "82uF" H 10375 3400 50  0000 L CNN
F 2 "Capacitor_SMD:CP_Elec_10x10" H 10388 3350 50  0001 C CNN
F 3 "~" H 10350 3500 50  0001 C CNN
F 4 "3000-0000000470" H 10350 3500 50  0001 C CNN "PartSpecification"
	1    10350 3500
	1    0    0    -1  
$EndComp
$Comp
L Device:CP C134
U 1 1 5ECB5BAD
P 10100 3500
F 0 "C134" H 10125 3600 50  0000 L CNN
F 1 "82uF" H 10125 3400 50  0000 L CNN
F 2 "Capacitor_SMD:CP_Elec_10x10" H 10138 3350 50  0001 C CNN
F 3 "~" H 10100 3500 50  0001 C CNN
F 4 "3000-0000000470" H 10100 3500 50  0001 C CNN "PartSpecification"
	1    10100 3500
	1    0    0    -1  
$EndComp
$Comp
L Device:CP C132
U 1 1 5ECB5BB3
P 9850 3500
F 0 "C132" H 9875 3600 50  0000 L CNN
F 1 "82uF" H 9875 3400 50  0000 L CNN
F 2 "Capacitor_SMD:CP_Elec_10x10" H 9888 3350 50  0001 C CNN
F 3 "~" H 9850 3500 50  0001 C CNN
F 4 "3000-0000000470" H 9850 3500 50  0001 C CNN "PartSpecification"
	1    9850 3500
	1    0    0    -1  
$EndComp
$Comp
L Device:CP C130
U 1 1 5ECB5BB9
P 9600 3500
F 0 "C130" H 9625 3600 50  0000 L CNN
F 1 "82uF" H 9625 3400 50  0000 L CNN
F 2 "Capacitor_SMD:CP_Elec_10x10" H 9638 3350 50  0001 C CNN
F 3 "~" H 9600 3500 50  0001 C CNN
F 4 "3000-0000000470" H 9600 3500 50  0001 C CNN "PartSpecification"
	1    9600 3500
	1    0    0    -1  
$EndComp
$Comp
L power:GND #PWR?
U 1 1 5ECB5BBF
P 10350 3750
F 0 "#PWR?" H 10350 3500 50  0001 C CNN
F 1 "GND" H 10350 3600 50  0000 C CNN
F 2 "" H 10350 3750 50  0001 C CNN
F 3 "" H 10350 3750 50  0001 C CNN
	1    10350 3750
	1    0    0    -1  
$EndComp
$Comp
L power:GND #PWR?
U 1 1 5ECB5BC5
P 10100 3750
F 0 "#PWR?" H 10100 3500 50  0001 C CNN
F 1 "GND" H 10100 3600 50  0000 C CNN
F 2 "" H 10100 3750 50  0001 C CNN
F 3 "" H 10100 3750 50  0001 C CNN
	1    10100 3750
	1    0    0    -1  
$EndComp
$Comp
L power:GND #PWR?
U 1 1 5ECB5BCB
P 9850 3750
F 0 "#PWR?" H 9850 3500 50  0001 C CNN
F 1 "GND" H 9850 3600 50  0000 C CNN
F 2 "" H 9850 3750 50  0001 C CNN
F 3 "" H 9850 3750 50  0001 C CNN
	1    9850 3750
	1    0    0    -1  
$EndComp
$Comp
L power:GND #PWR?
U 1 1 5ECB5BD1
P 9600 3750
F 0 "#PWR?" H 9600 3500 50  0001 C CNN
F 1 "GND" H 9600 3600 50  0000 C CNN
F 2 "" H 9600 3750 50  0001 C CNN
F 3 "" H 9600 3750 50  0001 C CNN
	1    9600 3750
	1    0    0    -1  
$EndComp
Wire Wire Line
	9600 3750 9600 3650
Wire Wire Line
	9850 3650 9850 3750
Wire Wire Line
	10350 4150 10600 4150
Wire Wire Line
	10600 4150 10600 3250
Wire Wire Line
	10600 3250 10350 3250
Wire Wire Line
	9600 3250 9600 3350
Connection ~ 10350 4150
Wire Wire Line
	9850 3250 9850 3350
Connection ~ 9850 3250
Wire Wire Line
	9850 3250 9600 3250
Wire Wire Line
	10100 3250 10100 3350
Connection ~ 10100 3250
Wire Wire Line
	10100 3250 9850 3250
Wire Wire Line
	10350 3250 10350 3350
Connection ~ 10350 3250
Wire Wire Line
	10350 3250 10100 3250
Wire Wire Line
	10350 3650 10350 3750
Wire Wire Line
	10100 3750 10100 3650
Text Label 10200 4150 0    50   ~ 0
V_OUT_FILTERED
Wire Wire Line
	9300 4150 9350 4150
Connection ~ 10100 4150
Wire Wire Line
	10100 4150 10350 4150
Connection ~ 9600 4150
Wire Wire Line
	9600 4150 9850 4150
Connection ~ 9850 4150
Wire Wire Line
	9850 4150 10100 4150
Wire Wire Line
	10600 2550 10600 2400
Connection ~ 10600 2400
Wire Wire Line
	10600 2850 10600 3250
Connection ~ 10600 3250
Wire Wire Line
	10600 4600 10600 4150
Connection ~ 10600 4150
$Comp
L Device:R R125
U 1 1 5ECE3A69
P 8950 2750
F 0 "R125" H 9020 2796 50  0000 L CNN
F 1 "0" H 9020 2705 50  0000 L CNN
F 2 "Resistor_SMD:R_0402_1005Metric" V 8880 2750 50  0001 C CNN
F 3 "~" H 8950 2750 50  0001 C CNN
	1    8950 2750
	1    0    0    -1  
$EndComp
$Comp
L Device:R R126
U 1 1 5ECE422D
P 9150 4150
F 0 "R126" V 8943 4150 50  0000 C CNN
F 1 "DNP" V 9034 4150 50  0000 C CNN
F 2 "Resistor_SMD:R_0402_1005Metric" V 9080 4150 50  0001 C CNN
F 3 "~" H 9150 4150 50  0001 C CNN
	1    9150 4150
	0    1    1    0   
$EndComp
Wire Wire Line
	8950 2600 8950 2400
Connection ~ 8950 2400
Wire Wire Line
	8950 2400 9350 2400
Wire Wire Line
	8250 5100 8950 5100
$Comp
L Device:R R118
U 1 1 5ED0470B
P 5750 1050
F 0 "R118" V 5543 1050 50  0000 C CNN
F 1 "0" V 5634 1050 50  0000 C CNN
F 2 "Resistor_SMD:R_0402_1005Metric" V 5680 1050 50  0001 C CNN
F 3 "~" H 5750 1050 50  0001 C CNN
	1    5750 1050
	0    1    1    0   
$EndComp
Wire Wire Line
	5900 1050 6000 1050
Text Label 6150 1050 0    50   ~ 0
VCC_BRANCH
$Comp
L Device:R R119
U 1 1 5ED1066E
P 6000 1300
F 0 "R119" H 5930 1254 50  0000 R CNN
F 1 "10" H 5930 1345 50  0000 R CNN
F 2 "Resistor_SMD:R_0402_1005Metric" V 5930 1300 50  0001 C CNN
F 3 "~" H 6000 1300 50  0001 C CNN
	1    6000 1300
	-1   0    0    1   
$EndComp
Wire Wire Line
	6000 1150 6000 1050
$Comp
L Device:R R120
U 1 1 5ED2B094
P 7100 4800
F 0 "R120" V 7307 4800 50  0000 C CNN
F 1 "10" V 7216 4800 50  0000 C CNN
F 2 "Resistor_SMD:R_0402_1005Metric" V 7030 4800 50  0001 C CNN
F 3 "~" H 7100 4800 50  0001 C CNN
	1    7100 4800
	0    -1   -1   0   
$EndComp
Wire Wire Line
	7850 4800 7250 4800
$Comp
L Device:R R117
U 1 1 5ED4408B
P 6200 3250
F 0 "R117" H 6130 3204 50  0000 R CNN
F 1 "10" H 6130 3295 50  0000 R CNN
F 2 "Resistor_SMD:R_0402_1005Metric" V 6130 3250 50  0001 C CNN
F 3 "~" H 6200 3250 50  0001 C CNN
	1    6200 3250
	-1   0    0    1   
$EndComp
Text Label 6250 3400 0    50   ~ 0
G_L_IN_R
$Comp
L Device:R R116
U 1 1 5ED478CB
P 6200 2600
F 0 "R116" V 6407 2600 50  0000 C CNN
F 1 "10" V 6316 2600 50  0000 C CNN
F 2 "Resistor_SMD:R_0402_1005Metric" V 6130 2600 50  0001 C CNN
F 3 "~" H 6200 2600 50  0001 C CNN
	1    6200 2600
	0    -1   -1   0   
$EndComp
Wire Wire Line
	6050 2600 5900 2600
Wire Wire Line
	6350 2600 6450 2600
Text Label 6400 2600 1    50   ~ 0
G_H_IN_R
$Comp
L Device:R R121
U 1 1 5EDCB529
P 7150 2700
F 0 "R121" H 7080 2654 50  0000 R CNN
F 1 "4" H 7080 2745 50  0000 R CNN
F 2 "Resistor_SMD:R_0402_1005Metric" V 7080 2700 50  0001 C CNN
F 3 "~" H 7150 2700 50  0001 C CNN
	1    7150 2700
	-1   0    0    1   
$EndComp
$Comp
L Device:C C127
U 1 1 5EDCE360
P 7150 2200
F 0 "C127" H 7265 2246 50  0000 L CNN
F 1 "2.2n" H 7265 2155 50  0000 L CNN
F 2 "Capacitor_SMD:C_0402_1005Metric" H 7188 2050 50  0001 C CNN
F 3 "~" H 7150 2200 50  0001 C CNN
	1    7150 2200
	1    0    0    -1  
$EndComp
Wire Wire Line
	7150 2850 7150 3000
Wire Wire Line
	7150 2550 7150 2350
$Comp
L power:GND #PWR?
U 1 1 5EDE7878
P 8550 1800
F 0 "#PWR?" H 8550 1550 50  0001 C CNN
F 1 "GND" H 8550 1650 50  0000 C CNN
F 2 "" H 8550 1800 50  0001 C CNN
F 3 "" H 8550 1800 50  0001 C CNN
	1    8550 1800
	1    0    0    -1  
$EndComp
Wire Wire Line
	8550 1800 8550 1700
Wire Wire Line
	8550 1200 8300 1200
$Comp
L Device:R R122
U 1 1 5EDF4222
P 7650 2700
F 0 "R122" H 7580 2654 50  0000 R CNN
F 1 "4" H 7580 2745 50  0000 R CNN
F 2 "Resistor_SMD:R_0402_1005Metric" V 7580 2700 50  0001 C CNN
F 3 "~" H 7650 2700 50  0001 C CNN
	1    7650 2700
	-1   0    0    1   
$EndComp
Wire Wire Line
	7650 2850 7650 3000
$Comp
L Device:C C128
U 1 1 5EE00D05
P 7650 2200
F 0 "C128" H 7765 2246 50  0000 L CNN
F 1 "2.2n" H 7765 2155 50  0000 L CNN
F 2 "Capacitor_SMD:C_0402_1005Metric" H 7688 2050 50  0001 C CNN
F 3 "~" H 7650 2200 50  0001 C CNN
	1    7650 2200
	1    0    0    -1  
$EndComp
Wire Wire Line
	7650 2350 7650 2550
$Comp
L Device:R R123
U 1 1 5EE1D7F7
P 8350 4400
F 0 "R123" V 8557 4400 50  0000 C CNN
F 1 "10" V 8466 4400 50  0000 C CNN
F 2 "Resistor_SMD:R_0402_1005Metric" V 8280 4400 50  0001 C CNN
F 3 "~" H 8350 4400 50  0001 C CNN
	1    8350 4400
	0    -1   -1   0   
$EndComp
$Comp
L Device:R R124
U 1 1 5EE501C3
P 8500 4900
F 0 "R124" V 8707 4900 50  0000 C CNN
F 1 "10" V 8616 4900 50  0000 C CNN
F 2 "Resistor_SMD:R_0402_1005Metric" V 8430 4900 50  0001 C CNN
F 3 "~" H 8500 4900 50  0001 C CNN
	1    8500 4900
	0    -1   -1   0   
$EndComp
Wire Wire Line
	8650 4900 8750 4900
Wire Wire Line
	8550 4400 8500 4400
Wire Wire Line
	5900 4400 8200 4400
Wire Wire Line
	5900 4900 8350 4900
Text Label 3500 2600 0    50   ~ 0
VIN
$Comp
L Device:R R127
U 1 1 5EEA6EC6
P 7700 5100
F 0 "R127" V 7907 5100 50  0000 C CNN
F 1 "2k" V 7816 5100 50  0000 C CNN
F 2 "Resistor_SMD:R_0402_1005Metric" V 7630 5100 50  0001 C CNN
F 3 "~" H 7700 5100 50  0001 C CNN
	1    7700 5100
	0    -1   -1   0   
$EndComp
Wire Wire Line
	7850 5100 8000 5100
Connection ~ 8000 5100
$Comp
L Device:C C139
U 1 1 5EEB43CF
P 7500 5650
F 0 "C139" H 7615 5696 50  0000 L CNN
F 1 "DNP" H 7615 5605 50  0000 L CNN
F 2 "Capacitor_SMD:C_0402_1005Metric" H 7538 5500 50  0001 C CNN
F 3 "~" H 7500 5650 50  0001 C CNN
	1    7500 5650
	1    0    0    -1  
$EndComp
Wire Wire Line
	7500 5500 7500 5100
Wire Wire Line
	7500 5100 7550 5100
Wire Wire Line
	7500 5100 5900 5100
Connection ~ 7500 5100
$Comp
L power:GND #PWR?
U 1 1 5EF06808
P 7500 5900
F 0 "#PWR?" H 7500 5650 50  0001 C CNN
F 1 "GND" H 7500 5750 50  0000 C CNN
F 2 "" H 7500 5900 50  0001 C CNN
F 3 "" H 7500 5900 50  0001 C CNN
	1    7500 5900
	1    0    0    -1  
$EndComp
Wire Wire Line
	7500 5900 7500 5800
$Comp
L Device:C C138
U 1 1 5EF20661
P 3250 2300
F 0 "C138" H 3365 2346 50  0000 L CNN
F 1 "DNP" H 3365 2255 50  0000 L CNN
F 2 "Capacitor_SMD:C_0402_1005Metric" H 3288 2150 50  0001 C CNN
F 3 "~" H 3250 2300 50  0001 C CNN
	1    3250 2300
	1    0    0    -1  
$EndComp
Wire Wire Line
	3250 2450 3250 2800
Connection ~ 3250 2800
Wire Wire Line
	3250 2800 4500 2800
$Comp
L power:GND #PWR?
U 1 1 5EF30AE1
P 3600 2150
F 0 "#PWR?" H 3600 1900 50  0001 C CNN
F 1 "GND" H 3600 2000 50  0000 C CNN
F 2 "" H 3600 2150 50  0001 C CNN
F 3 "" H 3600 2150 50  0001 C CNN
	1    3600 2150
	1    0    0    -1  
$EndComp
Wire Wire Line
	3600 2150 3600 2000
Wire Wire Line
	3600 2000 3250 2000
Wire Wire Line
	3250 2000 3250 2150
Text Label 3500 2800 0    50   ~ 0
VISNS
Text Label 5950 5100 0    50   ~ 0
VOSNS
Text Label 8750 4650 1    50   ~ 0
G_H_OUT_R
Text Label 8550 4100 1    50   ~ 0
G_L_OUT_R
Text Label 8950 5100 0    50   ~ 0
V_OUT_FB
Text Label 7150 2400 0    50   ~ 0
SNUB_IN
Text Label 7650 2500 2    50   ~ 0
SNUB_OUT
Text Label 6850 4800 1    50   ~ 0
BOOT2_D
Text Label 6000 1550 0    50   ~ 0
BOOT1_D
Text Label 6250 4800 0    50   ~ 0
BOOT2
Wire Wire Line
	4400 2400 4400 4800
Wire Wire Line
	4000 3400 4500 3400
Wire Wire Line
	4500 3100 2650 3100
Wire Wire Line
	4500 3200 2900 3200
Wire Wire Line
	4400 1050 5300 1050
Connection ~ 4400 4800
Wire Wire Line
	4400 4800 4500 4800
Wire Wire Line
	3200 4800 4400 4800
Wire Wire Line
	8950 2900 8950 4150
Wire Wire Line
	9000 4150 8950 4150
Connection ~ 8950 4150
Wire Wire Line
	8950 4150 8950 5100
Wire Wire Line
	9350 4350 9350 4150
Connection ~ 9350 4150
Wire Wire Line
	9350 4150 9600 4150
$Comp
L Device:CP C143
U 1 1 5F3ECC03
P 9350 3500
F 0 "C143" H 9375 3600 50  0000 L CNN
F 1 "82uF" H 9375 3400 50  0000 L CNN
F 2 "Capacitor_SMD:CP_Elec_10x10" H 9388 3350 50  0001 C CNN
F 3 "~" H 9350 3500 50  0001 C CNN
F 4 "3000-0000000470" H 9350 3500 50  0001 C CNN "PartSpecification"
	1    9350 3500
	1    0    0    -1  
$EndComp
$Comp
L power:GND #PWR?
U 1 1 5F3ECC09
P 9350 3750
F 0 "#PWR?" H 9350 3500 50  0001 C CNN
F 1 "GND" H 9350 3600 50  0000 C CNN
F 2 "" H 9350 3750 50  0001 C CNN
F 3 "" H 9350 3750 50  0001 C CNN
	1    9350 3750
	1    0    0    -1  
$EndComp
Wire Wire Line
	9350 3750 9350 3650
Wire Wire Line
	9350 3250 9350 3350
Wire Wire Line
	9600 3250 9350 3250
$Comp
L Device:CP C141
U 1 1 5F3FC0B8
P 9100 3500
F 0 "C141" H 9125 3600 50  0000 L CNN
F 1 "82uF" H 9125 3400 50  0000 L CNN
F 2 "Capacitor_SMD:CP_Elec_10x10" H 9138 3350 50  0001 C CNN
F 3 "~" H 9100 3500 50  0001 C CNN
F 4 "3000-0000000470" H 9100 3500 50  0001 C CNN "PartSpecification"
	1    9100 3500
	1    0    0    -1  
$EndComp
$Comp
L power:GND #PWR?
U 1 1 5F3FC0BE
P 9100 3750
F 0 "#PWR?" H 9100 3500 50  0001 C CNN
F 1 "GND" H 9100 3600 50  0000 C CNN
F 2 "" H 9100 3750 50  0001 C CNN
F 3 "" H 9100 3750 50  0001 C CNN
	1    9100 3750
	1    0    0    -1  
$EndComp
Wire Wire Line
	9100 3750 9100 3650
Wire Wire Line
	9100 3250 9100 3350
Wire Wire Line
	9350 3250 9100 3250
$Comp
L Device:CP C142
U 1 1 5F410356
P 9350 1750
F 0 "C142" H 9375 1850 50  0000 L CNN
F 1 "82uF" H 9375 1650 50  0000 L CNN
F 2 "Capacitor_SMD:CP_Elec_10x10" H 9388 1600 50  0001 C CNN
F 3 "~" H 9350 1750 50  0001 C CNN
F 4 "3000-0000000470" H 9350 1750 50  0001 C CNN "PartSpecification"
	1    9350 1750
	1    0    0    -1  
$EndComp
$Comp
L power:GND #PWR?
U 1 1 5F41035C
P 9350 2000
F 0 "#PWR?" H 9350 1750 50  0001 C CNN
F 1 "GND" H 9350 1850 50  0000 C CNN
F 2 "" H 9350 2000 50  0001 C CNN
F 3 "" H 9350 2000 50  0001 C CNN
	1    9350 2000
	1    0    0    -1  
$EndComp
Wire Wire Line
	9350 2000 9350 1900
Wire Wire Line
	9350 1500 9350 1600
Wire Wire Line
	9600 1500 9350 1500
$Comp
L Device:CP C140
U 1 1 5F4207AB
P 9100 1750
F 0 "C140" H 9125 1850 50  0000 L CNN
F 1 "82uF" H 9125 1650 50  0000 L CNN
F 2 "Capacitor_SMD:CP_Elec_10x10" H 9138 1600 50  0001 C CNN
F 3 "~" H 9100 1750 50  0001 C CNN
F 4 "3000-0000000470" H 9100 1750 50  0001 C CNN "PartSpecification"
	1    9100 1750
	1    0    0    -1  
$EndComp
$Comp
L power:GND #PWR?
U 1 1 5F4207B1
P 9100 2000
F 0 "#PWR?" H 9100 1750 50  0001 C CNN
F 1 "GND" H 9100 1850 50  0000 C CNN
F 2 "" H 9100 2000 50  0001 C CNN
F 3 "" H 9100 2000 50  0001 C CNN
	1    9100 2000
	1    0    0    -1  
$EndComp
Wire Wire Line
	9100 2000 9100 1900
Wire Wire Line
	9100 1500 9100 1600
Wire Wire Line
	9350 1500 9100 1500
Connection ~ 7350 4100
Connection ~ 7650 4100
Wire Wire Line
	7650 4100 7350 4100
Wire Wire Line
	6850 3600 7350 3600
Wire Wire Line
	6400 4100 7350 4100
Wire Wire Line
	7350 3700 7650 3700
Connection ~ 7350 3600
Wire Wire Line
	7350 3600 8050 3600
Wire Wire Line
	6400 3700 7350 3700
Connection ~ 7650 3000
Wire Wire Line
	7650 3000 7550 3000
Connection ~ 7150 3000
Wire Wire Line
	7150 3000 6850 3000
Connection ~ 5500 1050
Wire Wire Line
	5500 1050 5600 1050
Connection ~ 6000 1050
Wire Wire Line
	6000 1050 6650 1050
Wire Wire Line
	6000 1450 6000 1750
$Comp
L Connector:Screw_Terminal_01x02 J104
U 1 1 5F6822F9
P 2450 4900
F 0 "J104" H 2450 5000 50  0000 C CNN
F 1 "Screw_Terminal_01x02" H 2450 4700 50  0000 C CNN
F 2 "TerminalBlock:TerminalBlock_bornier-2_P5.08mm" H 2450 4900 50  0001 C CNN
F 3 "~" H 2450 4900 50  0001 C CNN
F 4 "3000-0000000184" H 2450 4900 50  0001 C CNN "PartSpecification"
	1    2450 4900
	-1   0    0    1   
$EndComp
Wire Wire Line
	2650 4800 2800 4800
Wire Wire Line
	2800 4900 2650 4900
Text Label 6000 2700 0    50   ~ 0
BOOT1
$Comp
L Device:L L104
U 1 1 5EF8630F
P 8100 1700
F 0 "L104" V 8050 1700 50  0000 C CNN
F 1 "L" V 8175 1700 50  0000 C CNN
F 2 "Inductor_SMD:L_0402_1005Metric" H 8100 1700 50  0001 C CNN
F 3 "~" H 8100 1700 50  0001 C CNN
	1    8100 1700
	0    1    1    0   
$EndComp
$Comp
L Device:L L103
U 1 1 5EF8699C
P 8100 1200
F 0 "L103" V 8050 1200 50  0000 C CNN
F 1 "L" V 8175 1200 50  0000 C CNN
F 2 "Inductor_SMD:L_0402_1005Metric" H 8100 1200 50  0001 C CNN
F 3 "~" H 8100 1200 50  0001 C CNN
	1    8100 1200
	0    1    1    0   
$EndComp
$Comp
L Device:C C145
U 1 1 5EF8766D
P 8100 1950
F 0 "C145" H 8125 2050 50  0000 L CNN
F 1 "C" H 8125 1850 50  0000 L CNN
F 2 "Capacitor_SMD:C_0402_1005Metric" H 8138 1800 50  0001 C CNN
F 3 "~" H 8100 1950 50  0001 C CNN
	1    8100 1950
	0    1    1    0   
$EndComp
$Comp
L Device:C C144
U 1 1 5EF87B93
P 8100 950
F 0 "C144" H 8125 1050 50  0000 L CNN
F 1 "C" H 8125 850 50  0000 L CNN
F 2 "Capacitor_SMD:C_0402_1005Metric" H 8138 800 50  0001 C CNN
F 3 "~" H 8100 950 50  0001 C CNN
	1    8100 950 
	0    1    1    0   
$EndComp
Wire Wire Line
	8250 950  8300 950 
Wire Wire Line
	8300 950  8300 1200
Wire Wire Line
	8300 1200 8250 1200
Connection ~ 8300 1200
Wire Wire Line
	7950 950  7900 950 
Wire Wire Line
	7900 950  7900 1200
Wire Wire Line
	7900 1200 7950 1200
Connection ~ 7900 1200
Wire Wire Line
	8550 1700 8300 1700
Wire Wire Line
	8300 1950 8250 1950
Wire Wire Line
	8300 1950 8300 1700
Connection ~ 8300 1700
Wire Wire Line
	8300 1700 8250 1700
Wire Wire Line
	7950 1700 7900 1700
Wire Wire Line
	7900 1700 7900 1950
Wire Wire Line
	7900 1950 7950 1950
Connection ~ 7900 1700
Connection ~ 6950 2400
Connection ~ 8550 1700
Wire Wire Line
	8550 1200 8550 1700
Wire Wire Line
	7650 1700 7650 2050
Wire Wire Line
	7650 1700 7900 1700
Wire Wire Line
	7150 2050 7150 1200
Wire Wire Line
	7150 1200 7900 1200
Text Label 7150 1200 0    50   ~ 0
SNUB_IN_2
Text Label 7750 1700 2    50   ~ 0
SNUB_OUT_2
$Comp
L Mechanical:Heatsink HS101
U 1 1 5EF6340B
P 2350 6050
F 0 "HS101" H 2350 6250 50  0000 C CNN
F 1 "Heatsink" H 2350 6000 50  0000 C CNN
F 2 "POWDER_Heatsink:ATS-CPX040040035-186-C2-R0" H 2362 6050 50  0001 C CNN
F 3 "~" H 2362 6050 50  0001 C CNN
	1    2350 6050
	1    0    0    -1  
$EndComp
$EndSCHEMATC
