EESchema Schematic File Version 4
EELAYER 30 0
EELAYER END
$Descr A4 11693 8268
encoding utf-8
Sheet 39 39
Title ""
Date ""
Rev ""
Comp ""
Comment1 ""
Comment2 ""
Comment3 ""
Comment4 ""
$EndDescr
Text HLabel 4000 2950 2    50   BiDi ~ 0
FRONTEND_GPIO[0..15]
Text HLabel 4000 3050 2    50   Output ~ 0
FRONTEND_VIO
Wire Wire Line
	1900 4450 2000 4450
Wire Wire Line
	1900 4550 1900 4450
$Comp
L power:GND #PWR?
U 1 1 6092E186
P 1900 4550
F 0 "#PWR?" H 1900 4300 50  0001 C CNN
F 1 "GND" H 1905 4377 50  0000 C CNN
F 2 "" H 1900 4550 50  0001 C CNN
F 3 "" H 1900 4550 50  0001 C CNN
	1    1900 4550
	1    0    0    -1  
$EndComp
Wire Wire Line
	2700 3550 2500 3550
Wire Wire Line
	2700 3200 2700 3550
Wire Wire Line
	2900 3200 2700 3200
Wire Wire Line
	2900 3300 2900 3200
$Comp
L power:GND #PWR?
U 1 1 6092CB99
P 2900 3300
F 0 "#PWR?" H 2900 3050 50  0001 C CNN
F 1 "GND" H 2905 3127 50  0000 C CNN
F 2 "" H 2900 3300 50  0001 C CNN
F 3 "" H 2900 3300 50  0001 C CNN
	1    2900 3300
	1    0    0    -1  
$EndComp
$Comp
L Connector_Generic:Conn_02x10_Odd_Even J3802
U 1 1 6092A0AE
P 2200 3950
F 0 "J3802" H 2250 4567 50  0000 C CNN
F 1 "Conn_02x10_Odd_Even" H 2250 4476 50  0000 C CNN
F 2 "Connector_PinHeader_2.54mm:PinHeader_2x10_P2.54mm_Vertical" H 2200 3950 50  0001 C CNN
F 3 "~" H 2200 3950 50  0001 C CNN
F 4 "3000-0000001282" H 2200 3950 50  0001 C CNN "PartSpecification"
	1    2200 3950
	1    0    0    -1  
$EndComp
$Comp
L power:+2V5 #PWR?
U 1 1 609473A9
P 1800 3450
F 0 "#PWR?" H 1800 3300 50  0001 C CNN
F 1 "+2V5" H 1815 3623 50  0000 C CNN
F 2 "" H 1800 3450 50  0001 C CNN
F 3 "" H 1800 3450 50  0001 C CNN
	1    1800 3450
	1    0    0    -1  
$EndComp
Wire Wire Line
	1800 3450 1800 3550
Wire Wire Line
	1800 3550 2000 3550
$Comp
L power:+3.3V #PWR?
U 1 1 60948030
P 3750 4350
F 0 "#PWR?" H 3750 4200 50  0001 C CNN
F 1 "+3.3V" H 3765 4523 50  0000 C CNN
F 2 "" H 3750 4350 50  0001 C CNN
F 3 "" H 3750 4350 50  0001 C CNN
	1    3750 4350
	1    0    0    -1  
$EndComp
Wire Wire Line
	3750 4350 3750 4450
Wire Wire Line
	3750 4450 2500 4450
Wire Wire Line
	2500 4350 3400 4350
Wire Bus Line
	3500 2950 4000 2950
Wire Bus Line
	1000 2950 3500 2950
Connection ~ 3500 2950
Entry Wire Line
	1100 3650 1000 3550
Entry Wire Line
	1000 3650 1100 3750
Entry Wire Line
	1000 3750 1100 3850
Entry Wire Line
	1000 3850 1100 3950
Entry Wire Line
	1000 3950 1100 4050
Entry Wire Line
	1000 4050 1100 4150
Entry Wire Line
	1000 4150 1100 4250
Entry Wire Line
	1000 4250 1100 4350
Entry Wire Line
	3500 3650 3400 3750
Entry Wire Line
	3500 3550 3400 3650
Entry Wire Line
	3500 3750 3400 3850
Entry Wire Line
	3500 3850 3400 3950
Entry Wire Line
	3500 3950 3400 4050
Entry Wire Line
	3500 4050 3400 4150
Entry Wire Line
	3500 4150 3400 4250
Entry Wire Line
	3500 4250 3400 4350
Wire Wire Line
	3400 4250 2500 4250
Wire Wire Line
	2500 4150 3400 4150
Wire Wire Line
	3400 4050 2500 4050
Wire Wire Line
	2500 3950 3400 3950
Wire Wire Line
	3400 3850 2500 3850
Wire Wire Line
	2500 3750 3400 3750
Wire Wire Line
	2000 3750 1100 3750
Wire Wire Line
	1100 3850 2000 3850
Wire Wire Line
	2000 3950 1100 3950
Wire Wire Line
	1100 4050 2000 4050
Wire Wire Line
	2000 4150 1100 4150
Wire Wire Line
	2000 4250 1100 4250
Wire Wire Line
	1100 4350 2000 4350
Text Label 1150 3650 0    50   ~ 0
FRONTEND_GPIO0
Text Label 2550 3650 0    50   ~ 0
FRONTEND_GPIO1
Wire Wire Line
	1100 3650 2000 3650
Wire Wire Line
	2500 3650 3400 3650
Text Label 1150 3750 0    50   ~ 0
FRONTEND_GPIO2
Text Label 1150 3850 0    50   ~ 0
FRONTEND_GPIO4
Text Label 1150 3950 0    50   ~ 0
FRONTEND_GPIO6
Text Label 1150 4050 0    50   ~ 0
FRONTEND_GPIO8
Text Label 1150 4150 0    50   ~ 0
FRONTEND_GPIO10
Text Label 1150 4250 0    50   ~ 0
FRONTEND_GPIO12
Text Label 1150 4350 0    50   ~ 0
FRONTEND_GPIO14
Text Label 2550 3750 0    50   ~ 0
FRONTEND_GPIO3
Text Label 2550 3850 0    50   ~ 0
FRONTEND_GPIO5
Text Label 2550 3950 0    50   ~ 0
FRONTEND_GPIO7
Text Label 2550 4050 0    50   ~ 0
FRONTEND_GPIO9
Text Label 2550 4150 0    50   ~ 0
FRONTEND_GPIO11
Text Label 2550 4250 0    50   ~ 0
FRONTEND_GPIO13
Text Label 2550 4350 0    50   ~ 0
FRONTEND_GPIO15
$Comp
L Connector_Generic:Conn_01x03 J3801
U 1 1 6095F604
P 5250 3500
F 0 "J3801" H 5330 3542 50  0000 L CNN
F 1 "Conn_01x03" H 5330 3451 50  0000 L CNN
F 2 "Connector_PinHeader_2.54mm:PinHeader_1x03_P2.54mm_Vertical" H 5250 3500 50  0001 C CNN
F 3 "~" H 5250 3500 50  0001 C CNN
F 4 "3000-0000000487" H 5250 3500 50  0001 C CNN "PartSpecification"
	1    5250 3500
	1    0    0    -1  
$EndComp
$Comp
L power:+2V5 #PWR?
U 1 1 6095FE08
P 5000 3350
F 0 "#PWR?" H 5000 3200 50  0001 C CNN
F 1 "+2V5" H 5015 3523 50  0000 C CNN
F 2 "" H 5000 3350 50  0001 C CNN
F 3 "" H 5000 3350 50  0001 C CNN
	1    5000 3350
	1    0    0    -1  
$EndComp
$Comp
L power:+3.3V #PWR?
U 1 1 60961514
P 5200 3950
F 0 "#PWR?" H 5200 3800 50  0001 C CNN
F 1 "+3.3V" H 5215 4123 50  0000 C CNN
F 2 "" H 5200 3950 50  0001 C CNN
F 3 "" H 5200 3950 50  0001 C CNN
	1    5200 3950
	1    0    0    -1  
$EndComp
Wire Wire Line
	5200 3950 5000 3950
Wire Wire Line
	5000 3950 5000 3600
Wire Wire Line
	5000 3600 5050 3600
Wire Wire Line
	5050 3400 5000 3400
Wire Wire Line
	5000 3400 5000 3350
Wire Wire Line
	5050 3500 4700 3500
Wire Wire Line
	3750 3050 4000 3050
$Comp
L Device:Ferrite_Bead_Small FB?
U 1 1 6097743D
P 3750 3250
AR Path="/605746B5/5F8E5420/5F955280/6097743D" Ref="FB?"  Part="1" 
AR Path="/608FCF27/6097743D" Ref="FB3801"  Part="1" 
F 0 "FB3801" H 3825 3300 50  0000 L CNN
F 1 "Ferrite_Bead_Small" H 3825 3200 50  0000 L CNN
F 2 "Inductor_SMD:L_0603_1608Metric" V 3680 3250 50  0001 C CNN
F 3 "~" H 3750 3250 50  0001 C CNN
F 4 "BLM18SP601SH1D" H 3750 3250 50  0001 C CNN "PartNumber"
F 5 "3000-0000001272" H 3750 3250 50  0001 C CNN "PartSpecification"
	1    3750 3250
	1    0    0    -1  
$EndComp
Wire Wire Line
	3750 3150 3750 3050
Wire Wire Line
	3750 3350 3750 3500
$Comp
L POWDER_ESD:D5V0P4UR6SO U?
U 1 1 6131BCE2
P 2000 5950
AR Path="/60834A7B/6083FA27/6131BCE2" Ref="U?"  Part="1" 
AR Path="/608FCF27/6131BCE2" Ref="U3902"  Part="1" 
F 0 "U3902" H 2250 6450 50  0000 C CNN
F 1 "D5V0P4UR6SO" H 1650 6450 50  0000 C CNN
F 2 "Package_TO_SOT_SMD:SOT-23-6" H 2650 6600 50  0001 C CNN
F 3 "" H 2000 5950 50  0001 C CNN
F 4 "3000-0000001313" H 2000 5950 50  0001 C CNN "PartSpecification"
	1    2000 5950
	1    0    0    -1  
$EndComp
$Comp
L POWDER_ESD:D5V0P4UR6SO U?
U 1 1 6131D6F1
P 5500 5950
AR Path="/60834A7B/6083FA27/6131D6F1" Ref="U?"  Part="1" 
AR Path="/608FCF27/6131D6F1" Ref="U3903"  Part="1" 
F 0 "U3903" H 5750 6450 50  0000 C CNN
F 1 "D5V0P4UR6SO" H 5150 6450 50  0000 C CNN
F 2 "Package_TO_SOT_SMD:SOT-23-6" H 6150 6600 50  0001 C CNN
F 3 "" H 5500 5950 50  0001 C CNN
F 4 "3000-0000001313" H 5500 5950 50  0001 C CNN "PartSpecification"
	1    5500 5950
	1    0    0    -1  
$EndComp
$Comp
L POWDER_ESD:D5V0P4UR6SO U?
U 1 1 6131EFD1
P 8950 5950
AR Path="/60834A7B/6083FA27/6131EFD1" Ref="U?"  Part="1" 
AR Path="/608FCF27/6131EFD1" Ref="U3904"  Part="1" 
F 0 "U3904" H 9200 6450 50  0000 C CNN
F 1 "D5V0P4UR6SO" H 8600 6450 50  0000 C CNN
F 2 "Package_TO_SOT_SMD:SOT-23-6" H 9600 6600 50  0001 C CNN
F 3 "" H 8950 5950 50  0001 C CNN
F 4 "3000-0000001313" H 8950 5950 50  0001 C CNN "PartSpecification"
	1    8950 5950
	1    0    0    -1  
$EndComp
$Comp
L POWDER_ESD:D5V0P4UR6SO U?
U 1 1 61321B5D
P 9000 3950
AR Path="/60834A7B/6083FA27/61321B5D" Ref="U?"  Part="1" 
AR Path="/608FCF27/61321B5D" Ref="U3901"  Part="1" 
F 0 "U3901" H 9250 4450 50  0000 C CNN
F 1 "D5V0P4UR6SO" H 8650 4450 50  0000 C CNN
F 2 "Package_TO_SOT_SMD:SOT-23-6" H 9650 4600 50  0001 C CNN
F 3 "" H 9000 3950 50  0001 C CNN
F 4 "3000-0000001313" H 9000 3950 50  0001 C CNN "PartSpecification"
	1    9000 3950
	1    0    0    -1  
$EndComp
Wire Wire Line
	2000 5400 2000 5000
Wire Wire Line
	4500 5000 4500 3500
Connection ~ 4500 3500
Wire Wire Line
	4500 3500 3750 3500
Wire Wire Line
	5500 5400 5500 5000
Wire Wire Line
	8950 5400 8950 5000
Wire Wire Line
	8950 5000 7000 5000
Connection ~ 4500 5000
Wire Wire Line
	9000 3000 9000 3400
Wire Wire Line
	3450 5900 2550 5900
Wire Wire Line
	4050 5900 4950 5900
Wire Wire Line
	6950 5900 6050 5900
Wire Wire Line
	7500 5900 8400 5900
Wire Wire Line
	10400 5900 9500 5900
Wire Wire Line
	8450 3900 7550 3900
Wire Wire Line
	9550 3900 10450 3900
Text Label 7600 5900 0    50   ~ 0
FRONTEND_GPIO0
Wire Wire Line
	550  5900 1450 5900
Text Label 9700 6000 0    50   ~ 0
FRONTEND_GPIO2
Text Label 9700 5900 0    50   ~ 0
FRONTEND_GPIO4
Text Label 7600 6000 0    50   ~ 0
FRONTEND_GPIO6
Text Label 7650 3900 0    50   ~ 0
FRONTEND_GPIO8
Text Label 9700 4000 0    50   ~ 0
FRONTEND_GPIO10
Text Label 9700 3900 0    50   ~ 0
FRONTEND_GPIO12
Text Label 7650 4000 0    50   ~ 0
FRONTEND_GPIO14
Wire Wire Line
	9550 4000 10450 4000
Wire Wire Line
	8450 4000 7550 4000
Wire Wire Line
	9500 6000 10400 6000
Wire Wire Line
	8400 6000 7500 6000
Wire Wire Line
	6050 6000 6950 6000
Wire Wire Line
	4950 6000 4050 6000
Wire Wire Line
	2550 6000 3450 6000
Text Label 2750 6000 0    50   ~ 0
FRONTEND_GPIO1
Wire Wire Line
	550  6000 1450 6000
Text Label 650  5900 0    50   ~ 0
FRONTEND_GPIO3
Text Label 650  6000 0    50   ~ 0
FRONTEND_GPIO5
Text Label 2750 5900 0    50   ~ 0
FRONTEND_GPIO7
Text Label 6250 6000 0    50   ~ 0
FRONTEND_GPIO9
Text Label 4150 5900 0    50   ~ 0
FRONTEND_GPIO11
Text Label 4150 6000 0    50   ~ 0
FRONTEND_GPIO13
Text Label 6250 5900 0    50   ~ 0
FRONTEND_GPIO15
$Comp
L power:GND #PWR?
U 1 1 61334338
P 2000 6600
F 0 "#PWR?" H 2000 6350 50  0001 C CNN
F 1 "GND" H 2005 6427 50  0000 C CNN
F 2 "" H 2000 6600 50  0001 C CNN
F 3 "" H 2000 6600 50  0001 C CNN
	1    2000 6600
	1    0    0    -1  
$EndComp
$Comp
L power:GND #PWR?
U 1 1 613348B8
P 5500 6600
F 0 "#PWR?" H 5500 6350 50  0001 C CNN
F 1 "GND" H 5505 6427 50  0000 C CNN
F 2 "" H 5500 6600 50  0001 C CNN
F 3 "" H 5500 6600 50  0001 C CNN
	1    5500 6600
	1    0    0    -1  
$EndComp
$Comp
L power:GND #PWR?
U 1 1 61334EAF
P 8950 6600
F 0 "#PWR?" H 8950 6350 50  0001 C CNN
F 1 "GND" H 8955 6427 50  0000 C CNN
F 2 "" H 8950 6600 50  0001 C CNN
F 3 "" H 8950 6600 50  0001 C CNN
	1    8950 6600
	1    0    0    -1  
$EndComp
$Comp
L power:GND #PWR?
U 1 1 61335257
P 9000 4600
F 0 "#PWR?" H 9000 4350 50  0001 C CNN
F 1 "GND" H 9005 4427 50  0000 C CNN
F 2 "" H 9000 4600 50  0001 C CNN
F 3 "" H 9000 4600 50  0001 C CNN
	1    9000 4600
	1    0    0    -1  
$EndComp
Wire Wire Line
	2000 6600 2000 6500
Connection ~ 5500 5000
Wire Wire Line
	5500 5000 4500 5000
Wire Wire Line
	2000 5000 4500 5000
Wire Wire Line
	9000 4500 9000 4600
Wire Wire Line
	9000 3000 7000 3000
Wire Wire Line
	7000 3000 7000 5000
Connection ~ 7000 5000
Wire Wire Line
	7000 5000 5500 5000
Wire Wire Line
	5500 6500 5500 6600
Wire Wire Line
	8950 6500 8950 6600
$Comp
L power:PWR_FLAG #FLG?
U 1 1 61845095
P 4700 3400
F 0 "#FLG?" H 4700 3475 50  0001 C CNN
F 1 "PWR_FLAG" H 4700 3573 50  0000 C CNN
F 2 "" H 4700 3400 50  0001 C CNN
F 3 "~" H 4700 3400 50  0001 C CNN
	1    4700 3400
	1    0    0    -1  
$EndComp
Wire Wire Line
	4700 3400 4700 3500
Wire Bus Line
	3500 2950 3500 4250
Wire Bus Line
	1000 2950 1000 4250
Connection ~ 4700 3500
Wire Wire Line
	4700 3500 4500 3500
Text Label 3900 3500 0    50   ~ 0
frontend_vio_ext
$EndSCHEMATC
