EESchema Schematic File Version 4
LIBS:fdd_frontend_ue-cache
EELAYER 30 0
EELAYER END
$Descr A4 11693 8268
encoding utf-8
Sheet 5 7
Title ""
Date ""
Rev ""
Comp ""
Comment1 ""
Comment2 ""
Comment3 ""
Comment4 ""
$EndDescr
$Comp
L POWDER_MCU:MSP432E401YTPDTR U501
U 2 1 5D69BE6F
P 7850 3050
F 0 "U501" H 8650 4350 60  0000 C CNN
F 1 "MSP432E401YTPDTR" H 7900 4350 60  0000 C CNN
F 2 "POWDER_MCU:MSP432E401YTPDTR" H 7850 2590 60  0001 C CNN
F 3 "" H 7850 2650 60  0000 C CNN
F 4 "Texas Instruments" H 7850 3050 50  0001 C CNN "Manufacturer"
F 5 "MSP432E401YTPDTR" H 7850 3050 50  0001 C CNN "PartNumber"
	2    7850 3050
	1    0    0    -1  
$EndComp
$Comp
L POWDER_MCU:MSP432E401YTPDTR U501
U 1 1 5D69BFA2
P 3850 3500
F 0 "U501" H 4550 5300 60  0000 C CNN
F 1 "MSP432E401YTPDTR" H 3850 4182 60  0000 C CNN
F 2 "POWDER_MCU:MSP432E401YTPDTR" H 3850 3040 60  0001 C CNN
F 3 "" H 3850 3100 60  0000 C CNN
F 4 "Texas Instruments" H 3850 3500 50  0001 C CNN "Manufacturer"
F 5 "MSP432E401YTPDTR" H 3850 3500 50  0001 C CNN "PartNumber"
	1    3850 3500
	1    0    0    -1  
$EndComp
Wire Wire Line
	4750 2550 5250 2550
Wire Wire Line
	4750 2950 5250 2950
Text HLabel 5250 2550 2    50   Output ~ 0
LINK_LED
Text HLabel 5250 2950 2    50   Output ~ 0
ACT_LED
$Comp
L Connector:USB_B_Micro J502
U 1 1 5D876CF9
P 3100 6600
F 0 "J502" H 3155 7067 50  0000 C CNN
F 1 "USB_B_Micro" H 3155 6976 50  0000 C CNN
F 2 "Connector_USB:USB_Micro-B_Amphenol_10103594-0001LF_Horizontal" H 3250 6550 50  0001 C CNN
F 3 "~" H 3250 6550 50  0001 C CNN
F 4 "Amphenol ICC (FCI)" H 3100 6600 50  0001 C CNN "Manufacturer"
F 5 "10103594-0001LF" H 3100 6600 50  0001 C CNN "PartNumber"
	1    3100 6600
	1    0    0    -1  
$EndComp
Wire Wire Line
	2950 2850 2400 2850
Text Label 2400 2850 0    50   ~ 0
VBUS
Wire Wire Line
	7000 2500 6550 2500
Wire Wire Line
	6550 2600 7000 2600
Text Label 6550 2500 0    50   ~ 0
USBPD_P
Text Label 6550 2600 0    50   ~ 0
USBPD_N
$Comp
L Device:R R501
U 1 1 5D8778AC
P 2150 2750
F 0 "R501" V 1943 2750 50  0000 C CNN
F 1 "100" V 2034 2750 50  0000 C CNN
F 2 "Resistor_SMD:R_0402_1005Metric" V 2080 2750 50  0001 C CNN
F 3 "~" H 2150 2750 50  0001 C CNN
F 4 "Delta Electronics/Cyntec" H 2150 2750 50  0001 C CNN "Manufacturer"
F 5 "PFR05S-101-FNH" H 2150 2750 50  0001 C CNN "PartNumber"
	1    2150 2750
	0    1    1    0   
$EndComp
Text Label 2350 2750 0    50   ~ 0
USB_ID_MCU
Wire Wire Line
	2300 2750 2950 2750
Text Label 1700 2750 0    50   ~ 0
USB_ID
Wire Wire Line
	1700 2750 2000 2750
Wire Wire Line
	3400 6800 3800 6800
Wire Wire Line
	3800 6800 3800 6850
Wire Wire Line
	3800 6850 4350 6850
Wire Wire Line
	4350 6700 3400 6700
Wire Wire Line
	3400 6600 3800 6600
Wire Wire Line
	3800 6600 3800 6550
Wire Wire Line
	3800 6550 4350 6550
Text Label 3850 6550 0    50   ~ 0
USBPD_P
Text Label 3850 6700 0    50   ~ 0
USBPD_N
Text Label 3850 6850 0    50   ~ 0
USB_ID
Wire Wire Line
	3400 6400 3800 6400
Text Label 3550 6400 0    50   ~ 0
VBUS
$Comp
L power:GND #PWR?
U 1 1 5D879561
P 3400 7100
F 0 "#PWR?" H 3400 6850 50  0001 C CNN
F 1 "GND" H 3405 6927 50  0000 C CNN
F 2 "" H 3400 7100 50  0001 C CNN
F 3 "" H 3400 7100 50  0001 C CNN
	1    3400 7100
	1    0    0    -1  
$EndComp
$Comp
L power:GND #PWR?
U 1 1 5D879712
P 3000 7500
F 0 "#PWR?" H 3000 7250 50  0001 C CNN
F 1 "GND" H 3005 7327 50  0000 C CNN
F 2 "" H 3000 7500 50  0001 C CNN
F 3 "" H 3000 7500 50  0001 C CNN
	1    3000 7500
	1    0    0    -1  
$EndComp
$Comp
L Device:R R502
U 1 1 5D879736
P 3000 7250
F 0 "R502" H 2930 7204 50  0000 R CNN
F 1 "1M" H 2930 7295 50  0000 R CNN
F 2 "Resistor_SMD:R_0402_1005Metric" V 2930 7250 50  0001 C CNN
F 3 "~" H 3000 7250 50  0001 C CNN
F 4 "Delta Electronics/Cyntec" H 3000 7250 50  0001 C CNN "Manufacturer"
F 5 "PFR05S-105-FNH" H 3000 7250 50  0001 C CNN "PartNumber"
	1    3000 7250
	-1   0    0    1   
$EndComp
Wire Wire Line
	3100 7000 3100 7050
Wire Wire Line
	3100 7050 3400 7050
Wire Wire Line
	3400 7050 3400 7100
Wire Wire Line
	3000 7100 3000 7050
Wire Wire Line
	3000 7400 3000 7500
$Comp
L 000_PreferredParts:C_1nF C503
U 1 1 5D87AA0C
P 2550 7300
F 0 "C503" H 2665 7346 50  0000 L CNN
F 1 "C_1nF" H 2665 7255 50  0000 L CNN
F 2 "Capacitor_SMD:C_0402_1005Metric" H 2588 7150 50  0001 C CNN
F 3 "~" H 2550 7300 50  0001 C CNN
F 4 "Wurth Electronics Inc." H 2550 7300 50  0001 C CNN "Manufacturer"
F 5 "885012205061" H 2550 7300 50  0001 C CNN "PartNumber"
	1    2550 7300
	1    0    0    -1  
$EndComp
$Comp
L 000_PreferredParts:C_1nF C502
U 1 1 5D87AA50
P 2050 7300
F 0 "C502" H 2165 7346 50  0000 L CNN
F 1 "C_1nF" H 2165 7255 50  0000 L CNN
F 2 "Capacitor_SMD:C_0402_1005Metric" H 2088 7150 50  0001 C CNN
F 3 "~" H 2050 7300 50  0001 C CNN
F 4 "Wurth Electronics Inc." H 2050 7300 50  0001 C CNN "Manufacturer"
F 5 "885012205061" H 2050 7300 50  0001 C CNN "PartNumber"
	1    2050 7300
	1    0    0    -1  
$EndComp
$Comp
L 000_PreferredParts:C_1nF C501
U 1 1 5D87AA80
P 1550 7300
F 0 "C501" H 1665 7346 50  0000 L CNN
F 1 "C_1nF" H 1665 7255 50  0000 L CNN
F 2 "Capacitor_SMD:C_0402_1005Metric" H 1588 7150 50  0001 C CNN
F 3 "~" H 1550 7300 50  0001 C CNN
F 4 "Wurth Electronics Inc." H 1550 7300 50  0001 C CNN "Manufacturer"
F 5 "885012205061" H 1550 7300 50  0001 C CNN "PartNumber"
	1    1550 7300
	1    0    0    -1  
$EndComp
$Comp
L power:GND #PWR?
U 1 1 5D87AAB4
P 2550 7550
F 0 "#PWR?" H 2550 7300 50  0001 C CNN
F 1 "GND" H 2555 7377 50  0000 C CNN
F 2 "" H 2550 7550 50  0001 C CNN
F 3 "" H 2550 7550 50  0001 C CNN
	1    2550 7550
	1    0    0    -1  
$EndComp
$Comp
L power:GND #PWR?
U 1 1 5D87AAD1
P 2050 7550
F 0 "#PWR?" H 2050 7300 50  0001 C CNN
F 1 "GND" H 2055 7377 50  0000 C CNN
F 2 "" H 2050 7550 50  0001 C CNN
F 3 "" H 2050 7550 50  0001 C CNN
	1    2050 7550
	1    0    0    -1  
$EndComp
$Comp
L power:GND #PWR?
U 1 1 5D87AAEE
P 1550 7550
F 0 "#PWR?" H 1550 7300 50  0001 C CNN
F 1 "GND" H 1555 7377 50  0000 C CNN
F 2 "" H 1550 7550 50  0001 C CNN
F 3 "" H 1550 7550 50  0001 C CNN
	1    1550 7550
	1    0    0    -1  
$EndComp
Wire Wire Line
	1550 7550 1550 7450
Wire Wire Line
	2050 7450 2050 7550
Wire Wire Line
	2550 7550 2550 7450
Wire Wire Line
	3000 7050 2550 7050
Wire Wire Line
	1550 7050 1550 7150
Connection ~ 3000 7050
Wire Wire Line
	3000 7050 3000 7000
Wire Wire Line
	2050 7150 2050 7050
Connection ~ 2050 7050
Wire Wire Line
	2050 7050 1550 7050
Wire Wire Line
	2550 7150 2550 7050
Connection ~ 2550 7050
Wire Wire Line
	2550 7050 2050 7050
Wire Wire Line
	2350 3750 2950 3750
Text Label 2300 3450 0    50   ~ 0
TCK
Text Label 2300 3550 0    50   ~ 0
TMS
Text Label 2300 3650 0    50   ~ 0
TDI
Text Label 2650 3750 0    50   ~ 0
TDO
$Comp
L Connector_Generic:Conn_02x05_Odd_Even J501
U 1 1 5D87FEC7
P 1650 4250
F 0 "J501" H 1700 4667 50  0000 C CNN
F 1 "Conn_02x05_Odd_Even" H 1700 4576 50  0000 C CNN
F 2 "Connector_PinHeader_1.27mm:PinHeader_2x05_P1.27mm_Vertical_SMD" H 1650 4250 50  0001 C CNN
F 3 "~" H 1650 4250 50  0001 C CNN
F 4 "Amphenol ICC (FCI)" H 1650 4250 50  0001 C CNN "Manufacturer"
F 5 "20021221-00010C4LF" H 1650 4250 50  0001 C CNN "PartNumber"
	1    1650 4250
	1    0    0    -1  
$EndComp
$Comp
L power:+3.3V #PWR?
U 1 1 5D880060
P 1200 3850
F 0 "#PWR?" H 1200 3700 50  0001 C CNN
F 1 "+3.3V" H 1215 4023 50  0000 C CNN
F 2 "" H 1200 3850 50  0001 C CNN
F 3 "" H 1200 3850 50  0001 C CNN
	1    1200 3850
	1    0    0    -1  
$EndComp
Wire Wire Line
	1200 3850 1200 4050
Wire Wire Line
	1200 4050 1450 4050
Wire Wire Line
	2150 3550 2150 4050
Wire Wire Line
	2150 4050 1950 4050
Wire Wire Line
	2150 3550 2950 3550
$Comp
L power:GND #PWR?
U 1 1 5D88118A
P 1350 4550
F 0 "#PWR?" H 1350 4300 50  0001 C CNN
F 1 "GND" H 1355 4377 50  0000 C CNN
F 2 "" H 1350 4550 50  0001 C CNN
F 3 "" H 1350 4550 50  0001 C CNN
	1    1350 4550
	1    0    0    -1  
$EndComp
Wire Wire Line
	1350 4550 1350 4450
Wire Wire Line
	1350 4450 1450 4450
Wire Wire Line
	1450 4350 1350 4350
Wire Wire Line
	1350 4350 1350 4450
Connection ~ 1350 4450
Wire Wire Line
	1350 4350 1350 4250
Wire Wire Line
	1350 4250 1450 4250
Connection ~ 1350 4350
Wire Wire Line
	1450 4150 1350 4150
Wire Wire Line
	1350 4150 1350 4250
Connection ~ 1350 4250
Wire Wire Line
	2050 3450 2050 4150
Wire Wire Line
	2050 4150 1950 4150
Wire Wire Line
	2050 3450 2950 3450
Wire Wire Line
	1950 4250 2350 4250
Wire Wire Line
	2350 4250 2350 3750
Wire Wire Line
	1950 4350 2250 4350
Wire Wire Line
	2250 4350 2250 3650
Wire Wire Line
	1950 4450 2200 4450
Text HLabel 2200 4450 2    50   Output ~ 0
RST
Wire Wire Line
	2950 1850 2550 1850
Wire Wire Line
	2550 1950 2950 1950
Wire Wire Line
	2950 2050 2550 2050
Wire Wire Line
	2550 2150 2950 2150
Wire Wire Line
	4750 1850 5200 1850
Wire Wire Line
	5200 1950 4750 1950
Wire Wire Line
	4750 2050 5200 2050
Wire Wire Line
	5200 2150 4750 2150
Wire Wire Line
	2950 4350 2650 4350
Wire Wire Line
	2650 4450 2950 4450
Wire Wire Line
	2950 4550 2650 4550
Wire Wire Line
	2650 4650 2950 4650
Text HLabel 2550 1850 0    50   BiDi ~ 0
PA0
Text HLabel 2550 1950 0    50   BiDi ~ 0
PA1
Text HLabel 2550 2050 0    50   BiDi ~ 0
PA2
Text HLabel 2550 2150 0    50   BiDi ~ 0
PA3
Text HLabel 2650 4350 0    50   BiDi ~ 0
PD0
Text HLabel 2650 4450 0    50   BiDi ~ 0
PD1
Text HLabel 2650 4550 0    50   BiDi ~ 0
PD2
Text HLabel 2650 4650 0    50   BiDi ~ 0
PD3
Wire Wire Line
	2250 3650 2950 3650
Text HLabel 5200 1850 2    50   Input ~ 0
ADC0
Text HLabel 5200 1950 2    50   Input ~ 0
ADC1
Text HLabel 5200 2050 2    50   Input ~ 0
ADC2
Text HLabel 5200 2150 2    50   Input ~ 0
ADC3
Wire Wire Line
	4750 3450 5200 3450
Wire Wire Line
	5200 3550 4750 3550
Wire Wire Line
	4750 3650 5200 3650
Wire Wire Line
	5200 3750 4750 3750
Text HLabel 5200 3450 2    50   BiDi ~ 0
PH0
Text HLabel 5200 3550 2    50   BiDi ~ 0
PH1
Text HLabel 5200 3650 2    50   BiDi ~ 0
PH2
Text HLabel 5200 3750 2    50   BiDi ~ 0
PH3
Wire Wire Line
	4750 4250 5200 4250
Wire Wire Line
	5200 4350 4750 4350
Wire Wire Line
	4750 4450 5200 4450
Wire Wire Line
	5200 4550 4750 4550
Text HLabel 5200 4250 2    50   BiDi ~ 0
PK0
Text HLabel 5200 4350 2    50   BiDi ~ 0
PK1
Text HLabel 5200 4450 2    50   BiDi ~ 0
PK2
Text HLabel 5200 4550 2    50   BiDi ~ 0
PK3
Wire Wire Line
	4750 4650 5200 4650
Wire Wire Line
	5200 4750 4750 4750
Wire Wire Line
	4750 4850 5200 4850
Wire Wire Line
	5200 4950 4750 4950
Text HLabel 5200 4650 2    50   BiDi ~ 0
PK4
Text HLabel 5200 4750 2    50   BiDi ~ 0
PK5
Text HLabel 5200 4850 2    50   BiDi ~ 0
PK6
Text HLabel 5200 4950 2    50   BiDi ~ 0
PK7
Wire Wire Line
	7000 1900 6550 1900
Wire Wire Line
	6550 2000 7000 2000
Wire Wire Line
	7000 2100 6550 2100
Wire Wire Line
	6550 2200 7000 2200
Text HLabel 6550 1900 0    50   BiDi ~ 0
PL0
Text HLabel 6550 2000 0    50   BiDi ~ 0
PL1
Text HLabel 6550 2100 0    50   BiDi ~ 0
PL2
Text HLabel 6550 2200 0    50   BiDi ~ 0
PL3
$Comp
L POWDER_ESD:TPD6E004 U502
U 1 1 5DE71314
P 1850 5700
F 0 "U502" H 2500 6450 50  0000 C CNN
F 1 "TPD6E004" H 1250 6450 50  0000 C CNN
F 2 "POWDER_ESD:TPD6E004_RSE_8" H 1100 6850 50  0001 C CNN
F 3 "" H 1150 6550 50  0001 C CNN
F 4 "Texas Instruments" H 1850 5700 50  0001 C CNN "Manufacturer"
F 5 "TPD6E004RSER" H 1850 5700 50  0001 C CNN "PartNumber"
	1    1850 5700
	1    0    0    -1  
$EndComp
$Comp
L power:+3.3V #PWR?
U 1 1 5DE71434
P 1850 4750
F 0 "#PWR?" H 1850 4600 50  0001 C CNN
F 1 "+3.3V" H 1865 4923 50  0000 C CNN
F 2 "" H 1850 4750 50  0001 C CNN
F 3 "" H 1850 4750 50  0001 C CNN
	1    1850 4750
	1    0    0    -1  
$EndComp
Wire Wire Line
	1850 4750 1850 4850
Wire Wire Line
	900  5550 700  5550
Wire Wire Line
	700  5700 900  5700
Wire Wire Line
	900  5850 700  5850
Wire Wire Line
	2800 5550 3000 5550
Wire Wire Line
	3000 5700 2800 5700
Wire Wire Line
	2800 5850 3000 5850
Text Label 750  5700 0    50   ~ 0
TCK
Text Label 750  5550 0    50   ~ 0
TMS
Text Label 2850 5850 0    50   ~ 0
TDI
Text Label 750  5850 0    50   ~ 0
TDO
$Comp
L POWDER_ESD:TPD6E004 U503
U 1 1 5DE823EC
P 5300 6700
F 0 "U503" H 5950 7450 50  0000 C CNN
F 1 "TPD6E004" H 4700 7450 50  0000 C CNN
F 2 "POWDER_ESD:TPD6E004_RSE_8" H 4550 7850 50  0001 C CNN
F 3 "" H 4600 7550 50  0001 C CNN
F 4 "Texas Instruments" H 5300 6700 50  0001 C CNN "Manufacturer"
F 5 "TPD6E004RSER" H 5300 6700 50  0001 C CNN "PartNumber"
	1    5300 6700
	1    0    0    -1  
$EndComp
Wire Wire Line
	3800 5650 5300 5650
Wire Wire Line
	5300 5650 5300 5850
Wire Wire Line
	3800 5650 3800 6400
Text Label 2000 4450 0    50   ~ 0
RST
Text Label 2850 5700 0    50   ~ 0
RST
$Comp
L power:GND #PWR?
U 1 1 5DE87B29
P 5300 7650
F 0 "#PWR?" H 5300 7400 50  0001 C CNN
F 1 "GND" H 5305 7477 50  0000 C CNN
F 2 "" H 5300 7650 50  0001 C CNN
F 3 "" H 5300 7650 50  0001 C CNN
	1    5300 7650
	1    0    0    -1  
$EndComp
Wire Wire Line
	5300 7650 5300 7550
Text Label 2150 7050 0    50   ~ 0
USB_SHIELD
$Comp
L power:GND #PWR?
U 1 1 5D66311B
P 1850 6650
F 0 "#PWR?" H 1850 6400 50  0001 C CNN
F 1 "GND" H 1855 6477 50  0000 C CNN
F 2 "" H 1850 6650 50  0001 C CNN
F 3 "" H 1850 6650 50  0001 C CNN
	1    1850 6650
	1    0    0    -1  
$EndComp
Wire Wire Line
	1850 6650 1850 6550
Text Label 2700 4750 0    50   ~ 0
RXD
Text Label 2700 4850 0    50   ~ 0
TXD
$Comp
L Connector:TestPoint TP502
U 1 1 5D8440DA
P 2200 4750
F 0 "TP502" H 2258 4868 50  0000 L CNN
F 1 "TestPoint" H 2258 4777 50  0000 L CNN
F 2 "TestPoint:TestPoint_Pad_D1.0mm" H 2400 4750 50  0001 C CNN
F 3 "~" H 2400 4750 50  0001 C CNN
	1    2200 4750
	1    0    0    -1  
$EndComp
$Comp
L Connector:TestPoint TP501
U 1 1 5D8448C3
P 2000 4850
F 0 "TP501" H 2058 4968 50  0000 L CNN
F 1 "TestPoint" H 2058 4877 50  0000 L CNN
F 2 "TestPoint:TestPoint_Pad_D1.0mm" H 2200 4850 50  0001 C CNN
F 3 "~" H 2200 4850 50  0001 C CNN
	1    2000 4850
	1    0    0    -1  
$EndComp
Wire Wire Line
	2200 4750 2950 4750
Wire Wire Line
	2000 4850 2950 4850
$EndSCHEMATC
