EESchema Schematic File Version 4
EELAYER 30 0
EELAYER END
$Descr A4 11693 8268
encoding utf-8
Sheet 22 39
Title ""
Date ""
Rev ""
Comp ""
Comment1 ""
Comment2 ""
Comment3 ""
Comment4 ""
$EndDescr
$Sheet
S 1500 1000 1000 2600
U 5F955280
F0 "bank1" 50
F1 "bank1.sch" 50
F2 "TEMP_SENSE_PA" I L 1500 3100 50 
F3 "TEMP_SENSE_LNA" I L 1500 3200 50 
F4 "VSENSE_PA" I L 1500 1100 50 
F5 "VSENSE_4_8" I L 1500 1200 50 
F6 "VSENSE_3_3VFR" I L 1500 1300 50 
F7 "VSENSE_LNA" I L 1500 1400 50 
F8 "VSENSE_LNA_BIAS" I L 1500 1500 50 
F9 "VSENSE_12" I L 1500 1600 50 
F10 "VSENSE_MAX10_6" I L 1500 1700 50 
F11 "VSENSE_1_2" I L 1500 1800 50 
F12 "VSENSE_2_5" I L 1500 1900 50 
F13 "VSENSE_2_5A" I L 1500 2000 50 
F14 "ISENSE_VCC1" I L 1500 2100 50 
F15 "ISENSE_VCC2" I L 1500 2200 50 
F16 "ISENSE_VCC3" I L 1500 2300 50 
F17 "ISENSE_VBIAS" I L 1500 2400 50 
F18 "ISENSE_LNA" I L 1500 2500 50 
F19 "ISENSE_MAX10_6" I L 1500 2600 50 
F20 "ISENSE_1_2" I L 1500 2700 50 
F21 "ISENSE_2_5" I L 1500 2800 50 
F22 "ISENSE_2_5A" I L 1500 2900 50 
F23 "GPAI[0..7]" I L 1500 3400 50 
F24 "REF_EN" O R 2500 3400 50 
F25 "A_5VA_VSENSE" I L 1500 3500 50 
$EndSheet
$Sheet
S 1500 4000 1050 1750
U 5F971A6D
F0 "bank2" 50
F1 "bank2.sch" 50
F2 "RF_REG_EN" O L 1500 4100 50 
F3 "RF_REG_PS_SYNC" O L 1500 4200 50 
F4 "RF_REG_DCDC_PG" I L 1500 4300 50 
F5 "RF_REG_LDO_4_8_PG" I L 1500 4400 50 
F6 "RF_REG_LDO_3_3VRF_PG" I L 1500 4500 50 
F7 "ATT_SI" O L 1500 4700 50 
F8 "ATT_CLK" O L 1500 4800 50 
F9 "ATT_LE" O L 1500 4900 50 
F10 "FAN_PWM" O L 1500 5500 50 
F11 "FAN_TACH" I L 1500 5600 50 
F12 "SYNC_1" O L 1500 5200 50 
F13 "SYNC_2" O L 1500 5300 50 
F14 "SYNC_3" O L 1500 5400 50 
F15 "SYNC_0" O L 1500 5100 50 
$EndSheet
$Sheet
S 3500 4500 1000 1000
U 5F989551
F0 "bank3" 50
F1 "bank3.sch" 50
F2 "MCU_IO[0..27]" B L 3500 5000 50 
$EndSheet
$Sheet
S 5000 4500 1000 1000
U 5F998CB2
F0 "bank4" 50
F1 "bank4.sch" 50
F2 "MCU_IO[28..35]" B L 5000 5000 50 
$EndSheet
$Sheet
S 7500 2500 1000 500 
U 5F9B591E
F0 "bank6" 50
F1 "bank6.sch" 50
F2 "FRONTEND_GPIO[0..15]" B R 8500 2700 50 
F3 "FRONTEND_VIO" I R 8500 2800 50 
$EndSheet
$Sheet
S 1000 6000 1500 1500
U 5F9DE784
F0 "max10_power" 50
F1 "max10_power.sch" 50
$EndSheet
$Sheet
S 3500 6000 1000 1000
U 5F9DEEB3
F0 "max10_analog" 50
F1 "max10_analog.sch" 50
F2 "REF_EN" I L 3500 6100 50 
$EndSheet
$Sheet
S 5500 6000 1000 1000
U 5F9E1037
F0 "max10_pll" 50
F1 "max10_pll.sch" 50
$EndSheet
Text HLabel 1400 5200 0    50   Output ~ 0
SYNC_1
Text HLabel 1400 5300 0    50   Output ~ 0
SYNC_2
Text HLabel 1400 5400 0    50   Output ~ 0
SYNC_3
Text HLabel 1400 1100 0    50   Input ~ 0
VSENSE_PA
Text HLabel 1400 1200 0    50   Input ~ 0
VSENSE_4_8
Text HLabel 1400 1300 0    50   Input ~ 0
VSENSE_3_3VFR
Text HLabel 1400 1400 0    50   Input ~ 0
VSENSE_LNA
Text HLabel 1400 1500 0    50   Input ~ 0
VSENSE_LNA_BIAS
Text HLabel 1400 1600 0    50   Input ~ 0
VSENSE_12
Text HLabel 1400 1700 0    50   Input ~ 0
VSENSE_MAX10_6
Text HLabel 1400 1800 0    50   Input ~ 0
VSENSE_1_2
Text HLabel 1400 1900 0    50   Input ~ 0
VSENSE_2_5
Text HLabel 1400 2000 0    50   Input ~ 0
VSENSE_2_5A
Text HLabel 1400 2100 0    50   Input ~ 0
ISENSE_VCC1
Text HLabel 1400 2200 0    50   Input ~ 0
ISENSE_VCC2
Text HLabel 1400 2300 0    50   Input ~ 0
ISENSE_VCC3
Text HLabel 1400 2400 0    50   Input ~ 0
ISENSE_VBIAS
Text HLabel 1400 2500 0    50   Input ~ 0
ISENSE_LNA
Text HLabel 1400 2600 0    50   Input ~ 0
ISENSE_MAX10_6
Text HLabel 1400 2700 0    50   Input ~ 0
ISENSE_1_2
Text HLabel 1400 2800 0    50   Input ~ 0
ISENSE_2_5
Text HLabel 1400 2900 0    50   Input ~ 0
ISENSE_2_5A
$Sheet
S 7500 3500 1000 500 
U 5F9AA234
F0 "bank5" 50
F1 "bank5.sch" 50
F2 "SDR_GPIO[0..11]" B R 8500 3750 50 
$EndSheet
Text HLabel 1400 3200 0    50   Input ~ 0
TEMP_SENSE_PA
Text HLabel 1400 3100 0    50   Input ~ 0
TEMP_SENSE_LNA
Wire Wire Line
	1400 3200 1500 3200
Wire Wire Line
	1500 3100 1400 3100
Wire Wire Line
	1400 2900 1500 2900
Wire Wire Line
	1500 2800 1400 2800
Wire Wire Line
	1400 2700 1500 2700
Wire Wire Line
	1500 2600 1400 2600
Wire Wire Line
	1400 2500 1500 2500
Wire Wire Line
	1500 2400 1400 2400
Wire Wire Line
	1400 2300 1500 2300
Wire Wire Line
	1500 2200 1400 2200
Wire Wire Line
	1400 2100 1500 2100
Wire Wire Line
	1500 2000 1400 2000
Wire Wire Line
	1400 1900 1500 1900
Wire Wire Line
	1500 1800 1400 1800
Wire Wire Line
	1400 1700 1500 1700
Wire Wire Line
	1500 1600 1400 1600
Wire Wire Line
	1400 1500 1500 1500
Wire Wire Line
	1500 1400 1400 1400
Wire Wire Line
	1400 1300 1500 1300
Wire Wire Line
	1500 1200 1400 1200
Wire Wire Line
	1400 1100 1500 1100
Text HLabel 1400 3400 0    50   Input ~ 0
GPAI[0..7]
Text HLabel 4850 1800 2    50   Output ~ 0
TDD_CTRL
Text HLabel 4850 1900 2    50   Output ~ 0
TDD_ENABLE
Text HLabel 4850 1100 2    50   Output ~ 0
LNA_REG_EN
Text HLabel 4850 1200 2    50   Output ~ 0
LNA_REG_VSEL_1
Text HLabel 4850 1300 2    50   Output ~ 0
LNA_REG_VSEL_2
Text HLabel 4850 1400 2    50   Output ~ 0
LNA_REG_PS_SYNC
Text HLabel 4850 1500 2    50   Input ~ 0
LNA_REG_DCDC_PG
Text HLabel 4850 1600 2    50   Input ~ 0
LNA_REG_LDO_PG
Text HLabel 4850 1700 2    50   Output ~ 0
LNA_BIAS[0..3]
Text HLabel 3150 1100 0    50   Output ~ 0
BP_RX_CTRL_1
Text HLabel 3150 1200 0    50   Output ~ 0
BP_RX_CTRL_2
Text HLabel 3150 1300 0    50   Output ~ 0
BP_RX_ENABLE
Text HLabel 1400 4100 0    50   Output ~ 0
RF_REG_EN
Text HLabel 1400 4200 0    50   Output ~ 0
RF_REG_PS_SYNC
Text HLabel 1400 4300 0    50   Input ~ 0
RF_REG_DCDC_PG
Text HLabel 1400 4400 0    50   Input ~ 0
RF_REG_LDO_4_8_PG
Text HLabel 1400 4500 0    50   Input ~ 0
RF_REG_LDO_3_3VRF_PG
Text HLabel 3000 3750 0    50   BiDi ~ 0
MCU_IO[0..35]
Text HLabel 7100 1100 2    50   Output ~ 0
PA_REG_EN
Text HLabel 7100 1200 2    50   Output ~ 0
PA_REG_VSEL_1
Text HLabel 7100 1300 2    50   Output ~ 0
PA_REG_VSEL_2
Text HLabel 7100 1400 2    50   Output ~ 0
PA_REG_PS_SYNC
Text HLabel 7100 1500 2    50   Input ~ 0
PA_REG_DCDC_PG
Text HLabel 7100 1600 2    50   Input ~ 0
PA_REG_LDO_PG
Text HLabel 7100 1700 2    50   Output ~ 0
PA_EN
Text HLabel 7100 1800 2    50   Output ~ 0
BT_TX_CTRL_1
Text HLabel 7100 1900 2    50   Output ~ 0
BP_TX_CTRL_2
Text HLabel 7100 2000 2    50   Output ~ 0
BP_TX_ENABLE
Text HLabel 1400 4700 0    50   Output ~ 0
ATT_SI
Text HLabel 1400 4800 0    50   Output ~ 0
ATT_CLK
Text HLabel 1400 4900 0    50   Output ~ 0
ATT_LE
Text HLabel 1400 5500 0    50   Output ~ 0
FAN_PWM
Text HLabel 1400 5600 0    50   Input ~ 0
FAN_TACH
Text HLabel 8600 3750 2    50   BiDi ~ 0
SDR_GPIO[0..11]
Text HLabel 8600 2700 2    50   BiDi ~ 0
FRONTEND_GPIO[0..15]
Text HLabel 8600 2800 2    50   Input ~ 0
FRONTEND_VIO
Text Notes 1950 4600 2    50   ~ 0
15
$Sheet
S 6000 1000 1000 1250
U 5F9C1206
F0 "bank7" 50
F1 "bank7.sch" 50
F2 "PA_REG_EN" O R 7000 1100 50 
F3 "PA_REG_VSEL_1" O R 7000 1200 50 
F4 "PA_REG_VSEL_2" O R 7000 1300 50 
F5 "PA_REG_PS_SYNC" O R 7000 1400 50 
F6 "PA_REG_DCDC_PG" I R 7000 1500 50 
F7 "PA_REG_LDO_PG" I R 7000 1600 50 
F8 "PA_EN" O R 7000 1700 50 
F9 "BT_TX_CTRL_1" O R 7000 1800 50 
F10 "BP_TX_CTRL_2" O R 7000 1900 50 
F11 "BP_TX_ENABLE" O R 7000 2000 50 
$EndSheet
Text Notes 4000 4900 2    50   ~ 0
31
Text Notes 5500 4900 2    50   ~ 0
11
Text Notes 7700 3850 2    50   ~ 0
19
Text Notes 7700 2850 2    50   ~ 0
27
Text Notes 6150 1550 2    50   ~ 0
11
Text Notes 3850 1500 2    50   ~ 0
23
Wire Wire Line
	3150 1100 3250 1100
Wire Wire Line
	3250 1200 3150 1200
Wire Wire Line
	3150 1300 3250 1300
Wire Bus Line
	4850 1700 4750 1700
Wire Wire Line
	4750 1100 4850 1100
Wire Wire Line
	4850 1200 4750 1200
Wire Wire Line
	4750 1300 4850 1300
Wire Wire Line
	4850 1400 4750 1400
Wire Wire Line
	4750 1500 4850 1500
Wire Wire Line
	4850 1600 4750 1600
Wire Wire Line
	4750 1800 4850 1800
Wire Wire Line
	4850 1900 4750 1900
Wire Wire Line
	7100 1100 7000 1100
Wire Wire Line
	7000 1200 7100 1200
Wire Wire Line
	7000 1300 7100 1300
Wire Wire Line
	7100 1400 7000 1400
Wire Wire Line
	7000 1500 7100 1500
Wire Wire Line
	7100 1600 7000 1600
Wire Wire Line
	7000 1700 7100 1700
Wire Wire Line
	7100 1800 7000 1800
Wire Wire Line
	7000 1900 7100 1900
Wire Wire Line
	7100 2000 7000 2000
Wire Bus Line
	8600 2700 8500 2700
Wire Wire Line
	8500 2800 8600 2800
Wire Bus Line
	8500 3750 8600 3750
Wire Wire Line
	1400 4100 1500 4100
Wire Wire Line
	1500 4200 1400 4200
Wire Wire Line
	1400 4300 1500 4300
Wire Wire Line
	1500 4400 1400 4400
Wire Wire Line
	1400 4500 1500 4500
Wire Wire Line
	1500 4700 1400 4700
Wire Wire Line
	1400 4800 1500 4800
Wire Wire Line
	1500 4900 1400 4900
Wire Wire Line
	2500 3400 2750 3400
Wire Wire Line
	2750 3400 2750 6100
Wire Wire Line
	2750 6100 3500 6100
Text HLabel 1400 5100 0    50   Output ~ 0
SYNC_0
Text Notes 5400 3100 2    50   ~ 0
MAX10 to have refdes U2201 consistent with this sheet.
Wire Bus Line
	1500 3400 1400 3400
Wire Wire Line
	1400 5100 1500 5100
Wire Wire Line
	1500 5200 1400 5200
Wire Wire Line
	1400 5300 1500 5300
Wire Wire Line
	1500 5400 1400 5400
Wire Wire Line
	1400 5500 1500 5500
Wire Wire Line
	1500 5600 1400 5600
Wire Bus Line
	3000 3750 3250 3750
Wire Bus Line
	3250 5750 4750 5750
Wire Bus Line
	4750 5750 4750 4900
Entry Bus Bus
	3250 4900 3350 5000
Entry Bus Bus
	4750 4900 4850 5000
Wire Bus Line
	4850 5000 5000 5000
Wire Bus Line
	3350 5000 3500 5000
Text Label 3450 5000 1    50   ~ 0
MCU_IO[0..27]
Text Label 4950 5000 1    50   ~ 0
MCU_IO[28..35]
Text HLabel 3150 1400 0    50   Output ~ 0
A_5VA_EN
Text HLabel 3150 1500 0    50   Input ~ 0
A_5VA_PG
Wire Wire Line
	3250 1400 3150 1400
Wire Wire Line
	3150 1500 3250 1500
Wire Wire Line
	1500 3500 1400 3500
Text HLabel 1400 3500 0    50   Input ~ 0
VSENSE_5VA
$Sheet
S 3250 1000 1500 1250
U 5F9D23DE
F0 "bank8" 50
F1 "bank8.sch" 50
F2 "TDD_CTRL" O R 4750 1800 50 
F3 "TDD_ENABLE" O R 4750 1900 50 
F4 "LNA_REG_EN" O R 4750 1100 50 
F5 "LNA_REG_VSEL_1" O R 4750 1200 50 
F6 "LNA_REG_VSEL_2" O R 4750 1300 50 
F7 "LNA_REG_PS_SYNC" O R 4750 1400 50 
F8 "LNA_REG_DCDC_PG" I R 4750 1500 50 
F9 "LNA_REG_LDO_PG" I R 4750 1600 50 
F10 "LNA_BIAS[0..3]" O R 4750 1700 50 
F11 "BP_RX_CTRL_1" O L 3250 1100 50 
F12 "BP_RX_CTRL_2" O L 3250 1200 50 
F13 "BP_RX_ENABLE" O L 3250 1300 50 
F14 "A_5VA_EN" O L 3250 1400 50 
F15 "A_5VA_PG" I L 3250 1500 50 
F16 "CONFIG_SEL" I L 3250 1700 50 
F17 "CONF_DONE" O L 3250 1800 50 
F18 "~STATUS" O L 3250 1900 50 
F19 "CRC_ERROR" O L 3250 2000 50 
$EndSheet
Text HLabel 3150 1700 0    50   Input ~ 0
CONFIG_SEL
Text HLabel 3150 2000 0    50   Output ~ 0
CRC_ERROR
Text HLabel 3150 1900 0    50   Output ~ 0
~STATUS
Text HLabel 3150 1800 0    50   Output ~ 0
CONF_DONE
Wire Wire Line
	3150 1700 3250 1700
Wire Wire Line
	3250 1800 3150 1800
Wire Wire Line
	3150 1900 3250 1900
Wire Wire Line
	3250 2000 3150 2000
Wire Bus Line
	3250 3750 3250 5750
$EndSCHEMATC
