EESchema Schematic File Version 4
LIBS:switch_5v-cache
EELAYER 26 0
EELAYER END
$Descr A4 11693 8268
encoding utf-8
Sheet 1 1
Title ""
Date ""
Rev ""
Comp ""
Comment1 ""
Comment2 ""
Comment3 ""
Comment4 ""
$EndDescr
$Comp
L POWDER_Power:CSD16321Q5 U104
U 1 1 5C3E3E87
P 3950 3700
F 0 "U104" H 4257 3746 50  0000 L CNN
F 1 "CSD16321Q5" H 4257 3655 50  0000 L CNN
F 2 "POWDER_Power:CSD16321Q5" H 3950 3700 50  0001 C CNN
F 3 "" H 3950 3700 50  0001 C CNN
	1    3950 3700
	1    0    0    -1  
$EndComp
$Comp
L POWDER_Power:CSD16321Q5 U103
U 1 1 5C409D65
P 3950 2350
F 0 "U103" H 4257 2396 50  0000 L CNN
F 1 "CSD16321Q5" H 4257 2305 50  0000 L CNN
F 2 "POWDER_Power:CSD16321Q5" H 3950 2350 50  0001 C CNN
F 3 "" H 3950 2350 50  0001 C CNN
	1    3950 2350
	1    0    0    -1  
$EndComp
$Comp
L Device:R R101
U 1 1 5C409DF6
P 2900 2400
F 0 "R101" V 2693 2400 50  0000 C CNN
F 1 "0" V 2784 2400 50  0000 C CNN
F 2 "Resistor_SMD:R_0402_1005Metric" V 2830 2400 50  0001 C CNN
F 3 "~" H 2900 2400 50  0001 C CNN
	1    2900 2400
	0    1    1    0   
$EndComp
$Comp
L POWDER_Power:UCC27511A U101
U 1 1 5C40A14A
P 2250 2350
F 0 "U101" H 2250 2878 50  0000 C CNN
F 1 "UCC27511A" H 2250 2787 50  0000 C CNN
F 2 "Package_TO_SOT_SMD:SOT-23-6" H 1900 2550 50  0001 C CNN
F 3 "" H 2250 2350 50  0001 C CNN
	1    2250 2350
	1    0    0    -1  
$EndComp
$Comp
L POWDER_Power:UCC27511A U102
U 1 1 5C40A1DE
P 2250 3700
F 0 "U102" H 2250 4228 50  0000 C CNN
F 1 "UCC27511A" H 2250 4137 50  0000 C CNN
F 2 "Package_TO_SOT_SMD:SOT-23-6" H 1900 3900 50  0001 C CNN
F 3 "" H 2250 3700 50  0001 C CNN
	1    2250 3700
	1    0    0    -1  
$EndComp
Wire Wire Line
	2750 2400 2650 2400
$Comp
L Device:R R103
U 1 1 5C40A249
P 3200 2300
F 0 "R103" V 2993 2300 50  0000 C CNN
F 1 "0" V 3084 2300 50  0000 C CNN
F 2 "Resistor_SMD:R_0402_1005Metric" V 3130 2300 50  0001 C CNN
F 3 "~" H 3200 2300 50  0001 C CNN
	1    3200 2300
	0    1    1    0   
$EndComp
Wire Wire Line
	3050 2300 2650 2300
Wire Wire Line
	3050 2400 3450 2400
Wire Wire Line
	3450 2400 3450 2350
Wire Wire Line
	3450 2300 3350 2300
Wire Wire Line
	3450 2350 3600 2350
Connection ~ 3450 2350
Wire Wire Line
	3450 2350 3450 2300
$Comp
L Device:R R102
U 1 1 5C40A622
P 2900 3750
F 0 "R102" V 2693 3750 50  0000 C CNN
F 1 "0" V 2784 3750 50  0000 C CNN
F 2 "Resistor_SMD:R_0402_1005Metric" V 2830 3750 50  0001 C CNN
F 3 "~" H 2900 3750 50  0001 C CNN
	1    2900 3750
	0    1    1    0   
$EndComp
Wire Wire Line
	2750 3750 2650 3750
$Comp
L Device:R R104
U 1 1 5C40A629
P 3200 3650
F 0 "R104" V 2993 3650 50  0000 C CNN
F 1 "0" V 3084 3650 50  0000 C CNN
F 2 "Resistor_SMD:R_0402_1005Metric" V 3130 3650 50  0001 C CNN
F 3 "~" H 3200 3650 50  0001 C CNN
	1    3200 3650
	0    1    1    0   
$EndComp
Wire Wire Line
	3050 3650 2650 3650
Wire Wire Line
	3050 3750 3450 3750
Wire Wire Line
	3450 3750 3450 3700
Wire Wire Line
	3450 3650 3350 3650
Wire Wire Line
	3450 3700 3600 3700
Connection ~ 3450 3700
Wire Wire Line
	3450 3700 3450 3650
$Comp
L power:GND #PWR?
U 1 1 5C40A75F
P 2250 4200
F 0 "#PWR?" H 2250 3950 50  0001 C CNN
F 1 "GND" H 2255 4027 50  0000 C CNN
F 2 "" H 2250 4200 50  0001 C CNN
F 3 "" H 2250 4200 50  0001 C CNN
	1    2250 4200
	1    0    0    -1  
$EndComp
$Comp
L power:GND #PWR?
U 1 1 5C40A781
P 3900 4200
F 0 "#PWR?" H 3900 3950 50  0001 C CNN
F 1 "GND" H 3905 4027 50  0000 C CNN
F 2 "" H 3900 4200 50  0001 C CNN
F 3 "" H 3900 4200 50  0001 C CNN
	1    3900 4200
	1    0    0    -1  
$EndComp
Wire Wire Line
	3900 4200 3900 4000
Wire Wire Line
	4000 4000 4000 3900
Wire Wire Line
	3900 4000 4000 4000
Connection ~ 3900 4000
Wire Wire Line
	3900 4000 3900 3900
Wire Wire Line
	4000 4000 4100 4000
Wire Wire Line
	4100 4000 4100 3900
Connection ~ 4000 4000
Wire Wire Line
	2250 4200 2250 4050
Text Label 1800 3350 0    50   ~ 0
VDD_L
Text Label 1800 2000 0    50   ~ 0
VDD_H
Wire Wire Line
	1450 2400 1850 2400
Text Label 1550 3650 0    50   ~ 0
IN_P_L
Text Label 1550 3750 0    50   ~ 0
IN_M_L
Text Label 1550 2400 0    50   ~ 0
IN_M_H
Text Label 1550 2300 0    50   ~ 0
IN_P_H
$Comp
L power:GND #PWR?
U 1 1 5C40BFF4
P 2250 2800
F 0 "#PWR?" H 2250 2550 50  0001 C CNN
F 1 "GND" H 2255 2627 50  0000 C CNN
F 2 "" H 2250 2800 50  0001 C CNN
F 3 "" H 2250 2800 50  0001 C CNN
	1    2250 2800
	1    0    0    -1  
$EndComp
Wire Wire Line
	2250 2800 2250 2700
Wire Wire Line
	3900 2550 3900 2650
Wire Wire Line
	3900 2650 4000 2650
Connection ~ 4000 2650
Wire Wire Line
	4000 2650 4000 2550
Wire Wire Line
	4100 2550 4100 2650
Wire Wire Line
	4100 2650 4000 2650
Wire Wire Line
	3900 3500 3900 3400
Wire Wire Line
	3900 3400 4000 3400
Wire Wire Line
	4000 3400 4000 3500
Wire Wire Line
	4000 2650 4000 2950
Connection ~ 4000 3400
Wire Wire Line
	4100 3500 4100 3400
Wire Wire Line
	4100 3400 4000 3400
Wire Wire Line
	4100 3400 4200 3400
Wire Wire Line
	4200 3400 4200 3500
Connection ~ 4100 3400
Wire Wire Line
	3900 2150 3900 2000
Wire Wire Line
	3900 2000 4000 2000
Wire Wire Line
	4200 2000 4200 2150
Wire Wire Line
	4100 2150 4100 2000
Connection ~ 4100 2000
Wire Wire Line
	4100 2000 4200 2000
Wire Wire Line
	4000 2150 4000 2000
Connection ~ 4000 2000
Wire Wire Line
	4000 2000 4100 2000
$Comp
L power:VDD #PWR?
U 1 1 5C40FF75
P 4000 1800
F 0 "#PWR?" H 4000 1650 50  0001 C CNN
F 1 "VDD" H 4017 1973 50  0000 C CNN
F 2 "" H 4000 1800 50  0001 C CNN
F 3 "" H 4000 1800 50  0001 C CNN
	1    4000 1800
	1    0    0    -1  
$EndComp
Wire Wire Line
	4000 1800 4000 2000
$Comp
L POWDER_Power:CSD17484F4 U106
U 1 1 5C410D3F
P 5150 3700
F 0 "U106" H 5257 3746 50  0000 L CNN
F 1 "CSD17484F4" H 5257 3655 50  0000 L CNN
F 2 "POWDER_Power:CSD17484F4" H 5150 3700 50  0001 C CNN
F 3 "" H 5150 3700 50  0001 C CNN
	1    5150 3700
	1    0    0    -1  
$EndComp
$Comp
L POWDER_Power:CSD17484F4 U105
U 1 1 5C410E6B
P 5150 2350
F 0 "U105" H 5257 2396 50  0000 L CNN
F 1 "CSD17484F4" H 5257 2305 50  0000 L CNN
F 2 "POWDER_Power:CSD17484F4" H 5150 2350 50  0001 C CNN
F 3 "" H 5150 2350 50  0001 C CNN
	1    5150 2350
	1    0    0    -1  
$EndComp
Wire Wire Line
	5200 2550 5200 2950
Wire Wire Line
	5200 2950 4000 2950
Connection ~ 5200 2950
Wire Wire Line
	5200 2950 5200 3500
Connection ~ 4000 2950
Wire Wire Line
	4000 2950 4000 3400
$Comp
L power:VDD #PWR?
U 1 1 5C412182
P 5200 1800
F 0 "#PWR?" H 5200 1650 50  0001 C CNN
F 1 "VDD" H 5217 1973 50  0000 C CNN
F 2 "" H 5200 1800 50  0001 C CNN
F 3 "" H 5200 1800 50  0001 C CNN
	1    5200 1800
	1    0    0    -1  
$EndComp
Wire Wire Line
	5200 1800 5200 2150
$Comp
L power:GND #PWR?
U 1 1 5C412C3E
P 5200 4200
F 0 "#PWR?" H 5200 3950 50  0001 C CNN
F 1 "GND" H 5205 4027 50  0000 C CNN
F 2 "" H 5200 4200 50  0001 C CNN
F 3 "" H 5200 4200 50  0001 C CNN
	1    5200 4200
	1    0    0    -1  
$EndComp
Wire Wire Line
	5200 4200 5200 3900
Wire Wire Line
	3600 2350 3600 2750
Wire Wire Line
	3600 2750 4750 2750
Wire Wire Line
	4750 2750 4750 2350
Wire Wire Line
	4750 2350 4950 2350
Connection ~ 3600 2350
Wire Wire Line
	3600 2350 3700 2350
Wire Wire Line
	3600 3700 3600 3250
Wire Wire Line
	3600 3250 4750 3250
Wire Wire Line
	4750 3250 4750 3700
Wire Wire Line
	4750 3700 4950 3700
Connection ~ 3600 3700
Wire Wire Line
	3600 3700 3700 3700
$Comp
L POWDER_Power:CSD13385F5 U108
U 1 1 5C41534B
P 6400 3700
F 0 "U108" H 6507 3746 50  0000 L CNN
F 1 "CSD13385F5" H 6507 3655 50  0000 L CNN
F 2 "POWDER_Power:CSD13385F5" H 6400 3700 50  0001 C CNN
F 3 "" H 6400 3700 50  0001 C CNN
	1    6400 3700
	1    0    0    -1  
$EndComp
$Comp
L POWDER_Power:CSD13385F5 U107
U 1 1 5C41548C
P 6400 2350
F 0 "U107" H 6507 2396 50  0000 L CNN
F 1 "CSD13385F5" H 6507 2305 50  0000 L CNN
F 2 "POWDER_Power:CSD13385F5" H 6400 2350 50  0001 C CNN
F 3 "" H 6400 2350 50  0001 C CNN
	1    6400 2350
	1    0    0    -1  
$EndComp
$Comp
L power:VDD #PWR?
U 1 1 5C4154E6
P 6450 1800
F 0 "#PWR?" H 6450 1650 50  0001 C CNN
F 1 "VDD" H 6467 1973 50  0000 C CNN
F 2 "" H 6450 1800 50  0001 C CNN
F 3 "" H 6450 1800 50  0001 C CNN
	1    6450 1800
	1    0    0    -1  
$EndComp
$Comp
L power:GND #PWR?
U 1 1 5C415509
P 6450 4200
F 0 "#PWR?" H 6450 3950 50  0001 C CNN
F 1 "GND" H 6455 4027 50  0000 C CNN
F 2 "" H 6450 4200 50  0001 C CNN
F 3 "" H 6450 4200 50  0001 C CNN
	1    6450 4200
	1    0    0    -1  
$EndComp
Wire Wire Line
	6450 4200 6450 3900
Wire Wire Line
	6450 3500 6450 2950
Wire Wire Line
	6450 2150 6450 1950
Wire Wire Line
	5200 2950 6450 2950
Connection ~ 6450 2950
Wire Wire Line
	6450 2950 6450 2550
Wire Wire Line
	6200 2350 6000 2350
Wire Wire Line
	6000 2350 6000 2750
Wire Wire Line
	6000 2750 4750 2750
Connection ~ 4750 2750
Wire Wire Line
	6200 3700 6000 3700
Wire Wire Line
	6000 3700 6000 3250
Wire Wire Line
	6000 3250 4750 3250
Connection ~ 4750 3250
$Comp
L Connector:Conn_01x07_Male J101
U 1 1 5C41C761
P 750 3100
F 0 "J101" H 856 3578 50  0000 C CNN
F 1 "Conn_01x07_Male" H 856 3487 50  0000 C CNN
F 2 "Connector_PinHeader_2.54mm:PinHeader_1x07_P2.54mm_Vertical" H 750 3100 50  0001 C CNN
F 3 "~" H 750 3100 50  0001 C CNN
	1    750  3100
	1    0    0    -1  
$EndComp
$Comp
L power:GND #PWR?
U 1 1 5C41C814
P 1050 3550
F 0 "#PWR?" H 1050 3300 50  0001 C CNN
F 1 "GND" H 1055 3377 50  0000 C CNN
F 2 "" H 1050 3550 50  0001 C CNN
F 3 "" H 1050 3550 50  0001 C CNN
	1    1050 3550
	1    0    0    -1  
$EndComp
Wire Wire Line
	1050 3550 1050 3400
Wire Wire Line
	1050 3400 950  3400
Wire Wire Line
	1150 3750 1850 3750
Wire Wire Line
	1250 3650 1850 3650
Wire Wire Line
	1350 3350 1350 3300
Wire Wire Line
	1350 3350 2250 3350
Wire Wire Line
	1450 2400 1450 2800
Wire Wire Line
	1350 2300 1850 2300
Wire Wire Line
	1250 2000 2250 2000
$Comp
L Connector:Conn_01x03_Male J102
U 1 1 5C42B26F
P 7750 2950
F 0 "J102" H 7723 2973 50  0000 R CNN
F 1 "Conn_01x03_Male" H 7723 2882 50  0000 R CNN
F 2 "Connector_PinHeader_2.54mm:PinHeader_1x03_P2.54mm_Vertical" H 7750 2950 50  0001 C CNN
F 3 "~" H 7750 2950 50  0001 C CNN
	1    7750 2950
	-1   0    0    -1  
$EndComp
$Comp
L power:GND #PWR?
U 1 1 5C42B33A
P 7450 3200
F 0 "#PWR?" H 7450 2950 50  0001 C CNN
F 1 "GND" H 7455 3027 50  0000 C CNN
F 2 "" H 7450 3200 50  0001 C CNN
F 3 "" H 7450 3200 50  0001 C CNN
	1    7450 3200
	1    0    0    -1  
$EndComp
Wire Wire Line
	7450 3200 7450 3050
Wire Wire Line
	7450 3050 7550 3050
Wire Wire Line
	7550 2950 6450 2950
$Comp
L power:VDD #PWR?
U 1 1 5C42FB19
P 7450 2700
F 0 "#PWR?" H 7450 2550 50  0001 C CNN
F 1 "VDD" H 7467 2873 50  0000 C CNN
F 2 "" H 7450 2700 50  0001 C CNN
F 3 "" H 7450 2700 50  0001 C CNN
	1    7450 2700
	1    0    0    -1  
$EndComp
Wire Wire Line
	7450 2700 7450 2850
Wire Wire Line
	7450 2850 7550 2850
Text Label 4500 3250 0    50   ~ 0
G_L
Text Label 4500 2750 0    50   ~ 0
G_H
Text Label 4500 2950 0    50   ~ 0
OUT
Text Label 2700 3650 0    50   ~ 0
OUTH_L
Text Label 2700 3750 0    50   ~ 0
OUTL_L
Text Label 2700 2400 0    50   ~ 0
OUTL_H
Text Label 2700 2300 0    50   ~ 0
OUTH_H
Wire Wire Line
	1350 2300 1350 2900
Wire Wire Line
	1450 2800 950  2800
Wire Wire Line
	1350 2900 950  2900
Wire Wire Line
	1250 3000 950  3000
Wire Wire Line
	1250 2000 1250 3000
Wire Wire Line
	950  3300 1350 3300
Wire Wire Line
	1150 3100 950  3100
Wire Wire Line
	1150 3100 1150 3750
Wire Wire Line
	1250 3200 950  3200
Wire Wire Line
	1250 3200 1250 3650
$Comp
L Device:C C101
U 1 1 5C453415
P 1900 1250
F 0 "C101" H 2015 1296 50  0000 L CNN
F 1 "1u" H 2015 1205 50  0000 L CNN
F 2 "Capacitor_SMD:C_0402_1005Metric" H 1938 1100 50  0001 C CNN
F 3 "~" H 1900 1250 50  0001 C CNN
	1    1900 1250
	1    0    0    -1  
$EndComp
$Comp
L Device:C C103
U 1 1 5C453598
P 2400 1250
F 0 "C103" H 2515 1296 50  0000 L CNN
F 1 "1n" H 2515 1205 50  0000 L CNN
F 2 "Capacitor_SMD:C_0402_1005Metric" H 2438 1100 50  0001 C CNN
F 3 "~" H 2400 1250 50  0001 C CNN
	1    2400 1250
	1    0    0    -1  
$EndComp
$Comp
L power:GND #PWR?
U 1 1 5C4535DC
P 2400 1600
F 0 "#PWR?" H 2400 1350 50  0001 C CNN
F 1 "GND" H 2405 1427 50  0000 C CNN
F 2 "" H 2400 1600 50  0001 C CNN
F 3 "" H 2400 1600 50  0001 C CNN
	1    2400 1600
	1    0    0    -1  
$EndComp
$Comp
L power:GND #PWR?
U 1 1 5C453607
P 1900 1600
F 0 "#PWR?" H 1900 1350 50  0001 C CNN
F 1 "GND" H 1905 1427 50  0000 C CNN
F 2 "" H 1900 1600 50  0001 C CNN
F 3 "" H 1900 1600 50  0001 C CNN
	1    1900 1600
	1    0    0    -1  
$EndComp
Wire Wire Line
	1900 1600 1900 1400
Wire Wire Line
	2400 1400 2400 1600
Wire Wire Line
	1250 2000 1250 900 
Wire Wire Line
	1250 900  1900 900 
Wire Wire Line
	1900 900  1900 1100
Connection ~ 1250 2000
Wire Wire Line
	1900 900  2400 900 
Wire Wire Line
	2400 900  2400 1100
Connection ~ 1900 900 
$Comp
L Device:C C102
U 1 1 5C45E5E7
P 1900 4900
F 0 "C102" H 2015 4946 50  0000 L CNN
F 1 "1u" H 2015 4855 50  0000 L CNN
F 2 "Capacitor_SMD:C_0402_1005Metric" H 1938 4750 50  0001 C CNN
F 3 "~" H 1900 4900 50  0001 C CNN
	1    1900 4900
	1    0    0    -1  
$EndComp
$Comp
L Device:C C104
U 1 1 5C45E5ED
P 2400 4900
F 0 "C104" H 2515 4946 50  0000 L CNN
F 1 "1n" H 2515 4855 50  0000 L CNN
F 2 "Capacitor_SMD:C_0402_1005Metric" H 2438 4750 50  0001 C CNN
F 3 "~" H 2400 4900 50  0001 C CNN
	1    2400 4900
	1    0    0    -1  
$EndComp
$Comp
L power:GND #PWR?
U 1 1 5C45E5F3
P 2400 5250
F 0 "#PWR?" H 2400 5000 50  0001 C CNN
F 1 "GND" H 2405 5077 50  0000 C CNN
F 2 "" H 2400 5250 50  0001 C CNN
F 3 "" H 2400 5250 50  0001 C CNN
	1    2400 5250
	1    0    0    -1  
$EndComp
$Comp
L power:GND #PWR?
U 1 1 5C45E5F9
P 1900 5250
F 0 "#PWR?" H 1900 5000 50  0001 C CNN
F 1 "GND" H 1905 5077 50  0000 C CNN
F 2 "" H 1900 5250 50  0001 C CNN
F 3 "" H 1900 5250 50  0001 C CNN
	1    1900 5250
	1    0    0    -1  
$EndComp
Wire Wire Line
	1900 5250 1900 5050
Wire Wire Line
	2400 5050 2400 5250
Wire Wire Line
	1900 4550 1900 4750
Wire Wire Line
	1900 4550 2400 4550
Wire Wire Line
	2400 4550 2400 4750
Connection ~ 1900 4550
Wire Wire Line
	1350 3350 1350 4550
Connection ~ 1350 3350
Wire Wire Line
	1350 4550 1900 4550
$Comp
L Device:C C105
U 1 1 5C4652A2
P 7800 1900
F 0 "C105" H 7915 1946 50  0000 L CNN
F 1 "1u" H 7915 1855 50  0000 L CNN
F 2 "Capacitor_SMD:C_0402_1005Metric" H 7838 1750 50  0001 C CNN
F 3 "~" H 7800 1900 50  0001 C CNN
	1    7800 1900
	1    0    0    -1  
$EndComp
$Comp
L Device:C C106
U 1 1 5C4652A8
P 8300 1900
F 0 "C106" H 8415 1946 50  0000 L CNN
F 1 "1n" H 8415 1855 50  0000 L CNN
F 2 "Capacitor_SMD:C_0402_1005Metric" H 8338 1750 50  0001 C CNN
F 3 "~" H 8300 1900 50  0001 C CNN
	1    8300 1900
	1    0    0    -1  
$EndComp
$Comp
L power:GND #PWR?
U 1 1 5C4652AE
P 8300 2250
F 0 "#PWR?" H 8300 2000 50  0001 C CNN
F 1 "GND" H 8305 2077 50  0000 C CNN
F 2 "" H 8300 2250 50  0001 C CNN
F 3 "" H 8300 2250 50  0001 C CNN
	1    8300 2250
	1    0    0    -1  
$EndComp
$Comp
L power:GND #PWR?
U 1 1 5C4652B4
P 7800 2250
F 0 "#PWR?" H 7800 2000 50  0001 C CNN
F 1 "GND" H 7805 2077 50  0000 C CNN
F 2 "" H 7800 2250 50  0001 C CNN
F 3 "" H 7800 2250 50  0001 C CNN
	1    7800 2250
	1    0    0    -1  
$EndComp
Wire Wire Line
	7800 2250 7800 2050
Wire Wire Line
	8300 2050 8300 2250
Wire Wire Line
	7800 1550 7800 1750
Wire Wire Line
	7800 1550 8300 1550
Wire Wire Line
	8300 1550 8300 1750
Connection ~ 7800 1550
Wire Wire Line
	7250 1550 7800 1550
Wire Wire Line
	7250 1550 7250 1950
Wire Wire Line
	7250 1950 6450 1950
Connection ~ 6450 1950
Wire Wire Line
	6450 1950 6450 1800
Text Notes 3500 1150 0    50   ~ 0
VDD_H = 7.5 to avoid VGS failure on CSD13385F5 (check others)\nVDD_L = 5
$EndSCHEMATC
