EESchema Schematic File Version 4
EELAYER 30 0
EELAYER END
$Descr A4 11693 8268
encoding utf-8
Sheet 11 14
Title ""
Date ""
Rev ""
Comp ""
Comment1 ""
Comment2 ""
Comment3 ""
Comment4 ""
$EndDescr
$Comp
L power:GND #PWR?
U 1 1 5E9AB1DB
P 6000 5950
AR Path="/5E9AB1DB" Ref="#PWR?"  Part="1" 
AR Path="/5E655037/5E9AB1DB" Ref="#PWR?"  Part="1" 
AR Path="/5E78F576/5E9AB1DB" Ref="#PWR?"  Part="1" 
F 0 "#PWR?" H 6000 5700 50  0001 C CNN
F 1 "GND" H 6005 5777 50  0000 C CNN
F 2 "" H 6000 5950 50  0001 C CNN
F 3 "" H 6000 5950 50  0001 C CNN
	1    6000 5950
	1    0    0    -1  
$EndComp
Wire Wire Line
	6000 5950 6000 5850
$Comp
L power:GND #PWR?
U 1 1 5E9AB1E2
P 5900 5950
AR Path="/5E9AB1E2" Ref="#PWR?"  Part="1" 
AR Path="/5E655037/5E9AB1E2" Ref="#PWR?"  Part="1" 
AR Path="/5E78F576/5E9AB1E2" Ref="#PWR?"  Part="1" 
F 0 "#PWR?" H 5900 5700 50  0001 C CNN
F 1 "GND" H 5905 5777 50  0000 C CNN
F 2 "" H 5900 5950 50  0001 C CNN
F 3 "" H 5900 5950 50  0001 C CNN
	1    5900 5950
	1    0    0    -1  
$EndComp
Wire Wire Line
	5900 5950 5900 5850
$Comp
L power:GND #PWR?
U 1 1 5E9AB1E9
P 5800 5950
AR Path="/5E9AB1E9" Ref="#PWR?"  Part="1" 
AR Path="/5E655037/5E9AB1E9" Ref="#PWR?"  Part="1" 
AR Path="/5E78F576/5E9AB1E9" Ref="#PWR?"  Part="1" 
F 0 "#PWR?" H 5800 5700 50  0001 C CNN
F 1 "GND" H 5805 5777 50  0000 C CNN
F 2 "" H 5800 5950 50  0001 C CNN
F 3 "" H 5800 5950 50  0001 C CNN
	1    5800 5950
	1    0    0    -1  
$EndComp
Wire Wire Line
	5800 5950 5800 5850
$Comp
L power:GND #PWR?
U 1 1 5E9AB1F0
P 5700 5950
AR Path="/5E9AB1F0" Ref="#PWR?"  Part="1" 
AR Path="/5E655037/5E9AB1F0" Ref="#PWR?"  Part="1" 
AR Path="/5E78F576/5E9AB1F0" Ref="#PWR?"  Part="1" 
F 0 "#PWR?" H 5700 5700 50  0001 C CNN
F 1 "GND" H 5705 5777 50  0000 C CNN
F 2 "" H 5700 5950 50  0001 C CNN
F 3 "" H 5700 5950 50  0001 C CNN
	1    5700 5950
	1    0    0    -1  
$EndComp
Wire Wire Line
	5700 5950 5700 5850
$Comp
L power:GND #PWR?
U 1 1 5E9AB1F7
P 5600 5950
AR Path="/5E9AB1F7" Ref="#PWR?"  Part="1" 
AR Path="/5E655037/5E9AB1F7" Ref="#PWR?"  Part="1" 
AR Path="/5E78F576/5E9AB1F7" Ref="#PWR?"  Part="1" 
F 0 "#PWR?" H 5600 5700 50  0001 C CNN
F 1 "GND" H 5605 5777 50  0000 C CNN
F 2 "" H 5600 5950 50  0001 C CNN
F 3 "" H 5600 5950 50  0001 C CNN
	1    5600 5950
	1    0    0    -1  
$EndComp
Wire Wire Line
	5600 5950 5600 5850
$Comp
L power:GND #PWR?
U 1 1 5E9AB1FE
P 5500 5950
AR Path="/5E9AB1FE" Ref="#PWR?"  Part="1" 
AR Path="/5E655037/5E9AB1FE" Ref="#PWR?"  Part="1" 
AR Path="/5E78F576/5E9AB1FE" Ref="#PWR?"  Part="1" 
F 0 "#PWR?" H 5500 5700 50  0001 C CNN
F 1 "GND" H 5505 5777 50  0000 C CNN
F 2 "" H 5500 5950 50  0001 C CNN
F 3 "" H 5500 5950 50  0001 C CNN
	1    5500 5950
	1    0    0    -1  
$EndComp
Wire Wire Line
	5500 5950 5500 5850
$Comp
L power:GND #PWR?
U 1 1 5E9AB205
P 5400 5950
AR Path="/5E9AB205" Ref="#PWR?"  Part="1" 
AR Path="/5E655037/5E9AB205" Ref="#PWR?"  Part="1" 
AR Path="/5E78F576/5E9AB205" Ref="#PWR?"  Part="1" 
F 0 "#PWR?" H 5400 5700 50  0001 C CNN
F 1 "GND" H 5405 5777 50  0000 C CNN
F 2 "" H 5400 5950 50  0001 C CNN
F 3 "" H 5400 5950 50  0001 C CNN
	1    5400 5950
	1    0    0    -1  
$EndComp
Wire Wire Line
	5400 5950 5400 5850
$Comp
L power:GND #PWR?
U 1 1 5E9AB20C
P 5300 5950
AR Path="/5E9AB20C" Ref="#PWR?"  Part="1" 
AR Path="/5E655037/5E9AB20C" Ref="#PWR?"  Part="1" 
AR Path="/5E78F576/5E9AB20C" Ref="#PWR?"  Part="1" 
F 0 "#PWR?" H 5300 5700 50  0001 C CNN
F 1 "GND" H 5305 5777 50  0000 C CNN
F 2 "" H 5300 5950 50  0001 C CNN
F 3 "" H 5300 5950 50  0001 C CNN
	1    5300 5950
	1    0    0    -1  
$EndComp
Wire Wire Line
	5300 5950 5300 5850
$Comp
L power:GND #PWR?
U 1 1 5E9AB213
P 5200 5950
AR Path="/5E9AB213" Ref="#PWR?"  Part="1" 
AR Path="/5E655037/5E9AB213" Ref="#PWR?"  Part="1" 
AR Path="/5E78F576/5E9AB213" Ref="#PWR?"  Part="1" 
F 0 "#PWR?" H 5200 5700 50  0001 C CNN
F 1 "GND" H 5205 5777 50  0000 C CNN
F 2 "" H 5200 5950 50  0001 C CNN
F 3 "" H 5200 5950 50  0001 C CNN
	1    5200 5950
	1    0    0    -1  
$EndComp
Wire Wire Line
	5200 5950 5200 5850
$Comp
L power:GND #PWR?
U 1 1 5E9AB21A
P 5100 5950
AR Path="/5E9AB21A" Ref="#PWR?"  Part="1" 
AR Path="/5E655037/5E9AB21A" Ref="#PWR?"  Part="1" 
AR Path="/5E78F576/5E9AB21A" Ref="#PWR?"  Part="1" 
F 0 "#PWR?" H 5100 5700 50  0001 C CNN
F 1 "GND" H 5105 5777 50  0000 C CNN
F 2 "" H 5100 5950 50  0001 C CNN
F 3 "" H 5100 5950 50  0001 C CNN
	1    5100 5950
	1    0    0    -1  
$EndComp
Wire Wire Line
	5100 5950 5100 5850
$Comp
L power:GND #PWR?
U 1 1 5E9AB221
P 5000 5950
AR Path="/5E9AB221" Ref="#PWR?"  Part="1" 
AR Path="/5E655037/5E9AB221" Ref="#PWR?"  Part="1" 
AR Path="/5E78F576/5E9AB221" Ref="#PWR?"  Part="1" 
F 0 "#PWR?" H 5000 5700 50  0001 C CNN
F 1 "GND" H 5005 5777 50  0000 C CNN
F 2 "" H 5000 5950 50  0001 C CNN
F 3 "" H 5000 5950 50  0001 C CNN
	1    5000 5950
	1    0    0    -1  
$EndComp
Wire Wire Line
	5000 5950 5000 5850
$Comp
L power:GND #PWR?
U 1 1 5E9AB228
P 4900 5950
AR Path="/5E9AB228" Ref="#PWR?"  Part="1" 
AR Path="/5E655037/5E9AB228" Ref="#PWR?"  Part="1" 
AR Path="/5E78F576/5E9AB228" Ref="#PWR?"  Part="1" 
F 0 "#PWR?" H 4900 5700 50  0001 C CNN
F 1 "GND" H 4905 5777 50  0000 C CNN
F 2 "" H 4900 5950 50  0001 C CNN
F 3 "" H 4900 5950 50  0001 C CNN
	1    4900 5950
	1    0    0    -1  
$EndComp
Wire Wire Line
	4900 5950 4900 5850
$Comp
L power:GND #PWR?
U 1 1 5E9AB22F
P 4800 5950
AR Path="/5E9AB22F" Ref="#PWR?"  Part="1" 
AR Path="/5E655037/5E9AB22F" Ref="#PWR?"  Part="1" 
AR Path="/5E78F576/5E9AB22F" Ref="#PWR?"  Part="1" 
F 0 "#PWR?" H 4800 5700 50  0001 C CNN
F 1 "GND" H 4805 5777 50  0000 C CNN
F 2 "" H 4800 5950 50  0001 C CNN
F 3 "" H 4800 5950 50  0001 C CNN
	1    4800 5950
	1    0    0    -1  
$EndComp
Wire Wire Line
	4800 5950 4800 5850
$Comp
L power:GND #PWR?
U 1 1 5E9AB236
P 4700 5950
AR Path="/5E9AB236" Ref="#PWR?"  Part="1" 
AR Path="/5E655037/5E9AB236" Ref="#PWR?"  Part="1" 
AR Path="/5E78F576/5E9AB236" Ref="#PWR?"  Part="1" 
F 0 "#PWR?" H 4700 5700 50  0001 C CNN
F 1 "GND" H 4705 5777 50  0000 C CNN
F 2 "" H 4700 5950 50  0001 C CNN
F 3 "" H 4700 5950 50  0001 C CNN
	1    4700 5950
	1    0    0    -1  
$EndComp
Wire Wire Line
	4700 5950 4700 5850
$Comp
L power:GND #PWR?
U 1 1 5E9AB23D
P 4600 5950
AR Path="/5E9AB23D" Ref="#PWR?"  Part="1" 
AR Path="/5E655037/5E9AB23D" Ref="#PWR?"  Part="1" 
AR Path="/5E78F576/5E9AB23D" Ref="#PWR?"  Part="1" 
F 0 "#PWR?" H 4600 5700 50  0001 C CNN
F 1 "GND" H 4605 5777 50  0000 C CNN
F 2 "" H 4600 5950 50  0001 C CNN
F 3 "" H 4600 5950 50  0001 C CNN
	1    4600 5950
	1    0    0    -1  
$EndComp
Wire Wire Line
	4600 5950 4600 5850
$Comp
L power:GND #PWR?
U 1 1 5E9AB244
P 4500 5950
AR Path="/5E9AB244" Ref="#PWR?"  Part="1" 
AR Path="/5E655037/5E9AB244" Ref="#PWR?"  Part="1" 
AR Path="/5E78F576/5E9AB244" Ref="#PWR?"  Part="1" 
F 0 "#PWR?" H 4500 5700 50  0001 C CNN
F 1 "GND" H 4505 5777 50  0000 C CNN
F 2 "" H 4500 5950 50  0001 C CNN
F 3 "" H 4500 5950 50  0001 C CNN
	1    4500 5950
	1    0    0    -1  
$EndComp
Wire Wire Line
	4500 5950 4500 5850
$Comp
L POWDER_RF:PE43712 U?
U 1 1 5E9AB24B
P 5250 5300
AR Path="/5E9AB24B" Ref="U?"  Part="1" 
AR Path="/5E655037/5E9AB24B" Ref="U1101"  Part="1" 
AR Path="/5E78F576/5E9AB24B" Ref="U?"  Part="1" 
F 0 "U1101" H 6100 5800 50  0000 C CNN
F 1 "PE43712" H 5250 5300 50  0000 C CNN
F 2 "Package_DFN_QFN:QFN-32-1EP_5x5mm_P0.5mm_EP3.1x3.1mm" H 6400 4000 50  0001 C CNN
F 3 "" H 6100 5800 50  0001 C CNN
F 4 "3000-0000000187" H 5250 5300 50  0001 C CNN "PartSpecification"
	1    5250 5300
	-1   0    0    -1  
$EndComp
Text HLabel 6750 5300 2    50   Input ~ 0
RF_IN
Wire Wire Line
	6200 5300 6750 5300
Text HLabel 3750 5300 0    50   Output ~ 0
RF_OUT
Wire Wire Line
	3750 5300 4300 5300
Text Label 6200 1350 0    50   ~ 0
TX_att_VDD
Wire Wire Line
	6000 1350 6500 1350
Connection ~ 6000 1350
Wire Wire Line
	5000 1850 5000 1750
Wire Wire Line
	5500 1850 5500 1750
Wire Wire Line
	5500 1350 6000 1350
Wire Wire Line
	6500 1850 6500 1750
$Comp
L power:GND #PWR?
U 1 1 5E9AB25C
P 6500 1850
AR Path="/5E9AB25C" Ref="#PWR?"  Part="1" 
AR Path="/5E655037/5E9AB25C" Ref="#PWR?"  Part="1" 
AR Path="/5E78F576/5E9AB25C" Ref="#PWR?"  Part="1" 
F 0 "#PWR?" H 6500 1600 50  0001 C CNN
F 1 "GND" H 6505 1677 50  0000 C CNN
F 2 "" H 6500 1850 50  0001 C CNN
F 3 "" H 6500 1850 50  0001 C CNN
	1    6500 1850
	1    0    0    -1  
$EndComp
Wire Wire Line
	5000 1350 5500 1350
Connection ~ 5000 1350
Wire Wire Line
	5000 1450 5000 1350
Connection ~ 5500 1350
Wire Wire Line
	5500 1450 5500 1350
Wire Wire Line
	6500 1450 6500 1350
$Comp
L 000_PreferredParts:C_100nF C?
U 1 1 5E9AB269
P 6500 1600
AR Path="/5E9AB269" Ref="C?"  Part="1" 
AR Path="/5E655037/5E9AB269" Ref="C1103"  Part="1" 
AR Path="/5E78F576/5E9AB269" Ref="C?"  Part="1" 
F 0 "C1103" H 6525 1700 50  0000 L CNN
F 1 "C_100nF" H 6525 1500 50  0001 L CNN
F 2 "Capacitor_SMD:C_0402_1005Metric" H 6538 1450 50  0001 C CNN
F 3 "~" H 6500 1600 50  0001 C CNN
F 4 "100nF" H 6650 1500 50  0000 C CNN "DisplayValue"
F 5 "3000-0000000125" H 0   0   50  0001 C CNN "PartSpecification"
	1    6500 1600
	1    0    0    -1  
$EndComp
$Comp
L 000_PreferredParts:C_1nF C?
U 1 1 5E9AB26F
P 5500 1600
AR Path="/5E9AB26F" Ref="C?"  Part="1" 
AR Path="/5E655037/5E9AB26F" Ref="C1102"  Part="1" 
AR Path="/5E78F576/5E9AB26F" Ref="C?"  Part="1" 
F 0 "C1102" H 5525 1700 50  0000 L CNN
F 1 "C_1nF" H 5525 1500 50  0000 L CNN
F 2 "Capacitor_SMD:C_0402_1005Metric" H 5538 1450 50  0001 C CNN
F 3 "~" H 5500 1600 50  0001 C CNN
F 4 "3000-0000000128" H 0   0   50  0001 C CNN "PartSpecification"
	1    5500 1600
	1    0    0    -1  
$EndComp
$Comp
L 000_PreferredParts:C_10pF C?
U 1 1 5E9AB275
P 5000 1600
AR Path="/5E9AB275" Ref="C?"  Part="1" 
AR Path="/5E655037/5E9AB275" Ref="C1101"  Part="1" 
AR Path="/5E78F576/5E9AB275" Ref="C?"  Part="1" 
F 0 "C1101" H 5025 1700 50  0000 L CNN
F 1 "C_10pF" H 5025 1500 50  0000 L CNN
F 2 "Capacitor_SMD:C_0402_1005Metric" H 5038 1450 50  0001 C CNN
F 3 "~" H 5000 1600 50  0001 C CNN
F 4 "3000-0000000582" H 0   0   50  0001 C CNN "PartSpecification"
	1    5000 1600
	1    0    0    -1  
$EndComp
Wire Wire Line
	4800 1350 5000 1350
Wire Wire Line
	4500 1350 4300 1350
$Comp
L Device:L L?
U 1 1 5E9AB27F
P 4650 1350
AR Path="/5E9AB27F" Ref="L?"  Part="1" 
AR Path="/5D96ADB0/5E9AB27F" Ref="L?"  Part="1" 
AR Path="/5E655037/5E9AB27F" Ref="L1101"  Part="1" 
AR Path="/5E78F576/5E9AB27F" Ref="L?"  Part="1" 
F 0 "L1101" V 4840 1350 50  0000 C CNN
F 1 "BEAD" V 4749 1350 50  0000 C CNN
F 2 "Inductor_SMD:L_0603_1608Metric" H 4650 1350 50  0001 C CNN
F 3 "~" H 4650 1350 50  0001 C CNN
F 4 "BLM18EG221SZ1" V 4650 1350 50  0001 C CNN "PartNumber"
F 5 "Murata Electronics" H 4650 1350 50  0001 C CNN "Manufacturer"
F 6 "3000-0000000091" H 4650 1350 50  0001 C CNN "PartSpecification"
	1    4650 1350
	0    -1   -1   0   
$EndComp
Text Label 4800 4650 1    50   ~ 0
TX_ATT_A1
Text Label 4700 4650 1    50   ~ 0
TX_ATT_A2
Text Label 4600 4650 1    50   ~ 0
TX_ATT_A0
Text Label 4500 4650 1    50   ~ 0
TX_ATT_S_P
Text Label 5800 4650 1    50   ~ 0
TX_ATT_D0
Text Label 5700 4650 1    50   ~ 0
TX_ATT_D1
Text Label 5600 4650 1    50   ~ 0
TX_ATT_D2
Text Label 5500 4650 1    50   ~ 0
TX_ATT_D3
Text Label 5400 4650 1    50   ~ 0
TX_ATT_D4
Text Label 5300 4650 1    50   ~ 0
TX_ATT_D5
Text Label 5200 4650 1    50   ~ 0
TX_ATT_D6
$Comp
L Connector:TestPoint TP?
U 1 1 5E9AB290
P 5800 2550
AR Path="/5E9AB290" Ref="TP?"  Part="1" 
AR Path="/5E655037/5E9AB290" Ref="TP1108"  Part="1" 
AR Path="/5E78F576/5E9AB290" Ref="TP?"  Part="1" 
F 0 "TP1108" H 5858 2668 50  0000 L CNN
F 1 "TestPoint" H 5858 2577 50  0001 L CNN
F 2 "TestPoint:TestPoint_Pad_D1.0mm" H 6000 2550 50  0001 C CNN
F 3 "~" H 6000 2550 50  0001 C CNN
	1    5800 2550
	-1   0    0    -1  
$EndComp
$Comp
L Connector:TestPoint TP?
U 1 1 5E9AB296
P 5700 2750
AR Path="/5E9AB296" Ref="TP?"  Part="1" 
AR Path="/5E655037/5E9AB296" Ref="TP1107"  Part="1" 
AR Path="/5E78F576/5E9AB296" Ref="TP?"  Part="1" 
F 0 "TP1107" H 5758 2868 50  0000 L CNN
F 1 "TestPoint" H 5758 2777 50  0001 L CNN
F 2 "TestPoint:TestPoint_Pad_D1.0mm" H 5900 2750 50  0001 C CNN
F 3 "~" H 5900 2750 50  0001 C CNN
	1    5700 2750
	-1   0    0    -1  
$EndComp
$Comp
L Connector:TestPoint TP?
U 1 1 5E9AB29C
P 5600 3350
AR Path="/5E9AB29C" Ref="TP?"  Part="1" 
AR Path="/5E655037/5E9AB29C" Ref="TP1106"  Part="1" 
AR Path="/5E78F576/5E9AB29C" Ref="TP?"  Part="1" 
F 0 "TP1106" H 5658 3468 50  0000 L CNN
F 1 "TestPoint" H 5658 3377 50  0001 L CNN
F 2 "TestPoint:TestPoint_Pad_D1.0mm" H 5800 3350 50  0001 C CNN
F 3 "~" H 5800 3350 50  0001 C CNN
	1    5600 3350
	-1   0    0    -1  
$EndComp
$Comp
L Connector:TestPoint TP?
U 1 1 5E9AB2A2
P 5500 3200
AR Path="/5E9AB2A2" Ref="TP?"  Part="1" 
AR Path="/5E655037/5E9AB2A2" Ref="TP1105"  Part="1" 
AR Path="/5E78F576/5E9AB2A2" Ref="TP?"  Part="1" 
F 0 "TP1105" H 5558 3318 50  0000 L CNN
F 1 "TestPoint" H 5558 3227 50  0001 L CNN
F 2 "TestPoint:TestPoint_Pad_D1.0mm" H 5700 3200 50  0001 C CNN
F 3 "~" H 5700 3200 50  0001 C CNN
	1    5500 3200
	-1   0    0    -1  
$EndComp
$Comp
L Connector:TestPoint TP?
U 1 1 5E9AB2A8
P 5400 3050
AR Path="/5E9AB2A8" Ref="TP?"  Part="1" 
AR Path="/5E655037/5E9AB2A8" Ref="TP1104"  Part="1" 
AR Path="/5E78F576/5E9AB2A8" Ref="TP?"  Part="1" 
F 0 "TP1104" H 5458 3168 50  0000 L CNN
F 1 "TestPoint" H 5458 3077 50  0001 L CNN
F 2 "TestPoint:TestPoint_Pad_D1.0mm" H 5600 3050 50  0001 C CNN
F 3 "~" H 5600 3050 50  0001 C CNN
	1    5400 3050
	-1   0    0    -1  
$EndComp
$Comp
L Connector:TestPoint TP?
U 1 1 5E9AB2AE
P 5300 2900
AR Path="/5E9AB2AE" Ref="TP?"  Part="1" 
AR Path="/5E655037/5E9AB2AE" Ref="TP1103"  Part="1" 
AR Path="/5E78F576/5E9AB2AE" Ref="TP?"  Part="1" 
F 0 "TP1103" H 5358 3018 50  0000 L CNN
F 1 "TestPoint" H 5358 2927 50  0001 L CNN
F 2 "TestPoint:TestPoint_Pad_D1.0mm" H 5500 2900 50  0001 C CNN
F 3 "~" H 5500 2900 50  0001 C CNN
	1    5300 2900
	-1   0    0    -1  
$EndComp
$Comp
L Connector:TestPoint TP?
U 1 1 5E9AB2B4
P 5200 2750
AR Path="/5E9AB2B4" Ref="TP?"  Part="1" 
AR Path="/5E655037/5E9AB2B4" Ref="TP1102"  Part="1" 
AR Path="/5E78F576/5E9AB2B4" Ref="TP?"  Part="1" 
F 0 "TP1102" H 5258 2868 50  0000 L CNN
F 1 "TestPoint" H 5258 2777 50  0001 L CNN
F 2 "TestPoint:TestPoint_Pad_D1.0mm" H 5400 2750 50  0001 C CNN
F 3 "~" H 5400 2750 50  0001 C CNN
	1    5200 2750
	-1   0    0    -1  
$EndComp
Wire Wire Line
	5800 4750 5800 2700
Wire Wire Line
	5700 4750 5700 2950
Wire Wire Line
	5600 4750 5600 3350
Wire Wire Line
	5500 4750 5500 3450
Wire Wire Line
	5400 4750 5400 3700
Wire Wire Line
	5300 4750 5300 3950
Wire Wire Line
	5200 4750 5200 4200
Text Label 5100 3050 1    50   ~ 0
ATT_SI
Text Label 5000 3050 1    50   ~ 0
ATT_CLK
Text Label 4900 3050 1    50   ~ 0
ATT_LE
$Comp
L power:GND #PWR?
U 1 1 5E9AB2C4
P 3600 2900
AR Path="/5E9AB2C4" Ref="#PWR?"  Part="1" 
AR Path="/5E655037/5E9AB2C4" Ref="#PWR?"  Part="1" 
AR Path="/5E78F576/5E9AB2C4" Ref="#PWR?"  Part="1" 
F 0 "#PWR?" H 3600 2650 50  0001 C CNN
F 1 "GND" H 3605 2727 50  0000 C CNN
F 2 "" H 3600 2900 50  0001 C CNN
F 3 "" H 3600 2900 50  0001 C CNN
	1    3600 2900
	1    0    0    -1  
$EndComp
$Comp
L Device:R R?
U 1 1 5E9AB2CC
P 4200 2500
AR Path="/5D69D382/5E9AB2CC" Ref="R?"  Part="1" 
AR Path="/5E9AB2CC" Ref="R?"  Part="1" 
AR Path="/5E655037/5E9AB2CC" Ref="R1101"  Part="1" 
AR Path="/5E78F576/5E9AB2CC" Ref="R?"  Part="1" 
F 0 "R1101" H 4270 2546 50  0000 L CNN
F 1 "10k" H 4270 2455 50  0000 L CNN
F 2 "Resistor_SMD:R_0402_1005Metric" V 4130 2500 50  0001 C CNN
F 3 "~" H 4200 2500 50  0001 C CNN
F 4 "Delta Electronics/Cyntec" H 4200 2500 50  0001 C CNN "Manufacturer"
F 5 "PFR05S-103-FNH" H 4200 2500 50  0001 C CNN "PartNumber"
F 6 "3000-0000000131" H 4200 2500 50  0001 C CNN "PartSpecification"
	1    4200 2500
	0    1    1    0   
$EndComp
$Comp
L Device:R R?
U 1 1 5E9AB2D4
P 4200 2800
AR Path="/5D69D382/5E9AB2D4" Ref="R?"  Part="1" 
AR Path="/5E9AB2D4" Ref="R?"  Part="1" 
AR Path="/5E655037/5E9AB2D4" Ref="R1102"  Part="1" 
AR Path="/5E78F576/5E9AB2D4" Ref="R?"  Part="1" 
F 0 "R1102" H 4270 2846 50  0000 L CNN
F 1 "10k" H 4270 2755 50  0000 L CNN
F 2 "Resistor_SMD:R_0402_1005Metric" V 4130 2800 50  0001 C CNN
F 3 "~" H 4200 2800 50  0001 C CNN
F 4 "Delta Electronics/Cyntec" H 4200 2800 50  0001 C CNN "Manufacturer"
F 5 "PFR05S-103-FNH" H 4200 2800 50  0001 C CNN "PartNumber"
F 6 "3000-0000000131" H 4200 2800 50  0001 C CNN "PartSpecification"
	1    4200 2800
	0    1    1    0   
$EndComp
$Comp
L Device:R R?
U 1 1 5E9AB2DC
P 4200 3300
AR Path="/5D69D382/5E9AB2DC" Ref="R?"  Part="1" 
AR Path="/5E9AB2DC" Ref="R?"  Part="1" 
AR Path="/5E655037/5E9AB2DC" Ref="R1103"  Part="1" 
AR Path="/5E78F576/5E9AB2DC" Ref="R?"  Part="1" 
F 0 "R1103" H 4270 3346 50  0000 L CNN
F 1 "10k" H 4270 3255 50  0000 L CNN
F 2 "Resistor_SMD:R_0402_1005Metric" V 4130 3300 50  0001 C CNN
F 3 "~" H 4200 3300 50  0001 C CNN
F 4 "Delta Electronics/Cyntec" H 4200 3300 50  0001 C CNN "Manufacturer"
F 5 "PFR05S-103-FNH" H 4200 3300 50  0001 C CNN "PartNumber"
F 6 "3000-0000000131" H 4200 3300 50  0001 C CNN "PartSpecification"
	1    4200 3300
	0    1    1    0   
$EndComp
Wire Wire Line
	4250 4700 4500 4700
$Comp
L Connector:TestPoint TP?
U 1 1 5E9AB2E3
P 4250 4700
AR Path="/5E9AB2E3" Ref="TP?"  Part="1" 
AR Path="/5E655037/5E9AB2E3" Ref="TP1101"  Part="1" 
AR Path="/5E78F576/5E9AB2E3" Ref="TP?"  Part="1" 
F 0 "TP1101" H 4308 4818 50  0000 L CNN
F 1 "TestPoint" H 4308 4727 50  0000 L CNN
F 2 "TestPoint:TestPoint_Pad_D1.0mm" H 4450 4700 50  0001 C CNN
F 3 "~" H 4450 4700 50  0001 C CNN
	1    4250 4700
	-1   0    0    -1  
$EndComp
$Comp
L power:+3.3V #PWR?
U 1 1 5E9AB2E9
P 3800 3200
AR Path="/5E9AB2E9" Ref="#PWR?"  Part="1" 
AR Path="/5E655037/5E9AB2E9" Ref="#PWR?"  Part="1" 
AR Path="/5E78F576/5E9AB2E9" Ref="#PWR?"  Part="1" 
F 0 "#PWR?" H 3800 3050 50  0001 C CNN
F 1 "+3.3V" H 3815 3373 50  0000 C CNN
F 2 "" H 3800 3200 50  0001 C CNN
F 3 "" H 3800 3200 50  0001 C CNN
	1    3800 3200
	1    0    0    -1  
$EndComp
$Comp
L Device:R R?
U 1 1 5E9AB2F1
P 4200 4150
AR Path="/5D69D382/5E9AB2F1" Ref="R?"  Part="1" 
AR Path="/5E9AB2F1" Ref="R?"  Part="1" 
AR Path="/5E655037/5E9AB2F1" Ref="R1104"  Part="1" 
AR Path="/5E78F576/5E9AB2F1" Ref="R?"  Part="1" 
F 0 "R1104" H 4270 4196 50  0000 L CNN
F 1 "10k" H 4270 4105 50  0000 L CNN
F 2 "Resistor_SMD:R_0402_1005Metric" V 4130 4150 50  0001 C CNN
F 3 "~" H 4200 4150 50  0001 C CNN
F 4 "Delta Electronics/Cyntec" H 4200 4150 50  0001 C CNN "Manufacturer"
F 5 "PFR05S-103-FNH" H 4200 4150 50  0001 C CNN "PartNumber"
F 6 "3000-0000000131" H 4200 4150 50  0001 C CNN "PartSpecification"
	1    4200 4150
	0    1    1    0   
$EndComp
$Comp
L power:GND #PWR?
U 1 1 5E9AB2F7
P 5000 1850
AR Path="/5E9AB2F7" Ref="#PWR?"  Part="1" 
AR Path="/5E655037/5E9AB2F7" Ref="#PWR?"  Part="1" 
AR Path="/5E78F576/5E9AB2F7" Ref="#PWR?"  Part="1" 
F 0 "#PWR?" H 5000 1600 50  0001 C CNN
F 1 "GND" H 5005 1677 50  0000 C CNN
F 2 "" H 5000 1850 50  0001 C CNN
F 3 "" H 5000 1850 50  0001 C CNN
	1    5000 1850
	1    0    0    -1  
$EndComp
$Comp
L power:GND #PWR?
U 1 1 5E9AB2FD
P 5500 1850
AR Path="/5E9AB2FD" Ref="#PWR?"  Part="1" 
AR Path="/5E655037/5E9AB2FD" Ref="#PWR?"  Part="1" 
AR Path="/5E78F576/5E9AB2FD" Ref="#PWR?"  Part="1" 
F 0 "#PWR?" H 5500 1600 50  0001 C CNN
F 1 "GND" H 5505 1677 50  0000 C CNN
F 2 "" H 5500 1850 50  0001 C CNN
F 3 "" H 5500 1850 50  0001 C CNN
	1    5500 1850
	1    0    0    -1  
$EndComp
Wire Wire Line
	6000 1350 6000 4750
Text HLabel 4300 1350 0    50   Input ~ 0
VDD
Wire Wire Line
	4350 4150 4500 4150
Wire Wire Line
	4500 4150 4500 4700
Wire Wire Line
	3800 4150 4050 4150
Wire Wire Line
	4600 3300 4600 4750
Wire Wire Line
	4350 3300 4600 3300
Wire Wire Line
	3600 2900 3600 2800
Wire Wire Line
	3600 2800 4050 2800
Wire Wire Line
	4050 2500 3600 2500
Wire Wire Line
	3600 2500 3600 2800
Connection ~ 3600 2800
Wire Wire Line
	4700 2800 4350 2800
Wire Wire Line
	4700 2800 4700 4750
Wire Wire Line
	4350 2500 4800 2500
Wire Wire Line
	4800 2500 4800 4750
Text HLabel 4800 2400 0    50   Input ~ 0
LE
Text HLabel 4800 2300 0    50   Input ~ 0
CLK
Text HLabel 4800 2200 0    50   Input ~ 0
SI
Wire Wire Line
	4900 2400 4800 2400
Wire Wire Line
	5000 2300 4800 2300
Wire Wire Line
	5100 2200 4800 2200
Wire Wire Line
	4900 2400 4900 4750
Wire Wire Line
	5000 2300 5000 4750
Wire Wire Line
	5100 2200 5100 4750
Connection ~ 4500 4700
Wire Wire Line
	4500 4700 4500 4750
$Comp
L Device:R R?
U 1 1 5E9AB324
P 6300 4200
AR Path="/5D69D382/5E9AB324" Ref="R?"  Part="1" 
AR Path="/5E9AB324" Ref="R?"  Part="1" 
AR Path="/5E655037/5E9AB324" Ref="R1108"  Part="1" 
AR Path="/5E78F576/5E9AB324" Ref="R?"  Part="1" 
F 0 "R1108" H 6370 4246 50  0000 L CNN
F 1 "10k" H 6370 4155 50  0000 L CNN
F 2 "Resistor_SMD:R_0402_1005Metric" V 6230 4200 50  0001 C CNN
F 3 "~" H 6300 4200 50  0001 C CNN
F 4 "Delta Electronics/Cyntec" H 6300 4200 50  0001 C CNN "Manufacturer"
F 5 "PFR05S-103-FNH" H 6300 4200 50  0001 C CNN "PartNumber"
F 6 "3000-0000000131" H 6300 4200 50  0001 C CNN "PartSpecification"
	1    6300 4200
	0    1    1    0   
$EndComp
$Comp
L Device:R R?
U 1 1 5E9AB32C
P 6550 3950
AR Path="/5D69D382/5E9AB32C" Ref="R?"  Part="1" 
AR Path="/5E9AB32C" Ref="R?"  Part="1" 
AR Path="/5E655037/5E9AB32C" Ref="R1111"  Part="1" 
AR Path="/5E78F576/5E9AB32C" Ref="R?"  Part="1" 
F 0 "R1111" H 6620 3996 50  0000 L CNN
F 1 "10k" H 6620 3905 50  0000 L CNN
F 2 "Resistor_SMD:R_0402_1005Metric" V 6480 3950 50  0001 C CNN
F 3 "~" H 6550 3950 50  0001 C CNN
F 4 "Delta Electronics/Cyntec" H 6550 3950 50  0001 C CNN "Manufacturer"
F 5 "PFR05S-103-FNH" H 6550 3950 50  0001 C CNN "PartNumber"
F 6 "3000-0000000131" H 6550 3950 50  0001 C CNN "PartSpecification"
	1    6550 3950
	0    1    1    0   
$EndComp
Wire Wire Line
	6150 4200 5200 4200
Connection ~ 5200 4200
Wire Wire Line
	5200 4200 5200 2750
Wire Wire Line
	6400 3950 5300 3950
Connection ~ 5300 3950
Wire Wire Line
	5300 3950 5300 2900
$Comp
L Device:R R?
U 1 1 5E9AB33A
P 6300 3700
AR Path="/5D69D382/5E9AB33A" Ref="R?"  Part="1" 
AR Path="/5E9AB33A" Ref="R?"  Part="1" 
AR Path="/5E655037/5E9AB33A" Ref="R1107"  Part="1" 
AR Path="/5E78F576/5E9AB33A" Ref="R?"  Part="1" 
F 0 "R1107" H 6370 3746 50  0000 L CNN
F 1 "10k" H 6370 3655 50  0000 L CNN
F 2 "Resistor_SMD:R_0402_1005Metric" V 6230 3700 50  0001 C CNN
F 3 "~" H 6300 3700 50  0001 C CNN
F 4 "Delta Electronics/Cyntec" H 6300 3700 50  0001 C CNN "Manufacturer"
F 5 "PFR05S-103-FNH" H 6300 3700 50  0001 C CNN "PartNumber"
F 6 "3000-0000000131" H 6300 3700 50  0001 C CNN "PartSpecification"
	1    6300 3700
	0    1    1    0   
$EndComp
$Comp
L Device:R R?
U 1 1 5E9AB342
P 6550 3450
AR Path="/5D69D382/5E9AB342" Ref="R?"  Part="1" 
AR Path="/5E9AB342" Ref="R?"  Part="1" 
AR Path="/5E655037/5E9AB342" Ref="R1110"  Part="1" 
AR Path="/5E78F576/5E9AB342" Ref="R?"  Part="1" 
F 0 "R1110" H 6620 3496 50  0000 L CNN
F 1 "10k" H 6620 3405 50  0000 L CNN
F 2 "Resistor_SMD:R_0402_1005Metric" V 6480 3450 50  0001 C CNN
F 3 "~" H 6550 3450 50  0001 C CNN
F 4 "Delta Electronics/Cyntec" H 6550 3450 50  0001 C CNN "Manufacturer"
F 5 "PFR05S-103-FNH" H 6550 3450 50  0001 C CNN "PartNumber"
F 6 "3000-0000000131" H 6550 3450 50  0001 C CNN "PartSpecification"
	1    6550 3450
	0    1    1    0   
$EndComp
Wire Wire Line
	6150 3700 5400 3700
Connection ~ 5400 3700
Wire Wire Line
	5400 3700 5400 3050
Wire Wire Line
	6400 3450 5500 3450
Connection ~ 5500 3450
Wire Wire Line
	5500 3450 5500 3200
Wire Wire Line
	7100 4200 6450 4200
Wire Wire Line
	6700 3950 7100 3950
Wire Wire Line
	7100 3950 7100 4200
Wire Wire Line
	6450 3700 7100 3700
Wire Wire Line
	7100 3700 7100 3950
Connection ~ 7100 3950
Wire Wire Line
	6700 3450 7100 3450
Wire Wire Line
	7100 3450 7100 3700
Connection ~ 7100 3700
$Comp
L Device:R R?
U 1 1 5E9AB359
P 6300 3200
AR Path="/5D69D382/5E9AB359" Ref="R?"  Part="1" 
AR Path="/5E9AB359" Ref="R?"  Part="1" 
AR Path="/5E655037/5E9AB359" Ref="R1106"  Part="1" 
AR Path="/5E78F576/5E9AB359" Ref="R?"  Part="1" 
F 0 "R1106" H 6370 3246 50  0000 L CNN
F 1 "10k" H 6370 3155 50  0000 L CNN
F 2 "Resistor_SMD:R_0402_1005Metric" V 6230 3200 50  0001 C CNN
F 3 "~" H 6300 3200 50  0001 C CNN
F 4 "Delta Electronics/Cyntec" H 6300 3200 50  0001 C CNN "Manufacturer"
F 5 "PFR05S-103-FNH" H 6300 3200 50  0001 C CNN "PartNumber"
F 6 "3000-0000000131" H 6300 3200 50  0001 C CNN "PartSpecification"
	1    6300 3200
	0    1    1    0   
$EndComp
Wire Wire Line
	6150 3200 6150 3350
Wire Wire Line
	6150 3350 5600 3350
Connection ~ 5600 3350
$Comp
L Device:R R?
U 1 1 5E9AB364
P 6550 2950
AR Path="/5D69D382/5E9AB364" Ref="R?"  Part="1" 
AR Path="/5E9AB364" Ref="R?"  Part="1" 
AR Path="/5E655037/5E9AB364" Ref="R1109"  Part="1" 
AR Path="/5E78F576/5E9AB364" Ref="R?"  Part="1" 
F 0 "R1109" H 6620 2996 50  0000 L CNN
F 1 "10k" H 6620 2905 50  0000 L CNN
F 2 "Resistor_SMD:R_0402_1005Metric" V 6480 2950 50  0001 C CNN
F 3 "~" H 6550 2950 50  0001 C CNN
F 4 "Delta Electronics/Cyntec" H 6550 2950 50  0001 C CNN "Manufacturer"
F 5 "PFR05S-103-FNH" H 6550 2950 50  0001 C CNN "PartNumber"
F 6 "3000-0000000131" H 6550 2950 50  0001 C CNN "PartSpecification"
	1    6550 2950
	0    1    1    0   
$EndComp
$Comp
L Device:R R?
U 1 1 5E9AB36C
P 6300 2700
AR Path="/5D69D382/5E9AB36C" Ref="R?"  Part="1" 
AR Path="/5E9AB36C" Ref="R?"  Part="1" 
AR Path="/5E655037/5E9AB36C" Ref="R1105"  Part="1" 
AR Path="/5E78F576/5E9AB36C" Ref="R?"  Part="1" 
F 0 "R1105" H 6370 2746 50  0000 L CNN
F 1 "10k" H 6370 2655 50  0000 L CNN
F 2 "Resistor_SMD:R_0402_1005Metric" V 6230 2700 50  0001 C CNN
F 3 "~" H 6300 2700 50  0001 C CNN
F 4 "Delta Electronics/Cyntec" H 6300 2700 50  0001 C CNN "Manufacturer"
F 5 "PFR05S-103-FNH" H 6300 2700 50  0001 C CNN "PartNumber"
F 6 "3000-0000000131" H 6300 2700 50  0001 C CNN "PartSpecification"
	1    6300 2700
	0    1    1    0   
$EndComp
Wire Wire Line
	6400 2950 5700 2950
Connection ~ 5700 2950
Wire Wire Line
	5700 2950 5700 2750
Wire Wire Line
	6150 2700 5800 2700
Connection ~ 5800 2700
Wire Wire Line
	5800 2700 5800 2550
Wire Wire Line
	6450 3200 7100 3200
Wire Wire Line
	7100 3200 7100 3450
Connection ~ 7100 3450
Wire Wire Line
	6700 2950 7100 2950
Wire Wire Line
	7100 2950 7100 3200
Connection ~ 7100 3200
Wire Wire Line
	6450 2700 7100 2700
Wire Wire Line
	7100 2700 7100 2950
Connection ~ 7100 2950
$Comp
L power:+3.3V #PWR?
U 1 1 5E9AB381
P 7100 2600
AR Path="/5E9AB381" Ref="#PWR?"  Part="1" 
AR Path="/5E655037/5E9AB381" Ref="#PWR?"  Part="1" 
AR Path="/5E78F576/5E9AB381" Ref="#PWR?"  Part="1" 
F 0 "#PWR?" H 7100 2450 50  0001 C CNN
F 1 "+3.3V" H 7115 2773 50  0000 C CNN
F 2 "" H 7100 2600 50  0001 C CNN
F 3 "" H 7100 2600 50  0001 C CNN
	1    7100 2600
	1    0    0    -1  
$EndComp
Wire Wire Line
	7100 2600 7100 2700
Connection ~ 7100 2700
Wire Wire Line
	3800 3200 3800 4150
$Comp
L power:GND #PWR?
U 1 1 5E9B349D
P 3950 3400
AR Path="/5E9B349D" Ref="#PWR?"  Part="1" 
AR Path="/5E655037/5E9B349D" Ref="#PWR?"  Part="1" 
AR Path="/5E78F576/5E9B349D" Ref="#PWR?"  Part="1" 
F 0 "#PWR?" H 3950 3150 50  0001 C CNN
F 1 "GND" H 3955 3227 50  0000 C CNN
F 2 "" H 3950 3400 50  0001 C CNN
F 3 "" H 3950 3400 50  0001 C CNN
	1    3950 3400
	1    0    0    -1  
$EndComp
Wire Wire Line
	3950 3400 3950 3300
Wire Wire Line
	3950 3300 4050 3300
$EndSCHEMATC
