EESchema Schematic File Version 4
EELAYER 30 0
EELAYER END
$Descr A4 11693 8268
encoding utf-8
Sheet 18 39
Title ""
Date ""
Rev ""
Comp ""
Comment1 ""
Comment2 ""
Comment3 ""
Comment4 ""
$EndDescr
$Comp
L POWDER_MCU:MSP432E401YTPDTR U1601
U 1 1 5D69BE6F
P 5350 2650
F 0 "U1601" H 5350 4450 60  0000 C CNN
F 1 "MSP432E401YTPDTR" H 5400 3950 60  0000 C CNN
F 2 "POWDER_MCU:MSP432E401YTPDTR" H 5350 2190 60  0001 C CNN
F 3 "" H 5350 2250 60  0000 C CNN
F 4 "Texas Instruments" H 5350 2650 50  0001 C CNN "Manufacturer"
F 5 "MSP432E401YTPDTR" H 5350 2650 50  0001 C CNN "PartNumber"
F 6 "3000-0000000080" H 5350 2650 50  0001 C CNN "PartSpecification"
	1    5350 2650
	1    0    0    -1  
$EndComp
Wire Wire Line
	6250 1700 6750 1700
Wire Wire Line
	6250 2100 6750 2100
Text HLabel 6750 1700 2    50   Output ~ 0
LINK_LED
Text HLabel 6750 2100 2    50   Output ~ 0
ACT_LED
$Comp
L Connector:USB_B_Micro J1603
U 1 1 5D876CF9
P 3950 6100
F 0 "J1603" H 4005 6567 50  0000 C CNN
F 1 "USB_B_Micro" H 4005 6476 50  0000 C CNN
F 2 "Connector_USB:USB_Micro-B_Amphenol_10103594-0001LF_Horizontal" H 4100 6050 50  0001 C CNN
F 3 "~" H 4100 6050 50  0001 C CNN
F 4 "Amphenol ICC (FCI)" H 3950 6100 50  0001 C CNN "Manufacturer"
F 5 "10103594-0001LF" H 3950 6100 50  0001 C CNN "PartNumber"
F 6 "3000-0000000158" H 3950 6100 50  0001 C CNN "PartSpecification"
	1    3950 6100
	1    0    0    -1  
$EndComp
Wire Wire Line
	4450 2000 3900 2000
Text Label 3900 2000 0    50   ~ 0
VBUS
Text Label 8000 1650 0    50   ~ 0
USBPD_P
Text Label 8000 1750 0    50   ~ 0
USBPD_N
$Comp
L Device:R R1605
U 1 1 5D8778AC
P 3650 1900
F 0 "R1605" V 3443 1900 50  0000 C CNN
F 1 "100" V 3534 1900 50  0000 C CNN
F 2 "Resistor_SMD:R_0402_1005Metric" V 3580 1900 50  0001 C CNN
F 3 "~" H 3650 1900 50  0001 C CNN
F 4 "Delta Electronics/Cyntec" H 3650 1900 50  0001 C CNN "Manufacturer"
F 5 "PFR05S-101-FNH" H 3650 1900 50  0001 C CNN "PartNumber"
F 6 "3000-0000000149" H 3650 1900 50  0001 C CNN "PartSpecification"
	1    3650 1900
	0    1    1    0   
$EndComp
Text Label 3850 1900 0    50   ~ 0
USB_ID_MCU
Wire Wire Line
	3800 1900 4450 1900
Text Label 3200 1900 0    50   ~ 0
USB_ID
Wire Wire Line
	3200 1900 3500 1900
Wire Wire Line
	4250 6300 5000 6300
Wire Wire Line
	5050 6200 4250 6200
Text Label 4700 6100 0    50   ~ 0
USBPD_P
Text Label 4700 6200 0    50   ~ 0
USBPD_N
Text Label 4700 6300 0    50   ~ 0
USB_ID
Wire Wire Line
	4250 5900 4650 5900
Text Label 4400 5900 0    50   ~ 0
VBUS
$Comp
L power:GND #PWR?
U 1 1 5D879561
P 4250 6600
F 0 "#PWR?" H 4250 6350 50  0001 C CNN
F 1 "GND" H 4255 6427 50  0000 C CNN
F 2 "" H 4250 6600 50  0001 C CNN
F 3 "" H 4250 6600 50  0001 C CNN
	1    4250 6600
	1    0    0    -1  
$EndComp
$Comp
L power:GND #PWR?
U 1 1 5D879712
P 3850 7000
F 0 "#PWR?" H 3850 6750 50  0001 C CNN
F 1 "GND" H 3855 6827 50  0000 C CNN
F 2 "" H 3850 7000 50  0001 C CNN
F 3 "" H 3850 7000 50  0001 C CNN
	1    3850 7000
	1    0    0    -1  
$EndComp
$Comp
L Device:R R1616
U 1 1 5D879736
P 3850 6750
F 0 "R1616" H 3780 6704 50  0000 R CNN
F 1 "1M" H 3780 6795 50  0000 R CNN
F 2 "Resistor_SMD:R_0402_1005Metric" V 3780 6750 50  0001 C CNN
F 3 "~" H 3850 6750 50  0001 C CNN
F 4 "Delta Electronics/Cyntec" H 3850 6750 50  0001 C CNN "Manufacturer"
F 5 "PFR05S-105-FNH" H 3850 6750 50  0001 C CNN "PartNumber"
F 6 "3000-0000000139" H 3850 6750 50  0001 C CNN "PartSpecification"
	1    3850 6750
	-1   0    0    1   
$EndComp
Wire Wire Line
	3950 6500 3950 6550
Wire Wire Line
	3950 6550 4250 6550
Wire Wire Line
	4250 6550 4250 6600
Wire Wire Line
	3850 6900 3850 7000
$Comp
L 000_PreferredParts:C_1nF C1603
U 1 1 5D87AA0C
P 3400 6800
F 0 "C1603" H 3515 6846 50  0000 L CNN
F 1 "C_1nF" H 3515 6755 50  0000 L CNN
F 2 "Capacitor_SMD:C_0402_1005Metric" H 3438 6650 50  0001 C CNN
F 3 "~" H 3400 6800 50  0001 C CNN
F 4 "Wurth Electronics Inc." H 3400 6800 50  0001 C CNN "Manufacturer"
F 5 "885012205061" H 3400 6800 50  0001 C CNN "PartNumber"
F 6 "3000-0000000128" H 500 -150 50  0001 C CNN "PartSpecification"
	1    3400 6800
	1    0    0    -1  
$EndComp
$Comp
L 000_PreferredParts:C_1nF C1602
U 1 1 5D87AA50
P 2900 6800
F 0 "C1602" H 3015 6846 50  0000 L CNN
F 1 "C_1nF" H 3015 6755 50  0000 L CNN
F 2 "Capacitor_SMD:C_0402_1005Metric" H 2938 6650 50  0001 C CNN
F 3 "~" H 2900 6800 50  0001 C CNN
F 4 "Wurth Electronics Inc." H 2900 6800 50  0001 C CNN "Manufacturer"
F 5 "885012205061" H 2900 6800 50  0001 C CNN "PartNumber"
F 6 "3000-0000000128" H 500 -150 50  0001 C CNN "PartSpecification"
	1    2900 6800
	1    0    0    -1  
$EndComp
$Comp
L 000_PreferredParts:C_1nF C1601
U 1 1 5D87AA80
P 2400 6800
F 0 "C1601" H 2515 6846 50  0000 L CNN
F 1 "C_1nF" H 2515 6755 50  0000 L CNN
F 2 "Capacitor_SMD:C_0402_1005Metric" H 2438 6650 50  0001 C CNN
F 3 "~" H 2400 6800 50  0001 C CNN
F 4 "Wurth Electronics Inc." H 2400 6800 50  0001 C CNN "Manufacturer"
F 5 "885012205061" H 2400 6800 50  0001 C CNN "PartNumber"
F 6 "3000-0000000128" H 500 -150 50  0001 C CNN "PartSpecification"
	1    2400 6800
	1    0    0    -1  
$EndComp
$Comp
L power:GND #PWR?
U 1 1 5D87AAB4
P 3400 7050
F 0 "#PWR?" H 3400 6800 50  0001 C CNN
F 1 "GND" H 3405 6877 50  0000 C CNN
F 2 "" H 3400 7050 50  0001 C CNN
F 3 "" H 3400 7050 50  0001 C CNN
	1    3400 7050
	1    0    0    -1  
$EndComp
$Comp
L power:GND #PWR?
U 1 1 5D87AAD1
P 2900 7050
F 0 "#PWR?" H 2900 6800 50  0001 C CNN
F 1 "GND" H 2905 6877 50  0000 C CNN
F 2 "" H 2900 7050 50  0001 C CNN
F 3 "" H 2900 7050 50  0001 C CNN
	1    2900 7050
	1    0    0    -1  
$EndComp
$Comp
L power:GND #PWR?
U 1 1 5D87AAEE
P 2400 7050
F 0 "#PWR?" H 2400 6800 50  0001 C CNN
F 1 "GND" H 2405 6877 50  0000 C CNN
F 2 "" H 2400 7050 50  0001 C CNN
F 3 "" H 2400 7050 50  0001 C CNN
	1    2400 7050
	1    0    0    -1  
$EndComp
Wire Wire Line
	2400 7050 2400 6950
Wire Wire Line
	2900 6950 2900 7050
Wire Wire Line
	3400 7050 3400 6950
Wire Wire Line
	3850 6550 3400 6550
Wire Wire Line
	2400 6550 2400 6650
Wire Wire Line
	2900 6650 2900 6550
Connection ~ 2900 6550
Wire Wire Line
	2900 6550 2400 6550
Wire Wire Line
	3400 6650 3400 6550
Connection ~ 3400 6550
Wire Wire Line
	3400 6550 2900 6550
Text Label 3800 2600 0    50   ~ 0
TCK
Text Label 3800 2700 0    50   ~ 0
TMS
Text Label 3800 2800 0    50   ~ 0
TDI
Text Label 3800 2900 0    50   ~ 0
TDO
$Comp
L Connector_Generic:Conn_02x05_Odd_Even J1602
U 1 1 5D87FEC7
P 1600 3000
F 0 "J1602" H 1650 3417 50  0000 C CNN
F 1 "Conn_02x05_Odd_Even" H 1650 3326 50  0000 C CNN
F 2 "POWDER_MCU:ARM_JTAG_0.127_10" H 1600 3000 50  0001 C CNN
F 3 "~" H 1600 3000 50  0001 C CNN
F 4 "Amphenol ICC (FCI)" H 1600 3000 50  0001 C CNN "Manufacturer"
F 5 "20021521-00010T4LF" H 1600 3000 50  0001 C CNN "PartNumber"
F 6 "3000-0000000164" H 1600 3000 50  0001 C CNN "PartSpecification"
	1    1600 3000
	1    0    0    -1  
$EndComp
$Comp
L power:+3.3V #PWR?
U 1 1 5D880060
P 1150 2500
F 0 "#PWR?" H 1150 2350 50  0001 C CNN
F 1 "+3.3V" H 1165 2673 50  0000 C CNN
F 2 "" H 1150 2500 50  0001 C CNN
F 3 "" H 1150 2500 50  0001 C CNN
	1    1150 2500
	1    0    0    -1  
$EndComp
Wire Wire Line
	1150 2500 1150 2700
Wire Wire Line
	1150 2800 1400 2800
Wire Wire Line
	2500 2800 1900 2800
$Comp
L power:GND #PWR?
U 1 1 5D88118A
P 1300 3300
F 0 "#PWR?" H 1300 3050 50  0001 C CNN
F 1 "GND" H 1305 3127 50  0000 C CNN
F 2 "" H 1300 3300 50  0001 C CNN
F 3 "" H 1300 3300 50  0001 C CNN
	1    1300 3300
	1    0    0    -1  
$EndComp
Wire Wire Line
	1300 3300 1300 3200
Wire Wire Line
	1300 3200 1400 3200
Wire Wire Line
	1400 3100 1300 3100
Wire Wire Line
	1300 3100 1300 3200
Connection ~ 1300 3200
Wire Wire Line
	1300 3100 1300 3000
Wire Wire Line
	1300 3000 1400 3000
Connection ~ 1300 3100
Wire Wire Line
	1400 2900 1300 2900
Wire Wire Line
	1300 2900 1300 3000
Connection ~ 1300 3000
Wire Wire Line
	2400 2900 1900 2900
Wire Wire Line
	1900 3000 2500 3000
Wire Wire Line
	2500 3000 2500 2900
Wire Wire Line
	1900 3100 2600 3100
Wire Wire Line
	2600 3100 2600 2800
Wire Wire Line
	1900 3200 2150 3200
Text HLabel 2150 3200 2    50   Output ~ 0
RST
$Comp
L power:+3.3V #PWR?
U 1 1 5DE71434
P 2000 4300
F 0 "#PWR?" H 2000 4150 50  0001 C CNN
F 1 "+3.3V" H 2015 4473 50  0000 C CNN
F 2 "" H 2000 4300 50  0001 C CNN
F 3 "" H 2000 4300 50  0001 C CNN
	1    2000 4300
	1    0    0    -1  
$EndComp
Wire Wire Line
	2000 4300 2000 4400
Wire Wire Line
	1450 4900 1250 4900
Wire Wire Line
	1250 5000 1450 5000
Wire Wire Line
	2550 4900 2750 4900
Wire Wire Line
	700  6500 500  6500
Wire Wire Line
	2750 5000 2550 5000
Text Label 1300 4900 0    50   ~ 0
TCK
Text Label 2600 5000 0    50   ~ 0
TMS
Text Label 2600 4900 0    50   ~ 0
TDI
Text Label 1300 5000 0    50   ~ 0
TDO
Wire Wire Line
	4650 5500 5600 5500
Wire Wire Line
	4650 5500 4650 5900
Text Label 1950 3200 0    50   ~ 0
RST
Text Label 550  6500 0    50   ~ 0
RST
$Comp
L power:GND #PWR?
U 1 1 5DE87B29
P 5600 6800
F 0 "#PWR?" H 5600 6550 50  0001 C CNN
F 1 "GND" H 5605 6627 50  0000 C CNN
F 2 "" H 5600 6800 50  0001 C CNN
F 3 "" H 5600 6800 50  0001 C CNN
	1    5600 6800
	1    0    0    -1  
$EndComp
Wire Wire Line
	5600 6800 5600 6700
Text Label 3000 6550 0    50   ~ 0
USB_SHIELD
$Comp
L power:GND #PWR?
U 1 1 5D66311B
P 2000 5600
F 0 "#PWR?" H 2000 5350 50  0001 C CNN
F 1 "GND" H 2005 5427 50  0000 C CNN
F 2 "" H 2000 5600 50  0001 C CNN
F 3 "" H 2000 5600 50  0001 C CNN
	1    2000 5600
	1    0    0    -1  
$EndComp
Wire Wire Line
	2000 5600 2000 5500
Text Label 4200 3900 0    50   ~ 0
RXD
Text Label 4200 4000 0    50   ~ 0
TXD
$Comp
L Connector:TestPoint TP1601
U 1 1 5D8440DA
P 3350 3900
F 0 "TP1601" H 3408 4018 50  0000 L CNN
F 1 "TestPoint" H 3408 3927 50  0000 L CNN
F 2 "TestPoint:TestPoint_Pad_D1.0mm" H 3550 3900 50  0001 C CNN
F 3 "~" H 3550 3900 50  0001 C CNN
	1    3350 3900
	1    0    0    -1  
$EndComp
$Comp
L Connector:TestPoint TP1602
U 1 1 5D8448C3
P 3550 4000
F 0 "TP1602" H 3608 4118 50  0000 L CNN
F 1 "TestPoint" H 3608 4027 50  0000 L CNN
F 2 "TestPoint:TestPoint_Pad_D1.0mm" H 3750 4000 50  0001 C CNN
F 3 "~" H 3750 4000 50  0001 C CNN
	1    3550 4000
	1    0    0    1   
$EndComp
Wire Wire Line
	3350 3900 4450 3900
$Comp
L POWDER_Misc:25AA02E48 U1603
U 1 1 5EBB6AE1
P 8550 5650
F 0 "U1603" H 8850 6000 50  0000 C CNN
F 1 "25AA02E48" H 8550 5650 50  0000 C CNN
F 2 "Package_SO:SOIC-8_3.9x4.9mm_P1.27mm" H 9450 5200 50  0001 C CNN
F 3 "" H 8550 5650 50  0001 C CNN
F 4 "3000-0000000189" H 8550 5650 50  0001 C CNN "PartSpecification"
	1    8550 5650
	1    0    0    -1  
$EndComp
Wire Wire Line
	3850 6500 3850 6550
Connection ~ 3850 6550
Wire Wire Line
	3850 6550 3850 6600
Wire Wire Line
	2500 2900 4450 2900
Wire Wire Line
	2600 2800 4450 2800
Wire Wire Line
	2500 2700 4450 2700
Wire Wire Line
	2400 2600 4450 2600
Wire Wire Line
	7950 5500 7500 5500
Text Label 7550 5500 0    50   ~ 0
SSI2RX
Wire Wire Line
	7950 5600 7500 5600
Wire Wire Line
	7500 5800 7950 5800
Wire Wire Line
	7500 5700 7950 5700
Text Label 7550 5600 0    50   ~ 0
SSI2TX
Text Label 7550 5800 0    50   ~ 0
MAC_CS
Text Label 7550 5700 0    50   ~ 0
SSI2Clk
$Comp
L power:GND #PWR?
U 1 1 5DF4AACC
P 8550 6150
F 0 "#PWR?" H 8550 5900 50  0001 C CNN
F 1 "GND" H 8555 5977 50  0000 C CNN
F 2 "" H 8550 6150 50  0001 C CNN
F 3 "" H 8550 6150 50  0001 C CNN
	1    8550 6150
	1    0    0    -1  
$EndComp
$Comp
L power:+3.3V #PWR?
U 1 1 5DF55195
P 8550 5200
F 0 "#PWR?" H 8550 5050 50  0001 C CNN
F 1 "+3.3V" H 8565 5373 50  0000 C CNN
F 2 "" H 8550 5200 50  0001 C CNN
F 3 "" H 8550 5200 50  0001 C CNN
	1    8550 5200
	1    0    0    -1  
$EndComp
Wire Wire Line
	8550 5200 8550 5250
Wire Wire Line
	4000 4100 4450 4100
Text Label 4050 4100 0    50   ~ 0
MAC_CS
$Comp
L Device:R R1614
U 1 1 5DF769EB
P 9400 5250
F 0 "R1614" V 9193 5250 50  0000 C CNN
F 1 "100" V 9284 5250 50  0000 C CNN
F 2 "Resistor_SMD:R_0402_1005Metric" V 9330 5250 50  0001 C CNN
F 3 "~" H 9400 5250 50  0001 C CNN
F 4 "Delta Electronics/Cyntec" H 9400 5250 50  0001 C CNN "Manufacturer"
F 5 "PFR05S-101-FNH" H 9400 5250 50  0001 C CNN "PartNumber"
F 6 "3000-0000000149" H 9400 5250 50  0001 C CNN "PartSpecification"
	1    9400 5250
	-1   0    0    1   
$EndComp
$Comp
L power:+3.3V #PWR?
U 1 1 5DF7736A
P 9400 5000
F 0 "#PWR?" H 9400 4850 50  0001 C CNN
F 1 "+3.3V" H 9415 5173 50  0000 C CNN
F 2 "" H 9400 5000 50  0001 C CNN
F 3 "" H 9400 5000 50  0001 C CNN
	1    9400 5000
	1    0    0    -1  
$EndComp
Wire Wire Line
	9400 5000 9400 5100
Wire Wire Line
	9400 5400 9400 5750
Wire Wire Line
	9400 5750 9150 5750
Wire Wire Line
	8550 6050 8550 6150
$Comp
L Device:R R1615
U 1 1 5DF8AEE0
P 9600 5850
F 0 "R1615" V 9393 5850 50  0000 C CNN
F 1 "100" V 9484 5850 50  0000 C CNN
F 2 "Resistor_SMD:R_0402_1005Metric" V 9530 5850 50  0001 C CNN
F 3 "~" H 9600 5850 50  0001 C CNN
F 4 "Delta Electronics/Cyntec" H 9600 5850 50  0001 C CNN "Manufacturer"
F 5 "PFR05S-101-FNH" H 9600 5850 50  0001 C CNN "PartNumber"
F 6 "3000-0000000149" H 9600 5850 50  0001 C CNN "PartSpecification"
	1    9600 5850
	-1   0    0    1   
$EndComp
Wire Wire Line
	9600 5700 9600 5550
Wire Wire Line
	9600 5550 9150 5550
$Comp
L power:GND #PWR?
U 1 1 5DF9039C
P 9600 6150
F 0 "#PWR?" H 9600 5900 50  0001 C CNN
F 1 "GND" H 9605 5977 50  0000 C CNN
F 2 "" H 9600 6150 50  0001 C CNN
F 3 "" H 9600 6150 50  0001 C CNN
	1    9600 6150
	1    0    0    -1  
$EndComp
Wire Wire Line
	9600 6150 9600 6000
$Comp
L Connector:TestPoint TP1603
U 1 1 5DF99858
P 9900 5400
F 0 "TP1603" H 9958 5518 50  0000 L CNN
F 1 "TestPoint" H 9958 5427 50  0000 L CNN
F 2 "TestPoint:TestPoint_Pad_D1.0mm" H 10100 5400 50  0001 C CNN
F 3 "~" H 10100 5400 50  0001 C CNN
	1    9900 5400
	1    0    0    -1  
$EndComp
Wire Wire Line
	9900 5400 9900 5550
Wire Wire Line
	9900 5550 9600 5550
Connection ~ 9600 5550
$Comp
L Switch:SW_Push SW?
U 1 1 5E3102F6
P 1000 1300
AR Path="/5D69D382/5E3102F6" Ref="SW?"  Part="1" 
AR Path="/5D67C7FD/5E3102F6" Ref="SW501"  Part="1" 
AR Path="/60834A7B/6083FA27/5E3102F6" Ref="SW1601"  Part="1" 
F 0 "SW1601" V 954 1448 50  0000 L CNN
F 1 "SW_Push" V 1045 1448 50  0000 L CNN
F 2 "Button_Switch_SMD:SW_SPST_PTS645" H 1000 1500 50  0001 C CNN
F 3 "" H 1000 1500 50  0001 C CNN
F 4 "C&K" H 1000 1300 50  0001 C CNN "Manufacturer"
F 5 "PTS645SK43SMTR92 LFS" H 1000 1300 50  0001 C CNN "PartNumber"
F 6 "3000-0000000176" H 1000 1300 50  0001 C CNN "PartSpecification"
	1    1000 1300
	0    1    1    0   
$EndComp
$Comp
L Switch:SW_Push SW?
U 1 1 5E315FAA
P 1500 1300
AR Path="/5D69D382/5E315FAA" Ref="SW?"  Part="1" 
AR Path="/5D67C7FD/5E315FAA" Ref="SW502"  Part="1" 
AR Path="/60834A7B/6083FA27/5E315FAA" Ref="SW1602"  Part="1" 
F 0 "SW1602" V 1454 1448 50  0000 L CNN
F 1 "SW_Push" V 1545 1448 50  0000 L CNN
F 2 "Button_Switch_SMD:SW_SPST_PTS645" H 1500 1500 50  0001 C CNN
F 3 "" H 1500 1500 50  0001 C CNN
F 4 "C&K" H 1500 1300 50  0001 C CNN "Manufacturer"
F 5 "PTS645SK43SMTR92 LFS" H 1500 1300 50  0001 C CNN "PartNumber"
F 6 "3000-0000000176" H 1500 1300 50  0001 C CNN "PartSpecification"
	1    1500 1300
	0    1    1    0   
$EndComp
$Comp
L Device:R R?
U 1 1 5E338DD5
P 1500 1850
AR Path="/5D69D382/5E338DD5" Ref="R?"  Part="1" 
AR Path="/5D67C7FD/5E338DD5" Ref="R504"  Part="1" 
AR Path="/60834A7B/6083FA27/5E338DD5" Ref="R1602"  Part="1" 
F 0 "R1602" H 1570 1896 50  0000 L CNN
F 1 "10k" H 1570 1805 50  0000 L CNN
F 2 "Resistor_SMD:R_0402_1005Metric" V 1430 1850 50  0001 C CNN
F 3 "~" H 1500 1850 50  0001 C CNN
F 4 "Delta Electronics/Cyntec" H 1500 1850 50  0001 C CNN "Manufacturer"
F 5 "PFR05S-103-FNH" H 1500 1850 50  0001 C CNN "PartNumber"
F 6 "3000-0000000131" H 1500 1850 50  0001 C CNN "PartSpecification"
	1    1500 1850
	1    0    0    -1  
$EndComp
$Comp
L Device:R R?
U 1 1 5E33E9B8
P 1000 1850
AR Path="/5D69D382/5E33E9B8" Ref="R?"  Part="1" 
AR Path="/5D67C7FD/5E33E9B8" Ref="R503"  Part="1" 
AR Path="/60834A7B/6083FA27/5E33E9B8" Ref="R1601"  Part="1" 
F 0 "R1601" H 1070 1896 50  0000 L CNN
F 1 "10k" H 1070 1805 50  0000 L CNN
F 2 "Resistor_SMD:R_0402_1005Metric" V 930 1850 50  0001 C CNN
F 3 "~" H 1000 1850 50  0001 C CNN
F 4 "Delta Electronics/Cyntec" H 1000 1850 50  0001 C CNN "Manufacturer"
F 5 "PFR05S-103-FNH" H 1000 1850 50  0001 C CNN "PartNumber"
F 6 "3000-0000000131" H 1000 1850 50  0001 C CNN "PartSpecification"
	1    1000 1850
	1    0    0    -1  
$EndComp
Wire Wire Line
	1000 1500 1000 1700
Wire Wire Line
	1500 1700 1500 1500
$Comp
L power:+3.3V #PWR?
U 1 1 5E3B166D
P 1000 1000
F 0 "#PWR?" H 1000 850 50  0001 C CNN
F 1 "+3.3V" H 1015 1173 50  0000 C CNN
F 2 "" H 1000 1000 50  0001 C CNN
F 3 "" H 1000 1000 50  0001 C CNN
	1    1000 1000
	1    0    0    -1  
$EndComp
Wire Wire Line
	1000 1100 1000 1050
Wire Wire Line
	1000 1050 1500 1050
Connection ~ 1000 1050
Wire Wire Line
	1000 1050 1000 1000
Wire Wire Line
	1500 1050 1500 1100
Wire Wire Line
	1000 2050 1000 2000
Wire Wire Line
	1500 2050 1500 2000
Wire Wire Line
	1500 2050 1250 2050
$Comp
L Device:R R?
U 1 1 5E40813A
P 3650 1300
AR Path="/5D69D382/5E40813A" Ref="R?"  Part="1" 
AR Path="/5D67C7FD/5E40813A" Ref="R509"  Part="1" 
AR Path="/60834A7B/6083FA27/5E40813A" Ref="R1607"  Part="1" 
F 0 "R1607" V 3443 1300 50  0000 C CNN
F 1 "10" V 3534 1300 50  0000 C CNN
F 2 "Resistor_SMD:R_0402_1005Metric" V 3580 1300 50  0001 C CNN
F 3 "~" H 3650 1300 50  0001 C CNN
F 4 "Delta Electronics/Cyntec" H 3650 1300 50  0001 C CNN "Manufacturer"
F 5 "PFR05S-100-FNH" H 3650 1300 50  0001 C CNN "PartNumber"
F 6 "3000-0000000146" H 3650 1300 50  0001 C CNN "PartSpecification"
	1    3650 1300
	0    1    1    0   
$EndComp
$Comp
L Device:R R?
U 1 1 5E40FB45
P 3350 1200
AR Path="/5D69D382/5E40FB45" Ref="R?"  Part="1" 
AR Path="/5D67C7FD/5E40FB45" Ref="R507"  Part="1" 
AR Path="/60834A7B/6083FA27/5E40FB45" Ref="R1606"  Part="1" 
F 0 "R1606" V 3143 1200 50  0000 C CNN
F 1 "10" V 3234 1200 50  0000 C CNN
F 2 "Resistor_SMD:R_0402_1005Metric" V 3280 1200 50  0001 C CNN
F 3 "~" H 3350 1200 50  0001 C CNN
F 4 "Delta Electronics/Cyntec" H 3350 1200 50  0001 C CNN "Manufacturer"
F 5 "PFR05S-100-FNH" H 3350 1200 50  0001 C CNN "PartNumber"
F 6 "3000-0000000146" H 3350 1200 50  0001 C CNN "PartSpecification"
	1    3350 1200
	0    1    1    0   
$EndComp
Text Label 4150 1200 0    50   ~ 0
PB2
Text Label 4150 1300 0    50   ~ 0
PB3
Text Label 3000 1200 0    50   ~ 0
PB2_
Wire Wire Line
	3000 1200 3200 1200
Wire Wire Line
	3000 1300 3500 1300
Text Label 3000 1300 0    50   ~ 0
PB3_
Text Label 1000 1650 0    50   ~ 0
PB2_
Text Label 1500 1650 0    50   ~ 0
PB3_
$Comp
L Device:R R1610
U 1 1 5E4B4E36
P 4200 1000
F 0 "R1610" V 4280 1000 50  0000 C CNN
F 1 "66.5" V 4200 1000 50  0000 C CNN
F 2 "Resistor_SMD:R_0402_1005Metric" V 4130 1000 50  0001 C CNN
F 3 "~" H 4200 1000 50  0001 C CNN
F 4 "3000-0000000242" V 4200 1000 50  0001 C CNN "PartSpecification"
	1    4200 1000
	0    1    1    0   
$EndComp
Wire Wire Line
	4350 1000 4450 1000
$Comp
L Device:R R1611
U 1 1 5E4C150E
P 3900 1100
F 0 "R1611" V 3980 1100 50  0000 C CNN
F 1 "66.5" V 3900 1100 50  0000 C CNN
F 2 "Resistor_SMD:R_0402_1005Metric" V 3830 1100 50  0001 C CNN
F 3 "~" H 3900 1100 50  0001 C CNN
F 4 "3000-0000000242" V 3900 1100 50  0001 C CNN "PartSpecification"
	1    3900 1100
	0    1    1    0   
$EndComp
Wire Wire Line
	4050 1100 4450 1100
Wire Wire Line
	3550 4000 4450 4000
$Comp
L Device:LED D1603
U 1 1 5E5231CA
P 2850 2150
F 0 "D1603" H 2850 2250 50  0000 C CNN
F 1 "RED LED" H 2850 2050 50  0000 C CNN
F 2 "LED_SMD:LED_0805_2012Metric_Castellated" H 2850 2150 50  0001 C CNN
F 3 "~" H 2850 2150 50  0001 C CNN
F 4 "3000-0000000214" H 2850 2150 50  0001 C CNN "PartSpecification"
	1    2850 2150
	0    -1   -1   0   
$EndComp
$Comp
L Device:LED D1602
U 1 1 5E523790
P 2700 1900
F 0 "D1602" H 2700 2000 50  0000 C CNN
F 1 "GREEN LED" H 2700 1800 50  0000 C CNN
F 2 "LED_SMD:LED_0805_2012Metric_Castellated" H 2700 1900 50  0001 C CNN
F 3 "~" H 2700 1900 50  0001 C CNN
F 4 "3000-0000000211" H 2700 1900 50  0001 C CNN "PartSpecification"
	1    2700 1900
	0    -1   -1   0   
$EndComp
Wire Wire Line
	2850 1100 3750 1100
Wire Wire Line
	2400 2600 2400 2900
Wire Wire Line
	2500 2700 2500 2800
Wire Wire Line
	2700 1750 2700 1000
Wire Wire Line
	2700 1000 4050 1000
$Comp
L power:GND #PWR?
U 1 1 5E5B423C
P 2850 2400
F 0 "#PWR?" H 2850 2150 50  0001 C CNN
F 1 "GND" H 2855 2227 50  0000 C CNN
F 2 "" H 2850 2400 50  0001 C CNN
F 3 "" H 2850 2400 50  0001 C CNN
	1    2850 2400
	1    0    0    -1  
$EndComp
$Comp
L power:GND #PWR?
U 1 1 5E5B474B
P 2700 2400
F 0 "#PWR?" H 2700 2150 50  0001 C CNN
F 1 "GND" H 2705 2227 50  0000 C CNN
F 2 "" H 2700 2400 50  0001 C CNN
F 3 "" H 2700 2400 50  0001 C CNN
	1    2700 2400
	1    0    0    -1  
$EndComp
Wire Wire Line
	2700 2400 2700 2050
Wire Wire Line
	2850 2300 2850 2400
Wire Wire Line
	2850 1100 2850 2000
Text Label 3200 1000 0    50   ~ 0
L0_C
Text Label 3200 1100 0    50   ~ 0
L1_C
Text Label 9700 5550 0    50   ~ 0
WP_B
Text Label 9250 5750 0    50   ~ 0
HOLD_B
Text Label 4350 1000 0    50   ~ 0
L0
Text Label 4350 1100 0    50   ~ 0
L1
$Comp
L POWDER_ESD:D5V0P4UR6SO U1602
U 1 1 6050877E
P 2000 4950
F 0 "U1602" H 2250 5450 50  0000 C CNN
F 1 "D5V0P4UR6SO" H 1650 5450 50  0000 C CNN
F 2 "Package_TO_SOT_SMD:SOT-23-6" H 2650 5600 50  0001 C CNN
F 3 "" H 2000 4950 50  0001 C CNN
F 4 "3000-0000001313" H 2000 4950 50  0001 C CNN "PartSpecification"
	1    2000 4950
	1    0    0    -1  
$EndComp
$Comp
L power:+3.3V #PWR?
U 1 1 6059C652
P 1250 5900
F 0 "#PWR?" H 1250 5750 50  0001 C CNN
F 1 "+3.3V" H 1265 6073 50  0000 C CNN
F 2 "" H 1250 5900 50  0001 C CNN
F 3 "" H 1250 5900 50  0001 C CNN
	1    1250 5900
	1    0    0    -1  
$EndComp
Wire Wire Line
	1250 5900 1250 6000
$Comp
L power:GND #PWR?
U 1 1 6059C661
P 1250 7200
F 0 "#PWR?" H 1250 6950 50  0001 C CNN
F 1 "GND" H 1255 7027 50  0000 C CNN
F 2 "" H 1250 7200 50  0001 C CNN
F 3 "" H 1250 7200 50  0001 C CNN
	1    1250 7200
	1    0    0    -1  
$EndComp
Wire Wire Line
	1250 7200 1250 7100
$Comp
L POWDER_ESD:D5V0P4UR6SO U1605
U 1 1 6059C668
P 1250 6550
F 0 "U1605" H 1500 7050 50  0000 C CNN
F 1 "D5V0P4UR6SO" H 900 7050 50  0000 C CNN
F 2 "Package_TO_SOT_SMD:SOT-23-6" H 1900 7200 50  0001 C CNN
F 3 "" H 1250 6550 50  0001 C CNN
F 4 "3000-0000001313" H 1250 6550 50  0001 C CNN "PartSpecification"
	1    1250 6550
	1    0    0    -1  
$EndComp
$Comp
L POWDER_ESD:D5V0P4UR6SO U1604
U 1 1 60628B7C
P 5600 6150
F 0 "U1604" H 5850 6650 50  0000 C CNN
F 1 "D5V0P4UR6SO" H 5250 6650 50  0000 C CNN
F 2 "Package_TO_SOT_SMD:SOT-23-6" H 6250 6800 50  0001 C CNN
F 3 "" H 5600 6150 50  0001 C CNN
F 4 "3000-0000001313" H 5600 6150 50  0001 C CNN "PartSpecification"
	1    5600 6150
	1    0    0    -1  
$EndComp
Wire Wire Line
	4250 6100 5050 6100
Wire Wire Line
	5600 5600 5600 5500
Wire Wire Line
	5000 7100 6500 7100
Wire Wire Line
	6500 7100 6500 6200
Wire Wire Line
	6500 6200 6150 6200
Wire Wire Line
	5000 6300 5000 7100
$Comp
L Connector:Conn_01x02_Male J1601
U 1 1 60757F0A
P 950 2700
F 0 "J1601" H 1058 2881 50  0000 C CNN
F 1 "Conn_01x02_Male" H 1058 2790 50  0000 C CNN
F 2 "Connector_PinHeader_2.54mm:PinHeader_1x02_P2.54mm_Vertical" H 950 2700 50  0001 C CNN
F 3 "~" H 950 2700 50  0001 C CNN
F 4 "3000-0000001276" H 950 2700 50  0001 C CNN "PartSpecification"
	1    950  2700
	1    0    0    -1  
$EndComp
Wire Wire Line
	8000 1650 8500 1650
Wire Wire Line
	8000 1750 8500 1750
NoConn ~ 6150 6100
NoConn ~ 1800 6500
NoConn ~ 1800 6600
NoConn ~ 700  6600
Text HLabel 3500 750  0    50   BiDi ~ 0
EPIOS[0..35]
Text HLabel 7000 3000 2    50   Output ~ 0
EN_[0..3]
Text HLabel 7000 650  2    50   Input ~ 0
PG_[0..3]
Text Label 4050 3800 0    50   ~ 0
SSI2Clk
Text Label 4050 3600 0    50   ~ 0
SSI2TX
Wire Wire Line
	4000 3800 4450 3800
Wire Wire Line
	4450 3600 4000 3600
Text Label 4050 3500 0    50   ~ 0
SSI2RX
Wire Wire Line
	4450 3500 4000 3500
Wire Wire Line
	4450 3300 4000 3300
Text Label 4000 3300 0    50   ~ 0
EPIOS4
Text Label 4000 3200 0    50   ~ 0
EPIOS5
Text Label 4000 3100 0    50   ~ 0
EPIOS6
Text Label 4000 3000 0    50   ~ 0
EPIOS7
Wire Wire Line
	4000 3000 4450 3000
Wire Wire Line
	4450 3100 4000 3100
Wire Wire Line
	4000 3200 4450 3200
Text Label 4000 1600 0    50   ~ 0
EPIOS8
Text Label 4000 1700 0    50   ~ 0
EPIOS9
Text Label 6500 2400 0    50   ~ 0
EPIOS10
Text Label 6500 2300 0    50   ~ 0
EPIOS11
Wire Wire Line
	6500 2300 6250 2300
Wire Wire Line
	6250 2400 6500 2400
Wire Wire Line
	4000 1700 4450 1700
Wire Wire Line
	4450 1600 4000 1600
Text Label 8000 2250 0    50   ~ 0
EPIOS12
Text Label 8000 2150 0    50   ~ 0
EPIOS13
Text Label 8000 2050 0    50   ~ 0
EPIOS14
Text Label 8000 1950 0    50   ~ 0
EPIOS15
Text Label 8000 1050 0    50   ~ 0
EPIOS16
Text Label 8000 1150 0    50   ~ 0
EPIOS17
Text Label 8000 1250 0    50   ~ 0
EPIOS18
Text Label 8000 1350 0    50   ~ 0
EPIOS19
Text Label 10500 2650 0    50   ~ 0
EPIOS20
Text Label 10500 2750 0    50   ~ 0
EPIOS21
Text Label 10500 2850 0    50   ~ 0
EPIOS22
Text Label 10500 2950 0    50   ~ 0
EPIOS23
Text Label 6500 4100 0    50   ~ 0
EPIOS24
Text Label 6500 4000 0    50   ~ 0
EPIOS25
Text Label 8000 1450 0    50   ~ 0
EPIOS26
Text Label 4000 2100 0    50   ~ 0
EPIOS27
Text Label 4000 2200 0    50   ~ 0
EPIOS28
Text Label 6500 3900 0    50   ~ 0
EPIOS31
Text Label 6500 3800 0    50   ~ 0
EPIOS32
Text Label 8000 1550 0    50   ~ 0
EPIOS33
Text Label 8000 3250 0    50   ~ 0
EPIOS34
Text Label 8000 3350 0    50   ~ 0
EPIOS35
Wire Wire Line
	8000 3350 8500 3350
Wire Wire Line
	8500 3250 8000 3250
Wire Wire Line
	8000 1550 8500 1550
Wire Wire Line
	8000 1450 8500 1450
Wire Wire Line
	8000 1250 8500 1250
Wire Wire Line
	8000 1350 8500 1350
Wire Wire Line
	8000 1150 8500 1150
Wire Wire Line
	8000 1050 8500 1050
Wire Wire Line
	8000 2150 8500 2150
Wire Wire Line
	8000 2250 8500 2250
Wire Wire Line
	8000 2050 8500 2050
Wire Wire Line
	8000 1950 8500 1950
Wire Wire Line
	10250 2850 10750 2850
Wire Wire Line
	10250 2950 10750 2950
Wire Wire Line
	10250 2750 10750 2750
Wire Wire Line
	10250 2650 10750 2650
Wire Wire Line
	6250 4000 6750 4000
Wire Wire Line
	6250 4100 6750 4100
Wire Wire Line
	6250 3900 6750 3900
Wire Wire Line
	6250 3800 6750 3800
Wire Wire Line
	4000 2200 4450 2200
Wire Wire Line
	4450 2100 4000 2100
Wire Wire Line
	3800 1300 4450 1300
Wire Wire Line
	3500 1200 4450 1200
Wire Bus Line
	7000 650  6600 650 
Entry Wire Line
	6600 1200 6500 1300
Entry Wire Line
	6600 1100 6500 1200
Entry Wire Line
	6600 1000 6500 1100
Entry Wire Line
	6600 900  6500 1000
Wire Wire Line
	6500 1000 6250 1000
Wire Wire Line
	6250 1100 6500 1100
Wire Wire Line
	6500 1200 6250 1200
Wire Wire Line
	6250 1300 6500 1300
Text Label 6300 1000 0    50   ~ 0
PG_0
Text Label 6300 1100 0    50   ~ 0
PG_1
Text Label 6300 1200 0    50   ~ 0
PG_2
Text Label 6300 1300 0    50   ~ 0
PG_3
Wire Bus Line
	7000 3000 6600 3000
Entry Wire Line
	6600 2700 6500 2600
Entry Wire Line
	6600 2800 6500 2700
Entry Wire Line
	6600 2900 6500 2800
Entry Wire Line
	6600 3000 6500 2900
Wire Wire Line
	6500 2600 6250 2600
Wire Wire Line
	6500 2700 6250 2700
Wire Wire Line
	6500 2800 6250 2800
Wire Wire Line
	6500 2900 6250 2900
Text Label 6300 2600 0    50   ~ 0
EN_0
Text Label 6300 2700 0    50   ~ 0
EN_1
Text Label 6300 2800 0    50   ~ 0
EN_2
Text Label 6300 2900 0    50   ~ 0
EN_3
NoConn ~ 4450 1400
NoConn ~ 4450 1500
NoConn ~ 4450 2300
NoConn ~ 4450 2400
NoConn ~ 4450 3700
NoConn ~ 4450 4200
NoConn ~ 6250 3200
NoConn ~ 6250 3100
NoConn ~ 6250 2000
NoConn ~ 6250 1900
NoConn ~ 6250 1800
NoConn ~ 6250 1500
NoConn ~ 8500 2350
NoConn ~ 8500 2450
NoConn ~ 8500 2550
NoConn ~ 8500 2650
NoConn ~ 8500 2850
NoConn ~ 8500 2950
NoConn ~ 10250 2450
NoConn ~ 10250 3050
NoConn ~ 10250 2150
Text Label 6500 3700 0    50   ~ 0
EPIOS3
Text Label 6500 3600 0    50   ~ 0
EPIOS2
Text Label 6500 3500 0    50   ~ 0
EPIOS1
Text Label 6500 3400 0    50   ~ 0
EPIOS0
Wire Wire Line
	6250 3600 6750 3600
Wire Wire Line
	6250 3700 6750 3700
Wire Wire Line
	6250 3500 6750 3500
Wire Wire Line
	6250 3400 6750 3400
Text Label 8000 3050 0    50   ~ 0
EPIOS29
Text Label 8000 3150 0    50   ~ 0
EPIOS30
Wire Wire Line
	8000 3150 8500 3150
Wire Wire Line
	8500 3050 8000 3050
Text HLabel 6600 1400 2    50   Input ~ 0
PG_3_3
Wire Wire Line
	6250 1400 6600 1400
$Comp
L power:GND #PWR?
U 1 1 6190FB7D
P 1250 2050
F 0 "#PWR?" H 1250 1800 50  0001 C CNN
F 1 "GND" H 1255 1877 50  0000 C CNN
F 2 "" H 1250 2050 50  0001 C CNN
F 3 "" H 1250 2050 50  0001 C CNN
	1    1250 2050
	1    0    0    -1  
$EndComp
Connection ~ 1250 2050
Wire Wire Line
	1250 2050 1000 2050
Text HLabel 10350 1750 2    50   Output ~ 0
CONFIG_SEL
Text HLabel 10350 2050 2    50   Input ~ 0
CRC_ERROR
Text HLabel 10350 1950 2    50   Input ~ 0
~STATUS
Text HLabel 10350 1850 2    50   Input ~ 0
CONF_DONE
$Comp
L POWDER_MCU:MSP432E401YTPDTR U1601
U 2 1 5D69BFA2
P 9350 2200
F 0 "U1601" H 9350 3500 60  0000 C CNN
F 1 "MSP432E401YTPDTR" H 9350 2882 60  0000 C CNN
F 2 "POWDER_MCU:MSP432E401YTPDTR" H 9350 1740 60  0001 C CNN
F 3 "" H 9350 1800 60  0000 C CNN
F 4 "Texas Instruments" H 9350 2200 50  0001 C CNN "Manufacturer"
F 5 "MSP432E401YTPDTR" H 9350 2200 50  0001 C CNN "PartNumber"
F 6 "3000-0000000080" H 9350 2200 50  0001 C CNN "PartSpecification"
	2    9350 2200
	1    0    0    -1  
$EndComp
Wire Wire Line
	10350 2050 10250 2050
Wire Wire Line
	10250 1950 10350 1950
Wire Wire Line
	10350 1850 10250 1850
Wire Wire Line
	10250 1750 10350 1750
Wire Bus Line
	6600 2700 6600 3000
Wire Bus Line
	6600 650  6600 1200
$EndSCHEMATC
