EESchema Schematic File Version 4
LIBS:power_supply-cache
EELAYER 29 0
EELAYER END
$Descr A4 11693 8268
encoding utf-8
Sheet 2 5
Title ""
Date ""
Rev ""
Comp ""
Comment1 ""
Comment2 ""
Comment3 ""
Comment4 ""
$EndDescr
$Comp
L POWDER_Power:TPS54561-Q1 U?
U 1 1 5C6714AE
P 5100 3150
AR Path="/5C6714AE" Ref="U?"  Part="1" 
AR Path="/5C66EB2D/5C6714AE" Ref="U201"  Part="1" 
F 0 "U201" H 5100 3765 50  0000 C CNN
F 1 "TPS54561-Q1" H 5100 3674 50  0000 C CNN
F 2 "POWDER_Power:TPS54561-Q1" H 5100 2450 50  0001 C CNN
F 3 "" H 4750 3650 50  0001 C CNN
F 4 "Texas Instruments" H 5100 3150 50  0001 C CNN "Manufacturer"
F 5 "TPS54561QDPRTQ1" H 5100 3150 50  0001 C CNN "PartNumber"
	1    5100 3150
	1    0    0    -1  
$EndComp
$Comp
L Device:C C?
U 1 1 5C6714B5
P 4300 3850
AR Path="/5C6714B5" Ref="C?"  Part="1" 
AR Path="/5C66EB2D/5C6714B5" Ref="C208"  Part="1" 
F 0 "C208" H 4415 3896 50  0000 L CNN
F 1 "27pF" H 4415 3805 50  0000 L CNN
F 2 "Capacitor_SMD:C_0402_1005Metric" H 4338 3700 50  0001 C CNN
F 3 "~" H 4300 3850 50  0001 C CNN
F 4 "C0402C270J5GACTU" H 4300 3850 50  0001 C CNN "PartNumber"
F 5 "KEMET" H 4300 3850 50  0001 C CNN "Manufacturer"
	1    4300 3850
	1    0    0    -1  
$EndComp
$Comp
L Device:C C?
U 1 1 5C6714BC
P 3900 4100
AR Path="/5C6714BC" Ref="C?"  Part="1" 
AR Path="/5C66EB2D/5C6714BC" Ref="C207"  Part="1" 
F 0 "C207" H 4015 4146 50  0000 L CNN
F 1 "4.7nF" H 4015 4055 50  0000 L CNN
F 2 "Capacitor_SMD:C_0402_1005Metric" H 3938 3950 50  0001 C CNN
F 3 "~" H 3900 4100 50  0001 C CNN
F 4 "GCM155R71H472KA37D" H 3900 4100 50  0001 C CNN "PartNumber"
F 5 "Murata Electronics North America" H 3900 4100 50  0001 C CNN "Manufacturer"
	1    3900 4100
	1    0    0    -1  
$EndComp
$Comp
L Device:R R?
U 1 1 5C6714C3
P 3900 3750
AR Path="/5C6714C3" Ref="R?"  Part="1" 
AR Path="/5C66EB2D/5C6714C3" Ref="R202"  Part="1" 
F 0 "R202" H 3970 3796 50  0000 L CNN
F 1 "29.4k" H 3970 3705 50  0000 L CNN
F 2 "Resistor_SMD:R_0402_1005Metric" V 3830 3750 50  0001 C CNN
F 3 "~" H 3900 3750 50  0001 C CNN
F 4 "RMCF0402FT29K4" H 3900 3750 50  0001 C CNN "PartNumber"
F 5 "Stackpole Electronics Inc" H 3900 3750 50  0001 C CNN "Manufacturer"
	1    3900 3750
	1    0    0    -1  
$EndComp
Wire Wire Line
	3900 3600 3900 3500
Wire Wire Line
	3900 3500 4300 3500
Wire Wire Line
	4300 3700 4300 3500
Connection ~ 4300 3500
Wire Wire Line
	4300 3500 4600 3500
Wire Wire Line
	3900 3900 3900 3950
$Comp
L Device:C C?
U 1 1 5C6714D0
P 3500 3750
AR Path="/5C6714D0" Ref="C?"  Part="1" 
AR Path="/5C66EB2D/5C6714D0" Ref="C206"  Part="1" 
F 0 "C206" H 3615 3796 50  0000 L CNN
F 1 "2.7nF" H 3615 3705 50  0000 L CNN
F 2 "Capacitor_SMD:C_0402_1005Metric" H 3538 3600 50  0001 C CNN
F 3 "~" H 3500 3750 50  0001 C CNN
F 4 "CL05B272KB5NNNC" H 3500 3750 50  0001 C CNN "PartNumber"
F 5 "Samsung Electro-Mechanics" H 3500 3750 50  0001 C CNN "Manufacturer"
	1    3500 3750
	1    0    0    -1  
$EndComp
Wire Wire Line
	3500 3600 3500 3300
Wire Wire Line
	3500 3300 4600 3300
$Comp
L Device:R R?
U 1 1 5C6714D9
P 3050 3750
AR Path="/5C6714D9" Ref="R?"  Part="1" 
AR Path="/5C66EB2D/5C6714D9" Ref="R201"  Part="1" 
F 0 "R201" H 3120 3796 50  0000 L CNN
F 1 "243k" H 3120 3705 50  0000 L CNN
F 2 "Resistor_SMD:R_0402_1005Metric" V 2980 3750 50  0001 C CNN
F 3 "~" H 3050 3750 50  0001 C CNN
F 4 "RMCF0402FT243K" H 3050 3750 50  0001 C CNN "PartNumber"
F 5 "Stackpole Electronics Inc" H 3050 3750 50  0001 C CNN "Manufacturer"
	1    3050 3750
	1    0    0    -1  
$EndComp
Wire Wire Line
	3050 3600 3050 3200
Wire Wire Line
	3050 3200 4600 3200
Wire Wire Line
	4600 2800 4050 2800
Wire Wire Line
	4050 2800 4050 2150
$Comp
L power:GND #PWR?
U 1 1 5C6714F9
P 4300 4500
AR Path="/5C6714F9" Ref="#PWR?"  Part="1" 
AR Path="/5C66EB2D/5C6714F9" Ref="#PWR?"  Part="1" 
F 0 "#PWR?" H 4300 4250 50  0001 C CNN
F 1 "GND" H 4305 4327 50  0000 C CNN
F 2 "" H 4300 4500 50  0001 C CNN
F 3 "" H 4300 4500 50  0001 C CNN
	1    4300 4500
	1    0    0    -1  
$EndComp
Wire Wire Line
	4300 4500 4300 4400
Wire Wire Line
	3900 4250 3900 4400
Wire Wire Line
	3900 4400 4300 4400
Connection ~ 4300 4400
Wire Wire Line
	4300 4400 4300 4000
Wire Wire Line
	3500 3900 3500 4400
Wire Wire Line
	3500 4400 3900 4400
Connection ~ 3900 4400
Wire Wire Line
	3050 3900 3050 4400
Wire Wire Line
	3050 4400 3500 4400
Connection ~ 3500 4400
$Comp
L Device:C C?
U 1 1 5C67150F
P 1100 2500
AR Path="/5C67150F" Ref="C?"  Part="1" 
AR Path="/5C66EB2D/5C67150F" Ref="C202"  Part="1" 
F 0 "C202" H 1215 2546 50  0000 L CNN
F 1 "2.2uF" H 1215 2455 50  0000 L CNN
F 2 "Capacitor_SMD:C_1206_3216Metric" H 1138 2350 50  0001 C CNN
F 3 "~" H 1100 2500 50  0001 C CNN
F 4 "TDK" H 1100 2500 50  0001 C CNN "Manufacturer"
F 5 "CGA5L3X7S2A225M160AB" H 1100 2500 50  0001 C CNN "PartNumber"
	1    1100 2500
	1    0    0    -1  
$EndComp
Wire Wire Line
	2350 2150 2350 2350
Wire Wire Line
	2350 2650 2350 2900
Wire Wire Line
	2350 2900 1900 2900
Wire Wire Line
	1700 2900 1700 3000
Wire Wire Line
	1900 2900 1900 2650
Connection ~ 1900 2900
Wire Wire Line
	1900 2900 1700 2900
Wire Wire Line
	2350 2150 1900 2150
Wire Wire Line
	1900 2150 1900 2350
Connection ~ 2350 2150
Wire Wire Line
	1500 2350 1500 2150
Wire Wire Line
	1500 2150 1900 2150
Connection ~ 1900 2150
Wire Wire Line
	1100 2350 1100 2150
Wire Wire Line
	1100 2150 1500 2150
Connection ~ 1500 2150
Wire Wire Line
	1500 2650 1500 2900
Wire Wire Line
	1500 2900 1700 2900
Connection ~ 1700 2900
Wire Wire Line
	1100 2650 1100 2900
Wire Wire Line
	1100 2900 1500 2900
Connection ~ 1500 2900
$Comp
L power:GND #PWR?
U 1 1 5C67152D
P 1700 3000
AR Path="/5C67152D" Ref="#PWR?"  Part="1" 
AR Path="/5C66EB2D/5C67152D" Ref="#PWR?"  Part="1" 
F 0 "#PWR?" H 1700 2750 50  0001 C CNN
F 1 "GND" H 1705 2827 50  0000 C CNN
F 2 "" H 1700 3000 50  0001 C CNN
F 3 "" H 1700 3000 50  0001 C CNN
	1    1700 3000
	1    0    0    -1  
$EndComp
$Comp
L power:VDD #PWR?
U 1 1 5C671533
P 1500 1900
AR Path="/5C671533" Ref="#PWR?"  Part="1" 
AR Path="/5C66EB2D/5C671533" Ref="#PWR?"  Part="1" 
F 0 "#PWR?" H 1500 1750 50  0001 C CNN
F 1 "VDD" H 1517 2073 50  0000 C CNN
F 2 "" H 1500 1900 50  0001 C CNN
F 3 "" H 1500 1900 50  0001 C CNN
	1    1500 1900
	1    0    0    -1  
$EndComp
Wire Wire Line
	1500 1900 1500 2150
$Comp
L Device:C C?
U 1 1 5C67153C
P 1500 2500
AR Path="/5C67153C" Ref="C?"  Part="1" 
AR Path="/5C66EB2D/5C67153C" Ref="C203"  Part="1" 
F 0 "C203" H 1615 2546 50  0000 L CNN
F 1 "2.2uF" H 1615 2455 50  0000 L CNN
F 2 "Capacitor_SMD:C_1206_3216Metric" H 1538 2350 50  0001 C CNN
F 3 "~" H 1500 2500 50  0001 C CNN
F 4 "TDK" H 1500 2500 50  0001 C CNN "Manufacturer"
F 5 "CGA5L3X7S2A225M160AB" H 1500 2500 50  0001 C CNN "PartNumber"
	1    1500 2500
	1    0    0    -1  
$EndComp
$Comp
L Device:C C?
U 1 1 5C671545
P 1900 2500
AR Path="/5C671545" Ref="C?"  Part="1" 
AR Path="/5C66EB2D/5C671545" Ref="C204"  Part="1" 
F 0 "C204" H 2015 2546 50  0000 L CNN
F 1 "2.2uF" H 2015 2455 50  0000 L CNN
F 2 "Capacitor_SMD:C_1206_3216Metric" H 1938 2350 50  0001 C CNN
F 3 "~" H 1900 2500 50  0001 C CNN
F 4 "TDK" H 1900 2500 50  0001 C CNN "Manufacturer"
F 5 "CGA5L3X7S2A225M160AB" H 1900 2500 50  0001 C CNN "PartNumber"
	1    1900 2500
	1    0    0    -1  
$EndComp
$Comp
L Device:C C?
U 1 1 5C67154E
P 2350 2500
AR Path="/5C67154E" Ref="C?"  Part="1" 
AR Path="/5C66EB2D/5C67154E" Ref="C205"  Part="1" 
F 0 "C205" H 2465 2546 50  0000 L CNN
F 1 "2.2uF" H 2465 2455 50  0000 L CNN
F 2 "Capacitor_SMD:C_1206_3216Metric" H 2388 2350 50  0001 C CNN
F 3 "~" H 2350 2500 50  0001 C CNN
F 4 "TDK" H 2350 2500 50  0001 C CNN "Manufacturer"
F 5 "CGA5L3X7S2A225M160AB" H 2350 2500 50  0001 C CNN "PartNumber"
	1    2350 2500
	1    0    0    -1  
$EndComp
$Comp
L Device:C C?
U 1 1 5C671555
P 5950 3000
AR Path="/5C671555" Ref="C?"  Part="1" 
AR Path="/5C66EB2D/5C671555" Ref="C209"  Part="1" 
F 0 "C209" V 5698 3000 50  0000 C CNN
F 1 "0.1uF" V 5789 3000 50  0000 C CNN
F 2 "Capacitor_SMD:C_0402_1005Metric" H 5988 2850 50  0001 C CNN
F 3 "~" H 5950 3000 50  0001 C CNN
F 4 "Samsung Electro-Mechanics" V 5950 3000 50  0001 C CNN "Manufacturer"
F 5 "CL05F104ZO5NNNC" V 5950 3000 50  0001 C CNN "PartNumber"
	1    5950 3000
	0    1    1    0   
$EndComp
Wire Wire Line
	5800 3000 5600 3000
$Comp
L Device:R R?
U 1 1 5C67155D
P 5800 2300
AR Path="/5C67155D" Ref="R?"  Part="1" 
AR Path="/5C66EB2D/5C67155D" Ref="R203"  Part="1" 
F 0 "R203" H 5870 2346 50  0000 L CNN
F 1 "1k" H 5870 2255 50  0000 L CNN
F 2 "Resistor_SMD:R_0402_1005Metric" V 5730 2300 50  0001 C CNN
F 3 "~" H 5800 2300 50  0001 C CNN
F 4 "3000-0000000156" H 5800 2300 50  0001 C CNN "PartSpecification"
	1    5800 2300
	1    0    0    -1  
$EndComp
Wire Wire Line
	5800 2450 5800 2650
Wire Wire Line
	5800 2800 5600 2800
Wire Wire Line
	5800 2150 5800 2000
Wire Wire Line
	5600 3200 6350 3200
Wire Wire Line
	6350 3200 6350 3000
Wire Wire Line
	6350 3000 6100 3000
$Comp
L power:GND #PWR?
U 1 1 5C67156A
P 5800 3850
AR Path="/5C67156A" Ref="#PWR?"  Part="1" 
AR Path="/5C66EB2D/5C67156A" Ref="#PWR?"  Part="1" 
F 0 "#PWR?" H 5800 3600 50  0001 C CNN
F 1 "GND" H 5805 3677 50  0000 C CNN
F 2 "" H 5800 3850 50  0001 C CNN
F 3 "" H 5800 3850 50  0001 C CNN
	1    5800 3850
	1    0    0    -1  
$EndComp
Wire Wire Line
	5800 3850 5800 3700
Wire Wire Line
	5800 3700 5600 3700
Wire Wire Line
	5600 3600 5800 3600
Wire Wire Line
	5800 3600 5800 3700
Connection ~ 5800 3700
$Comp
L Device:D_Schottky_AAK D?
U 1 1 5C671577
P 6650 3250
AR Path="/5C671577" Ref="D?"  Part="1" 
AR Path="/5C66EB2D/5C671577" Ref="D201"  Part="1" 
F 0 "D201" V 6629 3391 50  0000 L CNN
F 1 "D_Schottky_AAK" V 6720 3391 50  0000 L CNN
F 2 "Package_TO_SOT_SMD:TO-277B" H 6650 3250 50  0001 C CNN
F 3 "~" H 6650 3250 50  0001 C CNN
F 4 "ON Semiconductor" V 6650 3250 50  0001 C CNN "Manufacturer"
F 5 "FSV8100V" V 6650 3250 50  0001 C CNN "PartNumber"
	1    6650 3250
	0    1    1    0   
$EndComp
$Comp
L power:GND #PWR?
U 1 1 5C67157E
P 6650 3650
AR Path="/5C67157E" Ref="#PWR?"  Part="1" 
AR Path="/5C66EB2D/5C67157E" Ref="#PWR?"  Part="1" 
F 0 "#PWR?" H 6650 3400 50  0001 C CNN
F 1 "GND" H 6655 3477 50  0000 C CNN
F 2 "" H 6650 3650 50  0001 C CNN
F 3 "" H 6650 3650 50  0001 C CNN
	1    6650 3650
	1    0    0    -1  
$EndComp
Wire Wire Line
	6650 3650 6650 3550
Wire Wire Line
	6650 3550 6750 3550
Wire Wire Line
	6750 3550 6750 3450
Connection ~ 6650 3550
Wire Wire Line
	6650 3550 6650 3450
Wire Wire Line
	6650 3100 6650 3000
Wire Wire Line
	6650 3000 6350 3000
Connection ~ 6350 3000
$Comp
L Device:L L?
U 1 1 5C67158E
P 7000 3000
AR Path="/5C67158E" Ref="L?"  Part="1" 
AR Path="/5C66EB2D/5C67158E" Ref="L201"  Part="1" 
F 0 "L201" V 7190 3000 50  0000 C CNN
F 1 "22uH" V 7099 3000 50  0000 C CNN
F 2 "Inductor_SMD:L_Bourns_SRP1245A" H 7000 3000 50  0001 C CNN
F 3 "~" H 7000 3000 50  0001 C CNN
F 4 "Bourns" V 7000 3000 50  0001 C CNN "Manufacturer"
F 5 "SRP1265A-220M" V 7000 3000 50  0001 C CNN "PartNumber"
	1    7000 3000
	0    -1   -1   0   
$EndComp
Wire Wire Line
	6850 3000 6650 3000
Connection ~ 6650 3000
$Comp
L Device:C C?
U 1 1 5C67159A
P 8150 3350
AR Path="/5C67159A" Ref="C?"  Part="1" 
AR Path="/5C66EB2D/5C67159A" Ref="C210"  Part="1" 
F 0 "C210" H 8265 3396 50  0000 L CNN
F 1 "22uF" H 8265 3305 50  0000 L CNN
F 2 "Capacitor_SMD:C_0805_2012Metric" H 8188 3200 50  0001 C CNN
F 3 "~" H 8150 3350 50  0001 C CNN
F 4 "Murata" H 8150 3350 50  0001 C CNN "Manufacturer"
F 5 "GRM21BR61E226ME44K" H 8150 3350 50  0001 C CNN "PartNumber"
F 6 "2m" H 8150 3350 50  0001 C CNN "ESR"
	1    8150 3350
	1    0    0    -1  
$EndComp
$Comp
L Device:C C?
U 1 1 5C6715A3
P 650 2500
AR Path="/5C6715A3" Ref="C?"  Part="1" 
AR Path="/5C66EB2D/5C6715A3" Ref="C201"  Part="1" 
F 0 "C201" H 765 2546 50  0000 L CNN
F 1 "2.2uF" H 765 2455 50  0000 L CNN
F 2 "Capacitor_SMD:C_1206_3216Metric" H 688 2350 50  0001 C CNN
F 3 "~" H 650 2500 50  0001 C CNN
F 4 "TDK" H 650 2500 50  0001 C CNN "Manufacturer"
F 5 "CGA5L3X7S2A225M160AB" H 650 2500 50  0001 C CNN "PartNumber"
	1    650  2500
	1    0    0    -1  
$EndComp
Wire Wire Line
	650  2650 650  2900
Wire Wire Line
	650  2900 1100 2900
Connection ~ 1100 2900
Wire Wire Line
	650  2350 650  2150
Wire Wire Line
	650  2150 1100 2150
Connection ~ 1100 2150
Wire Wire Line
	8150 3200 8150 3000
Wire Wire Line
	8150 3000 7700 3000
$Comp
L power:GND #PWR?
U 1 1 5C6715B2
P 8150 3650
AR Path="/5C6715B2" Ref="#PWR?"  Part="1" 
AR Path="/5C66EB2D/5C6715B2" Ref="#PWR?"  Part="1" 
F 0 "#PWR?" H 8150 3400 50  0001 C CNN
F 1 "GND" H 8155 3477 50  0000 C CNN
F 2 "" H 8150 3650 50  0001 C CNN
F 3 "" H 8150 3650 50  0001 C CNN
	1    8150 3650
	1    0    0    -1  
$EndComp
$Comp
L power:GND #PWR?
U 1 1 5C6715B8
P 8550 3650
AR Path="/5C6715B8" Ref="#PWR?"  Part="1" 
AR Path="/5C66EB2D/5C6715B8" Ref="#PWR?"  Part="1" 
F 0 "#PWR?" H 8550 3400 50  0001 C CNN
F 1 "GND" H 8555 3477 50  0000 C CNN
F 2 "" H 8550 3650 50  0001 C CNN
F 3 "" H 8550 3650 50  0001 C CNN
	1    8550 3650
	1    0    0    -1  
$EndComp
$Comp
L power:GND #PWR?
U 1 1 5C6715BE
P 8950 3650
AR Path="/5C6715BE" Ref="#PWR?"  Part="1" 
AR Path="/5C66EB2D/5C6715BE" Ref="#PWR?"  Part="1" 
F 0 "#PWR?" H 8950 3400 50  0001 C CNN
F 1 "GND" H 8955 3477 50  0000 C CNN
F 2 "" H 8950 3650 50  0001 C CNN
F 3 "" H 8950 3650 50  0001 C CNN
	1    8950 3650
	1    0    0    -1  
$EndComp
$Comp
L power:GND #PWR?
U 1 1 5C6715C4
P 9400 3650
AR Path="/5C6715C4" Ref="#PWR?"  Part="1" 
AR Path="/5C66EB2D/5C6715C4" Ref="#PWR?"  Part="1" 
F 0 "#PWR?" H 9400 3400 50  0001 C CNN
F 1 "GND" H 9405 3477 50  0000 C CNN
F 2 "" H 9400 3650 50  0001 C CNN
F 3 "" H 9400 3650 50  0001 C CNN
	1    9400 3650
	1    0    0    -1  
$EndComp
Wire Wire Line
	8150 3650 8150 3500
Wire Wire Line
	8550 3500 8550 3650
Wire Wire Line
	8950 3650 8950 3500
Wire Wire Line
	9400 3500 9400 3650
Wire Wire Line
	9400 3200 9400 3000
Wire Wire Line
	9400 3000 8950 3000
Connection ~ 8150 3000
Wire Wire Line
	8550 3000 8550 3200
Connection ~ 8550 3000
Wire Wire Line
	8550 3000 8150 3000
Wire Wire Line
	8950 3000 8950 3200
Connection ~ 8950 3000
Wire Wire Line
	8950 3000 8550 3000
Text Notes 8550 2850 0    50   ~ 0
C=30 uF
$Comp
L Device:R R?
U 1 1 5C6715D8
P 7700 3300
AR Path="/5C6715D8" Ref="R?"  Part="1" 
AR Path="/5C66EB2D/5C6715D8" Ref="R204"  Part="1" 
F 0 "R204" H 7770 3346 50  0000 L CNN
F 1 "232k" H 7770 3255 50  0000 L CNN
F 2 "Resistor_SMD:R_0402_1005Metric" V 7630 3300 50  0001 C CNN
F 3 "~" H 7700 3300 50  0001 C CNN
F 4 "RMCF0402FT232K" H 7700 3300 50  0001 C CNN "PartNumber"
F 5 "Stackpole Electronics Inc" H 7700 3300 50  0001 C CNN "Manufacturer"
	1    7700 3300
	1    0    0    -1  
$EndComp
Wire Wire Line
	7700 3150 7700 3000
Connection ~ 7700 3000
Wire Wire Line
	7700 3000 7150 3000
$Comp
L Device:R R?
U 1 1 5C6715E2
P 7700 4150
AR Path="/5C6715E2" Ref="R?"  Part="1" 
AR Path="/5C66EB2D/5C6715E2" Ref="R205"  Part="1" 
F 0 "R205" H 7770 4196 50  0000 L CNN
F 1 "10k" H 7770 4105 50  0000 L CNN
F 2 "Resistor_SMD:R_0402_1005Metric" V 7630 4150 50  0001 C CNN
F 3 "~" H 7700 4150 50  0001 C CNN
F 4 "RMCF0402FT10K0" H 7700 4150 50  0001 C CNN "PartNumber"
F 5 "Stackpole Electronics Inc" H 7700 4150 50  0001 C CNN "Manufacturer"
	1    7700 4150
	1    0    0    -1  
$EndComp
Wire Wire Line
	7700 4000 7700 3900
$Comp
L power:GND #PWR?
U 1 1 5C6715EA
P 7700 4450
AR Path="/5C6715EA" Ref="#PWR?"  Part="1" 
AR Path="/5C66EB2D/5C6715EA" Ref="#PWR?"  Part="1" 
F 0 "#PWR?" H 7700 4200 50  0001 C CNN
F 1 "GND" H 7705 4277 50  0000 C CNN
F 2 "" H 7700 4450 50  0001 C CNN
F 3 "" H 7700 4450 50  0001 C CNN
	1    7700 4450
	1    0    0    -1  
$EndComp
Wire Wire Line
	7700 4450 7700 4300
Wire Wire Line
	7700 3900 6050 3900
Wire Wire Line
	6050 3900 6050 3400
Wire Wire Line
	5600 3400 6050 3400
Connection ~ 7700 3900
Wire Wire Line
	7700 3900 7700 3450
$Comp
L power:GND #PWR?
U 1 1 5C6715F6
P 9900 3650
AR Path="/5C6715F6" Ref="#PWR?"  Part="1" 
AR Path="/5C66EB2D/5C6715F6" Ref="#PWR?"  Part="1" 
F 0 "#PWR?" H 9900 3400 50  0001 C CNN
F 1 "GND" H 9905 3477 50  0000 C CNN
F 2 "" H 9900 3650 50  0001 C CNN
F 3 "" H 9900 3650 50  0001 C CNN
	1    9900 3650
	1    0    0    -1  
$EndComp
$Comp
L Connector:Screw_Terminal_01x02 J?
U 1 1 5C6715FC
P 10550 3000
AR Path="/5C6715FC" Ref="J?"  Part="1" 
AR Path="/5C66EB2D/5C6715FC" Ref="J201"  Part="1" 
F 0 "J201" H 10630 2992 50  0000 L CNN
F 1 "Screw_Terminal_01x02" H 10630 2901 50  0000 L CNN
F 2 "TerminalBlock:TerminalBlock_bornier-2_P5.08mm" H 10550 3000 50  0001 C CNN
F 3 "~" H 10550 3000 50  0001 C CNN
F 4 "Molex" H 10550 3000 50  0001 C CNN "Manufacturer"
F 5 "0398800302" H 10550 3000 50  0001 C CNN "PartNumber"
	1    10550 3000
	1    0    0    -1  
$EndComp
Wire Wire Line
	10350 3100 9900 3100
Wire Wire Line
	9900 3100 9900 3650
$Comp
L Device:C C?
U 1 1 5C671609
P 8550 3350
AR Path="/5C671609" Ref="C?"  Part="1" 
AR Path="/5C66EB2D/5C671609" Ref="C211"  Part="1" 
F 0 "C211" H 8665 3396 50  0000 L CNN
F 1 "22uF" H 8665 3305 50  0000 L CNN
F 2 "Capacitor_SMD:C_0805_2012Metric" H 8588 3200 50  0001 C CNN
F 3 "~" H 8550 3350 50  0001 C CNN
F 4 "Murata" H 8550 3350 50  0001 C CNN "Manufacturer"
F 5 "GRM21BR61E226ME44K" H 8550 3350 50  0001 C CNN "PartNumber"
	1    8550 3350
	1    0    0    -1  
$EndComp
$Comp
L Device:C C?
U 1 1 5C671612
P 8950 3350
AR Path="/5C671612" Ref="C?"  Part="1" 
AR Path="/5C66EB2D/5C671612" Ref="C212"  Part="1" 
F 0 "C212" H 9065 3396 50  0000 L CNN
F 1 "22uF" H 9065 3305 50  0000 L CNN
F 2 "Capacitor_SMD:C_0805_2012Metric" H 8988 3200 50  0001 C CNN
F 3 "~" H 8950 3350 50  0001 C CNN
F 4 "Murata" H 8950 3350 50  0001 C CNN "Manufacturer"
F 5 "GRM21BR61E226ME44K" H 8950 3350 50  0001 C CNN "PartNumber"
	1    8950 3350
	1    0    0    -1  
$EndComp
$Comp
L Device:C C?
U 1 1 5C67161B
P 9400 3350
AR Path="/5C67161B" Ref="C?"  Part="1" 
AR Path="/5C66EB2D/5C67161B" Ref="C213"  Part="1" 
F 0 "C213" H 9515 3396 50  0000 L CNN
F 1 "22uF" H 9515 3305 50  0000 L CNN
F 2 "Capacitor_SMD:C_0805_2012Metric" H 9438 3200 50  0001 C CNN
F 3 "~" H 9400 3350 50  0001 C CNN
F 4 "Murata" H 9400 3350 50  0001 C CNN "Manufacturer"
F 5 "GRM21BR61E226ME44K" H 9400 3350 50  0001 C CNN "PartNumber"
	1    9400 3350
	1    0    0    -1  
$EndComp
Text Notes 3850 1700 0    50   ~ 0
No UVLO, this will draw if anything will give.
Text Label 3500 3000 0    50   ~ 0
EN_Control
Text Label 3650 3200 0    50   ~ 0
RT_Control
Text Label 3850 3300 0    50   ~ 0
SS_Control
Text Label 4050 3500 0    50   ~ 0
COMP_Control
Text Label 3900 3950 0    50   ~ 0
COMP_RC_Control
Text Label 6950 3900 0    50   ~ 0
FB_Control
Text Label 6250 3000 0    50   ~ 0
SW_Control
Text Label 5800 2650 0    50   ~ 0
PWRGD_Control
Text Label 5700 3000 0    50   ~ 0
BOOT_Control
Text Label 8000 3000 0    50   ~ 0
VOUT_Control
Text HLabel 6450 2650 2    100  Output ~ 0
PWRGD
Wire Wire Line
	6450 2650 5800 2650
Connection ~ 5800 2650
Wire Wire Line
	5800 2650 5800 2800
Wire Wire Line
	2350 2150 4050 2150
$Comp
L power:+5V #PWR?
U 1 1 5C6B7C3B
P 5800 2000
F 0 "#PWR?" H 5800 1850 50  0001 C CNN
F 1 "+5V" H 5815 2173 50  0000 C CNN
F 2 "" H 5800 2000 50  0001 C CNN
F 3 "" H 5800 2000 50  0001 C CNN
	1    5800 2000
	1    0    0    -1  
$EndComp
$Comp
L Device:R R?
U 1 1 5C6BD0C3
P 9700 3000
AR Path="/5C6BD0C3" Ref="R?"  Part="1" 
AR Path="/5C66EB2D/5C6BD0C3" Ref="R206"  Part="1" 
F 0 "R206" V 9493 3000 50  0000 C CNN
F 1 "5m" V 9584 3000 50  0000 C CNN
F 2 "Resistor_SMD:R_0612_1632Metric" V 9630 3000 50  0001 C CNN
F 3 "~" H 9700 3000 50  0001 C CNN
F 4 "Ohmite" V 9700 3000 50  0001 C CNN "Manufacturer"
F 5 "FCSL32R005FER" V 9700 3000 50  0001 C CNN "PartNumber"
	1    9700 3000
	0    1    1    0   
$EndComp
Wire Wire Line
	9550 3000 9400 3000
Connection ~ 9400 3000
Wire Wire Line
	9850 3000 9950 3000
Text HLabel 10050 2600 2    100  Output ~ 0
RSM
Text HLabel 10050 2450 2    100  Output ~ 0
RSP
Wire Wire Line
	10050 2600 9950 2600
Wire Wire Line
	9950 2600 9950 3000
Wire Wire Line
	10050 2450 9400 2450
Wire Wire Line
	9400 2450 9400 3000
$Comp
L Device:Fuse F201
U 1 1 5C9276EC
P 10100 3000
F 0 "F201" V 9903 3000 50  0000 C CNN
F 1 "Fuse" V 9994 3000 50  0000 C CNN
F 2 "Fuse:Fuseholder_Cylinder-5x20mm_Stelvio-Kontek_PTF78_Horizontal_Open" V 10030 3000 50  0001 C CNN
F 3 "~" H 10100 3000 50  0001 C CNN
	1    10100 3000
	0    1    1    0   
$EndComp
Connection ~ 9950 3000
Wire Wire Line
	10250 3000 10350 3000
$Comp
L POWDER_Power:LM3724 U202
U 1 1 5C954904
P 1750 4100
F 0 "U202" H 2341 4146 50  0000 L CNN
F 1 "LM3724EM5-4.63/NOPB" H 2341 4055 50  0000 L CNN
F 2 "Package_TO_SOT_SMD:SOT-23-5" H 1950 4350 50  0001 C CNN
F 3 "" H 1750 4100 50  0001 C CNN
	1    1750 4100
	1    0    0    -1  
$EndComp
$Comp
L power:+5V #PWR?
U 1 1 5C95499C
P 1750 3600
F 0 "#PWR?" H 1750 3450 50  0001 C CNN
F 1 "+5V" H 1765 3773 50  0000 C CNN
F 2 "" H 1750 3600 50  0001 C CNN
F 3 "" H 1750 3600 50  0001 C CNN
	1    1750 3600
	1    0    0    -1  
$EndComp
Wire Wire Line
	1750 3700 1750 3600
Wire Wire Line
	2300 4100 2550 4100
Wire Wire Line
	2550 4100 2550 3000
Wire Wire Line
	2550 3000 4600 3000
$Comp
L power:GND #PWR?
U 1 1 5C958B18
P 1800 4600
AR Path="/5C958B18" Ref="#PWR?"  Part="1" 
AR Path="/5C66EB2D/5C958B18" Ref="#PWR?"  Part="1" 
F 0 "#PWR?" H 1800 4350 50  0001 C CNN
F 1 "GND" H 1805 4427 50  0000 C CNN
F 2 "" H 1800 4600 50  0001 C CNN
F 3 "" H 1800 4600 50  0001 C CNN
	1    1800 4600
	1    0    0    -1  
$EndComp
Wire Wire Line
	1800 4600 1800 4500
$Comp
L power:GND #PWR?
U 1 1 5C95ADBB
P 1700 4600
AR Path="/5C95ADBB" Ref="#PWR?"  Part="1" 
AR Path="/5C66EB2D/5C95ADBB" Ref="#PWR?"  Part="1" 
F 0 "#PWR?" H 1700 4350 50  0001 C CNN
F 1 "GND" H 1705 4427 50  0000 C CNN
F 2 "" H 1700 4600 50  0001 C CNN
F 3 "" H 1700 4600 50  0001 C CNN
	1    1700 4600
	1    0    0    -1  
$EndComp
Wire Wire Line
	1700 4600 1700 4500
$Comp
L Connector:TestPoint TP201
U 1 1 5C96256E
P 800 3950
F 0 "TP201" H 858 4070 50  0000 L CNN
F 1 "TestPoint" H 858 3979 50  0000 L CNN
F 2 "TestPoint:TestPoint_Pad_D1.0mm" H 1000 3950 50  0001 C CNN
F 3 "~" H 1000 3950 50  0001 C CNN
	1    800  3950
	1    0    0    -1  
$EndComp
Wire Wire Line
	800  3950 800  4100
Wire Wire Line
	800  4100 1200 4100
Text Label 10300 3000 1    50   ~ 0
CONTROL_OUT
Text Label 950  4100 0    50   ~ 0
MR
$EndSCHEMATC
