EESchema Schematic File Version 4
EELAYER 30 0
EELAYER END
$Descr A4 11693 8268
encoding utf-8
Sheet 20 39
Title ""
Date ""
Rev ""
Comp ""
Comment1 ""
Comment2 ""
Comment3 ""
Comment4 ""
$EndDescr
$Sheet
S 2000 2500 1500 1500
U 5F853053
F0 "reg1" 50
F1 "low_voltage_regulator.sch" 50
F2 "SYNC_1" I L 2000 3000 50 
F3 "VIN" I L 2000 2750 50 
F4 "SYNC_2" I L 2000 3100 50 
F5 "SYNC_3" I L 2000 3200 50 
F6 "PG_1" O R 3500 3000 50 
F7 "PG_2" O R 3500 3100 50 
F8 "PG_3" O R 3500 3200 50 
F9 "EN_1" I L 2000 3500 50 
F10 "EN_2" I L 2000 3600 50 
F11 "EN_3" I L 2000 3700 50 
F12 "IS_6" I L 2000 2650 50 
F13 "ISENSE_MAX10_6" O R 3500 3500 50 
F14 "ISENSE_1_2" O R 3500 3600 50 
F15 "ISENSE_2_5" O R 3500 3700 50 
F16 "ISENSE_2_5A" O R 3500 3800 50 
F17 "VSENSE_1_2" O R 3500 2650 50 
F18 "VSENSE_2_5" O R 3500 2750 50 
F19 "VSENSE_2_5A" O R 3500 2850 50 
$EndSheet
$Sheet
S 6000 1000 2500 5500
U 5F8E5420
F0 "CPLD" 50
F1 "CPLD.sch" 50
F2 "SYNC_1" O R 8500 2550 50 
F3 "SYNC_2" O R 8500 2650 50 
F4 "SYNC_3" O R 8500 2750 50 
F5 "VSENSE_PA" I L 6000 1100 50 
F6 "VSENSE_4_8" I L 6000 1200 50 
F7 "VSENSE_3_3VFR" I L 6000 1300 50 
F8 "VSENSE_LNA" I L 6000 1400 50 
F9 "VSENSE_LNA_BIAS" I L 6000 1500 50 
F10 "VSENSE_12" I L 6000 1600 50 
F11 "VSENSE_MAX10_6" I L 6000 1700 50 
F12 "VSENSE_1_2" I L 6000 1800 50 
F13 "VSENSE_2_5" I L 6000 1900 50 
F14 "VSENSE_2_5A" I L 6000 2000 50 
F15 "ISENSE_VCC1" I L 6000 2100 50 
F16 "ISENSE_VCC2" I L 6000 2200 50 
F17 "ISENSE_VCC3" I L 6000 2300 50 
F18 "ISENSE_VBIAS" I L 6000 2400 50 
F19 "ISENSE_LNA" I L 6000 2500 50 
F20 "ISENSE_MAX10_6" I L 6000 2600 50 
F21 "ISENSE_1_2" I L 6000 2700 50 
F22 "ISENSE_2_5" I L 6000 2800 50 
F23 "ISENSE_2_5A" I L 6000 2900 50 
F24 "TEMP_SENSE_PA" I L 6000 3200 50 
F25 "TEMP_SENSE_LNA" I L 6000 3300 50 
F26 "GPAI[0..7]" I L 6000 3500 50 
F27 "TDD_CTRL" O L 6000 3800 50 
F28 "TDD_ENABLE" O L 6000 3900 50 
F29 "LNA_REG_EN" O L 6000 4100 50 
F30 "LNA_REG_VSEL_1" O L 6000 4200 50 
F31 "LNA_REG_VSEL_2" O L 6000 4300 50 
F32 "LNA_REG_PS_SYNC" O L 6000 4400 50 
F33 "LNA_REG_DCDC_PG" I L 6000 4500 50 
F34 "LNA_REG_LDO_PG" I L 6000 4600 50 
F35 "LNA_BIAS[0..3]" O L 6000 4700 50 
F36 "BP_RX_CTRL_1" O L 6000 4900 50 
F37 "BP_RX_CTRL_2" O L 6000 5000 50 
F38 "BP_RX_ENABLE" O L 6000 5100 50 
F39 "RF_REG_EN" O L 6000 5300 50 
F40 "RF_REG_PS_SYNC" O L 6000 5400 50 
F41 "RF_REG_DCDC_PG" I L 6000 5500 50 
F42 "RF_REG_LDO_4_8_PG" I L 6000 5600 50 
F43 "RF_REG_LDO_3_3VRF_PG" I L 6000 5700 50 
F44 "MCU_IO[0..35]" B L 6000 6000 50 
F45 "PA_REG_EN" O R 8500 3050 50 
F46 "PA_REG_VSEL_1" O R 8500 3150 50 
F47 "PA_REG_VSEL_2" O R 8500 3250 50 
F48 "PA_REG_PS_SYNC" O R 8500 3350 50 
F49 "PA_REG_DCDC_PG" I R 8500 3450 50 
F50 "PA_REG_LDO_PG" I R 8500 3550 50 
F51 "PA_EN" O R 8500 3750 50 
F52 "BT_TX_CTRL_1" O R 8500 3950 50 
F53 "BP_TX_CTRL_2" O R 8500 4050 50 
F54 "BP_TX_ENABLE" O R 8500 4150 50 
F55 "ATT_SI" O R 8500 4450 50 
F56 "ATT_CLK" O R 8500 4550 50 
F57 "ATT_LE" O R 8500 4650 50 
F58 "FAN_PWM" O R 8500 4950 50 
F59 "FAN_TACH" I R 8500 5050 50 
F60 "SDR_GPIO[0..11]" B R 8500 5250 50 
F61 "FRONTEND_GPIO[0..15]" B R 8500 5650 50 
F62 "FRONTEND_VIO" I R 8500 5750 50 
F63 "SYNC_0" O R 8500 2450 50 
F64 "A_5VA_EN" O L 6000 6200 50 
F65 "A_5VA_PG" I L 6000 6300 50 
F66 "VSENSE_5VA" I L 6000 3000 50 
F67 "CONFIG_SEL" I R 8500 6050 50 
F68 "CRC_ERROR" O R 8500 6150 50 
F69 "~STATUS" O R 8500 6250 50 
F70 "CONF_DONE" O R 8500 6350 50 
$EndSheet
Wire Wire Line
	3500 3000 3750 3000
Wire Wire Line
	3500 3100 3750 3100
Wire Wire Line
	3500 3200 3750 3200
Text Label 1700 3000 0    50   ~ 0
SYNC_1
Text Label 1700 3100 0    50   ~ 0
SYNC_2
Text Label 1700 3200 0    50   ~ 0
SYNC_3
Wire Wire Line
	1700 3200 2000 3200
Wire Wire Line
	1700 3100 2000 3100
Wire Wire Line
	1700 3000 2000 3000
Text Label 1700 3500 0    50   ~ 0
EN_1
Wire Wire Line
	1700 3500 2000 3500
Wire Wire Line
	1700 3600 2000 3600
Wire Wire Line
	1700 3700 2000 3700
Text Label 1700 3600 0    50   ~ 0
EN_2
Text Label 1700 3700 0    50   ~ 0
EN_3
Text Label 3600 3000 0    50   ~ 0
PG_1
Text Label 3600 3100 0    50   ~ 0
PG_2
Text Label 3600 3200 0    50   ~ 0
PG_3
Wire Wire Line
	1750 2250 1750 2350
Wire Wire Line
	1750 2750 2000 2750
$Sheet
S 1500 1000 1000 1000
U 6065B34E
F0 "MAX10_6V_reg" 50
F1 "MAX10_6V_reg.sch" 50
F2 "EN" I L 1500 1500 50 
F3 "PS_SYNC" I L 1500 1600 50 
F4 "DCDC_PG" O R 2500 1700 50 
F5 "MAX10_6V" O R 2500 1500 50 
$EndSheet
$Comp
L Connector:Conn_01x02_Male J2001
U 1 1 60683CFA
P 1050 1900
F 0 "J2001" V 1204 1712 50  0000 R CNN
F 1 "Conn_01x02_Male" V 1113 1712 50  0000 R CNN
F 2 "Connector_PinHeader_2.54mm:PinHeader_1x02_P2.54mm_Vertical" H 1050 1900 50  0001 C CNN
F 3 "~" H 1050 1900 50  0001 C CNN
F 4 "3000-0000001276" H 1050 1900 50  0001 C CNN "PartSpecification"
	1    1050 1900
	0    -1   -1   0   
$EndComp
Wire Wire Line
	1150 1700 1150 1600
Wire Wire Line
	1150 1600 1500 1600
Wire Wire Line
	1050 1700 1050 1600
Wire Wire Line
	1050 1600 850  1600
Wire Wire Line
	3000 2250 3000 1500
Wire Wire Line
	3000 1500 2500 1500
Text HLabel 900  1250 0    50   Input ~ 0
EN_[0..3]
Entry Wire Line
	1600 3600 1700 3700
Entry Wire Line
	1600 3500 1700 3600
Entry Wire Line
	1600 3400 1700 3500
Wire Bus Line
	3850 1500 4350 1500
Entry Wire Line
	3850 3100 3750 3200
Entry Wire Line
	3850 3000 3750 3100
Entry Wire Line
	3850 2900 3750 3000
Text HLabel 4350 1500 2    50   Output ~ 0
PG_[0..3]
$Comp
L Connector_Generic:Conn_02x03_Odd_Even J2002
U 1 1 606A0D72
P 1500 3100
F 0 "J2002" H 1550 3417 50  0000 C CNN
F 1 "Conn_02x03_Odd_Even" H 1550 3326 50  0000 C CNN
F 2 "Connector_PinHeader_2.54mm:PinHeader_2x03_P2.54mm_Vertical" H 1500 3100 50  0001 C CNN
F 3 "~" H 1500 3100 50  0001 C CNN
F 4 "3000-0000001278" H 1500 3100 50  0001 C CNN "PartSpecification"
	1    1500 3100
	-1   0    0    -1  
$EndComp
Wire Bus Line
	900  1250 1050 1250
Wire Bus Line
	1050 1500 700  1500
Wire Bus Line
	700  1500 700  3350
Wire Bus Line
	700  3350 1600 3350
Wire Wire Line
	1500 1500 1150 1500
Entry Wire Line
	1050 1400 1150 1500
Wire Wire Line
	2500 1700 3750 1700
Entry Wire Line
	3850 1600 3750 1700
Text Label 2550 1700 0    50   ~ 0
PG_0
Text Label 1250 1500 0    50   ~ 0
EN_0
$Comp
L Device:R R?
U 1 1 60F9398F
P 3250 1000
AR Path="/60664CFF/60F9398F" Ref="R?"  Part="1" 
AR Path="/605746B5/60F9398F" Ref="R2001"  Part="1" 
F 0 "R2001" V 3330 1000 50  0000 C CNN
F 1 "10k" V 3250 1000 50  0000 C CNN
F 2 "Resistor_SMD:R_0402_1005Metric" V 3180 1000 50  0001 C CNN
F 3 "~" H 3250 1000 50  0001 C CNN
F 4 "3000-0000000131" V 3250 1000 50  0001 C CNN "PartSpecification"
	1    3250 1000
	0    1    1    0   
$EndComp
$Comp
L Device:R R?
U 1 1 60F93996
P 3500 1200
AR Path="/60664CFF/60F93996" Ref="R?"  Part="1" 
AR Path="/605746B5/60F93996" Ref="R2002"  Part="1" 
F 0 "R2002" V 3580 1200 50  0000 C CNN
F 1 "4.87k" V 3500 1200 50  0000 C CNN
F 2 "Resistor_SMD:R_0402_1005Metric" V 3430 1200 50  0001 C CNN
F 3 "~" H 3500 1200 50  0001 C CNN
F 4 "3000-0000000133" V 3500 1200 50  0001 C CNN "PartSpecification"
	1    3500 1200
	1    0    0    -1  
$EndComp
$Comp
L power:GND #PWR?
U 1 1 60F9399C
P 3500 1500
AR Path="/60664CFF/60F9399C" Ref="#PWR?"  Part="1" 
AR Path="/605746B5/60F9399C" Ref="#PWR?"  Part="1" 
F 0 "#PWR?" H 3500 1250 50  0001 C CNN
F 1 "GND" H 3505 1327 50  0000 C CNN
F 2 "" H 3500 1500 50  0001 C CNN
F 3 "" H 3500 1500 50  0001 C CNN
	1    3500 1500
	1    0    0    -1  
$EndComp
Wire Wire Line
	3500 1350 3500 1500
Wire Wire Line
	3500 1050 3500 1000
Wire Wire Line
	3500 1000 3800 1000
Connection ~ 3500 1000
Wire Wire Line
	3100 1000 3000 1000
Wire Wire Line
	3000 1000 3000 1500
Connection ~ 3000 1500
Wire Wire Line
	3400 1000 3500 1000
Text Label 3600 1000 0    50   ~ 0
VSENSE_MAX10_6
Wire Wire Line
	8500 2550 9000 2550
Text Label 8650 2550 0    50   ~ 0
SYNC_1_O
Wire Wire Line
	8500 2650 9000 2650
Text Label 8650 2650 0    50   ~ 0
SYNC_2_O
Wire Wire Line
	8500 2750 9000 2750
Text Label 8650 2750 0    50   ~ 0
SYNC_3_O
Wire Wire Line
	1200 3000 800  3000
Text Label 1150 3000 2    50   ~ 0
SYNC_1_O
Wire Wire Line
	1200 3100 800  3100
Text Label 1150 3100 2    50   ~ 0
SYNC_2_O
Wire Wire Line
	1200 3200 800  3200
Text Label 1150 3200 2    50   ~ 0
SYNC_3_O
$Comp
L Device:R R?
U 1 1 6109E345
P 2500 2250
AR Path="/6109E345" Ref="R?"  Part="1" 
AR Path="/5D949534/6109E345" Ref="R?"  Part="1" 
AR Path="/605746B5/5F853053/6109E345" Ref="R?"  Part="1" 
AR Path="/605746B5/6109E345" Ref="R2003"  Part="1" 
F 0 "R2003" V 2293 2250 50  0000 C CNN
F 1 "5m" V 2384 2250 50  0000 C CNN
F 2 "POWDER_Power:R_0508_1220Metric" V 2430 2250 50  0001 C CNN
F 3 "~" H 2500 2250 50  0001 C CNN
F 4 "Bourns Inc." H 2500 2250 50  0001 C CNN "Manufacturer"
F 5 "" H 2500 2250 50  0001 C CNN "PartNumber"
F 6 "3000-0000000584" V 2500 2250 50  0001 C CNN "PartSpecification"
	1    2500 2250
	0    -1   1    0   
$EndComp
Wire Wire Line
	2650 2250 2700 2250
Wire Wire Line
	1750 2250 2350 2250
Wire Wire Line
	2700 2250 2700 2350
Wire Wire Line
	2700 2350 1850 2350
Wire Wire Line
	1850 2350 1850 2650
Wire Wire Line
	1850 2650 2000 2650
Connection ~ 2700 2250
Wire Wire Line
	2700 2250 3000 2250
Text HLabel 5900 1100 0    50   Input ~ 0
VSENSE_PA
Text HLabel 5900 1200 0    50   Input ~ 0
VSENSE_4_8
Text HLabel 5900 1300 0    50   Input ~ 0
VSENSE_3_3VFR
Text HLabel 5900 1400 0    50   Input ~ 0
VSENSE_LNA
Text HLabel 5900 1500 0    50   Input ~ 0
VSENSE_LNA_BIAS
Text HLabel 5900 1600 0    50   Input ~ 0
VSENSE_12
Text HLabel 5900 2100 0    50   Input ~ 0
ISENSE_VCC1
Text HLabel 5900 2200 0    50   Input ~ 0
ISENSE_VCC2
Text HLabel 5900 2300 0    50   Input ~ 0
ISENSE_VCC3
Text HLabel 5900 2400 0    50   Input ~ 0
ISENSE_VBIAS
Text HLabel 5900 2500 0    50   Input ~ 0
ISENSE_LNA
Text HLabel 5900 3300 0    50   Input ~ 0
TEMP_SENSE_PA
Text HLabel 5900 3200 0    50   Input ~ 0
TEMP_SENSE_LNA
Text HLabel 5900 3500 0    50   Input ~ 0
GPAI[0..7]
Text Label 5900 1700 2    50   ~ 0
VSENSE_MAX10_6
Wire Wire Line
	5900 1700 6000 1700
Wire Wire Line
	5900 1100 6000 1100
Wire Wire Line
	5900 1200 6000 1200
Wire Wire Line
	5900 1300 6000 1300
Wire Wire Line
	5900 1400 6000 1400
Wire Wire Line
	5900 1500 6000 1500
Wire Wire Line
	5900 1600 6000 1600
Wire Wire Line
	5900 2100 6000 2100
Wire Wire Line
	5900 2200 6000 2200
Wire Wire Line
	5900 2300 6000 2300
Wire Wire Line
	5900 2400 6000 2400
Wire Wire Line
	5900 2500 6000 2500
Wire Wire Line
	5900 3200 6000 3200
Wire Wire Line
	5900 3300 6000 3300
Wire Bus Line
	5900 3500 6000 3500
Text Label 3600 2650 0    50   ~ 0
VSENSE_1_2
Text Label 3600 2750 0    50   ~ 0
VSENSE_2_5
Text Label 3600 2850 0    50   ~ 0
VSENSE_2_5A
Text Label 3600 3600 0    50   ~ 0
ISENSE_1_2
Text Label 3600 3700 0    50   ~ 0
ISENSE_2_5
Text Label 3600 3800 0    50   ~ 0
ISENSE_2_5A
Text Label 3600 3500 0    50   ~ 0
ISENSE_MAX10_6
Wire Wire Line
	3500 3500 3600 3500
Wire Wire Line
	3500 3600 3600 3600
Wire Wire Line
	3500 3700 3600 3700
Wire Wire Line
	3500 3800 3600 3800
Wire Wire Line
	3500 2650 3600 2650
Wire Wire Line
	3500 2750 3600 2750
Wire Wire Line
	3500 2850 3600 2850
Text Label 5900 2700 2    50   ~ 0
ISENSE_1_2
Text Label 5900 2800 2    50   ~ 0
ISENSE_2_5
Text Label 5900 2900 2    50   ~ 0
ISENSE_2_5A
Text Label 5900 2600 2    50   ~ 0
ISENSE_MAX10_6
Wire Wire Line
	6000 2600 5900 2600
Wire Wire Line
	6000 2700 5900 2700
Wire Wire Line
	6000 2800 5900 2800
Wire Wire Line
	6000 2900 5900 2900
Text Label 5900 1800 2    50   ~ 0
VSENSE_1_2
Text Label 5900 1900 2    50   ~ 0
VSENSE_2_5
Text Label 5900 2000 2    50   ~ 0
VSENSE_2_5A
Wire Wire Line
	6000 1800 5900 1800
Wire Wire Line
	6000 1900 5900 1900
Wire Wire Line
	6000 2000 5900 2000
Text HLabel 5900 3800 0    50   Output ~ 0
TDD_CTRL
Text HLabel 5900 3900 0    50   Output ~ 0
TDD_ENABLE
Text HLabel 5900 4100 0    50   Output ~ 0
LNA_REG_EN
Text HLabel 5900 4200 0    50   Output ~ 0
LNA_REG_VSEL_1
Text HLabel 5900 4300 0    50   Output ~ 0
LNA_REG_VSEL_2
Text HLabel 5900 4400 0    50   Output ~ 0
LNA_REG_PS_SYNC
Text HLabel 5900 4500 0    50   Input ~ 0
LNA_REG_DCDC_PG
Text HLabel 5900 4600 0    50   Input ~ 0
LNA_REG_LDO_PG
Text HLabel 5900 4700 0    50   Output ~ 0
LNA_BIAS[0..3]
Text HLabel 5900 4900 0    50   Output ~ 0
BP_RX_CTRL_1
Text HLabel 5900 5000 0    50   Output ~ 0
BP_RX_CTRL_2
Text HLabel 5900 5100 0    50   Output ~ 0
BP_RX_ENABLE
Text HLabel 5900 5300 0    50   Output ~ 0
RF_REG_EN
Text HLabel 5900 5400 0    50   Output ~ 0
RF_REG_PS_SYNC
Text HLabel 5900 5500 0    50   Input ~ 0
RF_REG_DCDC_PG
Text HLabel 5900 5600 0    50   Input ~ 0
RF_REG_LDO_4_8_PG
Text HLabel 5900 5700 0    50   Input ~ 0
RF_REG_LDO_3_3VRF_PG
Text HLabel 8600 3050 2    50   Output ~ 0
PA_REG_EN
Text HLabel 8600 3150 2    50   Output ~ 0
PA_REG_VSEL_1
Text HLabel 8600 3250 2    50   Output ~ 0
PA_REG_VSEL_2
Text HLabel 8600 3350 2    50   Output ~ 0
PA_REG_PS_SYNC
Text HLabel 8600 3450 2    50   Input ~ 0
PA_REG_DCDC_PG
Text HLabel 8600 3550 2    50   Input ~ 0
PA_REG_LDO_PG
Text HLabel 8600 3750 2    50   Output ~ 0
PA_EN
Text HLabel 8600 3950 2    50   Output ~ 0
BT_TX_CTRL_1
Text HLabel 8600 4050 2    50   Output ~ 0
BP_TX_CTRL_2
Text HLabel 8600 4150 2    50   Output ~ 0
BP_TX_ENABLE
Text HLabel 8600 4450 2    50   Output ~ 0
ATT_SI
Text HLabel 8600 4550 2    50   Output ~ 0
ATT_CLK
Text HLabel 8600 4650 2    50   Output ~ 0
ATT_LE
Text HLabel 8600 4950 2    50   Output ~ 0
FAN_PWM
Text HLabel 8600 5050 2    50   Input ~ 0
FAN_TACH
Text HLabel 8600 5250 2    50   BiDi ~ 0
SDR_GPIO[0..11]
Text HLabel 8600 5650 2    50   BiDi ~ 0
FRONTEND_GPIO[0..15]
Text HLabel 8600 5750 2    50   Input ~ 0
FRONTEND_VIO
Text HLabel 5900 6000 0    50   BiDi ~ 0
MCU_IO[0..35]
Wire Wire Line
	5900 3800 6000 3800
Wire Wire Line
	6000 3900 5900 3900
Wire Wire Line
	5900 4100 6000 4100
Wire Wire Line
	6000 4200 5900 4200
Wire Wire Line
	5900 4300 6000 4300
Wire Wire Line
	6000 4400 5900 4400
Wire Wire Line
	5900 4500 6000 4500
Wire Wire Line
	6000 4600 5900 4600
Wire Wire Line
	6000 4900 5900 4900
Wire Wire Line
	5900 5000 6000 5000
Wire Wire Line
	6000 5100 5900 5100
Wire Wire Line
	5900 5300 6000 5300
Wire Wire Line
	6000 5400 5900 5400
Wire Wire Line
	5900 5500 6000 5500
Wire Wire Line
	6000 5600 5900 5600
Wire Wire Line
	5900 5700 6000 5700
Wire Bus Line
	5900 4700 6000 4700
Wire Bus Line
	5900 6000 6000 6000
Wire Bus Line
	8500 5650 8600 5650
Wire Bus Line
	8600 5250 8500 5250
Wire Wire Line
	8600 5750 8500 5750
Wire Wire Line
	8500 5050 8600 5050
Wire Wire Line
	8600 4950 8500 4950
Wire Wire Line
	8500 4450 8600 4450
Wire Wire Line
	8600 4550 8500 4550
Wire Wire Line
	8500 4650 8600 4650
Wire Wire Line
	8600 4150 8500 4150
Wire Wire Line
	8500 4050 8600 4050
Wire Wire Line
	8600 3950 8500 3950
Wire Wire Line
	8600 3750 8500 3750
Wire Wire Line
	8500 3550 8600 3550
Wire Wire Line
	8600 3450 8500 3450
Wire Wire Line
	8500 3350 8600 3350
Wire Wire Line
	8600 3250 8500 3250
Wire Wire Line
	8500 3150 8600 3150
Wire Wire Line
	8600 3050 8500 3050
Text Label 850  1600 0    50   ~ 0
SYNC_0_O
Wire Wire Line
	8500 2450 9000 2450
Text Label 8650 2450 0    50   ~ 0
SYNC_0_O
$Comp
L power:PWR_FLAG #FLG?
U 1 1 61178BBC
P 1600 2350
F 0 "#FLG?" H 1600 2425 50  0001 C CNN
F 1 "PWR_FLAG" H 1600 2523 50  0000 C CNN
F 2 "" H 1600 2350 50  0001 C CNN
F 3 "~" H 1600 2350 50  0001 C CNN
	1    1600 2350
	1    0    0    -1  
$EndComp
Wire Wire Line
	1600 2350 1750 2350
Connection ~ 1750 2350
Wire Wire Line
	1750 2350 1750 2550
Wire Wire Line
	1750 2550 600  2550
Connection ~ 1750 2550
Wire Wire Line
	1750 2550 1750 2750
$Sheet
S 2000 4500 1000 500 
U 61256AAD
F0 "reg2" 50
F1 "regulator_5va.sch" 50
F2 "LDO_5VA_PG" O R 3000 4700 50 
F3 "VSENSE_5VA" O R 3000 4600 50 
F4 "EN_5VA" I L 2000 4700 50 
F5 "VIN" I L 2000 4600 50 
$EndSheet
Wire Wire Line
	600  2550 600  4600
Wire Wire Line
	600  4600 2000 4600
Wire Wire Line
	6000 3000 4500 3000
Wire Wire Line
	4500 3000 4500 4600
Wire Wire Line
	4500 4600 3000 4600
Wire Wire Line
	3000 4700 4500 4700
Wire Wire Line
	4500 4700 4500 6300
Wire Wire Line
	4500 6300 6000 6300
Wire Wire Line
	1900 6200 1900 4700
Wire Wire Line
	1900 4700 2000 4700
Wire Wire Line
	1900 6200 6000 6200
Text HLabel 8600 6050 2    50   Input ~ 0
CONFIG_SEL
Text HLabel 8600 6350 2    50   Output ~ 0
CRC_ERROR
Text HLabel 8600 6250 2    50   Output ~ 0
~STATUS
Text HLabel 8600 6150 2    50   Output ~ 0
CONF_DONE
Wire Wire Line
	8600 6050 8500 6050
Wire Wire Line
	8600 6250 8500 6250
Wire Wire Line
	8500 6150 8600 6150
Wire Wire Line
	8500 6350 8600 6350
Wire Bus Line
	1050 1250 1050 1500
Wire Bus Line
	1600 3350 1600 3600
Wire Bus Line
	3850 1500 3850 3100
$EndSCHEMATC
