EESchema Schematic File Version 4
EELAYER 30 0
EELAYER END
$Descr A4 11693 8268
encoding utf-8
Sheet 16 39
Title ""
Date ""
Rev ""
Comp ""
Comment1 ""
Comment2 ""
Comment3 ""
Comment4 ""
$EndDescr
$Comp
L POWDER_MCU:MSP432E401YTPDTR U?
U 3 1 5D69D478
P 6150 2050
AR Path="/5D67C7FD/5D69D478" Ref="U?"  Part="3" 
AR Path="/5D69D382/5D69D478" Ref="U501"  Part="3" 
AR Path="/60834A7B/6083FA2C/5D69D478" Ref="U1601"  Part="3" 
F 0 "U1601" H 6700 2700 60  0000 C CNN
F 1 "MSP432E401YTPDTR" H 6150 2300 60  0000 C CNN
F 2 "POWDER_MCU:MSP432E401YTPDTR" H 6150 1590 60  0001 C CNN
F 3 "" H 6150 1650 60  0000 C CNN
F 4 "Texas Instruments" H 6150 2050 50  0001 C CNN "Manufacturer"
F 5 "MSP432E401YTPDTR" H 6150 2050 50  0001 C CNN "PartNumber"
F 6 "3000-0000000080" H 6150 2050 50  0001 C CNN "PartSpecification"
	3    6150 2050
	1    0    0    -1  
$EndComp
$Comp
L Device:R R1702
U 1 1 5D7E29D4
P 2750 1300
F 0 "R1702" H 2820 1346 50  0000 L CNN
F 1 "1M" H 2820 1255 50  0000 L CNN
F 2 "Resistor_SMD:R_0402_1005Metric" V 2680 1300 50  0001 C CNN
F 3 "~" H 2750 1300 50  0001 C CNN
F 4 "Delta Electronics/Cyntec" H 2750 1300 50  0001 C CNN "Manufacturer"
F 5 "PFR05S-105-FNH" H 2750 1300 50  0001 C CNN "PartNumber"
F 6 "3000-0000000139" H 2750 1300 50  0001 C CNN "PartSpecification"
	1    2750 1300
	1    0    0    -1  
$EndComp
Wire Wire Line
	2750 1450 2750 1550
Wire Wire Line
	2750 1550 5350 1550
Wire Wire Line
	2750 1150 2750 1000
$Comp
L power:+3.3V #PWR?
U 1 1 5D7E2AE3
P 2750 1000
F 0 "#PWR?" H 2750 850 50  0001 C CNN
F 1 "+3.3V" H 2765 1173 50  0000 C CNN
F 2 "" H 2750 1000 50  0001 C CNN
F 3 "" H 2750 1000 50  0001 C CNN
	1    2750 1000
	1    0    0    -1  
$EndComp
$Comp
L Device:R R1701
U 1 1 5D7E327A
P 2300 1300
F 0 "R1701" H 2370 1346 50  0000 L CNN
F 1 "10k" H 2370 1255 50  0000 L CNN
F 2 "Resistor_SMD:R_0402_1005Metric" V 2230 1300 50  0001 C CNN
F 3 "~" H 2300 1300 50  0001 C CNN
F 4 "Delta Electronics/Cyntec" H 2300 1300 50  0001 C CNN "Manufacturer"
F 5 "PFR05S-103-FNH" H 2300 1300 50  0001 C CNN "PartNumber"
F 6 "3000-0000000131" H 2300 1300 50  0001 C CNN "PartSpecification"
	1    2300 1300
	1    0    0    -1  
$EndComp
$Comp
L power:+3.3V #PWR?
U 1 1 5D7E32D0
P 2300 1000
F 0 "#PWR?" H 2300 850 50  0001 C CNN
F 1 "+3.3V" H 2315 1173 50  0000 C CNN
F 2 "" H 2300 1000 50  0001 C CNN
F 3 "" H 2300 1000 50  0001 C CNN
	1    2300 1000
	1    0    0    -1  
$EndComp
Wire Wire Line
	2300 1150 2300 1000
Wire Wire Line
	2300 1450 2300 1650
Wire Wire Line
	2300 1650 4300 1650
$Comp
L 000_PreferredParts:C_0_1uF C1701
U 1 1 5D7E3360
P 2100 1900
F 0 "C1701" H 2215 1946 50  0000 L CNN
F 1 "C_0_1uF" H 2215 1855 50  0000 L CNN
F 2 "Capacitor_SMD:C_0402_1005Metric" H 2138 1750 50  0001 C CNN
F 3 "" H 2100 1900 50  0001 C CNN
F 4 "Murata Electronics" H 2100 1900 50  0001 C CNN "Manufacturer"
F 5 "GRM155R62A104KE14D" H 2100 1900 50  0001 C CNN "PartNumber"
F 6 "3000-0000000125" H 0   0   50  0001 C CNN "PartSpecification"
	1    2100 1900
	1    0    0    -1  
$EndComp
Wire Wire Line
	2100 1750 2100 1650
Wire Wire Line
	2100 1650 2300 1650
Connection ~ 2300 1650
$Comp
L power:GND #PWR?
U 1 1 5D7E3417
P 2100 2150
F 0 "#PWR?" H 2100 1900 50  0001 C CNN
F 1 "GND" H 2105 1977 50  0000 C CNN
F 2 "" H 2100 2150 50  0001 C CNN
F 3 "" H 2100 2150 50  0001 C CNN
	1    2100 2150
	1    0    0    -1  
$EndComp
Wire Wire Line
	2100 2150 2100 2050
$Comp
L Switch:SW_Push SW1701
U 1 1 5D7E35A8
P 1250 1950
F 0 "SW1701" V 1204 2098 50  0000 L CNN
F 1 "SW_Push" V 1295 2098 50  0000 L CNN
F 2 "Button_Switch_SMD:SW_SPST_PTS645" H 1250 2150 50  0001 C CNN
F 3 "" H 1250 2150 50  0001 C CNN
F 4 "C&K" H 1250 1950 50  0001 C CNN "Manufacturer"
F 5 "PTS645SK43SMTR92 LFS" H 1250 1950 50  0001 C CNN "PartNumber"
F 6 "3000-0000000176" H 1250 1950 50  0001 C CNN "PartSpecification"
	1    1250 1950
	0    1    1    0   
$EndComp
$Comp
L Device:R R1703
U 1 1 5D7E3628
P 1800 1650
F 0 "R1703" V 1593 1650 50  0000 C CNN
F 1 "10" V 1684 1650 50  0000 C CNN
F 2 "Resistor_SMD:R_0402_1005Metric" V 1730 1650 50  0001 C CNN
F 3 "~" H 1800 1650 50  0001 C CNN
F 4 "Delta Electronics/Cyntec" H 1800 1650 50  0001 C CNN "Manufacturer"
F 5 "PFR05S-100-FNH" H 1800 1650 50  0001 C CNN "PartNumber"
F 6 "3000-0000000146" H 1800 1650 50  0001 C CNN "PartSpecification"
	1    1800 1650
	0    1    1    0   
$EndComp
Wire Wire Line
	1950 1650 2100 1650
Connection ~ 2100 1650
Wire Wire Line
	1650 1650 1250 1650
Wire Wire Line
	1250 1650 1250 1750
$Comp
L power:GND #PWR?
U 1 1 5D7E38B5
P 1250 2250
F 0 "#PWR?" H 1250 2000 50  0001 C CNN
F 1 "GND" H 1255 2077 50  0000 C CNN
F 2 "" H 1250 2250 50  0001 C CNN
F 3 "" H 1250 2250 50  0001 C CNN
	1    1250 2250
	1    0    0    -1  
$EndComp
Wire Wire Line
	6950 1650 7050 1650
NoConn ~ 7050 1650
$Comp
L Device:R R1704
U 1 1 5D7E4E7F
P 10600 2000
F 0 "R1704" H 10670 2046 50  0000 L CNN
F 1 "4.87k" H 10670 1955 50  0000 L CNN
F 2 "Resistor_SMD:R_0402_1005Metric" V 10530 2000 50  0001 C CNN
F 3 "~" H 10600 2000 50  0001 C CNN
F 4 "Stackpole Electronics Inc" H 10600 2000 50  0001 C CNN "Manufacturer"
F 5 "RMCF0402FT4K87" H 10600 2000 50  0001 C CNN "PartNumber"
F 6 "3000-0000000133" H 10600 2000 50  0001 C CNN "PartSpecification"
	1    10600 2000
	1    0    0    -1  
$EndComp
Wire Wire Line
	10600 1850 10600 1750
Wire Wire Line
	10600 1750 6950 1750
$Comp
L power:GND #PWR?
U 1 1 5D7E5112
P 10600 2250
F 0 "#PWR?" H 10600 2000 50  0001 C CNN
F 1 "GND" H 10605 2077 50  0000 C CNN
F 2 "" H 10600 2250 50  0001 C CNN
F 3 "" H 10600 2250 50  0001 C CNN
	1    10600 2250
	1    0    0    -1  
$EndComp
Wire Wire Line
	10600 2250 10600 2150
$Comp
L Device:Crystal Y1701
U 1 1 5D7E5640
P 10050 2150
F 0 "Y1701" V 10004 2281 50  0000 L CNN
F 1 "Crystal" V 10095 2281 50  0000 L CNN
F 2 "Crystal:Crystal_SMD_3215-2Pin_3.2x1.5mm" H 10050 2150 50  0001 C CNN
F 3 "~" H 10050 2150 50  0001 C CNN
F 4 "ECS-.327-7-34B-C-TR" V 10050 2150 50  0001 C CNN "PartNumber"
F 5 "ECS Inc." H 10050 2150 50  0001 C CNN "Manufacturer"
F 6 "3000-0000000140" H 10050 2150 50  0001 C CNN "PartSpecification"
	1    10050 2150
	0    1    1    0   
$EndComp
$Comp
L Device:C C1703
U 1 1 5D7E577B
P 9500 2500
F 0 "C1703" H 9615 2546 50  0000 L CNN
F 1 "12pF" H 9615 2455 50  0000 L CNN
F 2 "Capacitor_SMD:C_0402_1005Metric" H 9538 2350 50  0001 C CNN
F 3 "~" H 9500 2500 50  0001 C CNN
F 4 "Murata Electronics" H 9500 2500 50  0001 C CNN "Manufacturer"
F 5 "GRM1555C1H120JA01D" H 9500 2500 50  0001 C CNN "PartNumber"
F 6 "3000-0000000179" H 9500 2500 50  0001 C CNN "PartSpecification"
	1    9500 2500
	1    0    0    -1  
$EndComp
$Comp
L Device:C C1702
U 1 1 5D7E57EB
P 9000 2500
F 0 "C1702" H 9115 2546 50  0000 L CNN
F 1 "12pF" H 9115 2455 50  0000 L CNN
F 2 "Capacitor_SMD:C_0402_1005Metric" H 9038 2350 50  0001 C CNN
F 3 "~" H 9000 2500 50  0001 C CNN
F 4 "Murata Electronics" H 9000 2500 50  0001 C CNN "Manufacturer"
F 5 "GRM1555C1H120JA01D" H 9000 2500 50  0001 C CNN "PartNumber"
F 6 "3000-0000000179" H 9000 2500 50  0001 C CNN "PartSpecification"
	1    9000 2500
	1    0    0    -1  
$EndComp
Wire Wire Line
	6950 2000 9000 2000
Wire Wire Line
	10050 2300 9500 2300
Wire Wire Line
	9000 2350 9000 2000
Connection ~ 9000 2000
Wire Wire Line
	9000 2000 10050 2000
Wire Wire Line
	9500 2350 9500 2300
Connection ~ 9500 2300
Wire Wire Line
	9500 2300 6950 2300
$Comp
L power:GND #PWR?
U 1 1 5D7E7610
P 9500 2750
F 0 "#PWR?" H 9500 2500 50  0001 C CNN
F 1 "GND" H 9505 2577 50  0000 C CNN
F 2 "" H 9500 2750 50  0001 C CNN
F 3 "" H 9500 2750 50  0001 C CNN
	1    9500 2750
	1    0    0    -1  
$EndComp
Wire Wire Line
	9500 2750 9500 2650
$Comp
L power:GND #PWR?
U 1 1 5D7E7965
P 9000 2750
F 0 "#PWR?" H 9000 2500 50  0001 C CNN
F 1 "GND" H 9005 2577 50  0000 C CNN
F 2 "" H 9000 2750 50  0001 C CNN
F 3 "" H 9000 2750 50  0001 C CNN
	1    9000 2750
	1    0    0    -1  
$EndComp
Wire Wire Line
	9000 2750 9000 2650
$Comp
L Device:C C1705
U 1 1 5D7E82B6
P 7550 3000
F 0 "C1705" H 7665 3046 50  0000 L CNN
F 1 "12pF" H 7665 2955 50  0000 L CNN
F 2 "Capacitor_SMD:C_0402_1005Metric" H 7588 2850 50  0001 C CNN
F 3 "~" H 7550 3000 50  0001 C CNN
F 4 "Murata Electronics" H 7550 3000 50  0001 C CNN "Manufacturer"
F 5 "GRM1555C1H120JA01D" H 7550 3000 50  0001 C CNN "PartNumber"
F 6 "3000-0000000179" H 7550 3000 50  0001 C CNN "PartSpecification"
	1    7550 3000
	1    0    0    -1  
$EndComp
$Comp
L Device:C C1704
U 1 1 5D7E82BC
P 7050 3000
F 0 "C1704" H 7165 3046 50  0000 L CNN
F 1 "12pF" H 7165 2955 50  0000 L CNN
F 2 "Capacitor_SMD:C_0402_1005Metric" H 7088 2850 50  0001 C CNN
F 3 "~" H 7050 3000 50  0001 C CNN
F 4 "Murata Electronics" H 7050 3000 50  0001 C CNN "Manufacturer"
F 5 "GRM1555C1H120JA01D" H 7050 3000 50  0001 C CNN "PartNumber"
F 6 "3000-0000000179" H 7050 3000 50  0001 C CNN "PartSpecification"
	1    7050 3000
	1    0    0    -1  
$EndComp
Wire Wire Line
	6950 2500 7050 2500
Wire Wire Line
	8150 2800 7550 2800
Wire Wire Line
	7050 2850 7050 2500
Wire Wire Line
	7550 2850 7550 2800
Connection ~ 7550 2800
Wire Wire Line
	7550 2800 6950 2800
$Comp
L power:GND #PWR?
U 1 1 5D7E82CA
P 7550 3250
F 0 "#PWR?" H 7550 3000 50  0001 C CNN
F 1 "GND" H 7555 3077 50  0000 C CNN
F 2 "" H 7550 3250 50  0001 C CNN
F 3 "" H 7550 3250 50  0001 C CNN
	1    7550 3250
	1    0    0    -1  
$EndComp
Wire Wire Line
	7550 3250 7550 3150
$Comp
L power:GND #PWR?
U 1 1 5D7E82D1
P 7050 3250
F 0 "#PWR?" H 7050 3000 50  0001 C CNN
F 1 "GND" H 7055 3077 50  0000 C CNN
F 2 "" H 7050 3250 50  0001 C CNN
F 3 "" H 7050 3250 50  0001 C CNN
	1    7050 3250
	1    0    0    -1  
$EndComp
Wire Wire Line
	7050 3250 7050 3150
$Comp
L Device:Crystal_GND24 Y1702
U 1 1 5D7EA536
P 8150 2650
F 0 "Y1702" V 8104 2891 50  0000 L CNN
F 1 "Crystal_GND24" V 8195 2891 50  0000 L CNN
F 2 "Crystal:Crystal_SMD_3225-4Pin_3.2x2.5mm" H 8150 2650 50  0001 C CNN
F 3 "~" H 8150 2650 50  0001 C CNN
F 4 "FA-238 25.0000MB-C3" V 8150 2650 50  0001 C CNN "PartNumber"
F 5 "EPSON" H 8150 2650 50  0001 C CNN "Manufacturer"
F 6 "3000-0000000155" H 8150 2650 50  0001 C CNN "PartSpecification"
	1    8150 2650
	0    1    1    0   
$EndComp
$Comp
L power:GND #PWR?
U 1 1 5D7EB1F8
P 7950 2950
F 0 "#PWR?" H 7950 2700 50  0001 C CNN
F 1 "GND" H 7955 2777 50  0000 C CNN
F 2 "" H 7950 2950 50  0001 C CNN
F 3 "" H 7950 2950 50  0001 C CNN
	1    7950 2950
	1    0    0    -1  
$EndComp
$Comp
L power:GND #PWR?
U 1 1 5D7EB21D
P 8350 2950
F 0 "#PWR?" H 8350 2700 50  0001 C CNN
F 1 "GND" H 8355 2777 50  0000 C CNN
F 2 "" H 8350 2950 50  0001 C CNN
F 3 "" H 8350 2950 50  0001 C CNN
	1    8350 2950
	1    0    0    -1  
$EndComp
Wire Wire Line
	8350 2950 8350 2650
Wire Wire Line
	7950 2650 7950 2950
Wire Wire Line
	5350 2400 2950 2400
Wire Wire Line
	2950 2400 2950 4150
Wire Wire Line
	3050 2300 5350 2300
$Comp
L power:+3.3V #PWR?
U 1 1 5D7EFAE3
P 5350 4300
F 0 "#PWR?" H 5350 4150 50  0001 C CNN
F 1 "+3.3V" H 5365 4473 50  0000 C CNN
F 2 "" H 5350 4300 50  0001 C CNN
F 3 "" H 5350 4300 50  0001 C CNN
	1    5350 4300
	1    0    0    -1  
$EndComp
$Comp
L 000_PreferredParts:C_0_1uF C1709
U 1 1 5D7EFB0A
P 5350 4950
F 0 "C1709" H 5465 4996 50  0000 L CNN
F 1 "C_0_1uF" H 5465 4905 50  0000 L CNN
F 2 "Capacitor_SMD:C_0402_1005Metric" H 5388 4800 50  0001 C CNN
F 3 "" H 5350 4950 50  0001 C CNN
F 4 "Murata Electronics" H 5350 4950 50  0001 C CNN "Manufacturer"
F 5 "GRM155R62A104KE14D" H 5350 4950 50  0001 C CNN "PartNumber"
F 6 "3000-0000000125" H 0   50  50  0001 C CNN "PartSpecification"
	1    5350 4950
	1    0    0    -1  
$EndComp
$Comp
L power:GND #PWR?
U 1 1 5D7F04DE
P 5350 5150
F 0 "#PWR?" H 5350 4900 50  0001 C CNN
F 1 "GND" H 5355 4977 50  0000 C CNN
F 2 "" H 5350 5150 50  0001 C CNN
F 3 "" H 5350 5150 50  0001 C CNN
	1    5350 5150
	1    0    0    -1  
$EndComp
Wire Wire Line
	5350 5150 5350 5100
Connection ~ 5350 4450
Wire Wire Line
	5350 4450 5350 4300
Wire Wire Line
	2850 2000 5350 2000
Wire Wire Line
	2750 1900 5350 1900
$Comp
L POWDER_ESD:RClamp2502L U1702
U 1 1 5D7F4913
P 1800 4950
F 0 "U1702" H 1800 5716 50  0000 C CNN
F 1 "RClamp2502L" H 1800 5625 50  0000 C CNN
F 2 "Package_SO:SOIC-8_3.9x4.9mm_P1.27mm" H 1750 5850 50  0001 C CNN
F 3 "" H 1750 5850 50  0001 C CNN
F 4 "Semtech Corporation" H 1800 4950 50  0001 C CNN "Manufacturer"
F 5 "RCLAMP2502L.TBT" H 1800 4950 50  0001 C CNN "PartNumber"
F 6 "3000-0000000083" H 1800 4950 50  0001 C CNN "PartSpecification"
	1    1800 4950
	1    0    0    -1  
$EndComp
$Comp
L POWDER_ESD:RClamp2502L U1701
U 1 1 5D7F49A9
P 1800 3350
F 0 "U1701" H 1800 4116 50  0000 C CNN
F 1 "RClamp2502L" H 1800 4025 50  0000 C CNN
F 2 "Package_SO:SOIC-8_3.9x4.9mm_P1.27mm" H 1750 4250 50  0001 C CNN
F 3 "" H 1750 4250 50  0001 C CNN
F 4 "Semtech Corporation" H 1800 3350 50  0001 C CNN "Manufacturer"
F 5 "RCLAMP2502L.TBT" H 1800 3350 50  0001 C CNN "PartNumber"
F 6 "3000-0000000083" H 1800 3350 50  0001 C CNN "PartSpecification"
	1    1800 3350
	1    0    0    -1  
$EndComp
Wire Wire Line
	1050 2850 1050 2500
Wire Wire Line
	1050 2500 2550 2500
Wire Wire Line
	2550 2500 2550 2850
Wire Wire Line
	2550 2850 2750 2850
Connection ~ 2550 2850
Connection ~ 2750 2850
Wire Wire Line
	2750 2850 2750 1900
Wire Wire Line
	1050 3850 1050 4100
Wire Wire Line
	1050 4100 2550 4100
Wire Wire Line
	2550 4100 2550 3850
Wire Wire Line
	2750 3850 2750 2850
Connection ~ 2550 3850
NoConn ~ 1050 3200
NoConn ~ 1050 3300
NoConn ~ 1050 3400
NoConn ~ 1050 3500
Text Label 3200 1900 0    50   ~ 0
RX_IN_N
Text Label 3200 2000 0    50   ~ 0
RX_IN_P
Text Label 3200 2300 0    50   ~ 0
TX_OUT_N
Text Label 3200 2400 0    50   ~ 0
TX_OUT_P
$Comp
L 000_PreferredParts:C_0_1uF C1706
U 1 1 5D7FF1C3
P 3250 3250
F 0 "C1706" H 3365 3296 50  0000 L CNN
F 1 "C_0_1uF" H 3365 3205 50  0000 L CNN
F 2 "Capacitor_SMD:C_0402_1005Metric" H 3288 3100 50  0001 C CNN
F 3 "" H 3250 3250 50  0001 C CNN
F 4 "Murata Electronics" H 3250 3250 50  0001 C CNN "Manufacturer"
F 5 "GRM155R62A104KE14D" H 3250 3250 50  0001 C CNN "PartNumber"
F 6 "3000-0000000125" H 0   0   50  0001 C CNN "PartSpecification"
	1    3250 3250
	1    0    0    -1  
$EndComp
$Comp
L 000_PreferredParts:C_0_1uF C1707
U 1 1 5D7FF245
P 5400 3250
F 0 "C1707" H 5515 3296 50  0000 L CNN
F 1 "C_0_1uF" H 5515 3205 50  0000 L CNN
F 2 "Capacitor_SMD:C_0402_1005Metric" H 5438 3100 50  0001 C CNN
F 3 "" H 5400 3250 50  0001 C CNN
F 4 "Murata Electronics" H 5400 3250 50  0001 C CNN "Manufacturer"
F 5 "GRM155R62A104KE14D" H 5400 3250 50  0001 C CNN "PartNumber"
F 6 "3000-0000000125" H 0   0   50  0001 C CNN "PartSpecification"
	1    5400 3250
	1    0    0    -1  
$EndComp
$Comp
L Device:R R1705
U 1 1 5D7FF2B1
P 3750 3250
F 0 "R1705" H 3820 3296 50  0000 L CNN
F 1 "49.9" H 3820 3205 50  0000 L CNN
F 2 "Resistor_SMD:R_0402_1005Metric" V 3680 3250 50  0001 C CNN
F 3 "~" H 3750 3250 50  0001 C CNN
F 4 "Stackpole Electronics Inc" H 3750 3250 50  0001 C CNN "Manufacturer"
F 5 "" H 3750 3250 50  0001 C CNN "PartNumber"
F 6 "3000-0000000577" H 3750 3250 50  0001 C CNN "PartSpecification"
	1    3750 3250
	1    0    0    -1  
$EndComp
$Comp
L Device:R R1708
U 1 1 5D7FF384
P 5000 3250
F 0 "R1708" H 5070 3296 50  0000 L CNN
F 1 "49.9" H 5070 3205 50  0000 L CNN
F 2 "Resistor_SMD:R_0402_1005Metric" V 4930 3250 50  0001 C CNN
F 3 "~" H 5000 3250 50  0001 C CNN
F 4 "Stackpole Electronics Inc" H 5000 3250 50  0001 C CNN "Manufacturer"
F 5 "" H 5000 3250 50  0001 C CNN "PartNumber"
F 6 "3000-0000000577" H 5000 3250 50  0001 C CNN "PartSpecification"
	1    5000 3250
	1    0    0    -1  
$EndComp
$Comp
L Device:R R1706
U 1 1 5D7FF3D0
P 4150 3250
F 0 "R1706" H 4220 3296 50  0000 L CNN
F 1 "49.9" H 4220 3205 50  0000 L CNN
F 2 "Resistor_SMD:R_0402_1005Metric" V 4080 3250 50  0001 C CNN
F 3 "~" H 4150 3250 50  0001 C CNN
F 4 "Stackpole Electronics Inc" H 4150 3250 50  0001 C CNN "Manufacturer"
F 5 "" H 4150 3250 50  0001 C CNN "PartNumber"
F 6 "3000-0000000577" H 4150 3250 50  0001 C CNN "PartSpecification"
	1    4150 3250
	1    0    0    -1  
$EndComp
$Comp
L Device:R R1707
U 1 1 5D7FF434
P 4550 3250
F 0 "R1707" H 4620 3296 50  0000 L CNN
F 1 "49.9" H 4620 3205 50  0000 L CNN
F 2 "Resistor_SMD:R_0402_1005Metric" V 4480 3250 50  0001 C CNN
F 3 "~" H 4550 3250 50  0001 C CNN
F 4 "Stackpole Electronics Inc" H 4550 3250 50  0001 C CNN "Manufacturer"
F 5 "" H 4550 3250 50  0001 C CNN "PartNumber"
F 6 "3000-0000000577" H 4550 3250 50  0001 C CNN "PartSpecification"
	1    4550 3250
	1    0    0    -1  
$EndComp
$Comp
L power:+3.3V #PWR?
U 1 1 5D8061FB
P 3250 2950
F 0 "#PWR?" H 3250 2800 50  0001 C CNN
F 1 "+3.3V" H 3265 3123 50  0000 C CNN
F 2 "" H 3250 2950 50  0001 C CNN
F 3 "" H 3250 2950 50  0001 C CNN
	1    3250 2950
	1    0    0    -1  
$EndComp
Wire Wire Line
	3250 3100 3250 3050
Wire Wire Line
	3250 3050 3750 3050
Wire Wire Line
	5400 3050 5400 3100
Connection ~ 3250 3050
Wire Wire Line
	3250 3050 3250 2950
Wire Wire Line
	5000 3100 5000 3050
Connection ~ 5000 3050
Wire Wire Line
	5000 3050 5400 3050
Wire Wire Line
	4550 3050 4550 3100
Connection ~ 4550 3050
Wire Wire Line
	4550 3050 5000 3050
Wire Wire Line
	4150 3100 4150 3050
Connection ~ 4150 3050
Wire Wire Line
	4150 3050 4550 3050
Wire Wire Line
	3750 3100 3750 3050
Connection ~ 3750 3050
Wire Wire Line
	3750 3050 4150 3050
$Comp
L power:GND #PWR?
U 1 1 5D80F01B
P 3250 3500
F 0 "#PWR?" H 3250 3250 50  0001 C CNN
F 1 "GND" H 3255 3327 50  0000 C CNN
F 2 "" H 3250 3500 50  0001 C CNN
F 3 "" H 3250 3500 50  0001 C CNN
	1    3250 3500
	1    0    0    -1  
$EndComp
$Comp
L power:GND #PWR?
U 1 1 5D80F099
P 5400 3500
F 0 "#PWR?" H 5400 3250 50  0001 C CNN
F 1 "GND" H 5405 3327 50  0000 C CNN
F 2 "" H 5400 3500 50  0001 C CNN
F 3 "" H 5400 3500 50  0001 C CNN
	1    5400 3500
	1    0    0    -1  
$EndComp
Wire Wire Line
	5400 3500 5400 3400
Wire Wire Line
	3250 3500 3250 3400
Wire Wire Line
	1050 4450 1050 4250
Wire Wire Line
	1050 4250 2550 4250
Wire Wire Line
	2550 4250 2550 4450
Wire Wire Line
	2550 4450 2950 4450
Connection ~ 2550 4450
Wire Wire Line
	3050 5450 2550 5450
Wire Wire Line
	2550 5650 2550 5450
Connection ~ 2550 5450
Wire Wire Line
	2550 5650 1050 5650
Wire Wire Line
	1050 5650 1050 5450
Wire Wire Line
	3050 2300 3050 4350
Connection ~ 2950 4150
Wire Wire Line
	2950 4150 2950 4450
Connection ~ 3050 4350
Wire Wire Line
	3050 4350 3050 5450
Wire Wire Line
	2850 2000 2850 3850
Wire Wire Line
	2750 4750 5000 4750
Wire Wire Line
	2750 3850 2750 4750
Wire Wire Line
	5000 3400 5000 4750
Connection ~ 5000 4750
Wire Wire Line
	4150 3400 4150 4350
Connection ~ 4150 4350
Wire Wire Line
	4150 4350 3050 4350
Wire Wire Line
	3750 3400 3750 4150
Connection ~ 3750 4150
Wire Wire Line
	3750 4150 2950 4150
Text Label 7450 2500 0    50   ~ 0
OSC_24_0
Text Label 7450 2800 0    50   ~ 0
OSC_24_1
Text Label 7450 2000 0    50   ~ 0
XOSC_32_0
Text Label 7450 2300 0    50   ~ 0
XOSC_32_1
Text Label 7450 1750 0    50   ~ 0
RBIAS
Text Label 3200 1550 0    50   ~ 0
WAKE_N
Text Label 3200 1650 0    50   ~ 0
RST_N
Text Label 1250 1650 0    50   ~ 0
RST_SW
Wire Wire Line
	1250 2150 1250 2250
Text HLabel 4200 1750 0    50   Input ~ 0
RST
Wire Wire Line
	4200 1750 4300 1750
Wire Wire Line
	4300 1750 4300 1650
Connection ~ 4300 1650
Wire Wire Line
	4300 1650 5350 1650
Wire Wire Line
	5350 4450 5650 4450
Wire Wire Line
	2850 4550 4550 4550
Wire Wire Line
	4550 3400 4550 4550
Connection ~ 4550 4550
Connection ~ 2850 3850
Wire Wire Line
	2850 3850 2850 4550
Wire Wire Line
	2550 3850 2850 3850
$Comp
L 000_PreferredParts:C_0_1uF C1708
U 1 1 5D690905
P 6050 3250
F 0 "C1708" H 6165 3296 50  0000 L CNN
F 1 "C_0_1uF" H 6165 3205 50  0000 L CNN
F 2 "Capacitor_SMD:C_0402_1005Metric" H 6088 3100 50  0001 C CNN
F 3 "" H 6050 3250 50  0001 C CNN
F 4 "Murata Electronics" H 6050 3250 50  0001 C CNN "Manufacturer"
F 5 "GRM155R62A104KE14D" H 6050 3250 50  0001 C CNN "PartNumber"
F 6 "3000-0000000125" H 0   0   50  0001 C CNN "PartSpecification"
	1    6050 3250
	1    0    0    -1  
$EndComp
$Comp
L power:GND #PWR?
U 1 1 5D690DAF
P 6050 3500
F 0 "#PWR?" H 6050 3250 50  0001 C CNN
F 1 "GND" H 6055 3327 50  0000 C CNN
F 2 "" H 6050 3500 50  0001 C CNN
F 3 "" H 6050 3500 50  0001 C CNN
	1    6050 3500
	1    0    0    -1  
$EndComp
Wire Wire Line
	6050 3400 6050 3500
Wire Wire Line
	6050 3100 6050 3050
Wire Wire Line
	6050 3050 5400 3050
Connection ~ 5400 3050
NoConn ~ 1050 4800
NoConn ~ 1050 4900
NoConn ~ 1050 5000
NoConn ~ 1050 5100
$Comp
L Transformer:PT61017PEL TR1601
U 1 1 61AA0AE7
P 6300 4450
F 0 "TR1601" H 6300 4992 50  0000 C CNN
F 1 "PT61017PEL" H 6300 4901 50  0000 C CNN
F 2 "Transformer_SMD:Transformer_Ethernet_Bourns_PT61017PEL" H 6300 3950 50  0001 C CNN
F 3 "https://www.bourns.com/docs/Product-Datasheets/PT61017PEL.pdf" H 5600 4800 50  0001 C CNN
F 4 "PT61017PEL,S558-5500-25-F,B78476A8065A003" H 6300 4450 50  0001 C CNN "PartNumber"
F 5 "3000-0000001306" H 6300 4450 50  0001 C CNN "PartSpecification"
	1    6300 4450
	1    0    0    -1  
$EndComp
Wire Wire Line
	3750 4150 5900 4150
Wire Wire Line
	4150 4350 5900 4350
Wire Wire Line
	4550 4550 5900 4550
Wire Wire Line
	5900 4250 5650 4250
Wire Wire Line
	5650 4250 5650 4450
Wire Wire Line
	5650 4450 5650 4650
Wire Wire Line
	5650 4650 5900 4650
Connection ~ 5650 4450
$Comp
L Connector:RJ45_Shielded J1604
U 1 1 61AD8C39
P 8700 4550
F 0 "J1604" H 8370 4589 50  0000 R CNN
F 1 "RJ45_Shielded" H 8370 4498 50  0000 R CNN
F 2 "POWDER_Misc:MTJ-88TX1-FSD-PGB" V 8700 4575 50  0001 C CNN
F 3 "~" V 8700 4575 50  0001 C CNN
F 4 "3000-0000000491" H 8700 4550 50  0001 C CNN "PartSpecification"
	1    8700 4550
	-1   0    0    -1  
$EndComp
Wire Wire Line
	6700 4150 7000 4150
Wire Wire Line
	6700 4350 7000 4350
Text Label 6800 4150 0    50   ~ 0
TX_RJ_P
Text Label 6800 4350 0    50   ~ 0
TX_RJ_N
Wire Wire Line
	6700 4550 7000 4550
Wire Wire Line
	6700 4750 7000 4750
Text Label 6800 4550 0    50   ~ 0
RX_RJ_P
Text Label 6800 4750 0    50   ~ 0
RX_RJ_N
Wire Wire Line
	8000 4850 8300 4850
Text Label 8000 4850 0    50   ~ 0
TX_RJ_P
Wire Wire Line
	8000 4750 8300 4750
Text Label 8000 4750 0    50   ~ 0
TX_RJ_N
Wire Wire Line
	8000 4650 8300 4650
Text Label 8000 4650 0    50   ~ 0
RX_RJ_P
Wire Wire Line
	8000 4350 8300 4350
Text Label 8000 4350 0    50   ~ 0
RX_RJ_N
Wire Wire Line
	8300 4250 8300 4200
Wire Wire Line
	8300 4450 8300 4500
$Comp
L power:GND #PWR?
U 1 1 61B061A8
P 8700 5150
F 0 "#PWR?" H 8700 4900 50  0001 C CNN
F 1 "GND" H 8705 4977 50  0000 C CNN
F 2 "" H 8700 5150 50  0001 C CNN
F 3 "" H 8700 5150 50  0001 C CNN
	1    8700 5150
	1    0    0    -1  
$EndComp
Wire Wire Line
	8700 5150 8700 5050
$Comp
L Device:R R1604
U 1 1 61B1965D
P 7250 4250
F 0 "R1604" H 7320 4296 50  0000 L CNN
F 1 "75.0" H 7320 4205 50  0000 L CNN
F 2 "Resistor_SMD:R_0402_1005Metric" V 7180 4250 50  0001 C CNN
F 3 "~" H 7250 4250 50  0001 C CNN
F 4 "" H 7250 4250 50  0001 C CNN "Manufacturer"
F 5 "" H 7250 4250 50  0001 C CNN "PartNumber"
F 6 "3000-0000001289" H 7250 4250 50  0001 C CNN "PartSpecification"
	1    7250 4250
	0    -1   -1   0   
$EndComp
$Comp
L Device:R R1609
U 1 1 61B1B844
P 7250 4650
F 0 "R1609" H 7320 4696 50  0000 L CNN
F 1 "75.0" H 7320 4605 50  0000 L CNN
F 2 "Resistor_SMD:R_0402_1005Metric" V 7180 4650 50  0001 C CNN
F 3 "~" H 7250 4650 50  0001 C CNN
F 4 "" H 7250 4650 50  0001 C CNN "Manufacturer"
F 5 "" H 7250 4650 50  0001 C CNN "PartNumber"
F 6 "3000-0000001289" H 7250 4650 50  0001 C CNN "PartSpecification"
	1    7250 4650
	0    -1   -1   0   
$EndComp
$Comp
L Device:R R1608
U 1 1 61B21178
P 7750 4500
F 0 "R1608" H 7820 4546 50  0000 L CNN
F 1 "75.0" H 7820 4455 50  0000 L CNN
F 2 "Resistor_SMD:R_0402_1005Metric" V 7680 4500 50  0001 C CNN
F 3 "~" H 7750 4500 50  0001 C CNN
F 4 "" H 7750 4500 50  0001 C CNN "Manufacturer"
F 5 "" H 7750 4500 50  0001 C CNN "PartNumber"
F 6 "3000-0000001289" H 7750 4500 50  0001 C CNN "PartSpecification"
	1    7750 4500
	0    -1   -1   0   
$EndComp
$Comp
L Device:R R1603
U 1 1 61B2195D
P 7750 4200
F 0 "R1603" H 7820 4246 50  0000 L CNN
F 1 "75.0" H 7820 4155 50  0000 L CNN
F 2 "Resistor_SMD:R_0402_1005Metric" V 7680 4200 50  0001 C CNN
F 3 "~" H 7750 4200 50  0001 C CNN
F 4 "" H 7750 4200 50  0001 C CNN "Manufacturer"
F 5 "" H 7750 4200 50  0001 C CNN "PartNumber"
F 6 "3000-0000001289" H 7750 4200 50  0001 C CNN "PartSpecification"
	1    7750 4200
	0    -1   -1   0   
$EndComp
Wire Wire Line
	6700 4250 7100 4250
Wire Wire Line
	7100 4650 6700 4650
Wire Wire Line
	7400 4650 7500 4650
Wire Wire Line
	7500 4650 7500 4500
Wire Wire Line
	7500 4200 7600 4200
Wire Wire Line
	7500 4250 7400 4250
Connection ~ 7500 4250
Wire Wire Line
	7500 4250 7500 4200
Wire Wire Line
	7500 4500 7600 4500
Connection ~ 7500 4500
Wire Wire Line
	7500 4500 7500 4250
Wire Wire Line
	7900 4500 8300 4500
Connection ~ 8300 4500
Wire Wire Line
	8300 4500 8300 4550
Wire Wire Line
	8300 4200 7900 4200
Connection ~ 8300 4200
Wire Wire Line
	8300 4200 8300 4150
$Comp
L Device:LED D?
U 1 1 61B4A9F5
P 9500 5250
AR Path="/60834A7B/6083FA27/61B4A9F5" Ref="D?"  Part="1" 
AR Path="/60834A7B/6083FA2C/61B4A9F5" Ref="D1604"  Part="1" 
F 0 "D1604" H 9500 5350 50  0000 C CNN
F 1 "RED LED" H 9500 5100 50  0000 C CNN
F 2 "LED_SMD:LED_0805_2012Metric_Castellated" H 9500 5250 50  0001 C CNN
F 3 "~" H 9500 5250 50  0001 C CNN
F 4 "3000-0000000214" H 9500 5250 50  0001 C CNN "PartSpecification"
	1    9500 5250
	0    -1   -1   0   
$EndComp
$Comp
L Device:LED D?
U 1 1 61B4A9FC
P 9250 5250
AR Path="/60834A7B/6083FA27/61B4A9FC" Ref="D?"  Part="1" 
AR Path="/60834A7B/6083FA2C/61B4A9FC" Ref="D1601"  Part="1" 
F 0 "D1601" H 9250 5350 50  0000 C CNN
F 1 "GREEN LED" H 9250 5450 50  0000 C CNN
F 2 "LED_SMD:LED_0805_2012Metric_Castellated" H 9250 5250 50  0001 C CNN
F 3 "~" H 9250 5250 50  0001 C CNN
F 4 "3000-0000000211" H 9250 5250 50  0001 C CNN "PartSpecification"
	1    9250 5250
	0    -1   -1   0   
$EndComp
Wire Wire Line
	9250 5100 9250 4800
Wire Wire Line
	9250 5500 9250 5400
Wire Wire Line
	9500 5400 9500 5500
Wire Wire Line
	9500 5000 9500 5100
$Comp
L Device:R R?
U 1 1 61B5273E
P 9900 4800
AR Path="/60834A7B/6083FA27/61B5273E" Ref="R?"  Part="1" 
AR Path="/60834A7B/6083FA2C/61B5273E" Ref="R1612"  Part="1" 
F 0 "R1612" V 9980 4800 50  0000 C CNN
F 1 "66.5" V 9900 4800 50  0000 C CNN
F 2 "Resistor_SMD:R_0402_1005Metric" V 9830 4800 50  0001 C CNN
F 3 "~" H 9900 4800 50  0001 C CNN
F 4 "3000-0000000242" V 9900 4800 50  0001 C CNN "PartSpecification"
	1    9900 4800
	0    1    1    0   
$EndComp
$Comp
L Device:R R?
U 1 1 61B52745
P 9900 5000
AR Path="/60834A7B/6083FA27/61B52745" Ref="R?"  Part="1" 
AR Path="/60834A7B/6083FA2C/61B52745" Ref="R1613"  Part="1" 
F 0 "R1613" V 9980 5000 50  0000 C CNN
F 1 "66.5" V 9900 5000 50  0000 C CNN
F 2 "Resistor_SMD:R_0402_1005Metric" V 9830 5000 50  0001 C CNN
F 3 "~" H 9900 5000 50  0001 C CNN
F 4 "3000-0000000242" V 9900 5000 50  0001 C CNN "PartSpecification"
	1    9900 5000
	0    1    1    0   
$EndComp
Wire Wire Line
	9500 5000 9750 5000
Wire Wire Line
	9250 4800 9750 4800
Text HLabel 10250 4800 2    50   Input ~ 0
G_LED
Text HLabel 10250 5000 2    50   Input ~ 0
R_LED
$Comp
L power:GND #PWR?
U 1 1 61B64CBC
P 9250 5500
F 0 "#PWR?" H 9250 5250 50  0001 C CNN
F 1 "GND" H 9255 5327 50  0000 C CNN
F 2 "" H 9250 5500 50  0001 C CNN
F 3 "" H 9250 5500 50  0001 C CNN
	1    9250 5500
	1    0    0    -1  
$EndComp
$Comp
L power:GND #PWR?
U 1 1 61B651B9
P 9500 5500
F 0 "#PWR?" H 9500 5250 50  0001 C CNN
F 1 "GND" H 9505 5327 50  0000 C CNN
F 2 "" H 9500 5500 50  0001 C CNN
F 3 "" H 9500 5500 50  0001 C CNN
	1    9500 5500
	1    0    0    -1  
$EndComp
Wire Wire Line
	10050 5000 10250 5000
Wire Wire Line
	10250 4800 10050 4800
Text Label 8000 4200 0    50   ~ 0
P78
Text Label 8000 4500 0    50   ~ 0
P45
Text Label 6800 4650 0    50   ~ 0
RX_RJ_CT
Text Label 6800 4250 0    50   ~ 0
TX_RJ_CT
$Comp
L 000_PreferredParts:C_1000pF C1604
U 1 1 61BBDAC3
P 7500 5000
F 0 "C1604" H 7615 5046 50  0000 L CNN
F 1 "C_1000pF" H 7615 4955 50  0000 L CNN
F 2 "Capacitor_SMD:C_0402_1005Metric" H 7538 4850 50  0001 C CNN
F 3 "" H 7500 5000 50  0001 C CNN
F 4 "3000-0000000128" H 7500 5000 50  0001 C CNN "PartSpecification"
	1    7500 5000
	1    0    0    -1  
$EndComp
Wire Wire Line
	7500 4850 7500 4650
Connection ~ 7500 4650
$Comp
L power:GND #PWR?
U 1 1 61BCEA85
P 7500 5200
F 0 "#PWR?" H 7500 4950 50  0001 C CNN
F 1 "GND" H 7505 5027 50  0000 C CNN
F 2 "" H 7500 5200 50  0001 C CNN
F 3 "" H 7500 5200 50  0001 C CNN
	1    7500 5200
	1    0    0    -1  
$EndComp
Wire Wire Line
	7500 5200 7500 5150
Connection ~ 7050 2500
Wire Wire Line
	7050 2500 8150 2500
Wire Wire Line
	5350 4450 5350 4800
Wire Wire Line
	5000 4750 5900 4750
Text Label 9700 4800 2    50   ~ 0
G_LED_R
Text Label 9700 5000 2    50   ~ 0
R_LED_R
Text Label 7500 4750 0    50   ~ 0
P_TERM
$EndSCHEMATC
