EESchema Schematic File Version 4
EELAYER 30 0
EELAYER END
$Descr A4 11693 8268
encoding utf-8
Sheet 31 39
Title ""
Date ""
Rev ""
Comp ""
Comment1 ""
Comment2 ""
Comment3 ""
Comment4 ""
$EndDescr
$Comp
L POWDER_Digital:10M50DAF256 U2201
U 11 1 5FA02824
P 4100 3900
F 0 "U2201" H 4100 4050 50  0000 C CNN
F 1 "‎10M08DAF256C8G" H 4100 3900 50  0000 C CNN
F 2 "Package_BGA:BGA-256_17.0x17.0mm_Layout16x16_P1.0mm_Ball0.5mm_Pad0.4mm_NSMD" H 4100 3900 50  0001 C CNN
F 3 "" H 4100 3900 50  0001 C CNN
F 4 "3000-0000001300" H 4100 3900 50  0001 C CNN "PartSpecification"
	11   4100 3900
	1    0    0    -1  
$EndComp
$Comp
L Device:Ferrite_Bead_Small FB3204
U 1 1 5FAE6A67
P 3550 2150
F 0 "FB3204" H 3625 2200 50  0000 L CNN
F 1 "Ferrite_Bead_Small" H 3625 2100 50  0000 L CNN
F 2 "Inductor_SMD:L_0603_1608Metric" V 3480 2150 50  0001 C CNN
F 3 "~" H 3550 2150 50  0001 C CNN
F 4 "BLM18KG221SH1D" H 3550 2150 50  0001 C CNN "PartNumber"
	1    3550 2150
	1    0    0    -1  
$EndComp
$Comp
L Device:Ferrite_Bead_Small FB3203
U 1 1 5FAE74B0
P 3650 1900
F 0 "FB3203" H 3725 1950 50  0000 L CNN
F 1 "Ferrite_Bead_Small" H 3725 1850 50  0000 L CNN
F 2 "Inductor_SMD:L_0603_1608Metric" V 3580 1900 50  0001 C CNN
F 3 "~" H 3650 1900 50  0001 C CNN
F 4 "BLM18KG221SH1D" H 3650 1900 50  0001 C CNN "PartNumber"
	1    3650 1900
	1    0    0    -1  
$EndComp
$Comp
L Device:Ferrite_Bead_Small FB3202
U 1 1 5FAE79CA
P 3750 1650
F 0 "FB3202" H 3825 1700 50  0000 L CNN
F 1 "Ferrite_Bead_Small" H 3825 1600 50  0000 L CNN
F 2 "Inductor_SMD:L_0603_1608Metric" V 3680 1650 50  0001 C CNN
F 3 "~" H 3750 1650 50  0001 C CNN
F 4 "BLM18KG221SH1D" H 3750 1650 50  0001 C CNN "PartNumber"
	1    3750 1650
	1    0    0    -1  
$EndComp
$Comp
L Device:Ferrite_Bead_Small FB3201
U 1 1 5FAE7F11
P 3850 1400
F 0 "FB3201" H 3925 1450 50  0000 L CNN
F 1 "Ferrite_Bead_Small" H 3925 1350 50  0000 L CNN
F 2 "Inductor_SMD:L_0603_1608Metric" V 3780 1400 50  0001 C CNN
F 3 "~" H 3850 1400 50  0001 C CNN
F 4 "BLM18KG221SH1D" H 3850 1400 50  0001 C CNN "PartNumber"
	1    3850 1400
	1    0    0    -1  
$EndComp
Wire Wire Line
	3850 1500 3850 2500
Wire Wire Line
	3750 1750 3750 2700
Wire Wire Line
	3650 3200 3650 2900
Wire Wire Line
	3550 2250 3550 3100
$Comp
L 000_PreferredParts:C_0_1uF C3214
U 1 1 5FAF71AB
P 3150 3350
F 0 "C3214" H 3175 3450 50  0000 L CNN
F 1 "C_0_1uF" H 3175 3250 50  0001 L CNN
F 2 "Capacitor_SMD:C_0402_1005Metric" H 3188 3200 50  0001 C CNN
F 3 "~" H 3150 3350 50  0001 C CNN
F 4 "0.1uF" H 3300 3250 50  0000 C CNN "DisplayValue"
F 5 "3000-0000000125" H 3150 3350 50  0001 C CNN "PartSpecification"
F 6 "100V" H 3150 3350 50  0001 C CNN "Voltage"
	1    3150 3350
	1    0    0    -1  
$EndComp
$Comp
L 000_PreferredParts:C_1nF C3213
U 1 1 5FAF82F9
P 2850 3350
F 0 "C3213" H 2875 3450 50  0000 L CNN
F 1 "C_1nF" H 2875 3250 50  0000 L CNN
F 2 "Capacitor_SMD:C_0402_1005Metric" H 2888 3200 50  0001 C CNN
F 3 "~" H 2850 3350 50  0001 C CNN
F 4 "3000-0000000128" H 2850 3350 50  0001 C CNN "PartSpecification"
	1    2850 3350
	1    0    0    -1  
$EndComp
$Comp
L power:GND #PWR?
U 1 1 5FAF8D18
P 3150 3600
F 0 "#PWR?" H 3150 3350 50  0001 C CNN
F 1 "GND" H 3150 3450 50  0000 C CNN
F 2 "" H 3150 3600 50  0001 C CNN
F 3 "" H 3150 3600 50  0001 C CNN
	1    3150 3600
	1    0    0    -1  
$EndComp
$Comp
L power:GND #PWR?
U 1 1 5FAF9366
P 2850 3600
F 0 "#PWR?" H 2850 3350 50  0001 C CNN
F 1 "GND" H 2850 3450 50  0000 C CNN
F 2 "" H 2850 3600 50  0001 C CNN
F 3 "" H 2850 3600 50  0001 C CNN
	1    2850 3600
	1    0    0    -1  
$EndComp
Wire Wire Line
	2850 3600 2850 3500
Wire Wire Line
	3150 3600 3150 3500
Wire Wire Line
	2850 3200 2850 3100
Wire Wire Line
	2850 3100 3150 3100
Connection ~ 3550 3100
Wire Wire Line
	3550 3100 3550 3200
Wire Wire Line
	3150 3200 3150 3100
Connection ~ 3150 3100
Wire Wire Line
	3150 3100 3550 3100
$Comp
L 000_PreferredParts:C_0_1uF C3210
U 1 1 5FAFC516
P 2500 3150
F 0 "C3210" H 2525 3250 50  0000 L CNN
F 1 "C_0_1uF" H 2525 3050 50  0001 L CNN
F 2 "Capacitor_SMD:C_0402_1005Metric" H 2538 3000 50  0001 C CNN
F 3 "~" H 2500 3150 50  0001 C CNN
F 4 "0.1uF" H 2650 3050 50  0000 C CNN "DisplayValue"
F 5 "3000-0000000125" H 2500 3150 50  0001 C CNN "PartSpecification"
F 6 "100V" H 2500 3150 50  0001 C CNN "Voltage"
	1    2500 3150
	1    0    0    -1  
$EndComp
$Comp
L 000_PreferredParts:C_1nF C3209
U 1 1 5FAFC51D
P 2200 3150
F 0 "C3209" H 2225 3250 50  0000 L CNN
F 1 "C_1nF" H 2225 3050 50  0000 L CNN
F 2 "Capacitor_SMD:C_0402_1005Metric" H 2238 3000 50  0001 C CNN
F 3 "~" H 2200 3150 50  0001 C CNN
F 4 "3000-0000000128" H 2200 3150 50  0001 C CNN "PartSpecification"
	1    2200 3150
	1    0    0    -1  
$EndComp
$Comp
L power:GND #PWR?
U 1 1 5FAFC523
P 2500 3400
F 0 "#PWR?" H 2500 3150 50  0001 C CNN
F 1 "GND" H 2500 3250 50  0000 C CNN
F 2 "" H 2500 3400 50  0001 C CNN
F 3 "" H 2500 3400 50  0001 C CNN
	1    2500 3400
	1    0    0    -1  
$EndComp
$Comp
L power:GND #PWR?
U 1 1 5FAFC529
P 2200 3400
F 0 "#PWR?" H 2200 3150 50  0001 C CNN
F 1 "GND" H 2200 3250 50  0000 C CNN
F 2 "" H 2200 3400 50  0001 C CNN
F 3 "" H 2200 3400 50  0001 C CNN
	1    2200 3400
	1    0    0    -1  
$EndComp
Wire Wire Line
	2200 3400 2200 3300
Wire Wire Line
	2500 3400 2500 3300
Wire Wire Line
	2200 3000 2200 2900
Wire Wire Line
	2200 2900 2500 2900
Wire Wire Line
	2500 3000 2500 2900
Connection ~ 2500 2900
Wire Wire Line
	2500 2900 3650 2900
Connection ~ 3650 2900
Wire Wire Line
	3650 2900 3650 2000
$Comp
L 000_PreferredParts:C_0_1uF C3206
U 1 1 5FAFF508
P 1850 2950
F 0 "C3206" H 1875 3050 50  0000 L CNN
F 1 "C_0_1uF" H 1875 2850 50  0001 L CNN
F 2 "Capacitor_SMD:C_0402_1005Metric" H 1888 2800 50  0001 C CNN
F 3 "~" H 1850 2950 50  0001 C CNN
F 4 "0.1uF" H 2000 2850 50  0000 C CNN "DisplayValue"
F 5 "3000-0000000125" H 1850 2950 50  0001 C CNN "PartSpecification"
F 6 "100V" H 1850 2950 50  0001 C CNN "Voltage"
	1    1850 2950
	1    0    0    -1  
$EndComp
$Comp
L 000_PreferredParts:C_1nF C3205
U 1 1 5FAFF50F
P 1550 2950
F 0 "C3205" H 1575 3050 50  0000 L CNN
F 1 "C_1nF" H 1575 2850 50  0000 L CNN
F 2 "Capacitor_SMD:C_0402_1005Metric" H 1588 2800 50  0001 C CNN
F 3 "~" H 1550 2950 50  0001 C CNN
F 4 "3000-0000000128" H 1550 2950 50  0001 C CNN "PartSpecification"
	1    1550 2950
	1    0    0    -1  
$EndComp
$Comp
L power:GND #PWR?
U 1 1 5FAFF515
P 1850 3200
F 0 "#PWR?" H 1850 2950 50  0001 C CNN
F 1 "GND" H 1850 3050 50  0000 C CNN
F 2 "" H 1850 3200 50  0001 C CNN
F 3 "" H 1850 3200 50  0001 C CNN
	1    1850 3200
	1    0    0    -1  
$EndComp
$Comp
L power:GND #PWR?
U 1 1 5FAFF51B
P 1550 3200
F 0 "#PWR?" H 1550 2950 50  0001 C CNN
F 1 "GND" H 1550 3050 50  0000 C CNN
F 2 "" H 1550 3200 50  0001 C CNN
F 3 "" H 1550 3200 50  0001 C CNN
	1    1550 3200
	1    0    0    -1  
$EndComp
Wire Wire Line
	1550 3200 1550 3100
Wire Wire Line
	1850 3200 1850 3100
Wire Wire Line
	1550 2800 1550 2700
Wire Wire Line
	1550 2700 1850 2700
Wire Wire Line
	1850 2800 1850 2700
Connection ~ 1850 2700
Wire Wire Line
	1850 2700 3750 2700
Connection ~ 3750 2700
Wire Wire Line
	3750 2700 3750 3200
$Comp
L 000_PreferredParts:C_0_1uF C3202
U 1 1 5FB02BD9
P 1200 2750
F 0 "C3202" H 1225 2850 50  0000 L CNN
F 1 "C_0_1uF" H 1225 2650 50  0001 L CNN
F 2 "Capacitor_SMD:C_0402_1005Metric" H 1238 2600 50  0001 C CNN
F 3 "~" H 1200 2750 50  0001 C CNN
F 4 "0.1uF" H 1350 2650 50  0000 C CNN "DisplayValue"
F 5 "3000-0000000125" H 1200 2750 50  0001 C CNN "PartSpecification"
F 6 "100V" H 1200 2750 50  0001 C CNN "Voltage"
	1    1200 2750
	1    0    0    -1  
$EndComp
$Comp
L 000_PreferredParts:C_1nF C3201
U 1 1 5FB02BE0
P 900 2750
F 0 "C3201" H 925 2850 50  0000 L CNN
F 1 "C_1nF" H 925 2650 50  0000 L CNN
F 2 "Capacitor_SMD:C_0402_1005Metric" H 938 2600 50  0001 C CNN
F 3 "~" H 900 2750 50  0001 C CNN
F 4 "3000-0000000128" H 900 2750 50  0001 C CNN "PartSpecification"
	1    900  2750
	1    0    0    -1  
$EndComp
$Comp
L power:GND #PWR?
U 1 1 5FB02BE6
P 1200 3000
F 0 "#PWR?" H 1200 2750 50  0001 C CNN
F 1 "GND" H 1200 2850 50  0000 C CNN
F 2 "" H 1200 3000 50  0001 C CNN
F 3 "" H 1200 3000 50  0001 C CNN
	1    1200 3000
	1    0    0    -1  
$EndComp
$Comp
L power:GND #PWR?
U 1 1 5FB02BEC
P 900 3000
F 0 "#PWR?" H 900 2750 50  0001 C CNN
F 1 "GND" H 900 2850 50  0000 C CNN
F 2 "" H 900 3000 50  0001 C CNN
F 3 "" H 900 3000 50  0001 C CNN
	1    900  3000
	1    0    0    -1  
$EndComp
Wire Wire Line
	900  3000 900  2900
Wire Wire Line
	1200 3000 1200 2900
Wire Wire Line
	900  2600 900  2500
Wire Wire Line
	900  2500 1200 2500
Wire Wire Line
	1200 2600 1200 2500
Connection ~ 1200 2500
Wire Wire Line
	1200 2500 3850 2500
Connection ~ 3850 2500
Wire Wire Line
	3850 2500 3850 3200
$Comp
L power:+1V2 #PWR?
U 1 1 5FB063CF
P 3850 1000
AR Path="/5F853053/5FB063CF" Ref="#PWR?"  Part="1" 
AR Path="/5F8E5420/5F9E1037/5FB063CF" Ref="#PWR?"  Part="1" 
AR Path="/605746B5/5F8E5420/5F9E1037/5FB063CF" Ref="#PWR?"  Part="1" 
F 0 "#PWR?" H 3850 850 50  0001 C CNN
F 1 "+1V2" H 3850 1140 50  0000 C CNN
F 2 "" H 3850 1000 50  0001 C CNN
F 3 "" H 3850 1000 50  0001 C CNN
	1    3850 1000
	1    0    0    -1  
$EndComp
Wire Wire Line
	3550 2050 3550 1150
Wire Wire Line
	3550 1150 3650 1150
Wire Wire Line
	3850 1150 3850 1000
Wire Wire Line
	3650 1800 3650 1150
Connection ~ 3650 1150
Wire Wire Line
	3650 1150 3750 1150
Wire Wire Line
	3750 1550 3750 1150
Connection ~ 3750 1150
Wire Wire Line
	3750 1150 3850 1150
Wire Wire Line
	3850 1300 3850 1150
Connection ~ 3850 1150
$Comp
L POWDER_PowerGlobals:+2V5_A #PWR?
U 1 1 5FB0CE15
P 4500 2000
AR Path="/5FB0CE15" Ref="#PWR?"  Part="1" 
AR Path="/5F8E5420/5F9E1037/5FB0CE15" Ref="#PWR?"  Part="1" 
AR Path="/605746B5/5F8E5420/5F9E1037/5FB0CE15" Ref="#PWR?"  Part="1" 
F 0 "#PWR?" H 4500 1850 50  0001 C CNN
F 1 "+2V5_A" H 4500 2140 50  0000 C CNN
F 2 "" H 4500 2000 50  0001 C CNN
F 3 "" H 4500 2000 50  0001 C CNN
	1    4500 2000
	1    0    0    -1  
$EndComp
Wire Wire Line
	4350 3200 4350 2500
Wire Wire Line
	4350 2100 4450 2100
Wire Wire Line
	4500 2100 4500 2000
Wire Wire Line
	4500 2100 4550 2100
Wire Wire Line
	4650 2100 4650 3100
Connection ~ 4500 2100
Wire Wire Line
	4550 3200 4550 2900
Connection ~ 4550 2100
Wire Wire Line
	4550 2100 4650 2100
Wire Wire Line
	4450 3200 4450 2700
Connection ~ 4450 2100
Wire Wire Line
	4450 2100 4500 2100
$Comp
L 000_PreferredParts:C_0_1uF C3215
U 1 1 5FB26FB3
P 5050 3350
F 0 "C3215" H 5075 3450 50  0000 L CNN
F 1 "C_0_1uF" H 5075 3250 50  0001 L CNN
F 2 "Capacitor_SMD:C_0402_1005Metric" H 5088 3200 50  0001 C CNN
F 3 "~" H 5050 3350 50  0001 C CNN
F 4 "0.1uF" H 5200 3250 50  0000 C CNN "DisplayValue"
F 5 "3000-0000000125" H 5050 3350 50  0001 C CNN "PartSpecification"
F 6 "100V" H 5050 3350 50  0001 C CNN "Voltage"
	1    5050 3350
	-1   0    0    -1  
$EndComp
$Comp
L 000_PreferredParts:C_1nF C3216
U 1 1 5FB26FBA
P 5350 3350
F 0 "C3216" H 5375 3450 50  0000 L CNN
F 1 "C_1nF" H 5375 3250 50  0000 L CNN
F 2 "Capacitor_SMD:C_0402_1005Metric" H 5388 3200 50  0001 C CNN
F 3 "~" H 5350 3350 50  0001 C CNN
F 4 "3000-0000000128" H 5350 3350 50  0001 C CNN "PartSpecification"
	1    5350 3350
	-1   0    0    -1  
$EndComp
$Comp
L power:GND #PWR?
U 1 1 5FB26FC0
P 5050 3600
F 0 "#PWR?" H 5050 3350 50  0001 C CNN
F 1 "GND" H 5050 3450 50  0000 C CNN
F 2 "" H 5050 3600 50  0001 C CNN
F 3 "" H 5050 3600 50  0001 C CNN
	1    5050 3600
	-1   0    0    -1  
$EndComp
$Comp
L power:GND #PWR?
U 1 1 5FB26FC6
P 5350 3600
F 0 "#PWR?" H 5350 3350 50  0001 C CNN
F 1 "GND" H 5350 3450 50  0000 C CNN
F 2 "" H 5350 3600 50  0001 C CNN
F 3 "" H 5350 3600 50  0001 C CNN
	1    5350 3600
	-1   0    0    -1  
$EndComp
Wire Wire Line
	5350 3600 5350 3500
Wire Wire Line
	5050 3600 5050 3500
Wire Wire Line
	5350 3200 5350 3100
Wire Wire Line
	5350 3100 5050 3100
Wire Wire Line
	5050 3200 5050 3100
Connection ~ 5050 3100
Wire Wire Line
	5050 3100 4650 3100
$Comp
L 000_PreferredParts:C_0_1uF C3211
U 1 1 5FB26FD6
P 5700 3150
F 0 "C3211" H 5725 3250 50  0000 L CNN
F 1 "C_0_1uF" H 5725 3050 50  0001 L CNN
F 2 "Capacitor_SMD:C_0402_1005Metric" H 5738 3000 50  0001 C CNN
F 3 "~" H 5700 3150 50  0001 C CNN
F 4 "0.1uF" H 5850 3050 50  0000 C CNN "DisplayValue"
F 5 "3000-0000000125" H 5700 3150 50  0001 C CNN "PartSpecification"
F 6 "100V" H 5700 3150 50  0001 C CNN "Voltage"
	1    5700 3150
	-1   0    0    -1  
$EndComp
$Comp
L 000_PreferredParts:C_1nF C3212
U 1 1 5FB26FDD
P 6000 3150
F 0 "C3212" H 6025 3250 50  0000 L CNN
F 1 "C_1nF" H 6025 3050 50  0000 L CNN
F 2 "Capacitor_SMD:C_0402_1005Metric" H 6038 3000 50  0001 C CNN
F 3 "~" H 6000 3150 50  0001 C CNN
F 4 "3000-0000000128" H 6000 3150 50  0001 C CNN "PartSpecification"
	1    6000 3150
	-1   0    0    -1  
$EndComp
$Comp
L power:GND #PWR?
U 1 1 5FB26FE3
P 5700 3400
F 0 "#PWR?" H 5700 3150 50  0001 C CNN
F 1 "GND" H 5700 3250 50  0000 C CNN
F 2 "" H 5700 3400 50  0001 C CNN
F 3 "" H 5700 3400 50  0001 C CNN
	1    5700 3400
	-1   0    0    -1  
$EndComp
$Comp
L power:GND #PWR?
U 1 1 5FB26FE9
P 6000 3400
F 0 "#PWR?" H 6000 3150 50  0001 C CNN
F 1 "GND" H 6000 3250 50  0000 C CNN
F 2 "" H 6000 3400 50  0001 C CNN
F 3 "" H 6000 3400 50  0001 C CNN
	1    6000 3400
	-1   0    0    -1  
$EndComp
Wire Wire Line
	6000 3400 6000 3300
Wire Wire Line
	5700 3400 5700 3300
Wire Wire Line
	6000 3000 6000 2900
Wire Wire Line
	6000 2900 5700 2900
Wire Wire Line
	5700 3000 5700 2900
Connection ~ 5700 2900
Wire Wire Line
	5700 2900 4550 2900
$Comp
L 000_PreferredParts:C_0_1uF C3207
U 1 1 5FB26FF9
P 6350 2950
F 0 "C3207" H 6375 3050 50  0000 L CNN
F 1 "C_0_1uF" H 6375 2850 50  0001 L CNN
F 2 "Capacitor_SMD:C_0402_1005Metric" H 6388 2800 50  0001 C CNN
F 3 "~" H 6350 2950 50  0001 C CNN
F 4 "0.1uF" H 6500 2850 50  0000 C CNN "DisplayValue"
F 5 "3000-0000000125" H 6350 2950 50  0001 C CNN "PartSpecification"
F 6 "100V" H 6350 2950 50  0001 C CNN "Voltage"
	1    6350 2950
	-1   0    0    -1  
$EndComp
$Comp
L 000_PreferredParts:C_1nF C3208
U 1 1 5FB27000
P 6650 2950
F 0 "C3208" H 6675 3050 50  0000 L CNN
F 1 "C_1nF" H 6675 2850 50  0000 L CNN
F 2 "Capacitor_SMD:C_0402_1005Metric" H 6688 2800 50  0001 C CNN
F 3 "~" H 6650 2950 50  0001 C CNN
F 4 "3000-0000000128" H 6650 2950 50  0001 C CNN "PartSpecification"
	1    6650 2950
	-1   0    0    -1  
$EndComp
$Comp
L power:GND #PWR?
U 1 1 5FB27006
P 6350 3200
F 0 "#PWR?" H 6350 2950 50  0001 C CNN
F 1 "GND" H 6350 3050 50  0000 C CNN
F 2 "" H 6350 3200 50  0001 C CNN
F 3 "" H 6350 3200 50  0001 C CNN
	1    6350 3200
	-1   0    0    -1  
$EndComp
$Comp
L power:GND #PWR?
U 1 1 5FB2700C
P 6650 3200
F 0 "#PWR?" H 6650 2950 50  0001 C CNN
F 1 "GND" H 6650 3050 50  0000 C CNN
F 2 "" H 6650 3200 50  0001 C CNN
F 3 "" H 6650 3200 50  0001 C CNN
	1    6650 3200
	-1   0    0    -1  
$EndComp
Wire Wire Line
	6650 3200 6650 3100
Wire Wire Line
	6350 3200 6350 3100
Wire Wire Line
	6650 2800 6650 2700
Wire Wire Line
	6650 2700 6350 2700
Wire Wire Line
	6350 2800 6350 2700
Connection ~ 6350 2700
Wire Wire Line
	6350 2700 4450 2700
$Comp
L 000_PreferredParts:C_0_1uF C3203
U 1 1 5FB2701C
P 7000 2750
F 0 "C3203" H 7025 2850 50  0000 L CNN
F 1 "C_0_1uF" H 7025 2650 50  0001 L CNN
F 2 "Capacitor_SMD:C_0402_1005Metric" H 7038 2600 50  0001 C CNN
F 3 "~" H 7000 2750 50  0001 C CNN
F 4 "0.1uF" H 7150 2650 50  0000 C CNN "DisplayValue"
F 5 "3000-0000000125" H 7000 2750 50  0001 C CNN "PartSpecification"
F 6 "100V" H 7000 2750 50  0001 C CNN "Voltage"
	1    7000 2750
	-1   0    0    -1  
$EndComp
$Comp
L 000_PreferredParts:C_1nF C3204
U 1 1 5FB27023
P 7300 2750
F 0 "C3204" H 7325 2850 50  0000 L CNN
F 1 "C_1nF" H 7325 2650 50  0000 L CNN
F 2 "Capacitor_SMD:C_0402_1005Metric" H 7338 2600 50  0001 C CNN
F 3 "~" H 7300 2750 50  0001 C CNN
F 4 "3000-0000000128" H 7300 2750 50  0001 C CNN "PartSpecification"
	1    7300 2750
	-1   0    0    -1  
$EndComp
$Comp
L power:GND #PWR?
U 1 1 5FB27029
P 7000 3000
F 0 "#PWR?" H 7000 2750 50  0001 C CNN
F 1 "GND" H 7000 2850 50  0000 C CNN
F 2 "" H 7000 3000 50  0001 C CNN
F 3 "" H 7000 3000 50  0001 C CNN
	1    7000 3000
	-1   0    0    -1  
$EndComp
$Comp
L power:GND #PWR?
U 1 1 5FB2702F
P 7300 3000
F 0 "#PWR?" H 7300 2750 50  0001 C CNN
F 1 "GND" H 7300 2850 50  0000 C CNN
F 2 "" H 7300 3000 50  0001 C CNN
F 3 "" H 7300 3000 50  0001 C CNN
	1    7300 3000
	-1   0    0    -1  
$EndComp
Wire Wire Line
	7300 3000 7300 2900
Wire Wire Line
	7000 3000 7000 2900
Wire Wire Line
	7300 2600 7300 2500
Wire Wire Line
	7300 2500 7000 2500
Wire Wire Line
	7000 2600 7000 2500
Connection ~ 7000 2500
Wire Wire Line
	7000 2500 4350 2500
Connection ~ 4650 3100
Wire Wire Line
	4650 3100 4650 3200
Connection ~ 4550 2900
Wire Wire Line
	4550 2900 4550 2100
Connection ~ 4450 2700
Wire Wire Line
	4450 2700 4450 2100
Connection ~ 4350 2500
Wire Wire Line
	4350 2500 4350 2100
Text Label 2950 2500 0    50   ~ 0
VCCD_PLL1
Text Label 2950 2700 0    50   ~ 0
VCCD_PLL2
Text Label 2950 2900 0    50   ~ 0
VCCD_PLL3
Text Label 2950 3100 0    50   ~ 0
VCCD_PLL4
$Comp
L power:PWR_FLAG #FLG?
U 1 1 61729D17
P 2850 3100
F 0 "#FLG?" H 2850 3175 50  0001 C CNN
F 1 "PWR_FLAG" H 2850 3273 50  0000 C CNN
F 2 "" H 2850 3100 50  0001 C CNN
F 3 "~" H 2850 3100 50  0001 C CNN
	1    2850 3100
	1    0    0    -1  
$EndComp
Connection ~ 2850 3100
$Comp
L power:PWR_FLAG #FLG?
U 1 1 6172A4C5
P 2200 2900
F 0 "#FLG?" H 2200 2975 50  0001 C CNN
F 1 "PWR_FLAG" H 2200 3073 50  0000 C CNN
F 2 "" H 2200 2900 50  0001 C CNN
F 3 "~" H 2200 2900 50  0001 C CNN
	1    2200 2900
	1    0    0    -1  
$EndComp
Connection ~ 2200 2900
$Comp
L power:PWR_FLAG #FLG?
U 1 1 6172A866
P 1550 2700
F 0 "#FLG?" H 1550 2775 50  0001 C CNN
F 1 "PWR_FLAG" H 1550 2873 50  0000 C CNN
F 2 "" H 1550 2700 50  0001 C CNN
F 3 "~" H 1550 2700 50  0001 C CNN
	1    1550 2700
	1    0    0    -1  
$EndComp
Connection ~ 1550 2700
$Comp
L power:PWR_FLAG #FLG?
U 1 1 6172ABF2
P 900 2500
F 0 "#FLG?" H 900 2575 50  0001 C CNN
F 1 "PWR_FLAG" H 900 2673 50  0000 C CNN
F 2 "" H 900 2500 50  0001 C CNN
F 3 "~" H 900 2500 50  0001 C CNN
	1    900  2500
	1    0    0    -1  
$EndComp
Connection ~ 900  2500
$EndSCHEMATC
