EESchema Schematic File Version 4
EELAYER 30 0
EELAYER END
$Descr A4 11693 8268
encoding utf-8
Sheet 24 27
Title ""
Date ""
Rev ""
Comp ""
Comment1 ""
Comment2 ""
Comment3 ""
Comment4 ""
$EndDescr
Text HLabel 2050 2500 0    50   Input ~ 0
v_12
$Comp
L 000_PreferredParts:C_10uF_0805 C2601
U 1 1 5E2D1CE0
P 2500 2750
F 0 "C2601" H 2525 2850 50  0000 L CNN
F 1 "C_10uF_0805" H 2525 2650 50  0001 L CNN
F 2 "Capacitor_SMD:C_0805_2012Metric" H 2538 2600 50  0001 C CNN
F 3 "~" H 2500 2750 50  0001 C CNN
F 4 "10uF" H 2650 2650 50  0000 C CNN "DisplayValue"
F 5 "0805" H 2650 2550 50  0000 C CNN "DisplayFootprint"
F 6 "3000-0000000134" H 2500 2750 50  0001 C CNN "PartSpecification"
	1    2500 2750
	1    0    0    -1  
$EndComp
$Comp
L 000_PreferredParts:C_10uF_0805 C2602
U 1 1 5E2D2034
P 3000 2750
F 0 "C2602" H 3025 2850 50  0000 L CNN
F 1 "C_10uF_0805" H 3025 2650 50  0001 L CNN
F 2 "Capacitor_SMD:C_0805_2012Metric" H 3038 2600 50  0001 C CNN
F 3 "~" H 3000 2750 50  0001 C CNN
F 4 "10uF" H 3150 2650 50  0000 C CNN "DisplayValue"
F 5 "0805" H 3150 2550 50  0000 C CNN "DisplayFootprint"
F 6 "3000-0000000134" H 3000 2750 50  0001 C CNN "PartSpecification"
	1    3000 2750
	1    0    0    -1  
$EndComp
$Comp
L 000_PreferredParts:C_10uF_0603 C2603
U 1 1 5E2D2257
P 3500 2750
F 0 "C2603" H 3525 2850 50  0000 L CNN
F 1 "C_10uF_0603" H 3525 2650 50  0001 L CNN
F 2 "Capacitor_SMD:C_0603_1608Metric" H 3538 2600 50  0001 C CNN
F 3 "~" H 3500 2750 50  0001 C CNN
F 4 "10uF" H 3650 2650 50  0000 C CNN "DisplayValue"
F 5 "0603" H 3650 2550 50  0000 C CNN "DisplayFootprint"
F 6 "3000-0000000135" H 3500 2750 50  0001 C CNN "PartSpecification"
	1    3500 2750
	1    0    0    -1  
$EndComp
$Comp
L power:GND #PWR?
U 1 1 5E2D24CF
P 2500 3000
F 0 "#PWR?" H 2500 2750 50  0001 C CNN
F 1 "GND" H 2500 2850 50  0000 C CNN
F 2 "" H 2500 3000 50  0001 C CNN
F 3 "" H 2500 3000 50  0001 C CNN
	1    2500 3000
	1    0    0    -1  
$EndComp
Wire Wire Line
	2500 3000 2500 2900
$Comp
L power:GND #PWR?
U 1 1 5E2D29DF
P 3000 3000
F 0 "#PWR?" H 3000 2750 50  0001 C CNN
F 1 "GND" H 3000 2850 50  0000 C CNN
F 2 "" H 3000 3000 50  0001 C CNN
F 3 "" H 3000 3000 50  0001 C CNN
	1    3000 3000
	1    0    0    -1  
$EndComp
Wire Wire Line
	3000 3000 3000 2900
$Comp
L power:GND #PWR?
U 1 1 5E2D2B3C
P 3500 3000
F 0 "#PWR?" H 3500 2750 50  0001 C CNN
F 1 "GND" H 3500 2850 50  0000 C CNN
F 2 "" H 3500 3000 50  0001 C CNN
F 3 "" H 3500 3000 50  0001 C CNN
	1    3500 3000
	1    0    0    -1  
$EndComp
Wire Wire Line
	3500 3000 3500 2900
Wire Wire Line
	3500 2600 3500 2500
Wire Wire Line
	3500 2500 3000 2500
Wire Wire Line
	2500 2600 2500 2500
Connection ~ 2500 2500
Wire Wire Line
	2500 2500 2050 2500
Wire Wire Line
	3000 2600 3000 2500
Connection ~ 3000 2500
Wire Wire Line
	3000 2500 2500 2500
$Comp
L POWDER_Power:TPS63070RNM U2601
U 1 1 5E2D3EB4
P 5100 2800
F 0 "U2601" H 5450 3400 60  0000 C CNN
F 1 "TPS63070RNM" H 5150 2950 60  0000 C CNN
F 2 "POWDER_Power:TPS63070RNMR" H 5200 2790 60  0001 C CNN
F 3 "" H 5200 3200 60  0000 C CNN
F 4 "Texas Instruments" H 5100 2800 50  0001 C CNN "Manufacturer"
F 5 "TPS63070RNMR" H 5100 2800 50  0001 C CNN "PartNumber"
F 6 "3000-0000000079" H 5100 2800 50  0001 C CNN "PartSpecification"
	1    5100 2800
	1    0    0    -1  
$EndComp
Wire Wire Line
	4500 2500 4350 2500
Connection ~ 3500 2500
Wire Wire Line
	4500 2400 4350 2400
Wire Wire Line
	4350 2400 4350 2500
Connection ~ 4350 2500
Wire Wire Line
	4350 2500 4000 2500
$Comp
L Device:R R2601
U 1 1 5E2D4C6A
P 4250 3100
F 0 "R2601" V 4330 3100 50  0000 C CNN
F 1 "10k" V 4250 3100 50  0000 C CNN
F 2 "Resistor_SMD:R_0402_1005Metric" V 4180 3100 50  0001 C CNN
F 3 "~" H 4250 3100 50  0001 C CNN
F 4 "3000-0000000131" H 4250 3100 50  0001 C CNN "PartSpecification"
	1    4250 3100
	0    1    1    0   
$EndComp
Wire Wire Line
	4100 3100 4000 3100
Connection ~ 4000 2500
Wire Wire Line
	4000 2500 3500 2500
Wire Wire Line
	4500 3200 4450 3200
$Comp
L power:GND #PWR?
U 1 1 5E2D719D
P 4450 3300
F 0 "#PWR?" H 4450 3050 50  0001 C CNN
F 1 "GND" H 4450 3150 50  0000 C CNN
F 2 "" H 4450 3300 50  0001 C CNN
F 3 "" H 4450 3300 50  0001 C CNN
	1    4450 3300
	1    0    0    -1  
$EndComp
Wire Wire Line
	4450 3300 4450 3200
$Comp
L 000_PreferredParts:C_100nF C2604
U 1 1 5E2D8296
P 3850 3200
F 0 "C2604" H 3875 3300 50  0000 L CNN
F 1 "C_100nF" H 3875 3100 50  0001 L CNN
F 2 "Capacitor_SMD:C_0402_1005Metric" H 3888 3050 50  0001 C CNN
F 3 "~" H 3850 3200 50  0001 C CNN
F 4 "100nF" H 4000 3100 50  0000 C CNN "DisplayValue"
F 5 "3000-0000000125" H 3850 3200 50  0001 C CNN "PartSpecification"
	1    3850 3200
	1    0    0    -1  
$EndComp
Wire Wire Line
	3850 3050 3850 2750
Wire Wire Line
	3850 2750 4500 2750
$Comp
L power:GND #PWR?
U 1 1 5E2D8A48
P 3850 3450
F 0 "#PWR?" H 3850 3200 50  0001 C CNN
F 1 "GND" H 3850 3300 50  0000 C CNN
F 2 "" H 3850 3450 50  0001 C CNN
F 3 "" H 3850 3450 50  0001 C CNN
	1    3850 3450
	1    0    0    -1  
$EndComp
Wire Wire Line
	3850 3450 3850 3350
$Comp
L power:GND #PWR?
U 1 1 5E2D8F7F
P 5000 3600
F 0 "#PWR?" H 5000 3350 50  0001 C CNN
F 1 "GND" H 5000 3450 50  0000 C CNN
F 2 "" H 5000 3600 50  0001 C CNN
F 3 "" H 5000 3600 50  0001 C CNN
	1    5000 3600
	1    0    0    -1  
$EndComp
$Comp
L power:GND #PWR?
U 1 1 5E2D914F
P 5200 3600
F 0 "#PWR?" H 5200 3350 50  0001 C CNN
F 1 "GND" H 5200 3450 50  0000 C CNN
F 2 "" H 5200 3600 50  0001 C CNN
F 3 "" H 5200 3600 50  0001 C CNN
	1    5200 3600
	1    0    0    -1  
$EndComp
Wire Wire Line
	5200 3600 5200 3500
Wire Wire Line
	5000 3600 5000 3500
$Comp
L Device:L L2601
U 1 1 5E2D9B50
P 5100 2000
F 0 "L2601" V 5050 2000 50  0000 C CNN
F 1 "1.5uH" V 5175 2000 50  0000 C CNN
F 2 "Inductor_SMD:L_Taiyo-Yuden_MD-4040" H 5100 2000 50  0001 C CNN
F 3 "~" H 5100 2000 50  0001 C CNN
F 4 "3000-0000000076" V 5100 2000 50  0001 C CNN "PartSpecification"
	1    5100 2000
	0    -1   -1   0   
$EndComp
Wire Wire Line
	5250 2000 5300 2000
Wire Wire Line
	5300 2000 5300 2150
Wire Wire Line
	4950 2000 4900 2000
Wire Wire Line
	4900 2000 4900 2150
$Comp
L power:GND #PWR?
U 1 1 5E2DBD86
P 6000 3500
F 0 "#PWR?" H 6000 3250 50  0001 C CNN
F 1 "GND" H 6000 3350 50  0000 C CNN
F 2 "" H 6000 3500 50  0001 C CNN
F 3 "" H 6000 3500 50  0001 C CNN
	1    6000 3500
	1    0    0    -1  
$EndComp
Wire Wire Line
	5700 2850 6000 2850
Wire Wire Line
	6000 2850 6000 3500
Wire Wire Line
	5700 3100 6500 3100
$Comp
L Device:R R2604
U 1 1 5E2DCA41
P 6500 2850
F 0 "R2604" V 6580 2850 50  0000 C CNN
F 1 "100k" V 6500 2850 50  0000 C CNN
F 2 "Resistor_SMD:R_0402_1005Metric" V 6430 2850 50  0001 C CNN
F 3 "~" H 6500 2850 50  0001 C CNN
F 4 "3000-0000000575" H 6500 2850 50  0001 C CNN "PartSpecification"
	1    6500 2850
	-1   0    0    1   
$EndComp
$Comp
L Device:R R2602
U 1 1 5E2DCD42
P 6200 2550
F 0 "R2602" V 6280 2550 50  0000 C CNN
F 1 "470k" V 6200 2550 50  0000 C CNN
F 2 "Resistor_SMD:R_0402_1005Metric" V 6130 2550 50  0001 C CNN
F 3 "~" H 6200 2550 50  0001 C CNN
F 4 "3000-0000000157" H 6200 2550 50  0001 C CNN "PartSpecification"
	1    6200 2550
	-1   0    0    1   
$EndComp
Wire Wire Line
	5700 2750 6200 2750
Wire Wire Line
	6200 2750 6200 2700
Wire Wire Line
	5700 2500 5800 2500
Wire Wire Line
	5800 2500 5800 2400
Wire Wire Line
	5800 2400 5700 2400
Wire Wire Line
	5800 2400 6200 2400
Connection ~ 5800 2400
Connection ~ 6200 2400
Wire Wire Line
	6200 2400 6500 2400
$Comp
L Device:R R2603
U 1 1 5E2DE62E
P 6200 3300
F 0 "R2603" V 6280 3300 50  0000 C CNN
F 1 "150k" V 6200 3300 50  0000 C CNN
F 2 "Resistor_SMD:R_0402_1005Metric" V 6130 3300 50  0001 C CNN
F 3 "~" H 6200 3300 50  0001 C CNN
F 4 "3000-0000000579" H 6200 3300 50  0001 C CNN "PartSpecification"
	1    6200 3300
	-1   0    0    1   
$EndComp
$Comp
L power:GND #PWR?
U 1 1 5E2DE908
P 6200 3500
F 0 "#PWR?" H 6200 3250 50  0001 C CNN
F 1 "GND" H 6200 3350 50  0000 C CNN
F 2 "" H 6200 3500 50  0001 C CNN
F 3 "" H 6200 3500 50  0001 C CNN
	1    6200 3500
	1    0    0    -1  
$EndComp
Wire Wire Line
	6200 3500 6200 3450
Wire Wire Line
	6200 3150 6200 2750
Connection ~ 6200 2750
Wire Wire Line
	6500 3100 6500 3000
Wire Wire Line
	6500 2700 6500 2400
Connection ~ 6500 2400
$Comp
L 000_PreferredParts:C_10uF_0603 C2605
U 1 1 5E2E1FFC
P 7000 2750
F 0 "C2605" H 7025 2850 50  0000 L CNN
F 1 "C_10uF_0603" H 7025 2650 50  0001 L CNN
F 2 "Capacitor_SMD:C_0603_1608Metric" H 7038 2600 50  0001 C CNN
F 3 "~" H 7000 2750 50  0001 C CNN
F 4 "10uF" H 7150 2650 50  0000 C CNN "DisplayValue"
F 5 "0603" H 7150 2550 50  0000 C CNN "DisplayFootprint"
F 6 "3000-0000000135" H 7000 2750 50  0001 C CNN "PartSpecification"
	1    7000 2750
	1    0    0    -1  
$EndComp
$Comp
L 000_PreferredParts:C_10uF_0603 C2606
U 1 1 5E2E2720
P 7300 2750
F 0 "C2606" H 7325 2850 50  0000 L CNN
F 1 "C_10uF_0603" H 7325 2650 50  0001 L CNN
F 2 "Capacitor_SMD:C_0603_1608Metric" H 7338 2600 50  0001 C CNN
F 3 "~" H 7300 2750 50  0001 C CNN
F 4 "10uF" H 7450 2650 50  0000 C CNN "DisplayValue"
F 5 "0603" H 7450 2550 50  0000 C CNN "DisplayFootprint"
F 6 "3000-0000000135" H 7300 2750 50  0001 C CNN "PartSpecification"
	1    7300 2750
	1    0    0    -1  
$EndComp
$Comp
L 000_PreferredParts:C_10uF_0603 C2607
U 1 1 5E2E2A81
P 7600 2750
F 0 "C2607" H 7625 2850 50  0000 L CNN
F 1 "C_10uF_0603" H 7625 2650 50  0001 L CNN
F 2 "Capacitor_SMD:C_0603_1608Metric" H 7638 2600 50  0001 C CNN
F 3 "~" H 7600 2750 50  0001 C CNN
F 4 "10uF" H 7750 2650 50  0000 C CNN "DisplayValue"
F 5 "0603" H 7750 2550 50  0000 C CNN "DisplayFootprint"
F 6 "3000-0000000135" H 7600 2750 50  0001 C CNN "PartSpecification"
	1    7600 2750
	1    0    0    -1  
$EndComp
$Comp
L 000_PreferredParts:C_10uF_0603 C2608
U 1 1 5E2E2D8A
P 7900 2750
F 0 "C2608" H 7925 2850 50  0000 L CNN
F 1 "C_10uF_0603" H 7925 2650 50  0001 L CNN
F 2 "Capacitor_SMD:C_0603_1608Metric" H 7938 2600 50  0001 C CNN
F 3 "~" H 7900 2750 50  0001 C CNN
F 4 "10uF" H 8050 2650 50  0000 C CNN "DisplayValue"
F 5 "0603" H 8050 2550 50  0000 C CNN "DisplayFootprint"
F 6 "3000-0000000135" H 7900 2750 50  0001 C CNN "PartSpecification"
	1    7900 2750
	1    0    0    -1  
$EndComp
$Comp
L 000_PreferredParts:C_10uF_0603 C2609
U 1 1 5E2E3019
P 8200 2750
F 0 "C2609" H 8225 2850 50  0000 L CNN
F 1 "C_10uF_0603" H 8225 2650 50  0001 L CNN
F 2 "Capacitor_SMD:C_0603_1608Metric" H 8238 2600 50  0001 C CNN
F 3 "~" H 8200 2750 50  0001 C CNN
F 4 "10uF" H 8350 2650 50  0000 C CNN "DisplayValue"
F 5 "0603" H 8350 2550 50  0000 C CNN "DisplayFootprint"
F 6 "3000-0000000135" H 8200 2750 50  0001 C CNN "PartSpecification"
	1    8200 2750
	1    0    0    -1  
$EndComp
$Comp
L 000_PreferredParts:C_10uF_0603 C2610
U 1 1 5E2E32E0
P 8700 2750
F 0 "C2610" H 8725 2850 50  0000 L CNN
F 1 "C_10uF_0603" H 8725 2650 50  0001 L CNN
F 2 "Capacitor_SMD:C_0603_1608Metric" H 8738 2600 50  0001 C CNN
F 3 "~" H 8700 2750 50  0001 C CNN
F 4 "10uF" H 8850 2650 50  0000 C CNN "DisplayValue"
F 5 "0603" H 8850 2550 50  0000 C CNN "DisplayFootprint"
F 6 "3000-0000000135" H 8700 2750 50  0001 C CNN "PartSpecification"
	1    8700 2750
	1    0    0    -1  
$EndComp
$Comp
L 000_PreferredParts:C_10uF_0603 C2611
U 1 1 5E2E356F
P 9000 2750
F 0 "C2611" H 9025 2850 50  0000 L CNN
F 1 "C_10uF_0603" H 9025 2650 50  0001 L CNN
F 2 "Capacitor_SMD:C_0603_1608Metric" H 9038 2600 50  0001 C CNN
F 3 "~" H 9000 2750 50  0001 C CNN
F 4 "10uF" H 9150 2650 50  0000 C CNN "DisplayValue"
F 5 "0603" H 9150 2550 50  0000 C CNN "DisplayFootprint"
F 6 "3000-0000000135" H 9000 2750 50  0001 C CNN "PartSpecification"
	1    9000 2750
	1    0    0    -1  
$EndComp
$Comp
L power:GND #PWR?
U 1 1 5E2E49DC
P 7000 3000
F 0 "#PWR?" H 7000 2750 50  0001 C CNN
F 1 "GND" H 7000 2850 50  0000 C CNN
F 2 "" H 7000 3000 50  0001 C CNN
F 3 "" H 7000 3000 50  0001 C CNN
	1    7000 3000
	1    0    0    -1  
$EndComp
Wire Wire Line
	7000 2900 7000 3000
$Comp
L power:GND #PWR?
U 1 1 5E2E63AB
P 7300 3000
F 0 "#PWR?" H 7300 2750 50  0001 C CNN
F 1 "GND" H 7300 2850 50  0000 C CNN
F 2 "" H 7300 3000 50  0001 C CNN
F 3 "" H 7300 3000 50  0001 C CNN
	1    7300 3000
	1    0    0    -1  
$EndComp
Wire Wire Line
	7300 2900 7300 3000
$Comp
L power:GND #PWR?
U 1 1 5E2E6D03
P 7600 3000
F 0 "#PWR?" H 7600 2750 50  0001 C CNN
F 1 "GND" H 7600 2850 50  0000 C CNN
F 2 "" H 7600 3000 50  0001 C CNN
F 3 "" H 7600 3000 50  0001 C CNN
	1    7600 3000
	1    0    0    -1  
$EndComp
Wire Wire Line
	7600 2900 7600 3000
$Comp
L power:GND #PWR?
U 1 1 5E2E7660
P 7900 3000
F 0 "#PWR?" H 7900 2750 50  0001 C CNN
F 1 "GND" H 7900 2850 50  0000 C CNN
F 2 "" H 7900 3000 50  0001 C CNN
F 3 "" H 7900 3000 50  0001 C CNN
	1    7900 3000
	1    0    0    -1  
$EndComp
Wire Wire Line
	7900 2900 7900 3000
$Comp
L power:GND #PWR?
U 1 1 5E2E7FF5
P 8200 3000
F 0 "#PWR?" H 8200 2750 50  0001 C CNN
F 1 "GND" H 8200 2850 50  0000 C CNN
F 2 "" H 8200 3000 50  0001 C CNN
F 3 "" H 8200 3000 50  0001 C CNN
	1    8200 3000
	1    0    0    -1  
$EndComp
Wire Wire Line
	8200 2900 8200 3000
$Comp
L power:GND #PWR?
U 1 1 5E2E8A79
P 8700 3000
F 0 "#PWR?" H 8700 2750 50  0001 C CNN
F 1 "GND" H 8700 2850 50  0000 C CNN
F 2 "" H 8700 3000 50  0001 C CNN
F 3 "" H 8700 3000 50  0001 C CNN
	1    8700 3000
	1    0    0    -1  
$EndComp
Wire Wire Line
	8700 2900 8700 3000
$Comp
L power:GND #PWR?
U 1 1 5E2E94BD
P 9000 3000
F 0 "#PWR?" H 9000 2750 50  0001 C CNN
F 1 "GND" H 9000 2850 50  0000 C CNN
F 2 "" H 9000 3000 50  0001 C CNN
F 3 "" H 9000 3000 50  0001 C CNN
	1    9000 3000
	1    0    0    -1  
$EndComp
Wire Wire Line
	9000 2900 9000 3000
Wire Wire Line
	9000 2600 9000 2400
Wire Wire Line
	6500 2400 7000 2400
Wire Wire Line
	7000 2600 7000 2400
Wire Wire Line
	7000 2400 7300 2400
Wire Wire Line
	7300 2600 7300 2400
Wire Wire Line
	7600 2600 7600 2400
Wire Wire Line
	7900 2600 7900 2400
Wire Wire Line
	8200 2600 8200 2400
Wire Wire Line
	8700 2600 8700 2400
Connection ~ 7000 2400
Connection ~ 7300 2400
Wire Wire Line
	7300 2400 7600 2400
Connection ~ 7600 2400
Wire Wire Line
	7600 2400 7900 2400
Connection ~ 7900 2400
Wire Wire Line
	7900 2400 8200 2400
Connection ~ 8200 2400
$Comp
L power:+3.3V #PWR?
U 1 1 5E2F45A9
P 9300 2300
F 0 "#PWR?" H 9300 2150 50  0001 C CNN
F 1 "+3.3V" H 9300 2440 50  0000 C CNN
F 2 "" H 9300 2300 50  0001 C CNN
F 3 "" H 9300 2300 50  0001 C CNN
	1    9300 2300
	1    0    0    -1  
$EndComp
Wire Wire Line
	9300 2300 9300 2400
Text HLabel 6600 3100 2    50   Output ~ 0
pg
Wire Wire Line
	6600 3100 6500 3100
Connection ~ 6500 3100
$Comp
L Device:R R2605
U 1 1 5E312B06
P 8450 2400
F 0 "R2605" V 8530 2400 50  0000 C CNN
F 1 "3m" V 8450 2400 50  0000 C CNN
F 2 "POWDER_Power:R_0508_1220Metric" V 8380 2400 50  0001 C CNN
F 3 "~" H 8450 2400 50  0001 C CNN
F 4 "3000-0000000499" H 8450 2400 50  0001 C CNN "PartSpecification"
	1    8450 2400
	0    1    1    0   
$EndComp
Wire Wire Line
	8300 2400 8200 2400
Wire Wire Line
	9300 2400 9000 2400
Wire Wire Line
	8200 2000 8500 2000
Wire Wire Line
	8200 2000 8200 2400
Wire Wire Line
	9300 2400 9500 2400
Connection ~ 9300 2400
Text HLabel 8500 2000 2    50   Output ~ 0
rsp_3_3
Text HLabel 9600 2400 2    50   Output ~ 0
rsn_3_3
$Comp
L Device:R R?
U 1 1 5E638D45
P 9500 3350
AR Path="/5E179620/5E638D45" Ref="R?"  Part="1" 
AR Path="/5E179620/5E2CEBB7/5E638D45" Ref="R2607"  Part="1" 
F 0 "R2607" V 9580 3350 50  0000 C CNN
F 1 "R" V 9500 3350 50  0000 C CNN
F 2 "Resistor_SMD:R_0402_1005Metric" V 9430 3350 50  0001 C CNN
F 3 "~" H 9500 3350 50  0001 C CNN
	1    9500 3350
	1    0    0    -1  
$EndComp
$Comp
L Device:R R?
U 1 1 5E638D4B
P 9500 2950
AR Path="/5E179620/5E638D4B" Ref="R?"  Part="1" 
AR Path="/5E179620/5E2CEBB7/5E638D4B" Ref="R2606"  Part="1" 
F 0 "R2606" V 9580 2950 50  0000 C CNN
F 1 "R" V 9500 2950 50  0000 C CNN
F 2 "Resistor_SMD:R_0402_1005Metric" V 9430 2950 50  0001 C CNN
F 3 "~" H 9500 2950 50  0001 C CNN
	1    9500 2950
	1    0    0    -1  
$EndComp
Wire Wire Line
	9500 3100 9500 3150
$Comp
L power:GND #PWR?
U 1 1 5E638D52
P 9500 3600
AR Path="/5E179620/5E638D52" Ref="#PWR?"  Part="1" 
AR Path="/5E179620/5E2CEBB7/5E638D52" Ref="#PWR?"  Part="1" 
F 0 "#PWR?" H 9500 3350 50  0001 C CNN
F 1 "GND" H 9500 3450 50  0000 C CNN
F 2 "" H 9500 3600 50  0001 C CNN
F 3 "" H 9500 3600 50  0001 C CNN
	1    9500 3600
	1    0    0    -1  
$EndComp
Wire Wire Line
	9500 3600 9500 3500
Connection ~ 9500 3150
Wire Wire Line
	9500 3150 9500 3200
Text HLabel 9650 3150 2    50   Output ~ 0
v_sense_3_3
Wire Wire Line
	9650 3150 9500 3150
Wire Wire Line
	9500 2800 9500 2400
Connection ~ 9500 2400
Wire Wire Line
	9500 2400 9600 2400
Wire Wire Line
	4000 2500 4000 3100
Wire Wire Line
	4400 3100 4500 3100
Wire Wire Line
	4400 3000 4500 3000
Text HLabel 4400 3000 0    50   Input ~ 0
EN
Text Label 4900 2000 1    50   ~ 0
L1
Text Label 5300 2000 0    50   ~ 0
L2
Text Label 4450 3100 0    50   ~ 0
PS_SYNC
Text Label 5850 2750 0    50   ~ 0
FB
Text Label 4150 2750 0    50   ~ 0
VAUX
Connection ~ 8700 2400
Wire Wire Line
	8700 2400 8600 2400
Connection ~ 9000 2400
Wire Wire Line
	9000 2400 8700 2400
$EndSCHEMATC
