(kicad_sch (version 20211123) (generator eeschema)

  (uuid 99c8fb7d-dab9-474e-b84e-25bb27a7ad1c)

  (paper "A4")

  (lib_symbols
    (symbol "000_PreferredParts:C_0_1uF" (pin_numbers hide) (pin_names (offset 0.254)) (in_bom yes) (on_board yes)
      (property "Reference" "C" (id 0) (at 0.635 2.54 0)
        (effects (font (size 1.27 1.27)) (justify left))
      )
      (property "Value" "C_0_1uF" (id 1) (at 0.635 -2.54 0)
        (effects (font (size 1.27 1.27)) (justify left) hide)
      )
      (property "Footprint" "Capacitor_SMD:C_0402_1005Metric" (id 2) (at 0.9652 -3.81 0)
        (effects (font (size 1.27 1.27)) hide)
      )
      (property "Datasheet" "~" (id 3) (at 0 0 0)
        (effects (font (size 1.27 1.27)) hide)
      )
      (property "DisplayValue" "0.1uF" (id 4) (at 3.81 -2.54 0)
        (effects (font (size 1.27 1.27)))
      )
      (property "PartSpecification" "3000-0000000125" (id 5) (at 0 0 0)
        (effects (font (size 1.27 1.27)) hide)
      )
      (property "Voltage" "100V" (id 6) (at 0 0 0)
        (effects (font (size 1.27 1.27)) hide)
      )
      (property "ki_keywords" "cap capacitor" (id 7) (at 0 0 0)
        (effects (font (size 1.27 1.27)) hide)
      )
      (property "ki_description" "Unpolarized capacitor" (id 8) (at 0 0 0)
        (effects (font (size 1.27 1.27)) hide)
      )
      (property "ki_fp_filters" "C_*" (id 9) (at 0 0 0)
        (effects (font (size 1.27 1.27)) hide)
      )
      (symbol "C_0_1uF_0_1"
        (polyline
          (pts
            (xy -2.032 -0.762)
            (xy 2.032 -0.762)
          )
          (stroke (width 0.508) (type default) (color 0 0 0 0))
          (fill (type none))
        )
        (polyline
          (pts
            (xy -2.032 0.762)
            (xy 2.032 0.762)
          )
          (stroke (width 0.508) (type default) (color 0 0 0 0))
          (fill (type none))
        )
      )
      (symbol "C_0_1uF_1_1"
        (pin passive line (at 0 3.81 270) (length 2.794)
          (name "~" (effects (font (size 1.27 1.27))))
          (number "1" (effects (font (size 1.27 1.27))))
        )
        (pin passive line (at 0 -3.81 90) (length 2.794)
          (name "~" (effects (font (size 1.27 1.27))))
          (number "2" (effects (font (size 1.27 1.27))))
        )
      )
    )
    (symbol "000_PreferredParts:C_1uF" (pin_numbers hide) (pin_names (offset 0.254)) (in_bom yes) (on_board yes)
      (property "Reference" "C" (id 0) (at 0.635 2.54 0)
        (effects (font (size 1.27 1.27)) (justify left))
      )
      (property "Value" "C_1uF" (id 1) (at 0.635 -2.54 0)
        (effects (font (size 1.27 1.27)) (justify left))
      )
      (property "Footprint" "Capacitor_SMD:C_0603_1608Metric" (id 2) (at 0.9652 -3.81 0)
        (effects (font (size 1.27 1.27)) hide)
      )
      (property "Datasheet" "~" (id 3) (at 0 0 0)
        (effects (font (size 1.27 1.27)) hide)
      )
      (property "PartSpecification" "3000-0000000136" (id 4) (at 0 0 0)
        (effects (font (size 1.27 1.27)) hide)
      )
      (property "ki_keywords" "cap capacitor" (id 5) (at 0 0 0)
        (effects (font (size 1.27 1.27)) hide)
      )
      (property "ki_description" "Unpolarized capacitor" (id 6) (at 0 0 0)
        (effects (font (size 1.27 1.27)) hide)
      )
      (property "ki_fp_filters" "C_*" (id 7) (at 0 0 0)
        (effects (font (size 1.27 1.27)) hide)
      )
      (symbol "C_1uF_0_1"
        (polyline
          (pts
            (xy -2.032 -0.762)
            (xy 2.032 -0.762)
          )
          (stroke (width 0.508) (type default) (color 0 0 0 0))
          (fill (type none))
        )
        (polyline
          (pts
            (xy -2.032 0.762)
            (xy 2.032 0.762)
          )
          (stroke (width 0.508) (type default) (color 0 0 0 0))
          (fill (type none))
        )
      )
      (symbol "C_1uF_1_1"
        (pin passive line (at 0 3.81 270) (length 2.794)
          (name "~" (effects (font (size 1.27 1.27))))
          (number "1" (effects (font (size 1.27 1.27))))
        )
        (pin passive line (at 0 -3.81 90) (length 2.794)
          (name "~" (effects (font (size 1.27 1.27))))
          (number "2" (effects (font (size 1.27 1.27))))
        )
      )
    )
    (symbol "Connector:RJ45_Shielded" (pin_names (offset 1.016)) (in_bom yes) (on_board yes)
      (property "Reference" "J" (id 0) (at -5.08 13.97 0)
        (effects (font (size 1.27 1.27)) (justify right))
      )
      (property "Value" "RJ45_Shielded" (id 1) (at 2.54 13.97 0)
        (effects (font (size 1.27 1.27)) (justify left))
      )
      (property "Footprint" "" (id 2) (at 0 0.635 90)
        (effects (font (size 1.27 1.27)) hide)
      )
      (property "Datasheet" "~" (id 3) (at 0 0.635 90)
        (effects (font (size 1.27 1.27)) hide)
      )
      (property "ki_keywords" "8P8C RJ female connector" (id 4) (at 0 0 0)
        (effects (font (size 1.27 1.27)) hide)
      )
      (property "ki_description" "RJ connector, 8P8C (8 positions 8 connected), Shielded" (id 5) (at 0 0 0)
        (effects (font (size 1.27 1.27)) hide)
      )
      (property "ki_fp_filters" "8P8C* RJ31* RJ32* RJ33* RJ34* RJ35* RJ41* RJ45* RJ49* RJ61*" (id 6) (at 0 0 0)
        (effects (font (size 1.27 1.27)) hide)
      )
      (symbol "RJ45_Shielded_0_1"
        (polyline
          (pts
            (xy -5.08 4.445)
            (xy -6.35 4.445)
          )
          (stroke (width 0) (type default) (color 0 0 0 0))
          (fill (type none))
        )
        (polyline
          (pts
            (xy -5.08 5.715)
            (xy -6.35 5.715)
          )
          (stroke (width 0) (type default) (color 0 0 0 0))
          (fill (type none))
        )
        (polyline
          (pts
            (xy -6.35 -3.175)
            (xy -5.08 -3.175)
            (xy -5.08 -3.175)
          )
          (stroke (width 0) (type default) (color 0 0 0 0))
          (fill (type none))
        )
        (polyline
          (pts
            (xy -6.35 -1.905)
            (xy -5.08 -1.905)
            (xy -5.08 -1.905)
          )
          (stroke (width 0) (type default) (color 0 0 0 0))
          (fill (type none))
        )
        (polyline
          (pts
            (xy -6.35 -0.635)
            (xy -5.08 -0.635)
            (xy -5.08 -0.635)
          )
          (stroke (width 0) (type default) (color 0 0 0 0))
          (fill (type none))
        )
        (polyline
          (pts
            (xy -6.35 0.635)
            (xy -5.08 0.635)
            (xy -5.08 0.635)
          )
          (stroke (width 0) (type default) (color 0 0 0 0))
          (fill (type none))
        )
        (polyline
          (pts
            (xy -6.35 1.905)
            (xy -5.08 1.905)
            (xy -5.08 1.905)
          )
          (stroke (width 0) (type default) (color 0 0 0 0))
          (fill (type none))
        )
        (polyline
          (pts
            (xy -5.08 3.175)
            (xy -6.35 3.175)
            (xy -6.35 3.175)
          )
          (stroke (width 0) (type default) (color 0 0 0 0))
          (fill (type none))
        )
        (polyline
          (pts
            (xy -6.35 -4.445)
            (xy -6.35 6.985)
            (xy 3.81 6.985)
            (xy 3.81 4.445)
            (xy 5.08 4.445)
            (xy 5.08 3.175)
            (xy 6.35 3.175)
            (xy 6.35 -0.635)
            (xy 5.08 -0.635)
            (xy 5.08 -1.905)
            (xy 3.81 -1.905)
            (xy 3.81 -4.445)
            (xy -6.35 -4.445)
            (xy -6.35 -4.445)
          )
          (stroke (width 0) (type default) (color 0 0 0 0))
          (fill (type none))
        )
        (rectangle (start 7.62 12.7) (end -7.62 -10.16)
          (stroke (width 0.254) (type default) (color 0 0 0 0))
          (fill (type background))
        )
      )
      (symbol "RJ45_Shielded_1_1"
        (pin passive line (at 10.16 -7.62 180) (length 2.54)
          (name "~" (effects (font (size 1.27 1.27))))
          (number "1" (effects (font (size 1.27 1.27))))
        )
        (pin passive line (at 10.16 -5.08 180) (length 2.54)
          (name "~" (effects (font (size 1.27 1.27))))
          (number "2" (effects (font (size 1.27 1.27))))
        )
        (pin passive line (at 10.16 -2.54 180) (length 2.54)
          (name "~" (effects (font (size 1.27 1.27))))
          (number "3" (effects (font (size 1.27 1.27))))
        )
        (pin passive line (at 10.16 0 180) (length 2.54)
          (name "~" (effects (font (size 1.27 1.27))))
          (number "4" (effects (font (size 1.27 1.27))))
        )
        (pin passive line (at 10.16 2.54 180) (length 2.54)
          (name "~" (effects (font (size 1.27 1.27))))
          (number "5" (effects (font (size 1.27 1.27))))
        )
        (pin passive line (at 10.16 5.08 180) (length 2.54)
          (name "~" (effects (font (size 1.27 1.27))))
          (number "6" (effects (font (size 1.27 1.27))))
        )
        (pin passive line (at 10.16 7.62 180) (length 2.54)
          (name "~" (effects (font (size 1.27 1.27))))
          (number "7" (effects (font (size 1.27 1.27))))
        )
        (pin passive line (at 10.16 10.16 180) (length 2.54)
          (name "~" (effects (font (size 1.27 1.27))))
          (number "8" (effects (font (size 1.27 1.27))))
        )
        (pin passive line (at 0 -12.7 90) (length 2.54)
          (name "~" (effects (font (size 1.27 1.27))))
          (number "SH" (effects (font (size 1.27 1.27))))
        )
      )
    )
    (symbol "POWDER_Misc:TRS3232E-Q1" (pin_names (offset 1.016)) (in_bom yes) (on_board yes)
      (property "Reference" "U" (id 0) (at 12.7 12.7 0)
        (effects (font (size 1.27 1.27)))
      )
      (property "Value" "TRS3232E-Q1" (id 1) (at 11.43 -38.1 0)
        (effects (font (size 1.27 1.27)))
      )
      (property "Footprint" "Package_SO:TSSOP-16_4.4x5mm_P0.65mm" (id 2) (at 22.86 15.24 0)
        (effects (font (size 1.27 1.27)) hide)
      )
      (property "Datasheet" "" (id 3) (at 0 0 0)
        (effects (font (size 1.27 1.27)) hide)
      )
      (property "ki_description" "3-V to 5.5-V Multi-Channel RS-232 Line Driver/Receiver With ±15-kV IEC ESD Protection" (id 4) (at 0 0 0)
        (effects (font (size 1.27 1.27)) hide)
      )
      (symbol "TRS3232E-Q1_0_0"
        (polyline
          (pts
            (xy 1.27 -24.765)
            (xy 1.27 -26.035)
            (xy 0.635 -26.035)
          )
          (stroke (width 0) (type default) (color 0 0 0 0))
          (fill (type none))
        )
        (polyline
          (pts
            (xy 1.27 -18.415)
            (xy 1.27 -19.685)
            (xy 0.635 -19.685)
          )
          (stroke (width 0) (type default) (color 0 0 0 0))
          (fill (type none))
        )
        (polyline
          (pts
            (xy 0 -26.035)
            (xy 0.635 -26.035)
            (xy 0.635 -24.765)
            (xy 1.905 -24.765)
          )
          (stroke (width 0) (type default) (color 0 0 0 0))
          (fill (type none))
        )
        (polyline
          (pts
            (xy 0 -19.685)
            (xy 0.635 -19.685)
            (xy 0.635 -18.415)
            (xy 1.905 -18.415)
          )
          (stroke (width 0) (type default) (color 0 0 0 0))
          (fill (type none))
        )
        (text "CMOS" (at -8.89 -1.27 0)
          (effects (font (size 1.27 1.27)))
        )
        (text "RS232" (at 11.43 -1.27 0)
          (effects (font (size 1.27 1.27)))
        )
      )
      (symbol "TRS3232E-Q1_0_1"
        (rectangle (start -16.51 -36.83) (end 17.78 11.43)
          (stroke (width 0) (type default) (color 0 0 0 0))
          (fill (type background))
        )
        (circle (center -3.81 -25.4) (radius 1.27)
          (stroke (width 0) (type default) (color 0 0 0 0))
          (fill (type none))
        )
        (circle (center -3.81 -19.05) (radius 1.27)
          (stroke (width 0) (type default) (color 0 0 0 0))
          (fill (type none))
        )
        (polyline
          (pts
            (xy -5.08 -25.4)
            (xy -7.62 -25.4)
          )
          (stroke (width 0) (type default) (color 0 0 0 0))
          (fill (type none))
        )
        (polyline
          (pts
            (xy -5.08 -19.05)
            (xy -7.62 -19.05)
          )
          (stroke (width 0) (type default) (color 0 0 0 0))
          (fill (type none))
        )
        (polyline
          (pts
            (xy -2.54 -12.7)
            (xy -7.62 -12.7)
          )
          (stroke (width 0) (type default) (color 0 0 0 0))
          (fill (type none))
        )
        (polyline
          (pts
            (xy -2.54 -6.35)
            (xy -7.62 -6.35)
          )
          (stroke (width 0) (type default) (color 0 0 0 0))
          (fill (type none))
        )
        (polyline
          (pts
            (xy 2.54 -25.4)
            (xy 7.62 -25.4)
          )
          (stroke (width 0) (type default) (color 0 0 0 0))
          (fill (type none))
        )
        (polyline
          (pts
            (xy 2.54 -19.05)
            (xy 7.62 -19.05)
          )
          (stroke (width 0) (type default) (color 0 0 0 0))
          (fill (type none))
        )
        (polyline
          (pts
            (xy 5.08 -12.7)
            (xy 7.62 -12.7)
          )
          (stroke (width 0) (type default) (color 0 0 0 0))
          (fill (type none))
        )
        (polyline
          (pts
            (xy 5.08 -6.35)
            (xy 7.62 -6.35)
          )
          (stroke (width 0) (type default) (color 0 0 0 0))
          (fill (type none))
        )
        (polyline
          (pts
            (xy -2.54 -10.16)
            (xy 2.54 -12.7)
            (xy -2.54 -15.24)
            (xy -2.54 -10.16)
          )
          (stroke (width 0) (type default) (color 0 0 0 0))
          (fill (type none))
        )
        (polyline
          (pts
            (xy -2.54 -3.81)
            (xy 2.54 -6.35)
            (xy -2.54 -8.89)
            (xy -2.54 -3.81)
          )
          (stroke (width 0) (type default) (color 0 0 0 0))
          (fill (type none))
        )
        (polyline
          (pts
            (xy 2.54 -27.94)
            (xy -2.54 -25.4)
            (xy 2.54 -22.86)
            (xy 2.54 -27.94)
          )
          (stroke (width 0) (type default) (color 0 0 0 0))
          (fill (type none))
        )
        (polyline
          (pts
            (xy 2.54 -21.59)
            (xy -2.54 -19.05)
            (xy 2.54 -16.51)
            (xy 2.54 -21.59)
          )
          (stroke (width 0) (type default) (color 0 0 0 0))
          (fill (type none))
        )
        (circle (center 3.81 -12.7) (radius 1.27)
          (stroke (width 0) (type default) (color 0 0 0 0))
          (fill (type none))
        )
        (circle (center 3.81 -6.35) (radius 1.27)
          (stroke (width 0) (type default) (color 0 0 0 0))
          (fill (type none))
        )
      )
      (symbol "TRS3232E-Q1_1_1"
        (pin bidirectional line (at -19.05 7.62 0) (length 2.54)
          (name "C1_P" (effects (font (size 1.27 1.27))))
          (number "1" (effects (font (size 1.27 1.27))))
        )
        (pin output line (at -19.05 -12.7 0) (length 2.54)
          (name "DIN_2" (effects (font (size 1.27 1.27))))
          (number "10" (effects (font (size 1.27 1.27))))
        )
        (pin input line (at -19.05 -6.35 0) (length 2.54)
          (name "DIN_1" (effects (font (size 1.27 1.27))))
          (number "11" (effects (font (size 1.27 1.27))))
        )
        (pin output line (at -19.05 -19.05 0) (length 2.54)
          (name "ROUT_1" (effects (font (size 1.27 1.27))))
          (number "12" (effects (font (size 1.27 1.27))))
        )
        (pin input line (at 20.32 -19.05 180) (length 2.54)
          (name "RIN_1" (effects (font (size 1.27 1.27))))
          (number "13" (effects (font (size 1.27 1.27))))
        )
        (pin output line (at 20.32 -6.35 180) (length 2.54)
          (name "DOUT_1" (effects (font (size 1.27 1.27))))
          (number "14" (effects (font (size 1.27 1.27))))
        )
        (pin power_in line (at 0 -39.37 90) (length 2.54)
          (name "GND" (effects (font (size 1.27 1.27))))
          (number "15" (effects (font (size 1.27 1.27))))
        )
        (pin power_in line (at 0 13.97 270) (length 2.54)
          (name "VCC" (effects (font (size 1.27 1.27))))
          (number "16" (effects (font (size 1.27 1.27))))
        )
        (pin bidirectional line (at -19.05 2.54 0) (length 2.54)
          (name "V_P" (effects (font (size 1.27 1.27))))
          (number "2" (effects (font (size 1.27 1.27))))
        )
        (pin bidirectional line (at -19.05 5.08 0) (length 2.54)
          (name "C1_M" (effects (font (size 1.27 1.27))))
          (number "3" (effects (font (size 1.27 1.27))))
        )
        (pin bidirectional line (at 20.32 7.62 180) (length 2.54)
          (name "C2_P" (effects (font (size 1.27 1.27))))
          (number "4" (effects (font (size 1.27 1.27))))
        )
        (pin bidirectional line (at 20.32 5.08 180) (length 2.54)
          (name "C2_M" (effects (font (size 1.27 1.27))))
          (number "5" (effects (font (size 1.27 1.27))))
        )
        (pin bidirectional line (at 20.32 2.54 180) (length 2.54)
          (name "V_M" (effects (font (size 1.27 1.27))))
          (number "6" (effects (font (size 1.27 1.27))))
        )
        (pin output line (at 20.32 -12.7 180) (length 2.54)
          (name "DOUT_2" (effects (font (size 1.27 1.27))))
          (number "7" (effects (font (size 1.27 1.27))))
        )
        (pin input line (at 20.32 -25.4 180) (length 2.54)
          (name "RIN_2" (effects (font (size 1.27 1.27))))
          (number "8" (effects (font (size 1.27 1.27))))
        )
        (pin output line (at -19.05 -25.4 0) (length 2.54)
          (name "ROUT_2" (effects (font (size 1.27 1.27))))
          (number "9" (effects (font (size 1.27 1.27))))
        )
      )
    )
    (symbol "power:+3.3V" (power) (pin_names (offset 0)) (in_bom yes) (on_board yes)
      (property "Reference" "#PWR" (id 0) (at 0 -3.81 0)
        (effects (font (size 1.27 1.27)) hide)
      )
      (property "Value" "+3.3V" (id 1) (at 0 3.556 0)
        (effects (font (size 1.27 1.27)))
      )
      (property "Footprint" "" (id 2) (at 0 0 0)
        (effects (font (size 1.27 1.27)) hide)
      )
      (property "Datasheet" "" (id 3) (at 0 0 0)
        (effects (font (size 1.27 1.27)) hide)
      )
      (property "ki_keywords" "power-flag" (id 4) (at 0 0 0)
        (effects (font (size 1.27 1.27)) hide)
      )
      (property "ki_description" "Power symbol creates a global label with name \"+3.3V\"" (id 5) (at 0 0 0)
        (effects (font (size 1.27 1.27)) hide)
      )
      (symbol "+3.3V_0_1"
        (polyline
          (pts
            (xy -0.762 1.27)
            (xy 0 2.54)
          )
          (stroke (width 0) (type default) (color 0 0 0 0))
          (fill (type none))
        )
        (polyline
          (pts
            (xy 0 0)
            (xy 0 2.54)
          )
          (stroke (width 0) (type default) (color 0 0 0 0))
          (fill (type none))
        )
        (polyline
          (pts
            (xy 0 2.54)
            (xy 0.762 1.27)
          )
          (stroke (width 0) (type default) (color 0 0 0 0))
          (fill (type none))
        )
      )
      (symbol "+3.3V_1_1"
        (pin power_in line (at 0 0 90) (length 0) hide
          (name "+3V3" (effects (font (size 1.27 1.27))))
          (number "1" (effects (font (size 1.27 1.27))))
        )
      )
    )
    (symbol "power:GND" (power) (pin_names (offset 0)) (in_bom yes) (on_board yes)
      (property "Reference" "#PWR" (id 0) (at 0 -6.35 0)
        (effects (font (size 1.27 1.27)) hide)
      )
      (property "Value" "GND" (id 1) (at 0 -3.81 0)
        (effects (font (size 1.27 1.27)))
      )
      (property "Footprint" "" (id 2) (at 0 0 0)
        (effects (font (size 1.27 1.27)) hide)
      )
      (property "Datasheet" "" (id 3) (at 0 0 0)
        (effects (font (size 1.27 1.27)) hide)
      )
      (property "ki_keywords" "power-flag" (id 4) (at 0 0 0)
        (effects (font (size 1.27 1.27)) hide)
      )
      (property "ki_description" "Power symbol creates a global label with name \"GND\" , ground" (id 5) (at 0 0 0)
        (effects (font (size 1.27 1.27)) hide)
      )
      (symbol "GND_0_1"
        (polyline
          (pts
            (xy 0 0)
            (xy 0 -1.27)
            (xy 1.27 -1.27)
            (xy 0 -2.54)
            (xy -1.27 -1.27)
            (xy 0 -1.27)
          )
          (stroke (width 0) (type default) (color 0 0 0 0))
          (fill (type none))
        )
      )
      (symbol "GND_1_1"
        (pin power_in line (at 0 0 270) (length 0) hide
          (name "GND" (effects (font (size 1.27 1.27))))
          (number "1" (effects (font (size 1.27 1.27))))
        )
      )
    )
  )


  (no_connect (at 170.18 66.04) (uuid 243396a1-81e0-401a-b5d3-433510bafb88))
  (no_connect (at 170.18 68.58) (uuid 3e00727d-3633-4f14-a008-b83c33cdece6))
  (no_connect (at 170.18 83.82) (uuid 4d86cd0f-920b-481d-9977-8725e1165555))
  (no_connect (at 170.18 71.12) (uuid 5562d4f9-2d68-41e2-bb8b-57cb8939ee83))
  (no_connect (at 205.74 71.12) (uuid 5e0bf11d-dcbf-4e21-b8c4-6d8df52febd8))
  (no_connect (at 170.18 76.2) (uuid 98ffbb87-1240-4cca-8f2c-a21e66c54921))
  (no_connect (at 205.74 66.04) (uuid c00c9ee8-12d5-4860-85f6-89b78f1e7fce))
  (no_connect (at 205.74 76.2) (uuid cfa805a1-fc76-4d8e-acd0-c05784430190))
  (no_connect (at 205.74 68.58) (uuid f0bdece0-d999-48d7-92f1-890a2ad34d80))
  (no_connect (at 205.74 83.82) (uuid f9b39b01-bd73-42ba-8b45-ee072467fa0d))

  (wire (pts (xy 86.36 102.87) (xy 82.55 102.87))
    (stroke (width 0) (type default) (color 0 0 0 0))
    (uuid 01f9f8d2-c1a4-4c19-8876-f0aa4c59c48e)
  )
  (wire (pts (xy 157.48 73.66) (xy 170.18 73.66))
    (stroke (width 0) (type default) (color 0 0 0 0))
    (uuid 0bcf0106-9b4a-482e-a0e8-b6e523d34726)
  )
  (wire (pts (xy 82.55 96.52) (xy 86.36 96.52))
    (stroke (width 0) (type default) (color 0 0 0 0))
    (uuid 1b9707a4-c4d3-45d0-8433-88b95aa9f4da)
  )
  (wire (pts (xy 146.05 82.55) (xy 146.05 85.09))
    (stroke (width 0) (type default) (color 0 0 0 0))
    (uuid 1d56485f-b738-41a6-86b7-2548d73c3374)
  )
  (wire (pts (xy 82.55 69.85) (xy 86.36 69.85))
    (stroke (width 0) (type default) (color 0 0 0 0))
    (uuid 1e553cac-40bc-4a20-a76b-ade3fc65801e)
  )
  (wire (pts (xy 114.3 50.8) (xy 114.3 48.26))
    (stroke (width 0) (type default) (color 0 0 0 0))
    (uuid 2e4e0a6c-185f-4009-a2c5-4a260d0c3f27)
  )
  (wire (pts (xy 73.66 69.85) (xy 74.93 69.85))
    (stroke (width 0) (type default) (color 0 0 0 0))
    (uuid 306eb00f-e01e-4f47-9984-d56a386a512f)
  )
  (wire (pts (xy 180.34 88.9) (xy 180.34 105.41))
    (stroke (width 0) (type default) (color 0 0 0 0))
    (uuid 46a6d536-de86-45b1-8ac4-cc4e784d14d5)
  )
  (wire (pts (xy 205.74 81.28) (xy 198.12 81.28))
    (stroke (width 0) (type default) (color 0 0 0 0))
    (uuid 4a9729fd-e997-407a-8624-8f01a63c37c3)
  )
  (wire (pts (xy 73.66 72.39) (xy 73.66 69.85))
    (stroke (width 0) (type default) (color 0 0 0 0))
    (uuid 54b98c68-24bc-4c23-b775-c8d2143d0565)
  )
  (wire (pts (xy 139.7 72.39) (xy 139.7 69.85))
    (stroke (width 0) (type default) (color 0 0 0 0))
    (uuid 58374fee-39f6-4cab-8286-0334c05a6971)
  )
  (wire (pts (xy 125.73 96.52) (xy 133.35 96.52))
    (stroke (width 0) (type default) (color 0 0 0 0))
    (uuid 590b415b-13bc-4f33-a6d2-6bd880e16def)
  )
  (wire (pts (xy 71.12 86.36) (xy 71.12 83.82))
    (stroke (width 0) (type default) (color 0 0 0 0))
    (uuid 5dd02968-29a0-4baa-9494-1175a2e7b81f)
  )
  (wire (pts (xy 105.41 58.42) (xy 105.41 63.5))
    (stroke (width 0) (type default) (color 0 0 0 0))
    (uuid 60317dae-703b-4ccb-abbb-6bbbed1853ad)
  )
  (wire (pts (xy 193.04 78.74) (xy 193.04 73.66))
    (stroke (width 0) (type default) (color 0 0 0 0))
    (uuid 60c060aa-8f2d-4e2a-bbc4-f010836892f5)
  )
  (wire (pts (xy 170.18 81.28) (xy 162.56 81.28))
    (stroke (width 0) (type default) (color 0 0 0 0))
    (uuid 72919957-ce62-45d6-a53a-8ad4a28357de)
  )
  (wire (pts (xy 86.36 74.93) (xy 71.12 74.93))
    (stroke (width 0) (type default) (color 0 0 0 0))
    (uuid 74d174f8-1095-46bf-bf56-6b0c1bd023ad)
  )
  (wire (pts (xy 114.3 38.1) (xy 114.3 40.64))
    (stroke (width 0) (type default) (color 0 0 0 0))
    (uuid 781212f2-2f94-4cca-8fb2-fd770998c09e)
  )
  (wire (pts (xy 125.73 83.82) (xy 133.35 83.82))
    (stroke (width 0) (type default) (color 0 0 0 0))
    (uuid 7abd6e27-f5d5-4bcc-a0d8-2cbe04becc02)
  )
  (wire (pts (xy 215.9 88.9) (xy 215.9 105.41))
    (stroke (width 0) (type default) (color 0 0 0 0))
    (uuid 80b2e1a8-4f5e-4149-825b-4360ede10401)
  )
  (wire (pts (xy 71.12 74.93) (xy 71.12 76.2))
    (stroke (width 0) (type default) (color 0 0 0 0))
    (uuid 87ef8960-f317-492d-9021-c88daf36ff31)
  )
  (wire (pts (xy 132.08 69.85) (xy 125.73 69.85))
    (stroke (width 0) (type default) (color 0 0 0 0))
    (uuid 88887f96-cac2-41e3-a5e0-4a4816b52403)
  )
  (wire (pts (xy 205.74 78.74) (xy 198.12 78.74))
    (stroke (width 0) (type default) (color 0 0 0 0))
    (uuid 88ae5071-5164-4514-9e0c-f72e7ed8e8f3)
  )
  (wire (pts (xy 157.48 78.74) (xy 157.48 73.66))
    (stroke (width 0) (type default) (color 0 0 0 0))
    (uuid 9ab47290-067e-4f00-a556-6bfdb460ec65)
  )
  (wire (pts (xy 125.73 72.39) (xy 139.7 72.39))
    (stroke (width 0) (type default) (color 0 0 0 0))
    (uuid a96165b0-b01c-4a77-a985-d17b17c6e817)
  )
  (wire (pts (xy 73.66 72.39) (xy 86.36 72.39))
    (stroke (width 0) (type default) (color 0 0 0 0))
    (uuid be44d459-d103-4a76-b8fe-16ab1fb3915e)
  )
  (wire (pts (xy 193.04 73.66) (xy 205.74 73.66))
    (stroke (width 0) (type default) (color 0 0 0 0))
    (uuid c9a510bc-ce37-45d3-a08b-144606085ea3)
  )
  (wire (pts (xy 82.55 83.82) (xy 86.36 83.82))
    (stroke (width 0) (type default) (color 0 0 0 0))
    (uuid cce74543-3dbf-4007-b233-ffc4cbb65551)
  )
  (wire (pts (xy 125.73 102.87) (xy 133.35 102.87))
    (stroke (width 0) (type default) (color 0 0 0 0))
    (uuid ce1cc0c4-2b4d-4b22-b3d7-bb5e83b5c6d1)
  )
  (wire (pts (xy 86.36 90.17) (xy 82.55 90.17))
    (stroke (width 0) (type default) (color 0 0 0 0))
    (uuid cf7b414f-5198-40f0-a02f-ebdc8828ad1e)
  )
  (wire (pts (xy 170.18 78.74) (xy 162.56 78.74))
    (stroke (width 0) (type default) (color 0 0 0 0))
    (uuid e093c109-6680-435a-a8b5-48420a9f8597)
  )
  (wire (pts (xy 105.41 120.65) (xy 105.41 116.84))
    (stroke (width 0) (type default) (color 0 0 0 0))
    (uuid e1da7546-588a-44c9-be5d-61be55d817d4)
  )
  (wire (pts (xy 125.73 90.17) (xy 133.35 90.17))
    (stroke (width 0) (type default) (color 0 0 0 0))
    (uuid f196a9f9-f9d8-4a85-846f-a5afa0fefffb)
  )
  (wire (pts (xy 125.73 74.93) (xy 146.05 74.93))
    (stroke (width 0) (type default) (color 0 0 0 0))
    (uuid f727e5b8-07fe-49ac-ba42-ce61e064d465)
  )

  (label "RIN_2" (at 162.56 78.74 0)
    (effects (font (size 1.27 1.27)) (justify left bottom))
    (uuid 08b3dfc2-fb14-4255-a81c-a4ca2f0df139)
  )
  (label "RIN_1" (at 198.12 78.74 0)
    (effects (font (size 1.27 1.27)) (justify left bottom))
    (uuid 217ba632-c45e-428b-b726-bd175289517a)
  )
  (label "V_M" (at 128.27 74.93 0)
    (effects (font (size 1.27 1.27)) (justify left bottom))
    (uuid 22a88578-6177-474f-ab11-34c986ebf27a)
  )
  (label "DOUT_2" (at 133.35 90.17 180)
    (effects (font (size 1.27 1.27)) (justify right bottom))
    (uuid 2bacbf9c-7997-48db-8424-75b23d8e330e)
  )
  (label "C2_M" (at 127 72.39 0)
    (effects (font (size 1.27 1.27)) (justify left bottom))
    (uuid 8243b980-7bee-47ac-9983-c49f98f2eeb2)
  )
  (label "C1_P" (at 82.55 69.85 0)
    (effects (font (size 1.27 1.27)) (justify left bottom))
    (uuid 884d877d-68e2-4af6-b0f6-1ad48c56d874)
  )
  (label "DOUT_1" (at 133.35 83.82 180)
    (effects (font (size 1.27 1.27)) (justify right bottom))
    (uuid c93cfab0-7d0f-4069-b5bf-e7d71af9c3e8)
  )
  (label "C2_P" (at 127 69.85 0)
    (effects (font (size 1.27 1.27)) (justify left bottom))
    (uuid d7d7595e-344d-476c-8368-df20159b0d53)
  )
  (label "RIN_1" (at 133.35 96.52 180)
    (effects (font (size 1.27 1.27)) (justify right bottom))
    (uuid d89b3e44-646b-4b78-a8f4-30415eb0f1f5)
  )
  (label "DOUT_2" (at 162.56 81.28 0)
    (effects (font (size 1.27 1.27)) (justify left bottom))
    (uuid dbdba2a7-8fb3-442c-b5bf-3c4e2c8a4c14)
  )
  (label "V_P" (at 71.12 74.93 0)
    (effects (font (size 1.27 1.27)) (justify left bottom))
    (uuid dd112493-aa67-4db1-8334-dbff5f5b11d7)
  )
  (label "RIN_2" (at 133.35 102.87 180)
    (effects (font (size 1.27 1.27)) (justify right bottom))
    (uuid f4451ed1-de72-4a3e-a6a8-b4529ac60c41)
  )
  (label "DOUT_1" (at 198.12 81.28 0)
    (effects (font (size 1.27 1.27)) (justify left bottom))
    (uuid f531666a-4f3c-4c38-b83f-5ec83bcb0182)
  )
  (label "C1_M" (at 82.55 72.39 0)
    (effects (font (size 1.27 1.27)) (justify left bottom))
    (uuid fe9a2d3a-79ff-4f56-9c25-924053ffa574)
  )

  (hierarchical_label "RX_1" (shape output) (at 82.55 96.52 180)
    (effects (font (size 1.27 1.27)) (justify right))
    (uuid 2cd9accf-949a-43db-9bfe-c3e491fd12f1)
  )
  (hierarchical_label "TX_1" (shape input) (at 82.55 83.82 180)
    (effects (font (size 1.27 1.27)) (justify right))
    (uuid 4dfe1505-c709-42a8-8e8c-bd9393767ccf)
  )
  (hierarchical_label "TX_2" (shape input) (at 82.55 90.17 180)
    (effects (font (size 1.27 1.27)) (justify right))
    (uuid 620e13f4-a53e-47cb-92be-f00d711956db)
  )
  (hierarchical_label "RX_2" (shape output) (at 82.55 102.87 180)
    (effects (font (size 1.27 1.27)) (justify right))
    (uuid 801cc2c6-48de-45df-9ad6-059037ef49f7)
  )

  (symbol (lib_id "POWDER_Misc:TRS3232E-Q1") (at 105.41 77.47 0)
    (in_bom yes) (on_board yes)
    (uuid 00000000-0000-0000-0000-00005e1c5c12)
    (property "Reference" "U1901" (id 0) (at 118.11 64.77 0))
    (property "Value" "TRS3232E-Q1" (id 1) (at 116.84 115.57 0))
    (property "Footprint" "Package_SO:TSSOP-16_4.4x5mm_P0.65mm" (id 2) (at 128.27 62.23 0)
      (effects (font (size 1.27 1.27)) hide)
    )
    (property "Datasheet" "" (id 3) (at 105.41 77.47 0)
      (effects (font (size 1.27 1.27)) hide)
    )
    (property "PartSpecification" "3000-0000000533" (id 4) (at 105.41 77.47 0)
      (effects (font (size 1.27 1.27)) hide)
    )
    (pin "1" (uuid 87547453-631e-4ab4-ae32-fd9d5bbec9ca))
    (pin "10" (uuid 07c70946-dd2e-4c93-ab73-6d219d21c2d6))
    (pin "11" (uuid 366fb7ac-b890-4a09-9d7e-cefc14e6556f))
    (pin "12" (uuid 92a2dd55-88de-46c7-84b7-a4d984643e49))
    (pin "13" (uuid f0764915-0e15-4e33-aa6c-e9aa2a3867d7))
    (pin "14" (uuid 52184fda-8929-4212-aa11-71b88f803d7c))
    (pin "15" (uuid a1788ef3-42b2-4812-ab6d-aa7c31b93427))
    (pin "16" (uuid 71ea432e-8494-44fb-a242-fa338955c70e))
    (pin "2" (uuid 6129cc46-18e5-4eb4-863b-6fee8e8ed0ef))
    (pin "3" (uuid ce85c102-1fef-4389-8ba3-6a87c2f5dfbb))
    (pin "4" (uuid 39435159-a502-4557-8869-f9cc2c994eac))
    (pin "5" (uuid 838a3d46-9b74-4fc4-99e0-bc903357f374))
    (pin "6" (uuid 65f47d0a-8ac6-4a79-9b42-f14b85cff4c1))
    (pin "7" (uuid d68aeb94-7e2b-4365-812c-e11ec3e4b55e))
    (pin "8" (uuid 08dade32-fb7e-45df-b5fc-8f7b5cfa2d83))
    (pin "9" (uuid 4605fb64-bee8-41db-9b37-52c7ee02b479))
  )

  (symbol (lib_id "power:GND") (at 105.41 120.65 0)
    (in_bom yes) (on_board yes)
    (uuid 00000000-0000-0000-0000-00005e1c5c18)
    (property "Reference" "#PWR?" (id 0) (at 105.41 127 0)
      (effects (font (size 1.27 1.27)) hide)
    )
    (property "Value" "GND" (id 1) (at 105.41 124.46 0))
    (property "Footprint" "" (id 2) (at 105.41 120.65 0)
      (effects (font (size 1.27 1.27)) hide)
    )
    (property "Datasheet" "" (id 3) (at 105.41 120.65 0)
      (effects (font (size 1.27 1.27)) hide)
    )
    (pin "1" (uuid 736db764-3453-44d1-acdb-3ffbbf8ebbc1))
  )

  (symbol (lib_id "power:+3.3V") (at 105.41 58.42 0)
    (in_bom yes) (on_board yes)
    (uuid 00000000-0000-0000-0000-00005e1c5c1f)
    (property "Reference" "#PWR?" (id 0) (at 105.41 62.23 0)
      (effects (font (size 1.27 1.27)) hide)
    )
    (property "Value" "+3.3V" (id 1) (at 105.41 54.864 0))
    (property "Footprint" "" (id 2) (at 105.41 58.42 0)
      (effects (font (size 1.27 1.27)) hide)
    )
    (property "Datasheet" "" (id 3) (at 105.41 58.42 0)
      (effects (font (size 1.27 1.27)) hide)
    )
    (pin "1" (uuid 1d36e0e1-9a9c-47b0-a886-298e8629f915))
  )

  (symbol (lib_id "000_PreferredParts:C_0_1uF") (at 135.89 69.85 270)
    (in_bom yes) (on_board yes)
    (uuid 00000000-0000-0000-0000-00005e1c5c28)
    (property "Reference" "C1903" (id 0) (at 138.43 70.485 0)
      (effects (font (size 1.27 1.27)) (justify left))
    )
    (property "Value" "C_0_1uF" (id 1) (at 133.35 70.485 0)
      (effects (font (size 1.27 1.27)) (justify left) hide)
    )
    (property "Footprint" "Capacitor_SMD:C_0402_1005Metric" (id 2) (at 132.08 70.8152 0)
      (effects (font (size 1.27 1.27)) hide)
    )
    (property "Datasheet" "~" (id 3) (at 135.89 69.85 0)
      (effects (font (size 1.27 1.27)) hide)
    )
    (property "DisplayValue" "0.1uF" (id 4) (at 133.35 73.66 0))
    (property "PartSpecification" "3000-0000000125" (id 5) (at 135.89 69.85 0)
      (effects (font (size 1.27 1.27)) hide)
    )
    (pin "1" (uuid ec27cae5-b1ca-4220-98d6-fef611e53fe5))
    (pin "2" (uuid bce3494f-d4f9-4520-a3f4-fdea28a096fe))
  )

  (symbol (lib_id "000_PreferredParts:C_0_1uF") (at 146.05 78.74 180)
    (in_bom yes) (on_board yes)
    (uuid 00000000-0000-0000-0000-00005e1c5c30)
    (property "Reference" "C1904" (id 0) (at 145.415 81.28 0)
      (effects (font (size 1.27 1.27)) (justify left))
    )
    (property "Value" "C_0_1uF" (id 1) (at 145.415 76.2 0)
      (effects (font (size 1.27 1.27)) (justify left) hide)
    )
    (property "Footprint" "Capacitor_SMD:C_0402_1005Metric" (id 2) (at 145.0848 74.93 0)
      (effects (font (size 1.27 1.27)) hide)
    )
    (property "Datasheet" "~" (id 3) (at 146.05 78.74 0)
      (effects (font (size 1.27 1.27)) hide)
    )
    (property "DisplayValue" "0.1uF" (id 4) (at 142.24 76.2 0))
    (property "PartSpecification" "3000-0000000125" (id 5) (at 146.05 78.74 0)
      (effects (font (size 1.27 1.27)) hide)
    )
    (pin "1" (uuid c740f1ad-f683-47f3-8b4b-4b9d35ec8046))
    (pin "2" (uuid 54bd93eb-8a39-4f2d-b7a4-e9eaf5e1b753))
  )

  (symbol (lib_id "000_PreferredParts:C_0_1uF") (at 78.74 69.85 270)
    (in_bom yes) (on_board yes)
    (uuid 00000000-0000-0000-0000-00005e1c5c38)
    (property "Reference" "C1902" (id 0) (at 81.28 70.485 0)
      (effects (font (size 1.27 1.27)) (justify left))
    )
    (property "Value" "C_0_1uF" (id 1) (at 76.2 70.485 0)
      (effects (font (size 1.27 1.27)) (justify left) hide)
    )
    (property "Footprint" "Capacitor_SMD:C_0402_1005Metric" (id 2) (at 74.93 70.8152 0)
      (effects (font (size 1.27 1.27)) hide)
    )
    (property "Datasheet" "~" (id 3) (at 78.74 69.85 0)
      (effects (font (size 1.27 1.27)) hide)
    )
    (property "DisplayValue" "0.1uF" (id 4) (at 76.2 73.66 0))
    (property "PartSpecification" "3000-0000000125" (id 5) (at 78.74 69.85 0)
      (effects (font (size 1.27 1.27)) hide)
    )
    (pin "1" (uuid 01eeca08-4670-4daa-a738-ad2c67ce94e4))
    (pin "2" (uuid 5cdd6506-2169-4c5e-a586-e3c2df1204df))
  )

  (symbol (lib_id "000_PreferredParts:C_0_1uF") (at 71.12 80.01 180)
    (in_bom yes) (on_board yes)
    (uuid 00000000-0000-0000-0000-00005e1c5c40)
    (property "Reference" "C1901" (id 0) (at 70.485 82.55 0)
      (effects (font (size 1.27 1.27)) (justify left))
    )
    (property "Value" "C_0_1uF" (id 1) (at 70.485 77.47 0)
      (effects (font (size 1.27 1.27)) (justify left) hide)
    )
    (property "Footprint" "Capacitor_SMD:C_0402_1005Metric" (id 2) (at 70.1548 76.2 0)
      (effects (font (size 1.27 1.27)) hide)
    )
    (property "Datasheet" "~" (id 3) (at 71.12 80.01 0)
      (effects (font (size 1.27 1.27)) hide)
    )
    (property "DisplayValue" "0.1uF" (id 4) (at 67.31 77.47 0))
    (property "PartSpecification" "3000-0000000125" (id 5) (at 71.12 80.01 0)
      (effects (font (size 1.27 1.27)) hide)
    )
    (pin "1" (uuid bdae2c6b-7b0f-4ebd-9597-e6f337e1e08d))
    (pin "2" (uuid c46a1280-1581-41e6-ae0f-7db9fa9f7f98))
  )

  (symbol (lib_id "power:GND") (at 146.05 85.09 0)
    (in_bom yes) (on_board yes)
    (uuid 00000000-0000-0000-0000-00005e1c5c4a)
    (property "Reference" "#PWR?" (id 0) (at 146.05 91.44 0)
      (effects (font (size 1.27 1.27)) hide)
    )
    (property "Value" "GND" (id 1) (at 146.05 88.9 0))
    (property "Footprint" "" (id 2) (at 146.05 85.09 0)
      (effects (font (size 1.27 1.27)) hide)
    )
    (property "Datasheet" "" (id 3) (at 146.05 85.09 0)
      (effects (font (size 1.27 1.27)) hide)
    )
    (pin "1" (uuid 412e60a2-a759-4be2-b3d3-42a12725ddfd))
  )

  (symbol (lib_id "power:GND") (at 71.12 86.36 0)
    (in_bom yes) (on_board yes)
    (uuid 00000000-0000-0000-0000-00005e1c5c57)
    (property "Reference" "#PWR?" (id 0) (at 71.12 92.71 0)
      (effects (font (size 1.27 1.27)) hide)
    )
    (property "Value" "GND" (id 1) (at 71.12 90.17 0))
    (property "Footprint" "" (id 2) (at 71.12 86.36 0)
      (effects (font (size 1.27 1.27)) hide)
    )
    (property "Datasheet" "" (id 3) (at 71.12 86.36 0)
      (effects (font (size 1.27 1.27)) hide)
    )
    (pin "1" (uuid 97dc79a6-1c9b-48d6-98ab-88b215c29aa8))
  )

  (symbol (lib_id "power:GND") (at 215.9 105.41 0) (unit 1)
    (in_bom yes) (on_board yes)
    (uuid 00000000-0000-0000-0000-00005e1cba7b)
    (property "Reference" "#PWR?" (id 0) (at 215.9 111.76 0)
      (effects (font (size 1.27 1.27)) hide)
    )
    (property "Value" "GND" (id 1) (at 215.9 109.22 0))
    (property "Footprint" "" (id 2) (at 215.9 105.41 0)
      (effects (font (size 1.27 1.27)) hide)
    )
    (property "Datasheet" "" (id 3) (at 215.9 105.41 0)
      (effects (font (size 1.27 1.27)) hide)
    )
    (pin "1" (uuid fb8b14c0-2f35-43ee-a4cd-65b026761705))
  )

  (symbol (lib_id "power:GND") (at 180.34 105.41 0) (unit 1)
    (in_bom yes) (on_board yes)
    (uuid 00000000-0000-0000-0000-00005e1cc3a8)
    (property "Reference" "#PWR?" (id 0) (at 180.34 111.76 0)
      (effects (font (size 1.27 1.27)) hide)
    )
    (property "Value" "GND" (id 1) (at 180.34 109.22 0))
    (property "Footprint" "" (id 2) (at 180.34 105.41 0)
      (effects (font (size 1.27 1.27)) hide)
    )
    (property "Datasheet" "" (id 3) (at 180.34 105.41 0)
      (effects (font (size 1.27 1.27)) hide)
    )
    (pin "1" (uuid 131faf47-f254-4c5a-a0e8-fd5169f724b7))
  )

  (symbol (lib_id "power:GND") (at 193.04 78.74 0) (unit 1)
    (in_bom yes) (on_board yes)
    (uuid 00000000-0000-0000-0000-00005e1cdf1e)
    (property "Reference" "#PWR?" (id 0) (at 193.04 85.09 0)
      (effects (font (size 1.27 1.27)) hide)
    )
    (property "Value" "GND" (id 1) (at 193.04 82.55 0))
    (property "Footprint" "" (id 2) (at 193.04 78.74 0)
      (effects (font (size 1.27 1.27)) hide)
    )
    (property "Datasheet" "" (id 3) (at 193.04 78.74 0)
      (effects (font (size 1.27 1.27)) hide)
    )
    (pin "1" (uuid acc84ee6-e422-49db-8173-10b1e03b811e))
  )

  (symbol (lib_id "power:GND") (at 157.48 78.74 0) (unit 1)
    (in_bom yes) (on_board yes)
    (uuid 00000000-0000-0000-0000-00005e1ce688)
    (property "Reference" "#PWR?" (id 0) (at 157.48 85.09 0)
      (effects (font (size 1.27 1.27)) hide)
    )
    (property "Value" "GND" (id 1) (at 157.48 82.55 0))
    (property "Footprint" "" (id 2) (at 157.48 78.74 0)
      (effects (font (size 1.27 1.27)) hide)
    )
    (property "Datasheet" "" (id 3) (at 157.48 78.74 0)
      (effects (font (size 1.27 1.27)) hide)
    )
    (pin "1" (uuid 740dd8f0-b73c-4a9d-97aa-10e9d76cab8f))
  )

  (symbol (lib_id "Connector:RJ45_Shielded") (at 180.34 76.2 0) (mirror y) (unit 1)
    (in_bom yes) (on_board yes)
    (uuid 00000000-0000-0000-0000-00005e4248c2)
    (property "Reference" "J1901" (id 0) (at 185.42 62.23 0)
      (effects (font (size 1.27 1.27)) (justify right))
    )
    (property "Value" "RJ45_Shielded" (id 1) (at 177.8 62.23 0)
      (effects (font (size 1.27 1.27)) (justify left))
    )
    (property "Footprint" "POWDER_Misc:MTJ-88TX1-FSD-PGB" (id 2) (at 180.34 75.565 90)
      (effects (font (size 1.27 1.27)) hide)
    )
    (property "Datasheet" "~" (id 3) (at 180.34 75.565 90)
      (effects (font (size 1.27 1.27)) hide)
    )
    (property "PartSpecification" "3000-0000000491" (id 4) (at 180.34 76.2 0)
      (effects (font (size 1.27 1.27)) hide)
    )
    (pin "1" (uuid 1ed6a01c-092c-4e90-95e3-f75acba3e41f))
    (pin "2" (uuid 41bd41ce-f3ba-4d09-8973-8b6844e8a26e))
    (pin "3" (uuid 286dcb8a-1bd3-4aa6-8e80-e6651b2d85e0))
    (pin "4" (uuid 981168ab-e70e-497f-9d34-2e67e4c74997))
    (pin "5" (uuid 7c85ddda-67b2-4645-ad9f-72715d9e59fa))
    (pin "6" (uuid 8bf5550c-eae7-4804-92bd-74c7c57e09f6))
    (pin "7" (uuid 3b593966-a6ed-469c-83ab-b141dda00b3f))
    (pin "8" (uuid f31aef50-22a0-4e30-a121-f25ff2c56a82))
    (pin "SH" (uuid 2cb0952d-4af1-410d-9782-95675c2ff79a))
  )

  (symbol (lib_id "Connector:RJ45_Shielded") (at 215.9 76.2 0) (mirror y) (unit 1)
    (in_bom yes) (on_board yes)
    (uuid 00000000-0000-0000-0000-00005e43b385)
    (property "Reference" "J1902" (id 0) (at 220.98 62.23 0)
      (effects (font (size 1.27 1.27)) (justify right))
    )
    (property "Value" "RJ45_Shielded" (id 1) (at 213.36 62.23 0)
      (effects (font (size 1.27 1.27)) (justify left))
    )
    (property "Footprint" "POWDER_Misc:MTJ-88TX1-FSD-PGB" (id 2) (at 215.9 75.565 90)
      (effects (font (size 1.27 1.27)) hide)
    )
    (property "Datasheet" "~" (id 3) (at 215.9 75.565 90)
      (effects (font (size 1.27 1.27)) hide)
    )
    (property "PartSpecification" "3000-0000000491" (id 4) (at 215.9 76.2 0)
      (effects (font (size 1.27 1.27)) hide)
    )
    (pin "1" (uuid 13604448-b9bc-4e82-a4e9-9dc27a49259c))
    (pin "2" (uuid 2e5f7e85-452b-4f1a-927a-f8c949998801))
    (pin "3" (uuid 5c1b2bc2-05fb-4f06-a346-6bdae7757e96))
    (pin "4" (uuid b50e7eee-e26f-4403-a9db-fbded4d09923))
    (pin "5" (uuid e2661df3-1988-4452-9e3a-558845ec128b))
    (pin "6" (uuid 3646319f-b55a-485d-af2a-ffc9f6a61297))
    (pin "7" (uuid d355e50f-2a22-4009-b72f-9946e7c1a6af))
    (pin "8" (uuid 6e88eb0e-af69-47c6-b3e0-0ed25211314c))
    (pin "SH" (uuid e11a8bd0-52e1-4657-b3ea-006609b7c2e0))
  )

  (symbol (lib_id "000_PreferredParts:C_1uF") (at 114.3 44.45 0) (unit 1)
    (in_bom yes) (on_board yes)
    (uuid 00000000-0000-0000-0000-00005f5d7b69)
    (property "Reference" "C1905" (id 0) (at 114.935 41.91 0)
      (effects (font (size 1.27 1.27)) (justify left))
    )
    (property "Value" "C_1uF" (id 1) (at 114.935 46.99 0)
      (effects (font (size 1.27 1.27)) (justify left))
    )
    (property "Footprint" "Capacitor_SMD:C_0603_1608Metric" (id 2) (at 115.2652 48.26 0)
      (effects (font (size 1.27 1.27)) hide)
    )
    (property "Datasheet" "~" (id 3) (at 114.3 44.45 0)
      (effects (font (size 1.27 1.27)) hide)
    )
    (property "PartSpecification" "3000-0000000136" (id 4) (at 114.3 44.45 0)
      (effects (font (size 1.27 1.27)) hide)
    )
    (pin "1" (uuid 93fc9036-7488-446f-a0fa-58d04b45db7a))
    (pin "2" (uuid c7042482-c5fd-4887-aff7-8b39b68856f2))
  )

  (symbol (lib_id "power:+3.3V") (at 114.3 38.1 0)
    (in_bom yes) (on_board yes)
    (uuid 00000000-0000-0000-0000-00005f5d8e36)
    (property "Reference" "#PWR?" (id 0) (at 114.3 41.91 0)
      (effects (font (size 1.27 1.27)) hide)
    )
    (property "Value" "+3.3V" (id 1) (at 114.3 34.544 0))
    (property "Footprint" "" (id 2) (at 114.3 38.1 0)
      (effects (font (size 1.27 1.27)) hide)
    )
    (property "Datasheet" "" (id 3) (at 114.3 38.1 0)
      (effects (font (size 1.27 1.27)) hide)
    )
    (pin "1" (uuid b9375e17-6884-4a7d-9729-479596eebd7d))
  )

  (symbol (lib_id "power:GND") (at 114.3 50.8 0) (unit 1)
    (in_bom yes) (on_board yes)
    (uuid 00000000-0000-0000-0000-00005f5d98c3)
    (property "Reference" "#PWR?" (id 0) (at 114.3 57.15 0)
      (effects (font (size 1.27 1.27)) hide)
    )
    (property "Value" "GND" (id 1) (at 114.3 54.61 0))
    (property "Footprint" "" (id 2) (at 114.3 50.8 0)
      (effects (font (size 1.27 1.27)) hide)
    )
    (property "Datasheet" "" (id 3) (at 114.3 50.8 0)
      (effects (font (size 1.27 1.27)) hide)
    )
    (pin "1" (uuid beafb865-8ea9-4aeb-85e5-2dda2eaf7699))
  )
)
