EESchema Schematic File Version 4
EELAYER 30 0
EELAYER END
$Descr A4 11693 8268
encoding utf-8
Sheet 20 27
Title ""
Date ""
Rev ""
Comp ""
Comment1 ""
Comment2 ""
Comment3 ""
Comment4 ""
$EndDescr
$Comp
L POWDER_MCU:MSP432E401YTPDTR U2002
U 4 1 5E221122
P 9900 3250
F 0 "U2002" H 9900 2950 60  0000 C CNN
F 1 "MSP432E401YTPDTR" H 9900 3500 60  0000 C CNN
F 2 "POWDER_MCU:MSP432E401YTPDTR" H 9900 2790 60  0001 C CNN
F 3 "" H 9900 2850 60  0000 C CNN
F 4 "Texas Instruments" H 9900 3250 50  0001 C CNN "Manufacturer"
F 5 "MSP432E401YTPDTR" H 9900 3250 50  0001 C CNN "PartNumber"
F 6 "3000-0000000080" H 9900 3250 50  0001 C CNN "PartSpecification"
	4    9900 3250
	1    0    0    -1  
$EndComp
NoConn ~ 9200 4400
$Comp
L power:GND #PWR?
U 1 1 5E2251B4
P 10800 4000
F 0 "#PWR?" H 10800 3750 50  0001 C CNN
F 1 "GND" H 10800 3850 50  0000 C CNN
F 2 "" H 10800 4000 50  0001 C CNN
F 3 "" H 10800 4000 50  0001 C CNN
	1    10800 4000
	1    0    0    -1  
$EndComp
Wire Wire Line
	10600 3050 10800 3050
Wire Wire Line
	10800 3050 10800 3250
Wire Wire Line
	10600 3750 10800 3750
Connection ~ 10800 3750
Wire Wire Line
	10800 3750 10800 4000
Wire Wire Line
	10600 3650 10800 3650
Connection ~ 10800 3650
Wire Wire Line
	10800 3650 10800 3750
Wire Wire Line
	10600 3550 10800 3550
Connection ~ 10800 3550
Wire Wire Line
	10800 3550 10800 3650
Wire Wire Line
	10600 3450 10800 3450
Connection ~ 10800 3450
Wire Wire Line
	10800 3450 10800 3550
Wire Wire Line
	10600 3350 10800 3350
Connection ~ 10800 3350
Wire Wire Line
	10800 3350 10800 3450
Wire Wire Line
	10600 3250 10800 3250
Connection ~ 10800 3250
Wire Wire Line
	10800 3250 10800 3350
$Comp
L Device:Ferrite_Bead FB2202
U 1 1 5E226F12
P 8650 4150
F 0 "FB2202" V 8500 4175 50  0000 C CNN
F 1 "Ferrite_Bead" V 8800 4150 50  0000 C CNN
F 2 "Inductor_SMD:L_1206_3216Metric" V 8580 4150 50  0001 C CNN
F 3 "~" H 8650 4150 50  0001 C CNN
F 4 "MI1206K601R−10" H 8650 4150 50  0001 C CNN "PartNumber"
F 5 "3000-0000000484" H 8650 4150 50  0001 C CNN "PartSpecification"
	1    8650 4150
	0    1    1    0   
$EndComp
$Comp
L 000_PreferredParts:C_0_1uF C2222
U 1 1 5E22764F
P 9000 4400
F 0 "C2222" H 9025 4500 50  0000 L CNN
F 1 "C_0_1uF" H 9025 4300 50  0001 L CNN
F 2 "Capacitor_SMD:C_0402_1005Metric" H 9038 4250 50  0001 C CNN
F 3 "~" H 9000 4400 50  0001 C CNN
F 4 "0.1uF" H 9150 4300 50  0000 C CNN "DisplayValue"
F 5 "3000-0000000125" H 9000 4400 50  0001 C CNN "PartSpecification"
	1    9000 4400
	1    0    0    -1  
$EndComp
Wire Wire Line
	9000 4250 9000 4150
Wire Wire Line
	9000 4150 9200 4150
Wire Wire Line
	9000 4150 8800 4150
Connection ~ 9000 4150
$Comp
L power:GND #PWR?
U 1 1 5E228240
P 9000 4650
F 0 "#PWR?" H 9000 4400 50  0001 C CNN
F 1 "GND" H 9000 4500 50  0000 C CNN
F 2 "" H 9000 4650 50  0001 C CNN
F 3 "" H 9000 4650 50  0001 C CNN
	1    9000 4650
	1    0    0    -1  
$EndComp
Wire Wire Line
	9000 4650 9000 4550
$Comp
L 000_PreferredParts:C_0_1uF C2221
U 1 1 5E229220
P 7800 4350
F 0 "C2221" H 7825 4450 50  0000 L CNN
F 1 "C_0_1uF" H 7825 4250 50  0001 L CNN
F 2 "Capacitor_SMD:C_0402_1005Metric" H 7838 4200 50  0001 C CNN
F 3 "~" H 7800 4350 50  0001 C CNN
F 4 "0.1uF" H 7950 4250 50  0000 C CNN "DisplayValue"
F 5 "3000-0000000125" H 7800 4350 50  0001 C CNN "PartSpecification"
	1    7800 4350
	1    0    0    -1  
$EndComp
Wire Wire Line
	9200 3950 9050 3950
Wire Wire Line
	9050 3950 9050 3850
Wire Wire Line
	9050 3850 9200 3850
Wire Wire Line
	9050 3850 7800 3850
Wire Wire Line
	7800 3850 7800 4200
Connection ~ 9050 3850
$Comp
L power:+3.3V #PWR?
U 1 1 5E22BBF3
P 8300 4050
F 0 "#PWR?" H 8300 3900 50  0001 C CNN
F 1 "+3.3V" H 8300 4190 50  0000 C CNN
F 2 "" H 8300 4050 50  0001 C CNN
F 3 "" H 8300 4050 50  0001 C CNN
	1    8300 4050
	1    0    0    -1  
$EndComp
Wire Wire Line
	8300 4050 8300 4150
Wire Wire Line
	8300 4150 8500 4150
$Comp
L 000_PreferredParts:C_1uF C2220
U 1 1 5E22C71E
P 7300 4350
F 0 "C2220" H 7325 4450 50  0000 L CNN
F 1 "C_1uF" H 7325 4250 50  0000 L CNN
F 2 "Capacitor_SMD:C_0603_1608Metric" H 7338 4200 50  0001 C CNN
F 3 "~" H 7300 4350 50  0001 C CNN
F 4 "3000-0000000136" H 7300 4350 50  0001 C CNN "PartSpecification"
	1    7300 4350
	1    0    0    -1  
$EndComp
$Comp
L 000_PreferredParts:C_1uF C2219
U 1 1 5E22CCB4
P 6800 4350
F 0 "C2219" H 6825 4450 50  0000 L CNN
F 1 "C_1uF" H 6825 4250 50  0000 L CNN
F 2 "Capacitor_SMD:C_0603_1608Metric" H 6838 4200 50  0001 C CNN
F 3 "~" H 6800 4350 50  0001 C CNN
F 4 "3000-0000000136" H 6800 4350 50  0001 C CNN "PartSpecification"
	1    6800 4350
	1    0    0    -1  
$EndComp
$Comp
L 000_PreferredParts:C_1uF C2218
U 1 1 5E22D12D
P 6300 4350
F 0 "C2218" H 6325 4450 50  0000 L CNN
F 1 "C_1uF" H 6325 4250 50  0000 L CNN
F 2 "Capacitor_SMD:C_0603_1608Metric" H 6338 4200 50  0001 C CNN
F 3 "~" H 6300 4350 50  0001 C CNN
F 4 "3000-0000000136" H 6300 4350 50  0001 C CNN "PartSpecification"
	1    6300 4350
	1    0    0    -1  
$EndComp
$Comp
L power:GND #PWR?
U 1 1 5E230DAE
P 7800 4700
F 0 "#PWR?" H 7800 4450 50  0001 C CNN
F 1 "GND" H 7800 4550 50  0000 C CNN
F 2 "" H 7800 4700 50  0001 C CNN
F 3 "" H 7800 4700 50  0001 C CNN
	1    7800 4700
	1    0    0    -1  
$EndComp
Wire Wire Line
	7800 4700 7800 4500
$Comp
L power:GND #PWR?
U 1 1 5E232F43
P 7300 4700
F 0 "#PWR?" H 7300 4450 50  0001 C CNN
F 1 "GND" H 7300 4550 50  0000 C CNN
F 2 "" H 7300 4700 50  0001 C CNN
F 3 "" H 7300 4700 50  0001 C CNN
	1    7300 4700
	1    0    0    -1  
$EndComp
Wire Wire Line
	7300 4700 7300 4500
$Comp
L power:GND #PWR?
U 1 1 5E2335A4
P 6800 4700
F 0 "#PWR?" H 6800 4450 50  0001 C CNN
F 1 "GND" H 6800 4550 50  0000 C CNN
F 2 "" H 6800 4700 50  0001 C CNN
F 3 "" H 6800 4700 50  0001 C CNN
	1    6800 4700
	1    0    0    -1  
$EndComp
Wire Wire Line
	6800 4700 6800 4500
$Comp
L power:GND #PWR?
U 1 1 5E233C97
P 6300 4700
F 0 "#PWR?" H 6300 4450 50  0001 C CNN
F 1 "GND" H 6300 4550 50  0000 C CNN
F 2 "" H 6300 4700 50  0001 C CNN
F 3 "" H 6300 4700 50  0001 C CNN
	1    6300 4700
	1    0    0    -1  
$EndComp
Wire Wire Line
	6300 4700 6300 4500
Wire Wire Line
	6300 4200 6300 3850
Wire Wire Line
	6300 3850 6800 3850
Connection ~ 7800 3850
Wire Wire Line
	7300 4200 7300 3850
Connection ~ 7300 3850
Wire Wire Line
	7300 3850 7800 3850
Wire Wire Line
	6800 4200 6800 3850
Connection ~ 6800 3850
Wire Wire Line
	6800 3850 7300 3850
$Comp
L 000_PreferredParts:C_0_1uF C2217
U 1 1 5E235DB9
P 5800 4350
F 0 "C2217" H 5825 4450 50  0000 L CNN
F 1 "C_0_1uF" H 5825 4250 50  0001 L CNN
F 2 "Capacitor_SMD:C_0402_1005Metric" H 5838 4200 50  0001 C CNN
F 3 "~" H 5800 4350 50  0001 C CNN
F 4 "0.1uF" H 5950 4250 50  0000 C CNN "DisplayValue"
F 5 "3000-0000000125" H 5800 4350 50  0001 C CNN "PartSpecification"
	1    5800 4350
	1    0    0    -1  
$EndComp
$Comp
L power:GND #PWR?
U 1 1 5E236405
P 5800 4700
F 0 "#PWR?" H 5800 4450 50  0001 C CNN
F 1 "GND" H 5800 4550 50  0000 C CNN
F 2 "" H 5800 4700 50  0001 C CNN
F 3 "" H 5800 4700 50  0001 C CNN
	1    5800 4700
	1    0    0    -1  
$EndComp
Wire Wire Line
	5800 4700 5800 4500
Wire Wire Line
	9200 3650 5800 3650
Wire Wire Line
	5800 3650 5800 4200
$Comp
L power:+3.3V #PWR?
U 1 1 5E2377F9
P 5200 3650
F 0 "#PWR?" H 5200 3500 50  0001 C CNN
F 1 "+3.3V" H 5200 3790 50  0000 C CNN
F 2 "" H 5200 3650 50  0001 C CNN
F 3 "" H 5200 3650 50  0001 C CNN
	1    5200 3650
	1    0    0    -1  
$EndComp
Wire Wire Line
	5650 3650 5800 3650
Connection ~ 5800 3650
$Comp
L 000_PreferredParts:C_0_1uF C2216
U 1 1 5E2447CA
P 5000 4350
F 0 "C2216" H 5025 4450 50  0000 L CNN
F 1 "C_0_1uF" H 5025 4250 50  0001 L CNN
F 2 "Capacitor_SMD:C_0402_1005Metric" H 5038 4200 50  0001 C CNN
F 3 "~" H 5000 4350 50  0001 C CNN
F 4 "0.1uF" H 5150 4250 50  0000 C CNN "DisplayValue"
F 5 "3000-0000000125" H 5000 4350 50  0001 C CNN "PartSpecification"
	1    5000 4350
	1    0    0    -1  
$EndComp
$Comp
L power:GND #PWR?
U 1 1 5E2447D0
P 5000 4700
F 0 "#PWR?" H 5000 4450 50  0001 C CNN
F 1 "GND" H 5000 4550 50  0000 C CNN
F 2 "" H 5000 4700 50  0001 C CNN
F 3 "" H 5000 4700 50  0001 C CNN
	1    5000 4700
	1    0    0    -1  
$EndComp
Wire Wire Line
	5000 4700 5000 4500
Wire Wire Line
	5000 4200 5000 3650
Wire Wire Line
	5000 3450 9200 3450
$Comp
L 000_PreferredParts:C_0_1uF C2215
U 1 1 5E24ACC2
P 4700 4350
F 0 "C2215" H 4725 4450 50  0000 L CNN
F 1 "C_0_1uF" H 4725 4250 50  0001 L CNN
F 2 "Capacitor_SMD:C_0402_1005Metric" H 4738 4200 50  0001 C CNN
F 3 "~" H 4700 4350 50  0001 C CNN
F 4 "0.1uF" H 4850 4250 50  0000 C CNN "DisplayValue"
F 5 "3000-0000000125" H 4700 4350 50  0001 C CNN "PartSpecification"
	1    4700 4350
	1    0    0    -1  
$EndComp
$Comp
L power:GND #PWR?
U 1 1 5E24ACC8
P 4700 4700
F 0 "#PWR?" H 4700 4450 50  0001 C CNN
F 1 "GND" H 4700 4550 50  0000 C CNN
F 2 "" H 4700 4700 50  0001 C CNN
F 3 "" H 4700 4700 50  0001 C CNN
	1    4700 4700
	1    0    0    -1  
$EndComp
Wire Wire Line
	4700 4700 4700 4500
$Comp
L 000_PreferredParts:C_0_1uF C2214
U 1 1 5E24BBB2
P 4400 4350
F 0 "C2214" H 4425 4450 50  0000 L CNN
F 1 "C_0_1uF" H 4425 4250 50  0001 L CNN
F 2 "Capacitor_SMD:C_0402_1005Metric" H 4438 4200 50  0001 C CNN
F 3 "~" H 4400 4350 50  0001 C CNN
F 4 "0.1uF" H 4550 4250 50  0000 C CNN "DisplayValue"
F 5 "3000-0000000125" H 4400 4350 50  0001 C CNN "PartSpecification"
	1    4400 4350
	1    0    0    -1  
$EndComp
$Comp
L power:GND #PWR?
U 1 1 5E24BBB8
P 4400 4700
F 0 "#PWR?" H 4400 4450 50  0001 C CNN
F 1 "GND" H 4400 4550 50  0000 C CNN
F 2 "" H 4400 4700 50  0001 C CNN
F 3 "" H 4400 4700 50  0001 C CNN
	1    4400 4700
	1    0    0    -1  
$EndComp
Wire Wire Line
	4400 4700 4400 4500
$Comp
L 000_PreferredParts:C_0_1uF C2213
U 1 1 5E24CA8C
P 4100 4350
F 0 "C2213" H 4125 4450 50  0000 L CNN
F 1 "C_0_1uF" H 4125 4250 50  0001 L CNN
F 2 "Capacitor_SMD:C_0402_1005Metric" H 4138 4200 50  0001 C CNN
F 3 "~" H 4100 4350 50  0001 C CNN
F 4 "0.1uF" H 4250 4250 50  0000 C CNN "DisplayValue"
F 5 "3000-0000000125" H 4100 4350 50  0001 C CNN "PartSpecification"
	1    4100 4350
	1    0    0    -1  
$EndComp
$Comp
L power:GND #PWR?
U 1 1 5E24CA92
P 4100 4700
F 0 "#PWR?" H 4100 4450 50  0001 C CNN
F 1 "GND" H 4100 4550 50  0000 C CNN
F 2 "" H 4100 4700 50  0001 C CNN
F 3 "" H 4100 4700 50  0001 C CNN
	1    4100 4700
	1    0    0    -1  
$EndComp
Wire Wire Line
	4100 4700 4100 4500
$Comp
L 000_PreferredParts:C_0_1uF C2212
U 1 1 5E24DB6E
P 3800 4350
F 0 "C2212" H 3825 4450 50  0000 L CNN
F 1 "C_0_1uF" H 3825 4250 50  0001 L CNN
F 2 "Capacitor_SMD:C_0402_1005Metric" H 3838 4200 50  0001 C CNN
F 3 "~" H 3800 4350 50  0001 C CNN
F 4 "0.1uF" H 3950 4250 50  0000 C CNN "DisplayValue"
F 5 "3000-0000000125" H 3800 4350 50  0001 C CNN "PartSpecification"
	1    3800 4350
	1    0    0    -1  
$EndComp
$Comp
L power:GND #PWR?
U 1 1 5E24DB74
P 3800 4700
F 0 "#PWR?" H 3800 4450 50  0001 C CNN
F 1 "GND" H 3800 4550 50  0000 C CNN
F 2 "" H 3800 4700 50  0001 C CNN
F 3 "" H 3800 4700 50  0001 C CNN
	1    3800 4700
	1    0    0    -1  
$EndComp
Wire Wire Line
	3800 4700 3800 4500
$Comp
L 000_PreferredParts:C_0_1uF C2211
U 1 1 5E24EDBA
P 3500 4350
F 0 "C2211" H 3525 4450 50  0000 L CNN
F 1 "C_0_1uF" H 3525 4250 50  0001 L CNN
F 2 "Capacitor_SMD:C_0402_1005Metric" H 3538 4200 50  0001 C CNN
F 3 "~" H 3500 4350 50  0001 C CNN
F 4 "0.1uF" H 3650 4250 50  0000 C CNN "DisplayValue"
F 5 "3000-0000000125" H 3500 4350 50  0001 C CNN "PartSpecification"
	1    3500 4350
	1    0    0    -1  
$EndComp
$Comp
L power:GND #PWR?
U 1 1 5E24EDC0
P 3500 4700
F 0 "#PWR?" H 3500 4450 50  0001 C CNN
F 1 "GND" H 3500 4550 50  0000 C CNN
F 2 "" H 3500 4700 50  0001 C CNN
F 3 "" H 3500 4700 50  0001 C CNN
	1    3500 4700
	1    0    0    -1  
$EndComp
Wire Wire Line
	3500 4700 3500 4500
$Comp
L 000_PreferredParts:C_0_1uF C2210
U 1 1 5E2500E0
P 3200 4350
F 0 "C2210" H 3225 4450 50  0000 L CNN
F 1 "C_0_1uF" H 3225 4250 50  0001 L CNN
F 2 "Capacitor_SMD:C_0402_1005Metric" H 3238 4200 50  0001 C CNN
F 3 "~" H 3200 4350 50  0001 C CNN
F 4 "0.1uF" H 3350 4250 50  0000 C CNN "DisplayValue"
F 5 "3000-0000000125" H 3200 4350 50  0001 C CNN "PartSpecification"
	1    3200 4350
	1    0    0    -1  
$EndComp
$Comp
L power:GND #PWR?
U 1 1 5E2500E6
P 3200 4700
F 0 "#PWR?" H 3200 4450 50  0001 C CNN
F 1 "GND" H 3200 4550 50  0000 C CNN
F 2 "" H 3200 4700 50  0001 C CNN
F 3 "" H 3200 4700 50  0001 C CNN
	1    3200 4700
	1    0    0    -1  
$EndComp
Wire Wire Line
	3200 4700 3200 4500
$Comp
L 000_PreferredParts:C_0_1uF C2209
U 1 1 5E2516FE
P 2900 4350
F 0 "C2209" H 2925 4450 50  0000 L CNN
F 1 "C_0_1uF" H 2925 4250 50  0001 L CNN
F 2 "Capacitor_SMD:C_0402_1005Metric" H 2938 4200 50  0001 C CNN
F 3 "~" H 2900 4350 50  0001 C CNN
F 4 "0.1uF" H 3050 4250 50  0000 C CNN "DisplayValue"
F 5 "3000-0000000125" H 2900 4350 50  0001 C CNN "PartSpecification"
	1    2900 4350
	1    0    0    -1  
$EndComp
$Comp
L power:GND #PWR?
U 1 1 5E251704
P 2900 4700
F 0 "#PWR?" H 2900 4450 50  0001 C CNN
F 1 "GND" H 2900 4550 50  0000 C CNN
F 2 "" H 2900 4700 50  0001 C CNN
F 3 "" H 2900 4700 50  0001 C CNN
	1    2900 4700
	1    0    0    -1  
$EndComp
Wire Wire Line
	2900 4700 2900 4500
$Comp
L 000_PreferredParts:C_0_1uF C2208
U 1 1 5E252CAC
P 2600 4350
F 0 "C2208" H 2625 4450 50  0000 L CNN
F 1 "C_0_1uF" H 2625 4250 50  0001 L CNN
F 2 "Capacitor_SMD:C_0402_1005Metric" H 2638 4200 50  0001 C CNN
F 3 "~" H 2600 4350 50  0001 C CNN
F 4 "0.1uF" H 2750 4250 50  0000 C CNN "DisplayValue"
F 5 "3000-0000000125" H 2600 4350 50  0001 C CNN "PartSpecification"
	1    2600 4350
	1    0    0    -1  
$EndComp
$Comp
L power:GND #PWR?
U 1 1 5E252CB2
P 2600 4700
F 0 "#PWR?" H 2600 4450 50  0001 C CNN
F 1 "GND" H 2600 4550 50  0000 C CNN
F 2 "" H 2600 4700 50  0001 C CNN
F 3 "" H 2600 4700 50  0001 C CNN
	1    2600 4700
	1    0    0    -1  
$EndComp
Wire Wire Line
	2600 4700 2600 4500
$Comp
L 000_PreferredParts:C_0_1uF C2206
U 1 1 5E25470A
P 2300 4350
F 0 "C2206" H 2325 4450 50  0000 L CNN
F 1 "C_0_1uF" H 2325 4250 50  0001 L CNN
F 2 "Capacitor_SMD:C_0402_1005Metric" H 2338 4200 50  0001 C CNN
F 3 "~" H 2300 4350 50  0001 C CNN
F 4 "0.1uF" H 2450 4250 50  0000 C CNN "DisplayValue"
F 5 "3000-0000000125" H 2300 4350 50  0001 C CNN "PartSpecification"
	1    2300 4350
	1    0    0    -1  
$EndComp
$Comp
L power:GND #PWR?
U 1 1 5E254710
P 2300 4700
F 0 "#PWR?" H 2300 4450 50  0001 C CNN
F 1 "GND" H 2300 4550 50  0000 C CNN
F 2 "" H 2300 4700 50  0001 C CNN
F 3 "" H 2300 4700 50  0001 C CNN
	1    2300 4700
	1    0    0    -1  
$EndComp
Wire Wire Line
	2300 4700 2300 4500
$Comp
L 000_PreferredParts:C_0_1uF C2205
U 1 1 5E256286
P 2000 4350
F 0 "C2205" H 2025 4450 50  0000 L CNN
F 1 "C_0_1uF" H 2025 4250 50  0001 L CNN
F 2 "Capacitor_SMD:C_0402_1005Metric" H 2038 4200 50  0001 C CNN
F 3 "~" H 2000 4350 50  0001 C CNN
F 4 "0.1uF" H 2150 4250 50  0000 C CNN "DisplayValue"
F 5 "3000-0000000125" H 2000 4350 50  0001 C CNN "PartSpecification"
	1    2000 4350
	1    0    0    -1  
$EndComp
$Comp
L power:GND #PWR?
U 1 1 5E25628C
P 2000 4700
F 0 "#PWR?" H 2000 4450 50  0001 C CNN
F 1 "GND" H 2000 4550 50  0000 C CNN
F 2 "" H 2000 4700 50  0001 C CNN
F 3 "" H 2000 4700 50  0001 C CNN
	1    2000 4700
	1    0    0    -1  
$EndComp
Wire Wire Line
	2000 4700 2000 4500
$Comp
L 000_PreferredParts:C_0_1uF C2203
U 1 1 5E2586BC
P 1700 4350
F 0 "C2203" H 1725 4450 50  0000 L CNN
F 1 "C_0_1uF" H 1725 4250 50  0001 L CNN
F 2 "Capacitor_SMD:C_0402_1005Metric" H 1738 4200 50  0001 C CNN
F 3 "~" H 1700 4350 50  0001 C CNN
F 4 "0.1uF" H 1850 4250 50  0000 C CNN "DisplayValue"
F 5 "3000-0000000125" H 1700 4350 50  0001 C CNN "PartSpecification"
	1    1700 4350
	1    0    0    -1  
$EndComp
$Comp
L power:GND #PWR?
U 1 1 5E2586C2
P 1700 4700
F 0 "#PWR?" H 1700 4450 50  0001 C CNN
F 1 "GND" H 1700 4550 50  0000 C CNN
F 2 "" H 1700 4700 50  0001 C CNN
F 3 "" H 1700 4700 50  0001 C CNN
	1    1700 4700
	1    0    0    -1  
$EndComp
Wire Wire Line
	1700 4700 1700 4500
$Comp
L 000_PreferredParts:C_0_1uF C2202
U 1 1 5E25A56E
P 1400 4350
F 0 "C2202" H 1425 4450 50  0000 L CNN
F 1 "C_0_1uF" H 1425 4250 50  0001 L CNN
F 2 "Capacitor_SMD:C_0402_1005Metric" H 1438 4200 50  0001 C CNN
F 3 "~" H 1400 4350 50  0001 C CNN
F 4 "0.1uF" H 1550 4250 50  0000 C CNN "DisplayValue"
F 5 "3000-0000000125" H 1400 4350 50  0001 C CNN "PartSpecification"
	1    1400 4350
	1    0    0    -1  
$EndComp
$Comp
L power:GND #PWR?
U 1 1 5E25A574
P 1400 4700
F 0 "#PWR?" H 1400 4450 50  0001 C CNN
F 1 "GND" H 1400 4550 50  0000 C CNN
F 2 "" H 1400 4700 50  0001 C CNN
F 3 "" H 1400 4700 50  0001 C CNN
	1    1400 4700
	1    0    0    -1  
$EndComp
Wire Wire Line
	1400 4700 1400 4500
$Comp
L 000_PreferredParts:C_0_1uF C2201
U 1 1 5E25C604
P 1100 4350
F 0 "C2201" H 1125 4450 50  0000 L CNN
F 1 "C_0_1uF" H 1125 4250 50  0001 L CNN
F 2 "Capacitor_SMD:C_0402_1005Metric" H 1138 4200 50  0001 C CNN
F 3 "~" H 1100 4350 50  0001 C CNN
F 4 "0.1uF" H 1250 4250 50  0000 C CNN "DisplayValue"
F 5 "3000-0000000125" H 1100 4350 50  0001 C CNN "PartSpecification"
	1    1100 4350
	1    0    0    -1  
$EndComp
$Comp
L power:GND #PWR?
U 1 1 5E25C60A
P 1100 4700
F 0 "#PWR?" H 1100 4450 50  0001 C CNN
F 1 "GND" H 1100 4550 50  0000 C CNN
F 2 "" H 1100 4700 50  0001 C CNN
F 3 "" H 1100 4700 50  0001 C CNN
	1    1100 4700
	1    0    0    -1  
$EndComp
Wire Wire Line
	1100 4700 1100 4500
Wire Wire Line
	9200 3350 4700 3350
Wire Wire Line
	4700 3350 4700 3650
Wire Wire Line
	4400 3250 9200 3250
Wire Wire Line
	4400 3250 4400 3650
Wire Wire Line
	9200 3150 4100 3150
Wire Wire Line
	4100 3150 4100 3650
Wire Wire Line
	3800 3050 9200 3050
Wire Wire Line
	3800 3050 3800 3650
Wire Wire Line
	9200 2950 3500 2950
Wire Wire Line
	3500 2950 3500 3650
Wire Wire Line
	3200 2850 9200 2850
Wire Wire Line
	3200 2850 3200 3650
Wire Wire Line
	9200 2750 2900 2750
Wire Wire Line
	2900 2750 2900 3650
Wire Wire Line
	2600 2650 9200 2650
Wire Wire Line
	2600 2650 2600 3650
Wire Wire Line
	9200 2550 2300 2550
Wire Wire Line
	2300 2550 2300 3650
Wire Wire Line
	2000 2450 9200 2450
Wire Wire Line
	2000 2450 2000 3650
Wire Wire Line
	9200 2350 1700 2350
Wire Wire Line
	1700 2350 1700 3650
Wire Wire Line
	9200 2250 1400 2250
Wire Wire Line
	1400 2250 1400 3650
Wire Wire Line
	9200 2150 1100 2150
Wire Wire Line
	1100 2150 1100 3650
$Comp
L power:+3.3V #PWR?
U 1 1 5E284D12
P 1000 3500
F 0 "#PWR?" H 1000 3350 50  0001 C CNN
F 1 "+3.3V" H 1000 3640 50  0000 C CNN
F 2 "" H 1000 3500 50  0001 C CNN
F 3 "" H 1000 3500 50  0001 C CNN
	1    1000 3500
	1    0    0    -1  
$EndComp
Wire Wire Line
	1000 3500 1000 3650
Wire Wire Line
	1000 3650 1100 3650
Connection ~ 5000 3650
Wire Wire Line
	5000 3650 5000 3450
Connection ~ 4700 3650
Wire Wire Line
	4700 3650 4700 4200
Wire Wire Line
	4700 3650 5000 3650
Connection ~ 4400 3650
Wire Wire Line
	4400 3650 4400 4200
Wire Wire Line
	4400 3650 4700 3650
Connection ~ 4100 3650
Wire Wire Line
	4100 3650 4100 4200
Wire Wire Line
	4100 3650 4400 3650
Connection ~ 3800 3650
Wire Wire Line
	3800 3650 3800 4200
Wire Wire Line
	3800 3650 4100 3650
Connection ~ 3500 3650
Wire Wire Line
	3500 3650 3500 4200
Wire Wire Line
	3500 3650 3800 3650
Connection ~ 3200 3650
Wire Wire Line
	3200 3650 3200 4200
Wire Wire Line
	3200 3650 3500 3650
Connection ~ 2900 3650
Wire Wire Line
	2900 3650 2900 4200
Wire Wire Line
	2900 3650 3200 3650
Connection ~ 2600 3650
Wire Wire Line
	2600 3650 2600 4200
Wire Wire Line
	2600 3650 2900 3650
Connection ~ 2300 3650
Wire Wire Line
	2300 3650 2300 4200
Wire Wire Line
	2300 3650 2600 3650
Connection ~ 2000 3650
Wire Wire Line
	2000 3650 2000 4200
Wire Wire Line
	2000 3650 2300 3650
Connection ~ 1700 3650
Wire Wire Line
	1700 3650 1700 4200
Wire Wire Line
	1700 3650 2000 3650
Connection ~ 1400 3650
Wire Wire Line
	1400 3650 1400 4200
Wire Wire Line
	1400 3650 1700 3650
Connection ~ 1100 3650
Wire Wire Line
	1100 3650 1100 4200
Wire Wire Line
	1100 3650 1400 3650
$Comp
L Device:Ferrite_Bead FB2201
U 1 1 5E28ED85
P 5500 3650
F 0 "FB2201" V 5350 3675 50  0000 C CNN
F 1 "Ferrite_Bead" V 5650 3650 50  0000 C CNN
F 2 "Inductor_SMD:L_1206_3216Metric" V 5430 3650 50  0001 C CNN
F 3 "~" H 5500 3650 50  0001 C CNN
F 4 "MI1206K601R−10" H 5500 3650 50  0001 C CNN "PartNumber"
F 5 "3000-0000000484" H 5500 3650 50  0001 C CNN "PartSpecification"
	1    5500 3650
	0    1    1    0   
$EndComp
Wire Wire Line
	5200 3650 5350 3650
$Comp
L 000_PreferredParts:C_1uF C2204
U 1 1 5E29971D
P 2000 1250
F 0 "C2204" H 2025 1350 50  0000 L CNN
F 1 "C_1uF" H 2025 1150 50  0000 L CNN
F 2 "Capacitor_SMD:C_0603_1608Metric" H 2038 1100 50  0001 C CNN
F 3 "~" H 2000 1250 50  0001 C CNN
F 4 "3000-0000000136" H 2000 1250 50  0001 C CNN "PartSpecification"
	1    2000 1250
	1    0    0    -1  
$EndComp
$Comp
L power:GND #PWR?
U 1 1 5E299E13
P 2000 1500
F 0 "#PWR?" H 2000 1250 50  0001 C CNN
F 1 "GND" H 2000 1350 50  0000 C CNN
F 2 "" H 2000 1500 50  0001 C CNN
F 3 "" H 2000 1500 50  0001 C CNN
	1    2000 1500
	1    0    0    -1  
$EndComp
$Comp
L power:+3.3V #PWR?
U 1 1 5E29A2DF
P 2000 1000
F 0 "#PWR?" H 2000 850 50  0001 C CNN
F 1 "+3.3V" H 2000 1140 50  0000 C CNN
F 2 "" H 2000 1000 50  0001 C CNN
F 3 "" H 2000 1000 50  0001 C CNN
	1    2000 1000
	1    0    0    -1  
$EndComp
$Comp
L 000_PreferredParts:C_1uF C2207
U 1 1 5E29B2E4
P 2500 1250
F 0 "C2207" H 2525 1350 50  0000 L CNN
F 1 "C_1uF" H 2525 1150 50  0000 L CNN
F 2 "Capacitor_SMD:C_0603_1608Metric" H 2538 1100 50  0001 C CNN
F 3 "~" H 2500 1250 50  0001 C CNN
F 4 "3000-0000000136" H 2500 1250 50  0001 C CNN "PartSpecification"
	1    2500 1250
	1    0    0    -1  
$EndComp
$Comp
L power:GND #PWR?
U 1 1 5E29B2EA
P 2500 1500
F 0 "#PWR?" H 2500 1250 50  0001 C CNN
F 1 "GND" H 2500 1350 50  0000 C CNN
F 2 "" H 2500 1500 50  0001 C CNN
F 3 "" H 2500 1500 50  0001 C CNN
	1    2500 1500
	1    0    0    -1  
$EndComp
$Comp
L power:+3.3V #PWR?
U 1 1 5E29B2F0
P 2500 1000
F 0 "#PWR?" H 2500 850 50  0001 C CNN
F 1 "+3.3V" H 2500 1140 50  0000 C CNN
F 2 "" H 2500 1000 50  0001 C CNN
F 3 "" H 2500 1000 50  0001 C CNN
	1    2500 1000
	1    0    0    -1  
$EndComp
Wire Wire Line
	2500 1100 2500 1000
Wire Wire Line
	2500 1400 2500 1500
Wire Wire Line
	2000 1500 2000 1400
Wire Wire Line
	2000 1100 2000 1000
Text Label 8650 3650 0    50   ~ 0
VDDA
Text Label 8650 3850 0    50   ~ 0
VDDC
Text Label 8900 4150 0    50   ~ 0
VREFA
$EndSCHEMATC
