EESchema Schematic File Version 4
LIBS:fdd_frontend_ue-cache
EELAYER 30 0
EELAYER END
$Descr A4 11693 8268
encoding utf-8
Sheet 2 7
Title ""
Date ""
Rev ""
Comp ""
Comment1 ""
Comment2 ""
Comment3 ""
Comment4 ""
$EndDescr
$Comp
L POWDER_Power:TPS63070RNM U201
U 1 1 5D67CCCA
P 6500 3700
AR Path="/5D562501/5D67CCCA" Ref="U201"  Part="1" 
AR Path="/5D587C46/5D67CCCA" Ref="U301"  Part="1" 
AR Path="/5D591ABD/5D67CCCA" Ref="U?"  Part="1" 
F 0 "U201" H 6850 4300 60  0000 C CNN
F 1 "TPS63070RNM" H 6500 3900 60  0000 C CNN
F 2 "POWDER_Power:TPS63070RNMR" H 6500 3640 60  0001 C CNN
F 3 "" H 6500 3700 60  0000 C CNN
F 4 "Texas Instruments" H 6500 3700 50  0001 C CNN "Manufacturer"
F 5 "TPS63070RNMR" H 6500 3700 50  0001 C CNN "PartNumber"
	1    6500 3700
	1    0    0    -1  
$EndComp
Text HLabel 3750 4150 0    50   Input ~ 0
EN
Text HLabel 3750 4250 0    50   Input ~ 0
PS_SYNC
Text HLabel 3750 4350 0    50   Input ~ 0
VSEL
Text HLabel 7200 4000 2    50   Output ~ 0
PG
Wire Wire Line
	7200 4000 7100 4000
$Comp
L power:GND #PWR?
U 1 1 5D56C9B4
P 6400 4550
AR Path="/5D562501/5D56C9B4" Ref="#PWR?"  Part="1" 
AR Path="/5D587C46/5D56C9B4" Ref="#PWR?"  Part="1" 
AR Path="/5D591ABD/5D56C9B4" Ref="#PWR?"  Part="1" 
F 0 "#PWR?" H 6400 4300 50  0001 C CNN
F 1 "GND" H 6405 4377 50  0000 C CNN
F 2 "" H 6400 4550 50  0001 C CNN
F 3 "" H 6400 4550 50  0001 C CNN
	1    6400 4550
	1    0    0    -1  
$EndComp
$Comp
L power:GND #PWR?
U 1 1 5D56C9C9
P 6600 4550
AR Path="/5D562501/5D56C9C9" Ref="#PWR?"  Part="1" 
AR Path="/5D587C46/5D56C9C9" Ref="#PWR?"  Part="1" 
AR Path="/5D591ABD/5D56C9C9" Ref="#PWR?"  Part="1" 
F 0 "#PWR?" H 6600 4300 50  0001 C CNN
F 1 "GND" H 6605 4377 50  0000 C CNN
F 2 "" H 6600 4550 50  0001 C CNN
F 3 "" H 6600 4550 50  0001 C CNN
	1    6600 4550
	1    0    0    -1  
$EndComp
Wire Wire Line
	6600 4550 6600 4400
Wire Wire Line
	6400 4400 6400 4550
$Comp
L 000_PreferredParts:C_100nF C204
U 1 1 5D56CA4A
P 3150 3950
AR Path="/5D562501/5D56CA4A" Ref="C204"  Part="1" 
AR Path="/5D587C46/5D56CA4A" Ref="C304"  Part="1" 
AR Path="/5D591ABD/5D56CA4A" Ref="C?"  Part="1" 
F 0 "C204" H 3265 3996 50  0000 L CNN
F 1 "C_100nF" H 3265 3905 50  0001 L CNN
F 2 "Capacitor_SMD:C_0402_1005Metric" H 3188 3800 50  0001 C CNN
F 3 "~" H 3150 3950 50  0001 C CNN
F 4 "100nF" H 3400 3900 50  0000 C CNN "DisplayValue"
F 5 "Murata Electronics" H 3150 3950 50  0001 C CNN "Manufacturer"
F 6 "GRM155R62A104KE14D" H 3150 3950 50  0001 C CNN "PartNumber"
	1    3150 3950
	1    0    0    -1  
$EndComp
Wire Wire Line
	3150 3800 3150 3650
$Comp
L power:GND #PWR?
U 1 1 5D56CAC8
P 3150 4250
AR Path="/5D562501/5D56CAC8" Ref="#PWR?"  Part="1" 
AR Path="/5D587C46/5D56CAC8" Ref="#PWR?"  Part="1" 
AR Path="/5D591ABD/5D56CAC8" Ref="#PWR?"  Part="1" 
F 0 "#PWR?" H 3150 4000 50  0001 C CNN
F 1 "GND" H 3155 4077 50  0000 C CNN
F 2 "" H 3150 4250 50  0001 C CNN
F 3 "" H 3150 4250 50  0001 C CNN
	1    3150 4250
	1    0    0    -1  
$EndComp
Wire Wire Line
	3150 4250 3150 4100
$Comp
L 000_PreferredParts:C_10uF_0805 C202
U 1 1 5D56CBDC
P 2300 3750
AR Path="/5D562501/5D56CBDC" Ref="C202"  Part="1" 
AR Path="/5D587C46/5D56CBDC" Ref="C302"  Part="1" 
AR Path="/5D591ABD/5D56CBDC" Ref="C?"  Part="1" 
F 0 "C202" H 2415 3796 50  0000 L CNN
F 1 "C_10uF_0805" H 2415 3705 50  0001 L CNN
F 2 "Capacitor_SMD:C_0805_2012Metric" H 2338 3600 50  0001 C CNN
F 3 "~" H 2300 3750 50  0001 C CNN
F 4 "0805" H 2500 3600 50  0000 C CNN "DisplayFootprint"
F 5 "10uF" H 2500 3700 50  0000 C CNN "DisplayValue"
F 6 "Murata Electronics" H 2300 3750 50  0001 C CNN "Manufacturer"
F 7 "GRM21BC8YA106ME11L" H 2300 3750 50  0001 C CNN "PartNumber"
	1    2300 3750
	1    0    0    -1  
$EndComp
$Comp
L 000_PreferredParts:C_10uF_0805 C201
U 1 1 5D56CC27
P 1850 3750
AR Path="/5D562501/5D56CC27" Ref="C201"  Part="1" 
AR Path="/5D587C46/5D56CC27" Ref="C301"  Part="1" 
AR Path="/5D591ABD/5D56CC27" Ref="C?"  Part="1" 
F 0 "C201" H 1965 3796 50  0000 L CNN
F 1 "C_10uF_0805" H 1965 3705 50  0001 L CNN
F 2 "Capacitor_SMD:C_0805_2012Metric" H 1888 3600 50  0001 C CNN
F 3 "~" H 1850 3750 50  0001 C CNN
F 4 "0805" H 2050 3600 50  0000 C CNN "DisplayFootprint"
F 5 "10uF" H 2050 3700 50  0000 C CNN "DisplayValue"
F 6 "Murata Electronics" H 1850 3750 50  0001 C CNN "Manufacturer"
F 7 "GRM21BC8YA106ME11L" H 1850 3750 50  0001 C CNN "PartNumber"
	1    1850 3750
	1    0    0    -1  
$EndComp
$Comp
L power:GND #PWR?
U 1 1 5D56CC55
P 2750 4000
AR Path="/5D562501/5D56CC55" Ref="#PWR?"  Part="1" 
AR Path="/5D587C46/5D56CC55" Ref="#PWR?"  Part="1" 
AR Path="/5D591ABD/5D56CC55" Ref="#PWR?"  Part="1" 
F 0 "#PWR?" H 2750 3750 50  0001 C CNN
F 1 "GND" H 2755 3827 50  0000 C CNN
F 2 "" H 2750 4000 50  0001 C CNN
F 3 "" H 2750 4000 50  0001 C CNN
	1    2750 4000
	1    0    0    -1  
$EndComp
$Comp
L power:GND #PWR?
U 1 1 5D56CC6A
P 2300 4000
AR Path="/5D562501/5D56CC6A" Ref="#PWR?"  Part="1" 
AR Path="/5D587C46/5D56CC6A" Ref="#PWR?"  Part="1" 
AR Path="/5D591ABD/5D56CC6A" Ref="#PWR?"  Part="1" 
F 0 "#PWR?" H 2300 3750 50  0001 C CNN
F 1 "GND" H 2305 3827 50  0000 C CNN
F 2 "" H 2300 4000 50  0001 C CNN
F 3 "" H 2300 4000 50  0001 C CNN
	1    2300 4000
	1    0    0    -1  
$EndComp
$Comp
L power:GND #PWR?
U 1 1 5D67CCD4
P 1850 4000
AR Path="/5D562501/5D67CCD4" Ref="#PWR?"  Part="1" 
AR Path="/5D587C46/5D67CCD4" Ref="#PWR?"  Part="1" 
AR Path="/5D591ABD/5D67CCD4" Ref="#PWR?"  Part="1" 
F 0 "#PWR?" H 1850 3750 50  0001 C CNN
F 1 "GND" H 1855 3827 50  0000 C CNN
F 2 "" H 1850 4000 50  0001 C CNN
F 3 "" H 1850 4000 50  0001 C CNN
	1    1850 4000
	1    0    0    -1  
$EndComp
Wire Wire Line
	1850 4000 1850 3900
Wire Wire Line
	2300 4000 2300 3900
Wire Wire Line
	2750 4000 2750 3900
Wire Wire Line
	5900 3400 5700 3400
Wire Wire Line
	2750 3400 2750 3600
Wire Wire Line
	2750 3400 2300 3400
Wire Wire Line
	2300 3400 2300 3600
Connection ~ 2750 3400
Wire Wire Line
	2300 3400 1850 3400
Wire Wire Line
	1850 3400 1850 3600
Connection ~ 2300 3400
Wire Wire Line
	5900 3300 5700 3300
Wire Wire Line
	5700 3300 5700 3400
Connection ~ 5700 3400
Wire Wire Line
	5700 3400 4450 3400
Wire Wire Line
	1850 3400 1500 3400
Connection ~ 1850 3400
Text HLabel 1500 3400 0    50   Input ~ 0
V_12
$Comp
L Device:L L201
U 1 1 5D67CCD5
P 6500 2900
AR Path="/5D562501/5D67CCD5" Ref="L201"  Part="1" 
AR Path="/5D587C46/5D67CCD5" Ref="L301"  Part="1" 
AR Path="/5D591ABD/5D67CCD5" Ref="L?"  Part="1" 
F 0 "L201" V 6690 2900 50  0000 C CNN
F 1 "1.5uH" V 6599 2900 50  0000 C CNN
F 2 "Inductor_SMD:L_Taiyo-Yuden_MD-4040" H 6500 2900 50  0001 C CNN
F 3 "~" H 6500 2900 50  0001 C CNN
F 4 "ABRACON" H 6500 2900 50  0001 C CNN "Manufacturer"
F 5 "ASPI-4030S-1R5N-T" H 6500 2900 50  0001 C CNN "PartNumber"
	1    6500 2900
	0    -1   -1   0   
$EndComp
Wire Wire Line
	6350 2900 6300 2900
Wire Wire Line
	6300 2900 6300 3050
Wire Wire Line
	6650 2900 6700 2900
Wire Wire Line
	6700 2900 6700 3050
$Comp
L 000_PreferredParts:C_10uF_0603 C205
U 1 1 5D67CCD6
P 8350 3600
AR Path="/5D562501/5D67CCD6" Ref="C205"  Part="1" 
AR Path="/5D587C46/5D67CCD6" Ref="C305"  Part="1" 
AR Path="/5D591ABD/5D67CCD6" Ref="C?"  Part="1" 
F 0 "C205" H 8465 3646 50  0000 L CNN
F 1 "C_10uF_0603" H 8375 3500 50  0001 L CNN
F 2 "Capacitor_SMD:C_0603_1608Metric" H 8388 3450 50  0001 C CNN
F 3 "~" H 8350 3600 50  0001 C CNN
F 4 "0603" H 8500 3400 50  0000 C CNN "DisplayFootprint"
F 5 "10uF" H 8500 3500 50  0000 C CNN "DisplayValue"
F 6 "Murata Electronics" H 8350 3600 50  0001 C CNN "Manufacturer"
F 7 "GRM188R6YA106MA73D" H 8350 3600 50  0001 C CNN "PartNumber"
	1    8350 3600
	1    0    0    -1  
$EndComp
$Comp
L Device:R R202
U 1 1 5D67CCD7
P 7900 3600
AR Path="/5D562501/5D67CCD7" Ref="R202"  Part="1" 
AR Path="/5D587C46/5D67CCD7" Ref="R302"  Part="1" 
AR Path="/5D591ABD/5D67CCD7" Ref="R?"  Part="1" 
F 0 "R202" H 7970 3646 50  0000 L CNN
F 1 "412.5k" H 7970 3555 50  0000 L CNN
F 2 "Resistor_SMD:R_0402_1005Metric" V 7830 3600 50  0001 C CNN
F 3 "~" H 7900 3600 50  0001 C CNN
F 4 "Stackpole Electronics Inc" H 7900 3600 50  0001 C CNN "Manufacturer"
F 5 "RMCF0201FT412K" H 7900 3600 50  0001 C CNN "PartNumber"
	1    7900 3600
	1    0    0    -1  
$EndComp
Wire Wire Line
	7100 3400 7300 3400
Wire Wire Line
	7900 3450 7900 3400
Connection ~ 7900 3400
$Comp
L Device:R R203
U 1 1 5D67CCD8
P 7900 4000
AR Path="/5D562501/5D67CCD8" Ref="R203"  Part="1" 
AR Path="/5D587C46/5D67CCD8" Ref="R303"  Part="1" 
AR Path="/5D591ABD/5D67CCD8" Ref="R?"  Part="1" 
F 0 "R203" H 7970 4046 50  0000 L CNN
F 1 "150k" H 7970 3955 50  0000 L CNN
F 2 "Resistor_SMD:R_0402_1005Metric" V 7830 4000 50  0001 C CNN
F 3 "~" H 7900 4000 50  0001 C CNN
F 4 "Stackpole Electronics Inc" H 7900 4000 50  0001 C CNN "Manufacturer"
F 5 "RMCF0201FT150K" H 7900 4000 50  0001 C CNN "PartNumber"
	1    7900 4000
	1    0    0    -1  
$EndComp
$Comp
L Device:R R201
U 1 1 5D67CCD9
P 7650 4000
AR Path="/5D562501/5D67CCD9" Ref="R201"  Part="1" 
AR Path="/5D587C46/5D67CCD9" Ref="R301"  Part="1" 
AR Path="/5D591ABD/5D67CCD9" Ref="R?"  Part="1" 
F 0 "R201" H 7720 4046 50  0000 L CNN
F 1 "165k" H 7720 3955 50  0000 L CNN
F 2 "Resistor_SMD:R_0402_1005Metric" V 7580 4000 50  0001 C CNN
F 3 "~" H 7650 4000 50  0001 C CNN
F 4 "Stackpole Electronics Inc" H 7650 4000 50  0001 C CNN "Manufacturer"
F 5 "RMCF0402FT165K" H 7650 4000 50  0001 C CNN "PartNumber"
	1    7650 4000
	1    0    0    -1  
$EndComp
Wire Wire Line
	7900 3750 7900 3800
Wire Wire Line
	7100 3650 7650 3650
Connection ~ 7900 3800
Wire Wire Line
	7900 3800 7900 3850
Wire Wire Line
	7650 3850 7650 3800
Connection ~ 7650 3800
Wire Wire Line
	7650 3800 7650 3650
Wire Wire Line
	7650 3800 7900 3800
$Comp
L power:GND #PWR?
U 1 1 5D67CCDA
P 7900 4250
AR Path="/5D562501/5D67CCDA" Ref="#PWR?"  Part="1" 
AR Path="/5D587C46/5D67CCDA" Ref="#PWR?"  Part="1" 
AR Path="/5D591ABD/5D67CCDA" Ref="#PWR?"  Part="1" 
F 0 "#PWR?" H 7900 4000 50  0001 C CNN
F 1 "GND" H 7905 4077 50  0000 C CNN
F 2 "" H 7900 4250 50  0001 C CNN
F 3 "" H 7900 4250 50  0001 C CNN
	1    7900 4250
	1    0    0    -1  
$EndComp
Wire Wire Line
	7900 4250 7900 4150
Wire Wire Line
	7650 4250 7650 4150
Wire Wire Line
	7100 3750 7500 3750
Wire Wire Line
	7500 3750 7500 4250
Wire Wire Line
	7500 4250 7650 4250
Wire Wire Line
	8350 3450 8350 3400
Wire Wire Line
	7900 3400 8350 3400
$Comp
L power:GND #PWR?
U 1 1 5D67CCDB
P 8350 3850
AR Path="/5D562501/5D67CCDB" Ref="#PWR?"  Part="1" 
AR Path="/5D587C46/5D67CCDB" Ref="#PWR?"  Part="1" 
AR Path="/5D591ABD/5D67CCDB" Ref="#PWR?"  Part="1" 
F 0 "#PWR?" H 8350 3600 50  0001 C CNN
F 1 "GND" H 8355 3677 50  0000 C CNN
F 2 "" H 8350 3850 50  0001 C CNN
F 3 "" H 8350 3850 50  0001 C CNN
	1    8350 3850
	1    0    0    -1  
$EndComp
Wire Wire Line
	8350 3850 8350 3750
$Comp
L power:GND #PWR?
U 1 1 5D572792
P 8800 3850
AR Path="/5D562501/5D572792" Ref="#PWR?"  Part="1" 
AR Path="/5D587C46/5D572792" Ref="#PWR?"  Part="1" 
AR Path="/5D591ABD/5D572792" Ref="#PWR?"  Part="1" 
F 0 "#PWR?" H 8800 3600 50  0001 C CNN
F 1 "GND" H 8805 3677 50  0000 C CNN
F 2 "" H 8800 3850 50  0001 C CNN
F 3 "" H 8800 3850 50  0001 C CNN
	1    8800 3850
	1    0    0    -1  
$EndComp
Wire Wire Line
	8800 3850 8800 3750
Wire Wire Line
	8800 3450 8800 3400
Wire Wire Line
	8800 3400 8650 3400
Connection ~ 8350 3400
$Comp
L power:GND #PWR?
U 1 1 5D67CCDF
P 9600 3850
AR Path="/5D562501/5D67CCDF" Ref="#PWR?"  Part="1" 
AR Path="/5D587C46/5D67CCDF" Ref="#PWR?"  Part="1" 
AR Path="/5D591ABD/5D67CCDF" Ref="#PWR?"  Part="1" 
F 0 "#PWR?" H 9600 3600 50  0001 C CNN
F 1 "GND" H 9605 3677 50  0000 C CNN
F 2 "" H 9600 3850 50  0001 C CNN
F 3 "" H 9600 3850 50  0001 C CNN
	1    9600 3850
	1    0    0    -1  
$EndComp
Wire Wire Line
	9600 3850 9600 3750
Wire Wire Line
	9600 3450 9600 3400
$Comp
L power:GND #PWR?
U 1 1 5D67CCE1
P 10400 3850
AR Path="/5D562501/5D67CCE1" Ref="#PWR?"  Part="1" 
AR Path="/5D587C46/5D67CCE1" Ref="#PWR?"  Part="1" 
AR Path="/5D591ABD/5D67CCE1" Ref="#PWR?"  Part="1" 
F 0 "#PWR?" H 10400 3600 50  0001 C CNN
F 1 "GND" H 10405 3677 50  0000 C CNN
F 2 "" H 10400 3850 50  0001 C CNN
F 3 "" H 10400 3850 50  0001 C CNN
	1    10400 3850
	1    0    0    -1  
$EndComp
Wire Wire Line
	10400 3850 10400 3750
Wire Wire Line
	10400 3450 10400 3400
Wire Wire Line
	8800 3400 9600 3400
Connection ~ 8800 3400
Connection ~ 9600 3400
Wire Wire Line
	9600 3400 10400 3400
Connection ~ 10400 3400
Wire Wire Line
	10400 3400 10750 3400
Text HLabel 10750 3400 2    50   Output ~ 0
V_OUT
Text Label 3250 3650 0    50   ~ 0
V_AUX
Text Label 7300 3650 0    50   ~ 0
FB
Text Label 7300 3750 0    50   ~ 0
FB2
Text Label 6300 2900 0    50   ~ 0
L1
Text Label 6700 2900 0    50   ~ 0
L2
$Comp
L 000_PreferredParts:C_10uF_0805 C206
U 1 1 5D72B746
P 8800 3600
AR Path="/5D562501/5D72B746" Ref="C206"  Part="1" 
AR Path="/5D587C46/5D72B746" Ref="C306"  Part="1" 
F 0 "C206" H 8915 3646 50  0000 L CNN
F 1 "C_10uF_0805" H 8825 3500 50  0001 L CNN
F 2 "Capacitor_SMD:C_0805_2012Metric" H 8838 3450 50  0001 C CNN
F 3 "~" H 8800 3600 50  0001 C CNN
F 4 "0805" H 8950 3400 50  0000 C CNN "DisplayFootprint"
F 5 "10uF" H 8950 3500 50  0000 C CNN "DisplayValue"
F 6 "Murata Electronics" H 8800 3600 50  0001 C CNN "Manufacturer"
F 7 "GRM21BC8YA106ME11L" H 8800 3600 50  0001 C CNN "PartNumber"
	1    8800 3600
	1    0    0    -1  
$EndComp
$Comp
L 000_PreferredParts:C_10uF_0805 C208
U 1 1 5D72B7B9
P 9600 3600
AR Path="/5D562501/5D72B7B9" Ref="C208"  Part="1" 
AR Path="/5D587C46/5D72B7B9" Ref="C308"  Part="1" 
F 0 "C208" H 9715 3646 50  0000 L CNN
F 1 "C_10uF_0805" H 9625 3500 50  0001 L CNN
F 2 "Capacitor_SMD:C_0805_2012Metric" H 9638 3450 50  0001 C CNN
F 3 "~" H 9600 3600 50  0001 C CNN
F 4 "0805" H 9750 3400 50  0000 C CNN "DisplayFootprint"
F 5 "10uF" H 9750 3500 50  0000 C CNN "DisplayValue"
F 6 "Murata Electronics" H 9600 3600 50  0001 C CNN "Manufacturer"
F 7 "GRM21BC8YA106ME11L" H 9600 3600 50  0001 C CNN "PartNumber"
	1    9600 3600
	1    0    0    -1  
$EndComp
$Comp
L 000_PreferredParts:C_10uF_0805 C210
U 1 1 5D72B7F5
P 10400 3600
AR Path="/5D562501/5D72B7F5" Ref="C210"  Part="1" 
AR Path="/5D587C46/5D72B7F5" Ref="C310"  Part="1" 
F 0 "C210" H 10515 3646 50  0000 L CNN
F 1 "C_10uF_0805" H 10425 3500 50  0001 L CNN
F 2 "Capacitor_SMD:C_0805_2012Metric" H 10438 3450 50  0001 C CNN
F 3 "~" H 10400 3600 50  0001 C CNN
F 4 "0805" H 10550 3400 50  0000 C CNN "DisplayFootprint"
F 5 "10uF" H 10550 3500 50  0000 C CNN "DisplayValue"
F 6 "Murata Electronics" H 10400 3600 50  0001 C CNN "Manufacturer"
F 7 "GRM21BC8YA106ME11L" H 10400 3600 50  0001 C CNN "PartNumber"
	1    10400 3600
	1    0    0    -1  
$EndComp
$Comp
L power:GND #PWR?
U 1 1 5D72DE3A
P 8800 4600
AR Path="/5D562501/5D72DE3A" Ref="#PWR?"  Part="1" 
AR Path="/5D587C46/5D72DE3A" Ref="#PWR?"  Part="1" 
AR Path="/5D591ABD/5D72DE3A" Ref="#PWR?"  Part="1" 
F 0 "#PWR?" H 8800 4350 50  0001 C CNN
F 1 "GND" H 8805 4427 50  0000 C CNN
F 2 "" H 8800 4600 50  0001 C CNN
F 3 "" H 8800 4600 50  0001 C CNN
	1    8800 4600
	1    0    0    -1  
$EndComp
Wire Wire Line
	8800 4600 8800 4500
Wire Wire Line
	8800 4200 8800 4150
Wire Wire Line
	8800 4150 8650 4150
$Comp
L power:GND #PWR?
U 1 1 5D72DE43
P 9600 4600
AR Path="/5D562501/5D72DE43" Ref="#PWR?"  Part="1" 
AR Path="/5D587C46/5D72DE43" Ref="#PWR?"  Part="1" 
AR Path="/5D591ABD/5D72DE43" Ref="#PWR?"  Part="1" 
F 0 "#PWR?" H 9600 4350 50  0001 C CNN
F 1 "GND" H 9605 4427 50  0000 C CNN
F 2 "" H 9600 4600 50  0001 C CNN
F 3 "" H 9600 4600 50  0001 C CNN
	1    9600 4600
	1    0    0    -1  
$EndComp
Wire Wire Line
	9600 4600 9600 4500
Wire Wire Line
	9600 4200 9600 4150
$Comp
L power:GND #PWR?
U 1 1 5D72DE4B
P 10400 4600
AR Path="/5D562501/5D72DE4B" Ref="#PWR?"  Part="1" 
AR Path="/5D587C46/5D72DE4B" Ref="#PWR?"  Part="1" 
AR Path="/5D591ABD/5D72DE4B" Ref="#PWR?"  Part="1" 
F 0 "#PWR?" H 10400 4350 50  0001 C CNN
F 1 "GND" H 10405 4427 50  0000 C CNN
F 2 "" H 10400 4600 50  0001 C CNN
F 3 "" H 10400 4600 50  0001 C CNN
	1    10400 4600
	1    0    0    -1  
$EndComp
Wire Wire Line
	10400 4600 10400 4500
Wire Wire Line
	10400 4200 10400 4150
Wire Wire Line
	8800 4150 9600 4150
Connection ~ 8800 4150
Connection ~ 9600 4150
Wire Wire Line
	9600 4150 10400 4150
$Comp
L 000_PreferredParts:C_10uF_0805 C207
U 1 1 5D72DE5A
P 8800 4350
AR Path="/5D562501/5D72DE5A" Ref="C207"  Part="1" 
AR Path="/5D587C46/5D72DE5A" Ref="C307"  Part="1" 
F 0 "C207" H 8915 4396 50  0000 L CNN
F 1 "C_10uF_0805" H 8825 4250 50  0001 L CNN
F 2 "Capacitor_SMD:C_0805_2012Metric" H 8838 4200 50  0001 C CNN
F 3 "~" H 8800 4350 50  0001 C CNN
F 4 "0805" H 8950 4150 50  0000 C CNN "DisplayFootprint"
F 5 "10uF" H 8950 4250 50  0000 C CNN "DisplayValue"
F 6 "Murata Electronics" H 8800 4350 50  0001 C CNN "Manufacturer"
F 7 "GRM21BC8YA106ME11L" H 8800 4350 50  0001 C CNN "PartNumber"
	1    8800 4350
	1    0    0    -1  
$EndComp
$Comp
L 000_PreferredParts:C_10uF_0805 C209
U 1 1 5D72DE60
P 9600 4350
AR Path="/5D562501/5D72DE60" Ref="C209"  Part="1" 
AR Path="/5D587C46/5D72DE60" Ref="C309"  Part="1" 
F 0 "C209" H 9715 4396 50  0000 L CNN
F 1 "C_10uF_0805" H 9625 4250 50  0001 L CNN
F 2 "Capacitor_SMD:C_0805_2012Metric" H 9638 4200 50  0001 C CNN
F 3 "~" H 9600 4350 50  0001 C CNN
F 4 "0805" H 9750 4150 50  0000 C CNN "DisplayFootprint"
F 5 "10uF" H 9750 4250 50  0000 C CNN "DisplayValue"
F 6 "Murata Electronics" H 9600 4350 50  0001 C CNN "Manufacturer"
F 7 "GRM21BC8YA106ME11L" H 9600 4350 50  0001 C CNN "PartNumber"
	1    9600 4350
	1    0    0    -1  
$EndComp
$Comp
L 000_PreferredParts:C_10uF_0805 C211
U 1 1 5D72DE66
P 10400 4350
AR Path="/5D562501/5D72DE66" Ref="C211"  Part="1" 
AR Path="/5D587C46/5D72DE66" Ref="C311"  Part="1" 
F 0 "C211" H 10515 4396 50  0000 L CNN
F 1 "C_10uF_0805" H 10515 4305 50  0001 L CNN
F 2 "Capacitor_SMD:C_0805_2012Metric" H 10438 4200 50  0001 C CNN
F 3 "~" H 10400 4350 50  0001 C CNN
F 4 "0805" H 10600 4200 50  0000 C CNN "DisplayFootprint"
F 5 "10uF" H 10600 4300 50  0000 C CNN "DisplayValue"
F 6 "Murata Electronics" H 10400 4350 50  0001 C CNN "Manufacturer"
F 7 "GRM21BC8YA106ME11L" H 10400 4350 50  0001 C CNN "PartNumber"
	1    10400 4350
	1    0    0    -1  
$EndComp
Wire Wire Line
	8650 3400 8650 4150
Connection ~ 8650 3400
Wire Wire Line
	8650 3400 8350 3400
$Comp
L Device:R R208
U 1 1 5D97FB91
P 5300 4300
AR Path="/5D562501/5D97FB91" Ref="R208"  Part="1" 
AR Path="/5D587C46/5D97FB91" Ref="R308"  Part="1" 
AR Path="/5D591ABD/5D97FB91" Ref="R?"  Part="1" 
F 0 "R208" V 5093 4300 50  0000 C CNN
F 1 "0" V 5184 4300 50  0000 C CNN
F 2 "Resistor_SMD:R_0402_1005Metric" V 5230 4300 50  0001 C CNN
F 3 "~" H 5300 4300 50  0001 C CNN
F 4 "Stackpole Electronics Inc" H 5300 4300 50  0001 C CNN "Manufacturer"
F 5 "RMCF0402ZT0R00" H 5300 4300 50  0001 C CNN "PartNumber"
	1    5300 4300
	0    1    1    0   
$EndComp
$Comp
L Device:R R209
U 1 1 5D97FC43
P 5800 4350
AR Path="/5D562501/5D97FC43" Ref="R209"  Part="1" 
AR Path="/5D587C46/5D97FC43" Ref="R309"  Part="1" 
AR Path="/5D591ABD/5D97FC43" Ref="R?"  Part="1" 
F 0 "R209" H 5730 4304 50  0000 R CNN
F 1 "DNP" H 5730 4395 50  0000 R CNN
F 2 "Resistor_SMD:R_0402_1005Metric" V 5730 4350 50  0001 C CNN
F 3 "~" H 5800 4350 50  0001 C CNN
	1    5800 4350
	-1   0    0    1   
$EndComp
$Comp
L Device:R R207
U 1 1 5D97FC9E
P 4300 4250
AR Path="/5D562501/5D97FC9E" Ref="R207"  Part="1" 
AR Path="/5D587C46/5D97FC9E" Ref="R307"  Part="1" 
AR Path="/5D591ABD/5D97FC9E" Ref="R?"  Part="1" 
F 0 "R207" V 4507 4250 50  0000 C CNN
F 1 "0" V 4416 4250 50  0000 C CNN
F 2 "Resistor_SMD:R_0402_1005Metric" V 4230 4250 50  0001 C CNN
F 3 "~" H 4300 4250 50  0001 C CNN
F 4 "Stackpole Electronics Inc" H 4300 4250 50  0001 C CNN "Manufacturer"
F 5 "RMCF0402ZT0R00" H 4300 4250 50  0001 C CNN "PartNumber"
	1    4300 4250
	0    -1   -1   0   
$EndComp
Wire Wire Line
	3150 3650 5900 3650
Wire Wire Line
	5800 4200 5800 4100
Wire Wire Line
	5550 4100 5800 4100
Connection ~ 5800 4100
Wire Wire Line
	5800 4100 5900 4100
$Comp
L power:GND #PWR?
U 1 1 5D985A40
P 5800 4600
AR Path="/5D562501/5D985A40" Ref="#PWR?"  Part="1" 
AR Path="/5D587C46/5D985A40" Ref="#PWR?"  Part="1" 
AR Path="/5D591ABD/5D985A40" Ref="#PWR?"  Part="1" 
F 0 "#PWR?" H 5800 4350 50  0001 C CNN
F 1 "GND" H 5805 4427 50  0000 C CNN
F 2 "" H 5800 4600 50  0001 C CNN
F 3 "" H 5800 4600 50  0001 C CNN
	1    5800 4600
	1    0    0    -1  
$EndComp
Wire Wire Line
	5800 4600 5800 4500
$Comp
L Device:R R206
U 1 1 5D98ADA3
P 3950 4150
AR Path="/5D562501/5D98ADA3" Ref="R206"  Part="1" 
AR Path="/5D587C46/5D98ADA3" Ref="R306"  Part="1" 
AR Path="/5D591ABD/5D98ADA3" Ref="R?"  Part="1" 
F 0 "R206" V 4157 4150 50  0000 C CNN
F 1 "0" V 4066 4150 50  0000 C CNN
F 2 "Resistor_SMD:R_0402_1005Metric" V 3880 4150 50  0001 C CNN
F 3 "~" H 3950 4150 50  0001 C CNN
F 4 "Stackpole Electronics Inc" H 3950 4150 50  0001 C CNN "Manufacturer"
F 5 "RMCF0402ZT0R00" H 3950 4150 50  0001 C CNN "PartNumber"
	1    3950 4150
	0    -1   -1   0   
$EndComp
$Comp
L Device:R R204
U 1 1 5D98ED78
P 4450 3900
AR Path="/5D562501/5D98ED78" Ref="R204"  Part="1" 
AR Path="/5D587C46/5D98ED78" Ref="R304"  Part="1" 
AR Path="/5D591ABD/5D98ED78" Ref="R?"  Part="1" 
F 0 "R204" H 4380 3854 50  0000 R CNN
F 1 "DNP" H 4380 3945 50  0000 R CNN
F 2 "Resistor_SMD:R_0402_1005Metric" V 4380 3900 50  0001 C CNN
F 3 "~" H 4450 3900 50  0001 C CNN
	1    4450 3900
	-1   0    0    1   
$EndComp
$Comp
L Device:R R205
U 1 1 5D98EDF8
P 4900 4000
AR Path="/5D562501/5D98EDF8" Ref="R205"  Part="1" 
AR Path="/5D587C46/5D98EDF8" Ref="R305"  Part="1" 
AR Path="/5D591ABD/5D98EDF8" Ref="R?"  Part="1" 
F 0 "R205" V 5107 4000 50  0000 C CNN
F 1 "DNP" V 5016 4000 50  0000 C CNN
F 2 "Resistor_SMD:R_0402_1005Metric" V 4830 4000 50  0001 C CNN
F 3 "~" H 4900 4000 50  0001 C CNN
	1    4900 4000
	0    -1   -1   0   
$EndComp
Wire Wire Line
	4450 3750 4450 3400
Connection ~ 4450 3400
Wire Wire Line
	4450 3400 2750 3400
Wire Wire Line
	4450 4050 4450 4150
Wire Wire Line
	4450 4150 4700 4150
Wire Wire Line
	4700 4150 4700 4000
Wire Wire Line
	4750 4000 4700 4000
Connection ~ 4700 4000
Wire Wire Line
	4700 4000 4700 3900
Wire Wire Line
	5050 4000 5150 4000
Wire Wire Line
	4100 4150 4450 4150
Connection ~ 4450 4150
Wire Wire Line
	5150 4250 5150 4000
Connection ~ 5150 4000
Wire Wire Line
	5150 4300 5050 4300
Wire Wire Line
	5050 4300 5050 4350
Text Label 5700 3900 0    50   ~ 0
EN_
Text Label 5500 4000 0    50   ~ 0
PS_SYNC_
Wire Wire Line
	5550 4100 5550 4300
Wire Wire Line
	5550 4300 5450 4300
Text Label 5550 4100 0    50   ~ 0
VSEL_
Wire Wire Line
	4150 4250 3750 4250
Wire Wire Line
	3750 4350 5050 4350
Wire Wire Line
	4450 4250 5150 4250
Wire Wire Line
	5150 4000 5900 4000
Wire Wire Line
	4700 3900 5900 3900
Wire Wire Line
	3800 4150 3750 4150
Wire Wire Line
	7100 3300 7300 3300
Wire Wire Line
	7300 3300 7300 3400
Connection ~ 7300 3400
Wire Wire Line
	7300 3400 7900 3400
$Comp
L 000_PreferredParts:C_10uF_0603 C203
U 1 1 5D804239
P 2750 3750
AR Path="/5D562501/5D804239" Ref="C203"  Part="1" 
AR Path="/5D587C46/5D804239" Ref="C303"  Part="1" 
F 0 "C203" H 2775 3850 50  0000 L CNN
F 1 "C_10uF_0603" H 2775 3650 50  0001 L CNN
F 2 "Capacitor_SMD:C_0603_1608Metric" H 2788 3600 50  0001 C CNN
F 3 "~" H 2750 3750 50  0001 C CNN
F 4 "10uF" H 2900 3650 50  0000 C CNN "DisplayValue"
F 5 "0603" H 2900 3550 50  0000 C CNN "DisplayFootprint"
F 6 "Murata Electronics" H 2750 3750 50  0001 C CNN "Manufacturer"
F 7 "GRM188R6YA106MA73D" H 2750 3750 50  0001 C CNN "PartNumber"
	1    2750 3750
	1    0    0    -1  
$EndComp
$EndSCHEMATC
