EESchema Schematic File Version 4
EELAYER 30 0
EELAYER END
$Descr A4 11693 8268
encoding utf-8
Sheet 14 14
Title ""
Date ""
Rev ""
Comp ""
Comment1 ""
Comment2 ""
Comment3 ""
Comment4 ""
$EndDescr
$Comp
L Connector_Generic:Conn_02x05_Odd_Even J?
U 1 1 5E2464A3
P 3050 2200
AR Path="/5D67C7FD/5E2464A3" Ref="J?"  Part="1" 
AR Path="/5E243016/5E2464A3" Ref="J1401"  Part="1" 
F 0 "J1401" H 3100 2617 50  0000 C CNN
F 1 "Conn_02x05_Odd_Even" H 3100 2526 50  0000 C CNN
F 2 "POWDER_MCU:ARM_JTAG_0.127_10" H 3050 2200 50  0001 C CNN
F 3 "~" H 3050 2200 50  0001 C CNN
F 4 "Amphenol ICC (FCI)" H 3050 2200 50  0001 C CNN "Manufacturer"
F 5 "20021521-00010T4LF" H 3050 2200 50  0001 C CNN "PartNumber"
F 6 "3000-0000000164" H 3050 2200 50  0001 C CNN "PartSpecification"
	1    3050 2200
	1    0    0    -1  
$EndComp
$Comp
L power:GND #PWR?
U 1 1 5E2464A9
P 2750 2500
AR Path="/5D67C7FD/5E2464A9" Ref="#PWR?"  Part="1" 
AR Path="/5E243016/5E2464A9" Ref="#PWR?"  Part="1" 
F 0 "#PWR?" H 2750 2250 50  0001 C CNN
F 1 "GND" H 2755 2327 50  0000 C CNN
F 2 "" H 2750 2500 50  0001 C CNN
F 3 "" H 2750 2500 50  0001 C CNN
	1    2750 2500
	1    0    0    -1  
$EndComp
$Comp
L power:GND #PWR?
U 1 1 5E2464AF
P 3450 2500
AR Path="/5D67C7FD/5E2464AF" Ref="#PWR?"  Part="1" 
AR Path="/5E243016/5E2464AF" Ref="#PWR?"  Part="1" 
F 0 "#PWR?" H 3450 2250 50  0001 C CNN
F 1 "GND" H 3455 2327 50  0000 C CNN
F 2 "" H 3450 2500 50  0001 C CNN
F 3 "" H 3450 2500 50  0001 C CNN
	1    3450 2500
	1    0    0    -1  
$EndComp
Wire Wire Line
	3450 2500 3450 2400
Wire Wire Line
	3450 2400 3350 2400
Wire Wire Line
	2750 2500 2750 2400
Wire Wire Line
	2750 2400 2850 2400
Text Label 2300 2000 0    50   ~ 0
SDR_GPIO0
Wire Wire Line
	2300 2000 2850 2000
Wire Wire Line
	3900 2000 3350 2000
Wire Wire Line
	2300 2100 2850 2100
Wire Wire Line
	3900 2100 3350 2100
Wire Wire Line
	2300 2200 2850 2200
Wire Wire Line
	3900 2200 3350 2200
Wire Wire Line
	2300 2300 2850 2300
Wire Wire Line
	3900 2300 3350 2300
Text Label 3900 2000 2    50   ~ 0
SDR_GPIO1
Text Label 2300 2100 0    50   ~ 0
SDR_GPIO2
Text Label 3900 2100 2    50   ~ 0
SDR_GPIO3
Text Label 2300 2200 0    50   ~ 0
SDR_GPIO4
Text Label 3900 2200 2    50   ~ 0
SDR_GPIO5
Text Label 2300 2300 0    50   ~ 0
SDR_GPIO6
Text Label 3900 2300 2    50   ~ 0
SDR_GPIO7
$Comp
L Connector_Generic:Conn_02x08_Odd_Even J?
U 1 1 5E2464C9
P 5200 2250
AR Path="/5D67C7FD/5E2464C9" Ref="J?"  Part="1" 
AR Path="/5E243016/5E2464C9" Ref="J1402"  Part="1" 
F 0 "J1402" H 5250 2650 50  0000 C CNN
F 1 "Conn_02x08_Odd_Even" H 5250 1750 50  0000 C CNN
F 2 "Connector_PinHeader_2.54mm:PinHeader_2x08_P2.54mm_Vertical_SMD" H 5200 2250 50  0001 C CNN
F 3 "~" H 5200 2250 50  0001 C CNN
F 4 "3000-0000000208" H 5200 2250 50  0001 C CNN "PartSpecification"
	1    5200 2250
	1    0    0    -1  
$EndComp
Text Label 4450 2050 0    50   ~ 0
SDR_GPIO0
Wire Wire Line
	4450 2050 5000 2050
Wire Wire Line
	4450 2150 5000 2150
Wire Wire Line
	4450 2250 5000 2250
Wire Wire Line
	4450 2350 5000 2350
Wire Wire Line
	4450 2450 5000 2450
Wire Wire Line
	4450 2550 5000 2550
Wire Wire Line
	4450 2650 5000 2650
Wire Wire Line
	6050 1950 5500 1950
Text Label 4450 2150 0    50   ~ 0
SDR_GPIO1
Text Label 4450 2250 0    50   ~ 0
SDR_GPIO2
Text Label 4450 2350 0    50   ~ 0
SDR_GPIO3
Text Label 4450 2450 0    50   ~ 0
SDR_GPIO4
Text Label 4450 2550 0    50   ~ 0
SDR_GPIO5
Text Label 4450 2650 0    50   ~ 0
SDR_GPIO6
Text Label 5600 1950 0    50   ~ 0
SDR_GPIO7
Text Label 5600 2050 0    50   ~ 0
SDR_GPIO8
Wire Wire Line
	5500 2050 6050 2050
Wire Wire Line
	5500 2150 6050 2150
Wire Wire Line
	5500 2250 6050 2250
Wire Wire Line
	5500 2350 6050 2350
Text Label 5600 2150 0    50   ~ 0
SDR_GPIO9
Text Label 5600 2250 0    50   ~ 0
SDR_GPIO10
Text Label 5600 2350 0    50   ~ 0
SDR_GPIO11
NoConn ~ 5500 2650
$Comp
L power:GND #PWR?
U 1 1 5E2464E8
P 5850 2700
AR Path="/5D67C7FD/5E2464E8" Ref="#PWR?"  Part="1" 
AR Path="/5E243016/5E2464E8" Ref="#PWR?"  Part="1" 
F 0 "#PWR?" H 5850 2450 50  0001 C CNN
F 1 "GND" H 5855 2527 50  0000 C CNN
F 2 "" H 5850 2700 50  0001 C CNN
F 3 "" H 5850 2700 50  0001 C CNN
	1    5850 2700
	1    0    0    -1  
$EndComp
Wire Wire Line
	5850 2700 5850 2550
Wire Wire Line
	5850 2550 5500 2550
Wire Wire Line
	5500 2450 5850 2450
Wire Wire Line
	5850 2450 5850 2550
Connection ~ 5850 2550
Wire Wire Line
	5000 1950 4450 1950
Text Label 4450 1950 0    50   ~ 0
SDR_3_3
$Comp
L POWDER_ESD:TPD6E004 U?
U 1 1 5E24BBAD
P 3800 4200
AR Path="/5D67C7FD/5E24BBAD" Ref="U?"  Part="1" 
AR Path="/5E243016/5E24BBAD" Ref="U1401"  Part="1" 
F 0 "U1401" H 4450 4950 50  0000 C CNN
F 1 "TPD6E004" H 3200 4950 50  0000 C CNN
F 2 "POWDER_ESD:TPD6E004_RSE_8" H 3050 5350 50  0001 C CNN
F 3 "" H 3100 5050 50  0001 C CNN
F 4 "Texas Instruments" H 3800 4200 50  0001 C CNN "Manufacturer"
F 5 "TPD6E004RSER" H 3800 4200 50  0001 C CNN "PartNumber"
F 6 "3000-0000000082" H 3800 4200 50  0001 C CNN "PartSpecification"
	1    3800 4200
	1    0    0    -1  
$EndComp
$Comp
L POWDER_ESD:TPD6E004 U?
U 1 1 5E24CEA6
P 7800 4200
AR Path="/5D67C7FD/5E24CEA6" Ref="U?"  Part="1" 
AR Path="/5E243016/5E24CEA6" Ref="U1402"  Part="1" 
F 0 "U1402" H 8450 4950 50  0000 C CNN
F 1 "TPD6E004" H 7200 4950 50  0000 C CNN
F 2 "POWDER_ESD:TPD6E004_RSE_8" H 7050 5350 50  0001 C CNN
F 3 "" H 7100 5050 50  0001 C CNN
F 4 "Texas Instruments" H 7800 4200 50  0001 C CNN "Manufacturer"
F 5 "TPD6E004RSER" H 7800 4200 50  0001 C CNN "PartNumber"
F 6 "3000-0000000082" H 7800 4200 50  0001 C CNN "PartSpecification"
	1    7800 4200
	1    0    0    -1  
$EndComp
Text Label 4900 4050 0    50   ~ 0
SDR_GPIO0
Wire Wire Line
	2300 4050 2850 4050
Wire Wire Line
	2300 4200 2850 4200
Wire Wire Line
	2300 4350 2850 4350
Wire Wire Line
	5300 4050 4750 4050
Wire Wire Line
	5300 4200 4750 4200
Wire Wire Line
	5300 4350 4750 4350
Text Label 4900 4200 0    50   ~ 0
SDR_GPIO1
Text Label 4900 4350 0    50   ~ 0
SDR_GPIO2
Text Label 2700 4350 2    50   ~ 0
SDR_GPIO3
Text Label 2700 4200 2    50   ~ 0
SDR_GPIO4
Text Label 2700 4050 2    50   ~ 0
SDR_GPIO5
Wire Wire Line
	6300 4050 6850 4050
Text Label 6300 4050 0    50   ~ 0
SDR_GPIO6
Wire Wire Line
	6300 4200 6850 4200
Text Label 6300 4200 0    50   ~ 0
SDR_GPIO7
Text Label 6300 4350 0    50   ~ 0
SDR_GPIO8
Wire Wire Line
	6850 4350 6300 4350
Wire Wire Line
	8750 4050 9300 4050
Wire Wire Line
	8750 4200 9300 4200
Wire Wire Line
	8750 4350 9300 4350
Text Label 9300 4050 2    50   ~ 0
SDR_GPIO9
Text Label 9300 4200 2    50   ~ 0
SDR_GPIO10
Text Label 9300 4350 2    50   ~ 0
SDR_GPIO11
$Comp
L power:+3.3V #PWR?
U 1 1 5E27DCC2
P 3800 3250
F 0 "#PWR?" H 3800 3100 50  0001 C CNN
F 1 "+3.3V" H 3800 3390 50  0000 C CNN
F 2 "" H 3800 3250 50  0001 C CNN
F 3 "" H 3800 3250 50  0001 C CNN
	1    3800 3250
	1    0    0    -1  
$EndComp
Wire Wire Line
	3800 3250 3800 3350
$Comp
L power:+3.3V #PWR?
U 1 1 5E27EEE3
P 7800 3250
F 0 "#PWR?" H 7800 3100 50  0001 C CNN
F 1 "+3.3V" H 7800 3390 50  0000 C CNN
F 2 "" H 7800 3250 50  0001 C CNN
F 3 "" H 7800 3250 50  0001 C CNN
	1    7800 3250
	1    0    0    -1  
$EndComp
Wire Wire Line
	7800 3250 7800 3350
$Comp
L power:GND #PWR?
U 1 1 5E280159
P 3800 5150
AR Path="/5D67C7FD/5E280159" Ref="#PWR?"  Part="1" 
AR Path="/5E243016/5E280159" Ref="#PWR?"  Part="1" 
F 0 "#PWR?" H 3800 4900 50  0001 C CNN
F 1 "GND" H 3805 4977 50  0000 C CNN
F 2 "" H 3800 5150 50  0001 C CNN
F 3 "" H 3800 5150 50  0001 C CNN
	1    3800 5150
	1    0    0    -1  
$EndComp
Wire Wire Line
	3800 5150 3800 5050
$Comp
L power:GND #PWR?
U 1 1 5E282D7C
P 7800 5150
AR Path="/5D67C7FD/5E282D7C" Ref="#PWR?"  Part="1" 
AR Path="/5E243016/5E282D7C" Ref="#PWR?"  Part="1" 
F 0 "#PWR?" H 7800 4900 50  0001 C CNN
F 1 "GND" H 7805 4977 50  0000 C CNN
F 2 "" H 7800 5150 50  0001 C CNN
F 3 "" H 7800 5150 50  0001 C CNN
	1    7800 5150
	1    0    0    -1  
$EndComp
Wire Wire Line
	7800 5150 7800 5050
Entry Wire Line
	2200 1900 2300 2000
Entry Wire Line
	2200 2000 2300 2100
Entry Wire Line
	2200 2100 2300 2200
Entry Wire Line
	2200 2200 2300 2300
Entry Wire Line
	3900 2000 4000 1900
Entry Wire Line
	3900 2100 4000 2000
Entry Wire Line
	3900 2200 4000 2100
Entry Wire Line
	3900 2300 4000 2200
Wire Bus Line
	2200 1500 2000 1500
Wire Bus Line
	4000 1500 2200 1500
Connection ~ 2200 1500
Entry Wire Line
	6050 1950 6150 1850
Entry Wire Line
	6050 2050 6150 1950
Entry Wire Line
	6050 2150 6150 2050
Entry Wire Line
	6050 2250 6150 2150
Entry Wire Line
	6050 2350 6150 2250
Entry Wire Line
	4350 1950 4450 2050
Entry Wire Line
	4350 2050 4450 2150
Entry Wire Line
	4350 2150 4450 2250
Entry Wire Line
	4350 2250 4450 2350
Entry Wire Line
	4350 2350 4450 2450
Entry Wire Line
	4350 2450 4450 2550
Entry Wire Line
	4350 2550 4450 2650
Wire Bus Line
	4350 1500 4000 1500
Connection ~ 4000 1500
Wire Bus Line
	6150 1500 4350 1500
Connection ~ 4350 1500
Text HLabel 2000 1500 0    50   BiDi ~ 0
SDR_GPIO[0..11]
Wire Bus Line
	2200 1500 2200 2200
Wire Bus Line
	4000 1500 4000 2200
Wire Bus Line
	6150 1500 6150 2250
Wire Bus Line
	4350 1500 4350 2550
$EndSCHEMATC
