EESchema Schematic File Version 4
EELAYER 30 0
EELAYER END
$Descr A4 11693 8268
encoding utf-8
Sheet 27 27
Title ""
Date ""
Rev ""
Comp ""
Comment1 ""
Comment2 ""
Comment3 ""
Comment4 ""
$EndDescr
$Comp
L Mechanical:MountingHole_Pad H2901
U 1 1 5E317BC4
P 3500 2400
F 0 "H2901" H 3500 2650 50  0000 C CNN
F 1 "MountingHole_Pad" H 3500 2575 50  0000 C CNN
F 2 "MountingHole:MountingHole_3.2mm_M3_ISO7380_Pad" H 3500 2400 50  0001 C CNN
F 3 "~" H 3500 2400 50  0001 C CNN
	1    3500 2400
	1    0    0    -1  
$EndComp
$Comp
L Mechanical:MountingHole_Pad H2904
U 1 1 5E318145
P 4500 2400
F 0 "H2904" H 4500 2650 50  0000 C CNN
F 1 "MountingHole_Pad" H 4500 2575 50  0000 C CNN
F 2 "MountingHole:MountingHole_3.2mm_M3_ISO7380_Pad" H 4500 2400 50  0001 C CNN
F 3 "~" H 4500 2400 50  0001 C CNN
	1    4500 2400
	1    0    0    -1  
$EndComp
$Comp
L Mechanical:MountingHole_Pad H2907
U 1 1 5E3182F3
P 5500 2400
F 0 "H2907" H 5500 2650 50  0000 C CNN
F 1 "MountingHole_Pad" H 5500 2575 50  0000 C CNN
F 2 "MountingHole:MountingHole_3.2mm_M3_ISO7380_Pad" H 5500 2400 50  0001 C CNN
F 3 "~" H 5500 2400 50  0001 C CNN
	1    5500 2400
	1    0    0    -1  
$EndComp
$Comp
L Mechanical:MountingHole_Pad H2902
U 1 1 5E3190F4
P 3500 3400
F 0 "H2902" H 3500 3650 50  0000 C CNN
F 1 "MountingHole_Pad" H 3500 3575 50  0000 C CNN
F 2 "MountingHole:MountingHole_3.2mm_M3_ISO7380_Pad" H 3500 3400 50  0001 C CNN
F 3 "~" H 3500 3400 50  0001 C CNN
	1    3500 3400
	1    0    0    -1  
$EndComp
$Comp
L Mechanical:MountingHole_Pad H2905
U 1 1 5E3190FA
P 4500 3400
F 0 "H2905" H 4500 3650 50  0000 C CNN
F 1 "MountingHole_Pad" H 4500 3575 50  0000 C CNN
F 2 "MountingHole:MountingHole_3.2mm_M3_ISO7380_Pad" H 4500 3400 50  0001 C CNN
F 3 "~" H 4500 3400 50  0001 C CNN
	1    4500 3400
	1    0    0    -1  
$EndComp
$Comp
L Mechanical:MountingHole_Pad H2908
U 1 1 5E319100
P 5500 3400
F 0 "H2908" H 5500 3650 50  0000 C CNN
F 1 "MountingHole_Pad" H 5500 3575 50  0000 C CNN
F 2 "MountingHole:MountingHole_3.2mm_M3_ISO7380_Pad" H 5500 3400 50  0001 C CNN
F 3 "~" H 5500 3400 50  0001 C CNN
	1    5500 3400
	1    0    0    -1  
$EndComp
$Comp
L Mechanical:MountingHole_Pad H2903
U 1 1 5E319B2F
P 3500 4400
F 0 "H2903" H 3500 4650 50  0000 C CNN
F 1 "MountingHole_Pad" H 3500 4575 50  0000 C CNN
F 2 "MountingHole:MountingHole_3.2mm_M3_ISO7380_Pad" H 3500 4400 50  0001 C CNN
F 3 "~" H 3500 4400 50  0001 C CNN
	1    3500 4400
	1    0    0    -1  
$EndComp
$Comp
L Mechanical:MountingHole_Pad H2906
U 1 1 5E319B35
P 4500 4400
F 0 "H2906" H 4500 4650 50  0000 C CNN
F 1 "MountingHole_Pad" H 4500 4575 50  0000 C CNN
F 2 "MountingHole:MountingHole_3.2mm_M3_ISO7380_Pad" H 4500 4400 50  0001 C CNN
F 3 "~" H 4500 4400 50  0001 C CNN
	1    4500 4400
	1    0    0    -1  
$EndComp
$Comp
L Mechanical:MountingHole_Pad H2909
U 1 1 5E319B3B
P 5500 4400
F 0 "H2909" H 5500 4650 50  0000 C CNN
F 1 "MountingHole_Pad" H 5500 4575 50  0000 C CNN
F 2 "MountingHole:MountingHole_3.2mm_M3_ISO7380_Pad" H 5500 4400 50  0001 C CNN
F 3 "~" H 5500 4400 50  0001 C CNN
	1    5500 4400
	1    0    0    -1  
$EndComp
$Comp
L power:GND #PWR?
U 1 1 5E319CD8
P 3500 2600
F 0 "#PWR?" H 3500 2350 50  0001 C CNN
F 1 "GND" H 3500 2450 50  0000 C CNN
F 2 "" H 3500 2600 50  0001 C CNN
F 3 "" H 3500 2600 50  0001 C CNN
	1    3500 2600
	1    0    0    -1  
$EndComp
Wire Wire Line
	3500 2600 3500 2500
$Comp
L power:GND #PWR?
U 1 1 5E31AB8E
P 4500 2600
F 0 "#PWR?" H 4500 2350 50  0001 C CNN
F 1 "GND" H 4500 2450 50  0000 C CNN
F 2 "" H 4500 2600 50  0001 C CNN
F 3 "" H 4500 2600 50  0001 C CNN
	1    4500 2600
	1    0    0    -1  
$EndComp
Wire Wire Line
	4500 2600 4500 2500
$Comp
L power:GND #PWR?
U 1 1 5E31ADB7
P 5500 2600
F 0 "#PWR?" H 5500 2350 50  0001 C CNN
F 1 "GND" H 5500 2450 50  0000 C CNN
F 2 "" H 5500 2600 50  0001 C CNN
F 3 "" H 5500 2600 50  0001 C CNN
	1    5500 2600
	1    0    0    -1  
$EndComp
Wire Wire Line
	5500 2600 5500 2500
$Comp
L power:GND #PWR?
U 1 1 5E31C25C
P 3500 3600
F 0 "#PWR?" H 3500 3350 50  0001 C CNN
F 1 "GND" H 3500 3450 50  0000 C CNN
F 2 "" H 3500 3600 50  0001 C CNN
F 3 "" H 3500 3600 50  0001 C CNN
	1    3500 3600
	1    0    0    -1  
$EndComp
Wire Wire Line
	3500 3600 3500 3500
$Comp
L power:GND #PWR?
U 1 1 5E31C263
P 4500 3600
F 0 "#PWR?" H 4500 3350 50  0001 C CNN
F 1 "GND" H 4500 3450 50  0000 C CNN
F 2 "" H 4500 3600 50  0001 C CNN
F 3 "" H 4500 3600 50  0001 C CNN
	1    4500 3600
	1    0    0    -1  
$EndComp
Wire Wire Line
	4500 3600 4500 3500
$Comp
L power:GND #PWR?
U 1 1 5E31C26A
P 5500 3600
F 0 "#PWR?" H 5500 3350 50  0001 C CNN
F 1 "GND" H 5500 3450 50  0000 C CNN
F 2 "" H 5500 3600 50  0001 C CNN
F 3 "" H 5500 3600 50  0001 C CNN
	1    5500 3600
	1    0    0    -1  
$EndComp
Wire Wire Line
	5500 3600 5500 3500
$Comp
L power:GND #PWR?
U 1 1 5E31C9CC
P 3500 4600
F 0 "#PWR?" H 3500 4350 50  0001 C CNN
F 1 "GND" H 3500 4450 50  0000 C CNN
F 2 "" H 3500 4600 50  0001 C CNN
F 3 "" H 3500 4600 50  0001 C CNN
	1    3500 4600
	1    0    0    -1  
$EndComp
Wire Wire Line
	3500 4600 3500 4500
$Comp
L power:GND #PWR?
U 1 1 5E31C9D3
P 4500 4600
F 0 "#PWR?" H 4500 4350 50  0001 C CNN
F 1 "GND" H 4500 4450 50  0000 C CNN
F 2 "" H 4500 4600 50  0001 C CNN
F 3 "" H 4500 4600 50  0001 C CNN
	1    4500 4600
	1    0    0    -1  
$EndComp
Wire Wire Line
	4500 4600 4500 4500
$Comp
L power:GND #PWR?
U 1 1 5E31C9DA
P 5500 4600
F 0 "#PWR?" H 5500 4350 50  0001 C CNN
F 1 "GND" H 5500 4450 50  0000 C CNN
F 2 "" H 5500 4600 50  0001 C CNN
F 3 "" H 5500 4600 50  0001 C CNN
	1    5500 4600
	1    0    0    -1  
$EndComp
Wire Wire Line
	5500 4600 5500 4500
$Comp
L Mechanical:Fiducial FID2901
U 1 1 5E326A7E
P 7000 2500
F 0 "FID2901" H 7000 2700 50  0000 C CNN
F 1 "Fiducial" H 7000 2625 50  0000 C CNN
F 2 "Fiducial:Fiducial_1mm_Mask2mm" H 7000 2500 50  0001 C CNN
F 3 "~" H 7000 2500 50  0001 C CNN
	1    7000 2500
	1    0    0    -1  
$EndComp
$Comp
L Mechanical:Fiducial FID2904
U 1 1 5E327307
P 7500 2500
F 0 "FID2904" H 7500 2700 50  0000 C CNN
F 1 "Fiducial" H 7500 2625 50  0000 C CNN
F 2 "Fiducial:Fiducial_1mm_Mask2mm" H 7500 2500 50  0001 C CNN
F 3 "~" H 7500 2500 50  0001 C CNN
	1    7500 2500
	1    0    0    -1  
$EndComp
$Comp
L Mechanical:Fiducial FID2907
U 1 1 5E3276B3
P 8000 2500
F 0 "FID2907" H 8000 2700 50  0000 C CNN
F 1 "Fiducial" H 8000 2625 50  0000 C CNN
F 2 "Fiducial:Fiducial_1mm_Mask2mm" H 8000 2500 50  0001 C CNN
F 3 "~" H 8000 2500 50  0001 C CNN
	1    8000 2500
	1    0    0    -1  
$EndComp
$Comp
L Mechanical:Fiducial FID2902
U 1 1 5E32877D
P 7000 3000
F 0 "FID2902" H 7000 3200 50  0000 C CNN
F 1 "Fiducial" H 7000 3125 50  0000 C CNN
F 2 "Fiducial:Fiducial_1mm_Mask2mm" H 7000 3000 50  0001 C CNN
F 3 "~" H 7000 3000 50  0001 C CNN
	1    7000 3000
	1    0    0    -1  
$EndComp
$Comp
L Mechanical:Fiducial FID2905
U 1 1 5E328783
P 7500 3000
F 0 "FID2905" H 7500 3200 50  0000 C CNN
F 1 "Fiducial" H 7500 3125 50  0000 C CNN
F 2 "Fiducial:Fiducial_1mm_Mask2mm" H 7500 3000 50  0001 C CNN
F 3 "~" H 7500 3000 50  0001 C CNN
	1    7500 3000
	1    0    0    -1  
$EndComp
$Comp
L Mechanical:Fiducial FID2908
U 1 1 5E328789
P 8000 3000
F 0 "FID2908" H 8000 3200 50  0000 C CNN
F 1 "Fiducial" H 8000 3125 50  0000 C CNN
F 2 "Fiducial:Fiducial_1mm_Mask2mm" H 8000 3000 50  0001 C CNN
F 3 "~" H 8000 3000 50  0001 C CNN
	1    8000 3000
	1    0    0    -1  
$EndComp
$Comp
L Mechanical:Fiducial FID2903
U 1 1 5E329935
P 7000 3500
F 0 "FID2903" H 7000 3700 50  0000 C CNN
F 1 "Fiducial" H 7000 3625 50  0000 C CNN
F 2 "Fiducial:Fiducial_1mm_Mask2mm" H 7000 3500 50  0001 C CNN
F 3 "~" H 7000 3500 50  0001 C CNN
	1    7000 3500
	1    0    0    -1  
$EndComp
$Comp
L Mechanical:Fiducial FID2906
U 1 1 5E32993B
P 7500 3500
F 0 "FID2906" H 7500 3700 50  0000 C CNN
F 1 "Fiducial" H 7500 3625 50  0000 C CNN
F 2 "Fiducial:Fiducial_1mm_Mask2mm" H 7500 3500 50  0001 C CNN
F 3 "~" H 7500 3500 50  0001 C CNN
	1    7500 3500
	1    0    0    -1  
$EndComp
$Comp
L Mechanical:Fiducial FID2909
U 1 1 5E329941
P 8000 3500
F 0 "FID2909" H 8000 3700 50  0000 C CNN
F 1 "Fiducial" H 8000 3625 50  0000 C CNN
F 2 "Fiducial:Fiducial_1mm_Mask2mm" H 8000 3500 50  0001 C CNN
F 3 "~" H 8000 3500 50  0001 C CNN
	1    8000 3500
	1    0    0    -1  
$EndComp
$EndSCHEMATC
