EESchema Schematic File Version 4
EELAYER 30 0
EELAYER END
$Descr A3 16535 11693
encoding utf-8
Sheet 1 39
Title ""
Date ""
Rev ""
Comp ""
Comment1 ""
Comment2 ""
Comment3 ""
Comment4 ""
$EndDescr
Wire Wire Line
	1200 4200 1300 4200
$Comp
L Connector:Conn_Coaxial J101
U 1 1 5D23A7CA
P 1000 4200
F 0 "J101" H 1100 4450 50  0000 C CNN
F 1 "Conn_Coaxial" H 1150 4350 50  0000 C CNN
F 2 "POWDER_RF:SMA_EndLaunch_142-0761-881" H 1000 4200 50  0001 C CNN
F 3 " ~" H 1000 4200 50  0001 C CNN
F 4 "Cinch Connectivity Solutions Johnson" H 1000 4200 50  0001 C CNN "Manufacturer"
F 5 "142-0761-881" H 1000 4200 50  0001 C CNN "PartNumber"
F 6 "3000-0000000165" H 1000 4200 50  0001 C CNN "PartSpecification"
	1    1000 4200
	-1   0    0    -1  
$EndComp
$Comp
L power:GND #PWR?
U 1 1 5D23AFE1
P 1000 4650
F 0 "#PWR?" H 1000 4400 50  0001 C CNN
F 1 "GND" H 1005 4477 50  0000 C CNN
F 2 "" H 1000 4650 50  0001 C CNN
F 3 "" H 1000 4650 50  0001 C CNN
	1    1000 4650
	1    0    0    -1  
$EndComp
Wire Wire Line
	1000 4650 1000 4400
$Comp
L Connector:Conn_Coaxial J102
U 1 1 5D23FE0B
P 8500 800
F 0 "J102" V 8750 650 50  0000 L CNN
F 1 "Conn_Coaxial" V 8650 400 50  0000 L CNN
F 2 "POWDER_RF:SMA_EndLaunch_142-0761-881" H 8500 800 50  0001 C CNN
F 3 " ~" H 8500 800 50  0001 C CNN
F 4 "Cinch Connectivity Solutions Johnson" H 8500 800 50  0001 C CNN "Manufacturer"
F 5 "142-0761-881" H 8500 800 50  0001 C CNN "PartNumber"
F 6 "3000-0000000165" H 8500 800 50  0001 C CNN "PartSpecification"
	1    8500 800 
	0    -1   -1   0   
$EndComp
$Comp
L power:GND #PWR?
U 1 1 5D242F06
P 9250 950
F 0 "#PWR?" H 9250 700 50  0001 C CNN
F 1 "GND" H 9255 777 50  0000 C CNN
F 2 "" H 9250 950 50  0001 C CNN
F 3 "" H 9250 950 50  0001 C CNN
	1    9250 950 
	1    0    0    -1  
$EndComp
Wire Wire Line
	9250 950  9250 800 
$Comp
L Device:R R104
U 1 1 5D24D1B4
P 9750 4200
F 0 "R104" V 9543 4200 50  0000 C CNN
F 1 "47pF" V 9634 4200 50  0000 C CNN
F 2 "Resistor_SMD:R_0201_0603Metric" V 9680 4200 50  0001 C CNN
F 3 "~" H 9750 4200 50  0001 C CNN
F 4 "" H 9750 4200 50  0001 C CNN "Manufacturer"
F 5 "" H 9750 4200 50  0001 C CNN "PartNumber"
F 6 "3000-0000000161" H 9750 4200 50  0001 C CNN "PartSpecification"
	1    9750 4200
	0    1    1    0   
$EndComp
$Comp
L Device:R R103
U 1 1 5D253390
P 9500 4450
F 0 "R103" H 9430 4404 50  0000 R CNN
F 1 "DNP" H 9430 4495 50  0000 R CNN
F 2 "Resistor_SMD:R_0201_0603Metric" V 9430 4450 50  0001 C CNN
F 3 "~" H 9500 4450 50  0001 C CNN
	1    9500 4450
	-1   0    0    1   
$EndComp
Wire Wire Line
	9500 4200 9500 4300
Connection ~ 9500 4200
Wire Wire Line
	9500 4200 9600 4200
$Comp
L Device:R R105
U 1 1 5D25A0AE
P 10000 4450
F 0 "R105" H 9930 4404 50  0000 R CNN
F 1 "DNP" H 9930 4495 50  0000 R CNN
F 2 "Resistor_SMD:R_0201_0603Metric" V 9930 4450 50  0001 C CNN
F 3 "~" H 10000 4450 50  0001 C CNN
	1    10000 4450
	-1   0    0    1   
$EndComp
Wire Wire Line
	10000 4200 10000 4300
Connection ~ 10000 4200
Wire Wire Line
	10000 4200 9900 4200
$Comp
L power:GND #PWR?
U 1 1 5D25EBC3
P 9500 4700
F 0 "#PWR?" H 9500 4450 50  0001 C CNN
F 1 "GND" H 9505 4527 50  0000 C CNN
F 2 "" H 9500 4700 50  0001 C CNN
F 3 "" H 9500 4700 50  0001 C CNN
	1    9500 4700
	1    0    0    -1  
$EndComp
$Comp
L power:GND #PWR?
U 1 1 5D260511
P 10000 4700
F 0 "#PWR?" H 10000 4450 50  0001 C CNN
F 1 "GND" H 10005 4527 50  0000 C CNN
F 2 "" H 10000 4700 50  0001 C CNN
F 3 "" H 10000 4700 50  0001 C CNN
	1    10000 4700
	1    0    0    -1  
$EndComp
Wire Wire Line
	10000 4600 10000 4700
Wire Wire Line
	9500 4600 9500 4700
Wire Wire Line
	15300 4300 15050 4300
$Comp
L Connector:Conn_Coaxial J103
U 1 1 5D299CC6
P 15500 4300
F 0 "J103" H 15650 4400 50  0000 L CNN
F 1 "Conn_Coaxial" H 15650 4300 50  0000 L CNN
F 2 "POWDER_RF:SMA_EndLaunch_142-0761-881" H 15500 4300 50  0001 C CNN
F 3 " ~" H 15500 4300 50  0001 C CNN
F 4 "Cinch Connectivity Solutions Johnson" H 15500 4300 50  0001 C CNN "Manufacturer"
F 5 "142-0761-881" H 15500 4300 50  0001 C CNN "PartNumber"
F 6 "3000-0000000165" H 15500 4300 50  0001 C CNN "PartSpecification"
	1    15500 4300
	1    0    0    -1  
$EndComp
$Comp
L power:GND #PWR?
U 1 1 5D29D283
P 15500 4750
F 0 "#PWR?" H 15500 4500 50  0001 C CNN
F 1 "GND" H 15505 4577 50  0000 C CNN
F 2 "" H 15500 4750 50  0001 C CNN
F 3 "" H 15500 4750 50  0001 C CNN
	1    15500 4750
	1    0    0    -1  
$EndComp
Wire Wire Line
	15500 4750 15500 4500
Text Label 8500 1150 0    50   ~ 0
ant
Text Label 15150 4300 1    50   ~ 0
pa_in
Text Label 10300 4200 1    50   ~ 0
pa_out_att_1
Text Label 9200 4200 0    50   ~ 0
pa_out
Text Label 10250 4700 0    50   ~ 0
pa_en
$Sheet
S 11000 1150 1000 850 
U 5D587C46
F0 "vreg_5_2" 50
F1 "voltage_regulator_5.sch" 50
F2 "EN" I L 11000 1450 50 
F3 "PS_SYNC" I L 11000 1750 50 
F4 "VSEL_1" I L 11000 1550 50 
F5 "V_12" I L 11000 1250 50 
F6 "V_OUT" O R 12000 1250 50 
F7 "DCDC_PG" O R 12000 1450 50 
F8 "LDO_PG" O R 12000 1550 50 
F9 "VSEL_2" I L 11000 1650 50 
F10 "VSENSE_OUT" O R 12000 1850 50 
$EndSheet
$Sheet
S 14500 7850 900  650 
U 5D591ABD
F0 "vreg_3_3_1" 50
F1 "voltage_regulator_3_3.sch" 50
F2 "PG" O R 15400 8150 50 
F3 "V_12" I L 14500 7950 50 
F4 "V_OUT" O R 15400 7950 50 
$EndSheet
$Comp
L power:+12V #PWR?
U 1 1 5D59A645
P 3750 2250
F 0 "#PWR?" H 3750 2100 50  0001 C CNN
F 1 "+12V" H 3765 2423 50  0000 C CNN
F 2 "" H 3750 2250 50  0001 C CNN
F 3 "" H 3750 2250 50  0001 C CNN
	1    3750 2250
	1    0    0    -1  
$EndComp
Wire Wire Line
	3750 2250 3750 2450
Wire Wire Line
	3750 2450 4000 2450
$Comp
L power:+12V #PWR?
U 1 1 5D5A301C
P 10750 1050
F 0 "#PWR?" H 10750 900 50  0001 C CNN
F 1 "+12V" H 10765 1223 50  0000 C CNN
F 2 "" H 10750 1050 50  0001 C CNN
F 3 "" H 10750 1050 50  0001 C CNN
	1    10750 1050
	1    0    0    -1  
$EndComp
Wire Wire Line
	10750 1050 10750 1250
Wire Wire Line
	10750 1250 11000 1250
$Comp
L power:+12V #PWR?
U 1 1 5D5ABD69
P 14250 7750
F 0 "#PWR?" H 14250 7600 50  0001 C CNN
F 1 "+12V" H 14265 7923 50  0000 C CNN
F 2 "" H 14250 7750 50  0001 C CNN
F 3 "" H 14250 7750 50  0001 C CNN
	1    14250 7750
	1    0    0    -1  
$EndComp
Wire Wire Line
	14250 7750 14250 7950
Wire Wire Line
	14250 7950 14500 7950
Text Label 12100 1250 0    50   ~ 0
VDD_PA
Wire Wire Line
	15400 7950 15650 7950
$Comp
L power:+3.3V #PWR?
U 1 1 5D5D9F95
P 15650 7750
F 0 "#PWR?" H 15650 7600 50  0001 C CNN
F 1 "+3.3V" H 15665 7923 50  0000 C CNN
F 2 "" H 15650 7750 50  0001 C CNN
F 3 "" H 15650 7750 50  0001 C CNN
	1    15650 7750
	1    0    0    -1  
$EndComp
Wire Wire Line
	15650 7750 15650 7950
$Comp
L Device:D_TVS D101
U 1 1 5D88D993
P 1300 4450
F 0 "D101" V 1254 4529 50  0000 L CNN
F 1 "D_TVS" V 1345 4529 50  0000 L CNN
F 2 "Capacitor_SMD:C_0201_0603Metric" H 1300 4450 50  0001 C CNN
F 3 "~" H 1300 4450 50  0001 C CNN
F 4 "SESD0201X1BN-0010-098" V 1300 4450 50  0001 C CNN "PartNumber"
F 5 "Littelfuse Inc." H 1300 4450 50  0001 C CNN "Manufacturer"
F 6 "3000-0000000088" H 1300 4450 50  0001 C CNN "PartSpecification"
	1    1300 4450
	0    1    1    0   
$EndComp
$Comp
L power:GND #PWR?
U 1 1 5D8A2378
P 1300 4650
F 0 "#PWR?" H 1300 4400 50  0001 C CNN
F 1 "GND" H 1305 4477 50  0000 C CNN
F 2 "" H 1300 4650 50  0001 C CNN
F 3 "" H 1300 4650 50  0001 C CNN
	1    1300 4650
	1    0    0    -1  
$EndComp
Wire Wire Line
	1300 4650 1300 4600
Wire Wire Line
	1300 4300 1300 4200
$Comp
L Device:D_TVS D102
U 1 1 5D8B7F82
P 8900 1700
F 0 "D102" H 8900 1484 50  0000 C CNN
F 1 "D_TVS" H 8900 1575 50  0000 C CNN
F 2 "Capacitor_SMD:C_0201_0603Metric" H 8900 1700 50  0001 C CNN
F 3 "~" H 8900 1700 50  0001 C CNN
F 4 "SESD0201X1BN-0010-098" V 8900 1700 50  0001 C CNN "PartNumber"
F 5 "Littelfuse Inc." H 8900 1700 50  0001 C CNN "Manufacturer"
F 6 "3000-0000000088" H 8900 1700 50  0001 C CNN "PartSpecification"
	1    8900 1700
	0    -1   -1   0   
$EndComp
$Comp
L power:GND #PWR?
U 1 1 5D8C2D1F
P 8900 1950
F 0 "#PWR?" H 8900 1700 50  0001 C CNN
F 1 "GND" H 8905 1777 50  0000 C CNN
F 2 "" H 8900 1950 50  0001 C CNN
F 3 "" H 8900 1950 50  0001 C CNN
	1    8900 1950
	1    0    0    -1  
$EndComp
Wire Wire Line
	8900 1950 8900 1850
$Comp
L Device:D_TVS D103
U 1 1 5D8CDC3E
P 15050 4550
F 0 "D103" V 15096 4471 50  0000 R CNN
F 1 "D_TVS" V 15005 4471 50  0000 R CNN
F 2 "Capacitor_SMD:C_0201_0603Metric" H 15050 4550 50  0001 C CNN
F 3 "~" H 15050 4550 50  0001 C CNN
F 4 "SESD0201X1BN-0010-098" V 15050 4550 50  0001 C CNN "PartNumber"
F 5 "Littelfuse Inc." H 15050 4550 50  0001 C CNN "Manufacturer"
F 6 "3000-0000000088" H 15050 4550 50  0001 C CNN "PartSpecification"
	1    15050 4550
	0    -1   -1   0   
$EndComp
Wire Wire Line
	15050 4400 15050 4300
$Comp
L power:GND #PWR?
U 1 1 5D8E3D8F
P 15050 4750
F 0 "#PWR?" H 15050 4500 50  0001 C CNN
F 1 "GND" H 15055 4577 50  0000 C CNN
F 2 "" H 15050 4750 50  0001 C CNN
F 3 "" H 15050 4750 50  0001 C CNN
	1    15050 4750
	1    0    0    -1  
$EndComp
Wire Wire Line
	15050 4750 15050 4700
Wire Wire Line
	10300 1450 11000 1450
Wire Wire Line
	11000 1550 10300 1550
Wire Wire Line
	10300 1650 11000 1650
Text Label 12100 1550 0    50   ~ 0
PA_REG_LDO_PG
Text Label 10300 1650 0    50   ~ 0
PA_REG_VSEL_2
Text Label 12100 1450 0    50   ~ 0
PA_REG_DCDC_PG
Text Label 10300 1750 0    50   ~ 0
PA_REG_PS_SYNC
Wire Wire Line
	12300 1450 12000 1450
Text Label 15500 8150 0    50   ~ 0
PG_3_3
Wire Wire Line
	15700 8150 15400 8150
$Comp
L Connector:Screw_Terminal_01x02 J104
U 1 1 5D6B88F4
P 3200 1100
F 0 "J104" H 3280 1092 50  0000 L CNN
F 1 "Screw_Terminal_01x02" H 3280 1001 50  0000 L CNN
F 2 "TerminalBlock:TerminalBlock_bornier-2_P5.08mm" H 3200 1100 50  0001 C CNN
F 3 "~" H 3200 1100 50  0001 C CNN
F 4 "Molex" H 3200 1100 50  0001 C CNN "Manufacturer"
F 5 "0398800302" H 3200 1100 50  0001 C CNN "PartNumber"
F 6 "3000-0000000184" H 3200 1100 50  0001 C CNN "PartSpecification"
	1    3200 1100
	1    0    0    -1  
$EndComp
$Comp
L power:+12V #PWR?
U 1 1 5D6B9142
P 2250 1000
F 0 "#PWR?" H 2250 850 50  0001 C CNN
F 1 "+12V" H 2265 1173 50  0000 C CNN
F 2 "" H 2250 1000 50  0001 C CNN
F 3 "" H 2250 1000 50  0001 C CNN
	1    2250 1000
	1    0    0    -1  
$EndComp
$Comp
L power:GND #PWR?
U 1 1 5D6B9F88
P 2250 1300
F 0 "#PWR?" H 2250 1050 50  0001 C CNN
F 1 "GND" H 2255 1127 50  0000 C CNN
F 2 "" H 2250 1300 50  0001 C CNN
F 3 "" H 2250 1300 50  0001 C CNN
	1    2250 1300
	1    0    0    -1  
$EndComp
Wire Wire Line
	2250 1300 2250 1200
Wire Wire Line
	2250 1200 3000 1200
Wire Wire Line
	3000 1100 2750 1100
$Sheet
S 2000 9500 500  500 
U 5D614D04
F0 "mounting_holes" 50
F1 "mounting_holes.sch" 50
$EndSheet
Connection ~ 15050 4300
$Sheet
S 10500 3800 1000 1000
U 5D96ADB0
F0 "PA" 50
F1 "PA.sch" 50
F2 "VBIAS" I R 11500 4750 50 
F3 "VCC3" I R 11500 4650 50 
F4 "VCC2" I R 11500 4550 50 
F5 "VCC1" I R 11500 4450 50 
F6 "RF_IN" I R 11500 4200 50 
F7 "RF_OUT" O L 10500 4200 50 
F8 "PA_EN" I L 10500 4700 50 
F9 "TEMP_SENSE" O L 10500 4600 50 
$EndSheet
Wire Wire Line
	10000 4200 10500 4200
Wire Wire Line
	11800 4650 11500 4650
Wire Wire Line
	11800 4550 11500 4550
Wire Wire Line
	11800 4450 11500 4450
Wire Wire Line
	11500 4750 11800 4750
Text Label 11500 4750 0    50   ~ 0
PA_VBIAS
Text Label 11500 4650 0    50   ~ 0
PA_VCC3
Text Label 11500 4550 0    50   ~ 0
PA_VCC2
Text Label 11500 4450 0    50   ~ 0
PA_VCC1
$Sheet
S 5000 3700 1000 1000
U 5E073A72
F0 "LNA" 50
F1 "LNA.sch" 50
F2 "VDD" I R 6000 3800 50 
F3 "VBIAS" I R 6000 4600 50 
F4 "RF_IN" I R 6000 4200 50 
F5 "RF_OUT" O L 5000 4200 50 
F6 "TEMP_SENSE" O L 5000 4600 50 
$EndSheet
Wire Wire Line
	6400 3800 6000 3800
$Sheet
S 13250 3800 1000 950 
U 5E655037
F0 "TX_attenuator" 50
F1 "TX_attenuator.sch" 50
F2 "RF_IN" I R 14250 4300 50 
F3 "RF_OUT" O L 13250 4300 50 
F4 "VDD" I R 14250 3950 50 
F5 "LE" I R 14250 4650 50 
F6 "CLK" I R 14250 4550 50 
F7 "SI" I R 14250 4450 50 
$EndSheet
Wire Wire Line
	11500 4200 12000 4200
Wire Wire Line
	14250 3950 14500 3950
Text Label 11550 4200 0    50   ~ 0
pa_att_in
$Sheet
S 2000 3700 1000 1000
U 5E78F576
F0 "RX_attenuator" 50
F1 "RX_attenuator.sch" 50
F2 "RF_IN" I R 3000 4200 50 
F3 "RF_OUT" O L 2000 4200 50 
F4 "VDD" I R 3000 3850 50 
F5 "LE" I R 3000 4600 50 
F6 "CLK" I R 3000 4500 50 
F7 "SI" I R 3000 4400 50 
$EndSheet
Wire Wire Line
	6000 4600 6300 4600
Text Label 6050 4600 0    50   ~ 0
lna_v_bias
Wire Wire Line
	3200 3850 3000 3850
Wire Wire Line
	14250 4450 14450 4450
Wire Wire Line
	14250 4550 14450 4550
Wire Wire Line
	14450 4650 14250 4650
Text Label 14300 4650 0    50   ~ 0
ATT_LE
Text Label 14300 4550 0    50   ~ 0
ATT_CLK
Text Label 14300 4450 0    50   ~ 0
ATT_SI
Wire Wire Line
	3250 4600 3000 4600
Wire Wire Line
	3250 4500 3000 4500
Wire Wire Line
	3250 4400 3000 4400
Text Label 3050 4600 0    50   ~ 0
ATT_LE
Text Label 3050 4500 0    50   ~ 0
ATT_CLK
Text Label 3050 4400 0    50   ~ 0
ATT_SI
Text Label 6150 4200 0    50   ~ 0
lna_in
Text Label 4600 4200 0    50   ~ 0
lna_out
Wire Wire Line
	11000 1750 10300 1750
Wire Wire Line
	12000 1550 12300 1550
Text Label 10300 1550 0    50   ~ 0
PA_REG_VSEL_1
Text Label 10300 1450 0    50   ~ 0
PA_REG_EN
Text Label 15350 2050 0    50   ~ 0
PA_VCC1
Text Label 15350 2350 0    50   ~ 0
PA_VCC2
Text Label 15350 2650 0    50   ~ 0
PA_VCC3
Text Label 15350 2950 0    50   ~ 0
PA_VBIAS
$Comp
L Connector:TestPoint TP107
U 1 1 5D6D7453
P 15000 1000
F 0 "TP107" H 15058 1118 50  0000 L CNN
F 1 "TestPoint" H 15058 1027 50  0000 L CNN
F 2 "TestPoint:TestPoint_Pad_D1.0mm" H 15200 1000 50  0001 C CNN
F 3 "~" H 15200 1000 50  0001 C CNN
	1    15000 1000
	-1   0    0    -1  
$EndComp
Text Label 5100 2950 0    50   ~ 0
ISENSE_LNA
$Sheet
S 13500 1600 1000 1000
U 5D949534
F0 "PA_power_monitor" 50
F1 "PA_power_monitor.sch" 50
F2 "IN_P" I R 14500 1850 50 
F3 "PA_VCC3" O R 14500 2250 50 
F4 "PA_VCC2" O R 14500 2150 50 
F5 "PA_VBIAS" O R 14500 2350 50 
F6 "PA_VCC1" O R 14500 2050 50 
F7 "ISENSE_VCC3" O L 13500 2150 50 
F8 "ISENSE_VCC2" O L 13500 2050 50 
F9 "ISENSE_VBIAS" O L 13500 2250 50 
F10 "ISENSE_VCC1" O L 13500 1950 50 
$EndSheet
Wire Wire Line
	14500 1850 15000 1850
Wire Wire Line
	15000 1850 15000 1250
Connection ~ 15000 1250
Wire Wire Line
	13500 1950 12750 1950
Wire Wire Line
	13500 2050 12750 2050
Wire Wire Line
	13500 2150 12750 2150
Wire Wire Line
	13500 2250 12750 2250
Text Label 12750 1950 0    50   ~ 0
ISENSE_VCC1
Connection ~ 1300 4200
Wire Wire Line
	14250 4300 14650 4300
$Sheet
S 10500 7750 700  200 
U 5E243016
F0 "SDR_GPIO" 50
F1 "SDR_GPIO.sch" 50
F2 "SDR_GPIO[0..11]" B L 10500 7850 50 
$EndSheet
Wire Bus Line
	9250 7850 10500 7850
Text Label 3050 4200 0    50   ~ 0
LNA_out_f
Wire Wire Line
	9250 800  8700 800 
Text Label 6050 3800 0    50   ~ 0
VDD_LNA
Wire Wire Line
	14500 2350 14800 2350
Wire Wire Line
	14500 2250 14900 2250
Wire Wire Line
	14500 2150 15000 2150
Text Notes 12600 5950 0    50   ~ 0
Attenuators have 0 DC because antenna ports are\nDC shorted to ground, LNA matching circuit has a\ncapacitor in line with it and PA datasheet states there\nis a DC blocking cap internal to the module.
$Comp
L Device:C C103
U 1 1 5DD6AF7F
P 1750 4200
F 0 "C103" H 1775 4300 50  0000 L CNN
F 1 "47pF" H 1775 4100 50  0000 L CNN
F 2 "Capacitor_SMD:C_0201_0603Metric" H 1788 4050 50  0001 C CNN
F 3 "~" H 1750 4200 50  0001 C CNN
F 4 "3000-0000000161" H 1750 4200 50  0001 C CNN "PartSpecification"
	1    1750 4200
	0    1    1    0   
$EndComp
Wire Wire Line
	1900 4200 2000 4200
$Comp
L Device:C C104
U 1 1 5DD9B573
P 14800 4300
F 0 "C104" H 14825 4400 50  0000 L CNN
F 1 "47pF" H 14825 4200 50  0000 L CNN
F 2 "Capacitor_SMD:C_0201_0603Metric" H 14838 4150 50  0001 C CNN
F 3 "~" H 14800 4300 50  0001 C CNN
F 4 "3000-0000000161" H 14800 4300 50  0001 C CNN "PartSpecification"
	1    14800 4300
	0    1    1    0   
$EndComp
Wire Wire Line
	14950 4300 15050 4300
Text Label 1950 4200 3    50   ~ 0
LNA_out_decoup
Wire Wire Line
	9150 4200 9500 4200
Wire Wire Line
	5300 2950 5000 2950
Wire Notes Line style solid
	5600 4300 5600 4100
Wire Notes Line style solid
	5600 4100 5400 4200
Wire Notes Line style solid
	5400 4200 5600 4300
Text Notes 6700 3650 0    50   ~ 0
BP filter\n2400-2700
Text Notes 7750 950  0    50   ~ 0
SP2T
Text Notes 8400 3650 0    50   ~ 0
LP filter
Text Notes 4250 4000 0    50   ~ 0
SP2T
Text Notes 3800 4200 0    50   ~ 0
BP 2.4 GHz
Text Notes 3900 3800 0    50   ~ 0
BP B41
Text Notes 3600 4000 0    50   ~ 0
SP2T
Wire Wire Line
	8500 1500 8350 1500
$Comp
L power:GND #PWR?
U 1 1 609583EF
P 8100 2300
F 0 "#PWR?" H 8100 2050 50  0001 C CNN
F 1 "GND" H 8105 2127 50  0000 C CNN
F 2 "" H 8100 2300 50  0001 C CNN
F 3 "" H 8100 2300 50  0001 C CNN
	1    8100 2300
	1    0    0    -1  
$EndComp
Wire Wire Line
	8100 2300 8100 2200
$Comp
L POWDER_RF:SKYA21003 U101
U 1 1 6096A371
P 7850 1650
F 0 "U101" H 7550 2150 50  0000 C CNN
F 1 "SKYA21003" H 8150 2150 50  0000 C CNN
F 2 "POWDER_RF:SKYA21003" H 7850 1650 50  0001 C CNN
F 3 "" H 7850 1650 50  0001 C CNN
F 4 "3000-0000001307" H 7850 1650 50  0001 C CNN "PartSpecification"
	1    7850 1650
	-1   0    0    -1  
$EndComp
Wire Wire Line
	7350 1600 7000 1600
Wire Wire Line
	7350 1500 7200 1500
Wire Wire Line
	7200 1500 7200 3300
Wire Wire Line
	7200 3300 8100 3300
Wire Wire Line
	6000 4200 6400 4200
Wire Wire Line
	7000 3500 7900 3500
Wire Wire Line
	7900 3500 7900 4200
Wire Wire Line
	7900 4200 7800 4200
Wire Wire Line
	7000 1600 7000 3500
$Comp
L POWDER_RF:DEA162495BT-1289A1 FL101
U 1 1 609D45C6
P 7100 4200
F 0 "FL101" H 7100 4765 50  0000 C CNN
F 1 "DEA162495BT-1289A1" H 7100 4674 50  0000 C CNN
F 2 "POWDER_RF:DEA162495BT-1289A1" H 7100 4500 50  0001 C CNN
F 3 "" H 7100 4200 50  0001 C CNN
F 4 "3000-0000001375" H 7100 4200 50  0001 C CNN "PartSpecification"
	1    7100 4200
	-1   0    0    -1  
$EndComp
$Comp
L power:GND #PWR?
U 1 1 609E5F4E
P 7050 4800
F 0 "#PWR?" H 7050 4550 50  0001 C CNN
F 1 "GND" H 7055 4627 50  0000 C CNN
F 2 "" H 7050 4800 50  0001 C CNN
F 3 "" H 7050 4800 50  0001 C CNN
	1    7050 4800
	1    0    0    -1  
$EndComp
Wire Wire Line
	7050 4800 7050 4700
Wire Wire Line
	7150 4700 7150 4800
$Comp
L power:GND #PWR?
U 1 1 60A01DE0
P 7150 4800
F 0 "#PWR?" H 7150 4550 50  0001 C CNN
F 1 "GND" H 7155 4627 50  0000 C CNN
F 2 "" H 7150 4800 50  0001 C CNN
F 3 "" H 7150 4800 50  0001 C CNN
	1    7150 4800
	1    0    0    -1  
$EndComp
$Comp
L POWDER_RF:DEA162700LT-5014A1 FL102
U 1 1 60A14154
P 8700 4200
F 0 "FL102" H 8700 4615 50  0000 C CNN
F 1 "DEA162700LT-5014A1" H 8700 4524 50  0000 C CNN
F 2 "POWDER_RF:DEA162700LT-5014A1" H 8700 4600 50  0001 C CNN
F 3 "" H 8700 4200 50  0001 C CNN
F 4 "3000-0000001376" H 8700 4200 50  0001 C CNN "PartSpecification"
	1    8700 4200
	-1   0    0    -1  
$EndComp
Wire Wire Line
	8100 3300 8100 4200
Wire Wire Line
	8100 4200 8250 4200
$Comp
L power:GND #PWR?
U 1 1 60AAA506
P 8550 4650
F 0 "#PWR?" H 8550 4400 50  0001 C CNN
F 1 "GND" H 8555 4477 50  0000 C CNN
F 2 "" H 8550 4650 50  0001 C CNN
F 3 "" H 8550 4650 50  0001 C CNN
	1    8550 4650
	1    0    0    -1  
$EndComp
Wire Wire Line
	8550 4650 8550 4550
Wire Wire Line
	8650 4550 8650 4650
$Comp
L power:GND #PWR?
U 1 1 60AAA50E
P 8650 4650
F 0 "#PWR?" H 8650 4400 50  0001 C CNN
F 1 "GND" H 8655 4477 50  0000 C CNN
F 2 "" H 8650 4650 50  0001 C CNN
F 3 "" H 8650 4650 50  0001 C CNN
	1    8650 4650
	1    0    0    -1  
$EndComp
$Comp
L power:GND #PWR?
U 1 1 60AB8AF6
P 8750 4650
F 0 "#PWR?" H 8750 4400 50  0001 C CNN
F 1 "GND" H 8755 4477 50  0000 C CNN
F 2 "" H 8750 4650 50  0001 C CNN
F 3 "" H 8750 4650 50  0001 C CNN
	1    8750 4650
	1    0    0    -1  
$EndComp
Wire Wire Line
	8750 4650 8750 4550
Wire Wire Line
	8850 4550 8850 4650
$Comp
L power:GND #PWR?
U 1 1 60AB8AFE
P 8850 4650
F 0 "#PWR?" H 8850 4400 50  0001 C CNN
F 1 "GND" H 8855 4477 50  0000 C CNN
F 2 "" H 8850 4650 50  0001 C CNN
F 3 "" H 8850 4650 50  0001 C CNN
	1    8850 4650
	1    0    0    -1  
$EndComp
$Sheet
S 3500 3700 1000 1000
U 60ADA657
F0 "switched_bp_rx" 50
F1 "switched_bp.sch" 50
F2 "RF_IN" I R 4500 4200 50 
F3 "RF_OUT" O L 3500 4200 50 
F4 "CTRL_1" I R 4500 4400 50 
F5 "ENABLE" I R 4500 4600 50 
F6 "CTRL_2" I R 4500 4500 50 
$EndSheet
Wire Wire Line
	4500 4200 5000 4200
Wire Wire Line
	3000 4200 3500 4200
Text Label 1400 4200 1    50   ~ 0
LNA_out_att
$Sheet
S 12000 3800 1000 1000
U 60C1ED24
F0 "switched_bp_tx" 50
F1 "switched_bp.sch" 50
F2 "RF_IN" I R 13000 4300 50 
F3 "RF_OUT" O L 12000 4200 50 
F4 "CTRL_1" I R 13000 4500 50 
F5 "ENABLE" I R 13000 4700 50 
F6 "CTRL_2" I R 13000 4600 50 
$EndSheet
Wire Wire Line
	13000 4300 13250 4300
$Comp
L power:GND #PWR?
U 1 1 60C857EF
P 8000 2300
F 0 "#PWR?" H 8000 2050 50  0001 C CNN
F 1 "GND" H 8005 2127 50  0000 C CNN
F 2 "" H 8000 2300 50  0001 C CNN
F 3 "" H 8000 2300 50  0001 C CNN
	1    8000 2300
	1    0    0    -1  
$EndComp
Wire Wire Line
	8000 2300 8000 2200
$Comp
L power:GND #PWR?
U 1 1 60C942DC
P 7900 2300
F 0 "#PWR?" H 7900 2050 50  0001 C CNN
F 1 "GND" H 7905 2127 50  0000 C CNN
F 2 "" H 7900 2300 50  0001 C CNN
F 3 "" H 7900 2300 50  0001 C CNN
	1    7900 2300
	1    0    0    -1  
$EndComp
Wire Wire Line
	7900 2300 7900 2200
$Comp
L power:GND #PWR?
U 1 1 60CA2FBC
P 7800 2300
F 0 "#PWR?" H 7800 2050 50  0001 C CNN
F 1 "GND" H 7805 2127 50  0000 C CNN
F 2 "" H 7800 2300 50  0001 C CNN
F 3 "" H 7800 2300 50  0001 C CNN
	1    7800 2300
	1    0    0    -1  
$EndComp
Wire Wire Line
	7800 2300 7800 2200
$Comp
L power:GND #PWR?
U 1 1 60CB1E50
P 7700 2300
F 0 "#PWR?" H 7700 2050 50  0001 C CNN
F 1 "GND" H 7705 2127 50  0000 C CNN
F 2 "" H 7700 2300 50  0001 C CNN
F 3 "" H 7700 2300 50  0001 C CNN
	1    7700 2300
	1    0    0    -1  
$EndComp
Wire Wire Line
	7700 2300 7700 2200
$Comp
L power:GND #PWR?
U 1 1 60CC0E68
P 7600 2300
F 0 "#PWR?" H 7600 2050 50  0001 C CNN
F 1 "GND" H 7605 2127 50  0000 C CNN
F 2 "" H 7600 2300 50  0001 C CNN
F 3 "" H 7600 2300 50  0001 C CNN
	1    7600 2300
	1    0    0    -1  
$EndComp
Wire Wire Line
	7600 2300 7600 2200
$Sheet
S 5000 6000 500  500 
U 6070220E
F0 "fan" 50
F1 "fan.sch" 50
F2 "FAN_TACH" O R 5500 6300 50 
F3 "FAN_PWM" I L 5000 6200 50 
$EndSheet
$Sheet
S 5000 5000 1000 500 
U 60767402
F0 "LNA_bias" 50
F1 "LNA_bias.sch" 50
F2 "LNA_BIAS_IN[0..3]" I L 5000 5200 50 
F3 "LNA_BIAS_OUT" O R 6000 5300 50 
F4 "VSENSE_OUT" O R 6000 5400 50 
$EndSheet
Wire Wire Line
	6000 5300 6300 5300
$Sheet
S 7500 10250 1500 800 
U 60834A7B
F0 "MCU" 50
F1 "MCU.sch" 50
F2 "MCU_IO[0..35]" B L 7500 10450 50 
F3 "EN_[0..3]" O L 7500 10550 50 
F4 "PG_[0..3]" I R 9000 10450 50 
F5 "PG_3_3" I R 9000 10550 50 
F6 "CONFIG_SEL" O R 9000 10650 50 
F7 "CRC_ERROR" I R 9000 10750 50 
F8 "~STATUS" I R 9000 10850 50 
F9 "CONF_DONE" I R 9000 10950 50 
$EndSheet
Wire Wire Line
	6400 2450 6400 3800
Wire Wire Line
	7850 1000 7850 1100
$Comp
L POWDER_PowerGlobals:+4.8V #PWR?
U 1 1 60556AD1
P 5500 900
F 0 "#PWR?" H 5500 750 50  0001 C CNN
F 1 "+4.8V" H 5515 1073 50  0000 C CNN
F 2 "" H 5500 900 50  0001 C CNN
F 3 "" H 5500 900 50  0001 C CNN
	1    5500 900 
	1    0    0    -1  
$EndComp
$Comp
L 000_PreferredParts:C_10pF C102
U 1 1 60557626
P 6750 1250
F 0 "C102" H 6865 1296 50  0000 L CNN
F 1 "C_10pF" H 6865 1205 50  0000 L CNN
F 2 "Capacitor_SMD:C_0402_1005Metric" H 6788 1100 50  0001 C CNN
F 3 "~" H 6750 1250 50  0001 C CNN
F 4 "3000-0000000582" H 6750 1250 50  0001 C CNN "PartSpecification"
	1    6750 1250
	1    0    0    -1  
$EndComp
$Comp
L 000_PreferredParts:C_1nF C101
U 1 1 60557C3D
P 6250 1250
F 0 "C101" H 6365 1296 50  0000 L CNN
F 1 "C_1nF" H 6365 1205 50  0000 L CNN
F 2 "Capacitor_SMD:C_0402_1005Metric" H 6288 1100 50  0001 C CNN
F 3 "~" H 6250 1250 50  0001 C CNN
F 4 "3000-0000000128" H 6250 1250 50  0001 C CNN "PartSpecification"
	1    6250 1250
	1    0    0    -1  
$EndComp
$Comp
L power:GND #PWR?
U 1 1 60558A07
P 6750 1500
F 0 "#PWR?" H 6750 1250 50  0001 C CNN
F 1 "GND" H 6755 1327 50  0000 C CNN
F 2 "" H 6750 1500 50  0001 C CNN
F 3 "" H 6750 1500 50  0001 C CNN
	1    6750 1500
	1    0    0    -1  
$EndComp
$Comp
L power:GND #PWR?
U 1 1 60558D7B
P 6250 1500
F 0 "#PWR?" H 6250 1250 50  0001 C CNN
F 1 "GND" H 6255 1327 50  0000 C CNN
F 2 "" H 6250 1500 50  0001 C CNN
F 3 "" H 6250 1500 50  0001 C CNN
	1    6250 1500
	1    0    0    -1  
$EndComp
Wire Wire Line
	6250 1500 6250 1400
Wire Wire Line
	6750 1400 6750 1500
Wire Wire Line
	6750 1100 6750 1000
Wire Wire Line
	6250 1000 6250 1100
Wire Wire Line
	10250 4700 10500 4700
$Sheet
S 10000 2250 1000 1000
U 605A4C0E
F0 "voltage_regulator_rf_misc" 50
F1 "voltage_regulator_rf_misc.sch" 50
F2 "EN" I L 10000 2550 50 
F3 "PS_SYNC" I L 10000 2650 50 
F4 "V_12" I L 10000 2350 50 
F5 "DCDC_PG" O R 11000 2550 50 
F6 "LDO_4_8_PG" O R 11000 2750 50 
F7 "LDO_3_3VRF_PG" O R 11000 2850 50 
F8 "VSENSE_4_8" O R 11000 3050 50 
F9 "VSENSE_3_3VRF" O R 11000 3150 50 
$EndSheet
$Comp
L power:+12V #PWR?
U 1 1 605BB19A
P 9750 2150
F 0 "#PWR?" H 9750 2000 50  0001 C CNN
F 1 "+12V" H 9765 2323 50  0000 C CNN
F 2 "" H 9750 2150 50  0001 C CNN
F 3 "" H 9750 2150 50  0001 C CNN
	1    9750 2150
	1    0    0    -1  
$EndComp
Wire Wire Line
	9750 2150 9750 2350
Wire Wire Line
	9750 2350 10000 2350
Wire Wire Line
	15000 1000 15000 1250
Wire Wire Line
	14800 2350 14800 2950
Wire Wire Line
	14900 2650 14900 2250
Wire Wire Line
	15000 2350 15000 2150
Wire Wire Line
	14800 2950 15800 2950
Wire Wire Line
	14900 2650 15800 2650
Wire Wire Line
	15000 2350 15800 2350
Wire Wire Line
	14500 2050 15800 2050
$Comp
L POWDER_PowerGlobals:+3.3VRF #PWR?
U 1 1 606B90C1
P 14500 3850
F 0 "#PWR?" H 14500 3700 50  0001 C CNN
F 1 "+3.3VRF" H 14515 4023 50  0000 C CNN
F 2 "" H 14500 3850 50  0001 C CNN
F 3 "" H 14500 3850 50  0001 C CNN
	1    14500 3850
	1    0    0    -1  
$EndComp
Wire Wire Line
	14500 3850 14500 3950
$Comp
L POWDER_PowerGlobals:+3.3VRF #PWR?
U 1 1 605255BA
P 3200 3750
F 0 "#PWR?" H 3200 3600 50  0001 C CNN
F 1 "+3.3VRF" H 3215 3923 50  0000 C CNN
F 2 "" H 3200 3750 50  0001 C CNN
F 3 "" H 3200 3750 50  0001 C CNN
	1    3200 3750
	1    0    0    -1  
$EndComp
Wire Wire Line
	3200 3750 3200 3850
Wire Wire Line
	8500 1500 8900 1500
Wire Wire Line
	8900 1500 8900 1550
Connection ~ 8500 1500
Wire Wire Line
	8500 1000 8500 1500
Wire Wire Line
	1300 4200 1600 4200
$Sheet
S 7250 5500 2000 4500
U 605746B5
F0 "MAX10" 50
F1 "MAX10.sch" 50
F2 "EN_[0..3]" I L 7250 9850 50 
F3 "PG_[0..3]" O R 9250 9800 50 
F4 "VSENSE_PA" I L 7250 5650 50 
F5 "VSENSE_4_8" I L 7250 5750 50 
F6 "VSENSE_3_3VFR" I L 7250 5850 50 
F7 "VSENSE_LNA" I L 7250 5950 50 
F8 "VSENSE_LNA_BIAS" I L 7250 6050 50 
F9 "VSENSE_12" I L 7250 6150 50 
F10 "ISENSE_VCC1" I L 7250 6350 50 
F11 "ISENSE_VCC2" I L 7250 6450 50 
F12 "ISENSE_VCC3" I L 7250 6550 50 
F13 "ISENSE_VBIAS" I L 7250 6650 50 
F14 "ISENSE_LNA" I L 7250 6750 50 
F15 "TEMP_SENSE_PA" I L 7250 6950 50 
F16 "TEMP_SENSE_LNA" I L 7250 7050 50 
F17 "GPAI[0..7]" I L 7250 7250 50 
F18 "TDD_CTRL" O L 7250 7450 50 
F19 "TDD_ENABLE" O L 7250 7550 50 
F20 "LNA_REG_EN" O L 7250 7750 50 
F21 "LNA_REG_VSEL_1" O L 7250 7850 50 
F22 "LNA_REG_VSEL_2" O L 7250 7950 50 
F23 "LNA_REG_PS_SYNC" O L 7250 8050 50 
F24 "LNA_REG_DCDC_PG" I L 7250 8150 50 
F25 "LNA_REG_LDO_PG" I L 7250 8250 50 
F26 "LNA_BIAS[0..3]" O L 7250 8350 50 
F27 "BP_RX_CTRL_1" O L 7250 8550 50 
F28 "BP_RX_CTRL_2" O L 7250 8650 50 
F29 "BP_RX_ENABLE" O L 7250 8750 50 
F30 "RF_REG_EN" O L 7250 9050 50 
F31 "RF_REG_PS_SYNC" O L 7250 9150 50 
F32 "RF_REG_DCDC_PG" I L 7250 9250 50 
F33 "RF_REG_LDO_4_8_PG" I L 7250 9350 50 
F34 "RF_REG_LDO_3_3VRF_PG" I L 7250 9450 50 
F35 "PA_REG_EN" O R 9250 5650 50 
F36 "PA_REG_VSEL_1" O R 9250 5750 50 
F37 "PA_REG_VSEL_2" O R 9250 5850 50 
F38 "PA_REG_PS_SYNC" O R 9250 5950 50 
F39 "PA_REG_DCDC_PG" I R 9250 6050 50 
F40 "PA_REG_LDO_PG" I R 9250 6150 50 
F41 "PA_EN" O R 9250 6350 50 
F42 "BT_TX_CTRL_1" O R 9250 6550 50 
F43 "BP_TX_CTRL_2" O R 9250 6650 50 
F44 "BP_TX_ENABLE" O R 9250 6750 50 
F45 "ATT_SI" O R 9250 7050 50 
F46 "ATT_CLK" O R 9250 7150 50 
F47 "ATT_LE" O R 9250 7250 50 
F48 "FAN_PWM" O R 9250 7550 50 
F49 "FAN_TACH" I R 9250 7650 50 
F50 "SDR_GPIO[0..11]" B R 9250 7850 50 
F51 "FRONTEND_GPIO[0..15]" B R 9250 8250 50 
F52 "FRONTEND_VIO" I R 9250 8350 50 
F53 "MCU_IO[0..35]" B L 7250 9750 50 
F54 "CONFIG_SEL" I R 9250 9200 50 
F55 "CRC_ERROR" O R 9250 9300 50 
F56 "~STATUS" O R 9250 9400 50 
F57 "CONF_DONE" O R 9250 9500 50 
$EndSheet
Text Label 12750 2050 0    50   ~ 0
ISENSE_VCC2
Text Label 12750 2150 0    50   ~ 0
ISENSE_VCC3
Text Label 12750 2250 0    50   ~ 0
ISENSE_VBIAS
Wire Wire Line
	12000 1250 15000 1250
Wire Wire Line
	12000 1850 12300 1850
Text Label 12100 1850 0    50   ~ 0
VSENSE_PA
Wire Wire Line
	11000 3050 11500 3050
Wire Wire Line
	11500 3150 11000 3150
Text Label 11100 3050 0    50   ~ 0
VSENSE_4_8
Text Label 11100 3150 0    50   ~ 0
VSENSE_3_3VRF
Wire Wire Line
	5000 2450 6400 2450
Wire Wire Line
	5300 3050 5000 3050
Text Label 5100 3050 0    50   ~ 0
VSENSE_LNA
Wire Wire Line
	6300 4600 6300 5300
Wire Wire Line
	6000 5400 6500 5400
Text Label 6100 5400 0    50   ~ 0
VSENSE_LNA_BIAS
$Comp
L Device:R R?
U 1 1 60F61D7F
P 1350 1300
AR Path="/60664CFF/60F61D7F" Ref="R?"  Part="1" 
AR Path="/60F61D7F" Ref="R101"  Part="1" 
F 0 "R101" V 1430 1300 50  0000 C CNN
F 1 "10k" V 1350 1300 50  0000 C CNN
F 2 "Resistor_SMD:R_0402_1005Metric" V 1280 1300 50  0001 C CNN
F 3 "~" H 1350 1300 50  0001 C CNN
F 4 "3000-0000000131" V 1350 1300 50  0001 C CNN "PartSpecification"
	1    1350 1300
	1    0    0    -1  
$EndComp
$Comp
L Device:R R?
U 1 1 60F61D86
P 1350 1700
AR Path="/60664CFF/60F61D86" Ref="R?"  Part="1" 
AR Path="/60F61D86" Ref="R102"  Part="1" 
F 0 "R102" V 1430 1700 50  0000 C CNN
F 1 "4.87k" V 1350 1700 50  0000 C CNN
F 2 "Resistor_SMD:R_0402_1005Metric" V 1280 1700 50  0001 C CNN
F 3 "~" H 1350 1700 50  0001 C CNN
F 4 "3000-0000000133" V 1350 1700 50  0001 C CNN "PartSpecification"
	1    1350 1700
	1    0    0    -1  
$EndComp
$Comp
L power:GND #PWR?
U 1 1 60F61D8C
P 1350 2000
AR Path="/60664CFF/60F61D8C" Ref="#PWR?"  Part="1" 
AR Path="/60F61D8C" Ref="#PWR?"  Part="1" 
F 0 "#PWR?" H 1350 1750 50  0001 C CNN
F 1 "GND" H 1355 1827 50  0000 C CNN
F 2 "" H 1350 2000 50  0001 C CNN
F 3 "" H 1350 2000 50  0001 C CNN
	1    1350 2000
	1    0    0    -1  
$EndComp
Wire Wire Line
	1350 1850 1350 1950
Wire Wire Line
	1350 1550 1350 1500
Connection ~ 1350 1500
Wire Wire Line
	1350 1500 1350 1450
Wire Wire Line
	1350 1100 1350 1150
Text Label 1450 1500 0    50   ~ 0
VSENSE_12
$Sheet
S 5000 7000 1000 500 
U 61921A24
F0 "GPAI" 50
F1 "GPAI.sch" 50
F2 "GPAI[0..7]" O R 6000 7250 50 
$EndSheet
Wire Bus Line
	6000 7250 7250 7250
Text Label 6250 7250 0    50   ~ 0
GPAI[0..7]
Wire Wire Line
	5000 4600 4900 4600
Wire Wire Line
	4900 4600 4900 4850
Text Label 4900 4850 0    50   ~ 0
TEMP_SENSE_LNA
Text Label 10150 5000 0    50   ~ 0
TEMP_SENSE_PA
Wire Wire Line
	10150 5000 10150 4600
Wire Wire Line
	10150 4600 10500 4600
Text Label 6250 7050 0    50   ~ 0
TEMP_SENSE_LNA
Wire Wire Line
	6250 7050 7250 7050
Text Label 6250 6950 0    50   ~ 0
TEMP_SENSE_PA
Wire Wire Line
	6250 6950 7250 6950
Text Label 6250 6750 0    50   ~ 0
ISENSE_LNA
Wire Wire Line
	6250 6750 7250 6750
Text Label 6250 5950 0    50   ~ 0
VSENSE_LNA
Wire Wire Line
	6250 5950 7250 5950
Text Label 6250 5650 0    50   ~ 0
VSENSE_PA
Wire Wire Line
	6250 5650 7250 5650
Text Label 6250 5750 0    50   ~ 0
VSENSE_4_8
Wire Wire Line
	6250 5750 7250 5750
Text Label 6250 5850 0    50   ~ 0
VSENSE_3_3VRF
Wire Wire Line
	6250 5850 7250 5850
Text Label 6250 6050 0    50   ~ 0
VSENSE_LNA_BIAS
Wire Wire Line
	6250 6050 7250 6050
Text Label 6250 6150 0    50   ~ 0
VSENSE_12
Wire Wire Line
	6250 6150 7250 6150
Text Label 6250 6350 0    50   ~ 0
ISENSE_VCC1
Wire Wire Line
	6250 6350 7250 6350
Text Label 6250 6450 0    50   ~ 0
ISENSE_VCC2
Text Label 6250 6550 0    50   ~ 0
ISENSE_VCC3
Text Label 6250 6650 0    50   ~ 0
ISENSE_VBIAS
Wire Wire Line
	6250 6650 7250 6650
Wire Wire Line
	6250 6550 7250 6550
Wire Wire Line
	6250 6450 7250 6450
Wire Wire Line
	8350 1700 8700 1700
Wire Wire Line
	8700 1800 8350 1800
Text Label 8400 1700 0    50   ~ 0
TDD_CTRL
Text Label 8400 1800 0    50   ~ 0
TDD_ENABLE
Text Label 6250 7450 0    50   ~ 0
TDD_CTRL
Text Label 6250 7550 0    50   ~ 0
TDD_ENABLE
Text Label 9350 6350 0    50   ~ 0
pa_en
Text Label 9350 5850 0    50   ~ 0
PA_REG_VSEL_2
Text Label 9350 5950 0    50   ~ 0
PA_REG_PS_SYNC
Text Label 9350 5750 0    50   ~ 0
PA_REG_VSEL_1
Text Label 9350 5650 0    50   ~ 0
PA_REG_EN
Text Label 9350 6150 0    50   ~ 0
PA_REG_LDO_PG
Text Label 9350 6050 0    50   ~ 0
PA_REG_DCDC_PG
Wire Wire Line
	9300 2550 10000 2550
Text Label 9300 2550 0    50   ~ 0
RF_REG_EN
Wire Wire Line
	9300 2650 10000 2650
Text Label 9300 2650 0    50   ~ 0
RF_REG_PS_SYNC
Text Label 11100 2550 0    50   ~ 0
RF_REG_DCDC_PG
Text Label 11100 2750 0    50   ~ 0
RF_REG_LDO_4_8_PG
Text Label 11100 2850 0    50   ~ 0
RF_REG_LDO_3_3VRF_PG
Wire Wire Line
	11000 2550 11500 2550
Wire Wire Line
	11000 2750 11500 2750
Wire Wire Line
	11000 2850 11500 2850
Text Label 6250 9050 0    50   ~ 0
RF_REG_EN
Text Label 6250 9150 0    50   ~ 0
RF_REG_PS_SYNC
Text Label 6250 9250 0    50   ~ 0
RF_REG_DCDC_PG
Text Label 6250 9350 0    50   ~ 0
RF_REG_LDO_4_8_PG
Text Label 6250 9450 0    50   ~ 0
RF_REG_LDO_3_3VRF_PG
Wire Wire Line
	3300 2650 4000 2650
Wire Wire Line
	4000 2750 3300 2750
Wire Wire Line
	3300 2850 4000 2850
Text Label 3300 2850 0    50   ~ 0
LNA_REG_VSEL_2
Text Label 3300 2950 0    50   ~ 0
LNA_REG_PS_SYNC
Wire Wire Line
	4000 2950 3300 2950
Text Label 3300 2750 0    50   ~ 0
LNA_REG_VSEL_1
Text Label 3300 2650 0    50   ~ 0
LNA_REG_EN
Text Label 5100 2750 0    50   ~ 0
LNA_REG_LDO_PG
Text Label 5100 2650 0    50   ~ 0
LNA_REG_DCDC_PG
Wire Wire Line
	5300 2650 5000 2650
Wire Wire Line
	5000 2750 5300 2750
$Sheet
S 4000 2350 1000 1000
U 60664CFF
F0 "vreg_lna" 50
F1 "voltage_regulator_lna.sch" 50
F2 "EN" I L 4000 2650 50 
F3 "PS_SYNC" I L 4000 2950 50 
F4 "VSEL_1" I L 4000 2750 50 
F5 "V_12" I L 4000 2450 50 
F6 "V_OUT" O R 5000 2450 50 
F7 "DCDC_PG" O R 5000 2650 50 
F8 "LDO_PG" O R 5000 2750 50 
F9 "VSEL_2" I L 4000 2850 50 
F10 "I_MEAS" O R 5000 2950 50 
F11 "VSENSE_OUT" O R 5000 3050 50 
$EndSheet
Text Label 6250 7950 0    50   ~ 0
LNA_REG_VSEL_2
Text Label 6250 8050 0    50   ~ 0
LNA_REG_PS_SYNC
Text Label 6250 7850 0    50   ~ 0
LNA_REG_VSEL_1
Text Label 6250 7750 0    50   ~ 0
LNA_REG_EN
Text Label 6250 8250 0    50   ~ 0
LNA_REG_LDO_PG
Text Label 6250 8150 0    50   ~ 0
LNA_REG_DCDC_PG
Wire Bus Line
	5000 5200 4500 5200
Wire Bus Line
	4500 5200 4500 8350
Wire Bus Line
	4500 8350 7250 8350
Text Label 9350 7250 0    50   ~ 0
ATT_LE
Text Label 9350 7150 0    50   ~ 0
ATT_CLK
Text Label 9350 7050 0    50   ~ 0
ATT_SI
Wire Wire Line
	4500 4400 4700 4400
Wire Wire Line
	4700 4500 4500 4500
Wire Wire Line
	4500 4600 4700 4600
Text Label 4550 4400 0    50   ~ 0
BP_RX_CTRL_1
Text Label 4550 4500 0    50   ~ 0
BP_RX_CTRL_2
Text Label 4550 4600 0    50   ~ 0
BP_RX_ENABLE
Text Label 6250 8550 0    50   ~ 0
BP_RX_CTRL_1
Text Label 6250 8650 0    50   ~ 0
BP_RX_CTRL_2
Text Label 6250 8750 0    50   ~ 0
BP_RX_ENABLE
Wire Wire Line
	13000 4500 13200 4500
Wire Wire Line
	13200 4600 13000 4600
Wire Wire Line
	13000 4700 13200 4700
Text Label 13000 4500 0    50   ~ 0
BP_TX_CTRL_1
Text Label 13000 4600 0    50   ~ 0
BP_TX_CTRL_2
Text Label 13000 4700 0    50   ~ 0
BP_TX_ENABLE
Text Label 9350 6550 0    50   ~ 0
BP_TX_CTRL_1
Text Label 9350 6650 0    50   ~ 0
BP_TX_CTRL_2
Text Label 9350 6750 0    50   ~ 0
BP_TX_ENABLE
Wire Wire Line
	5000 6200 4600 6200
Text Label 4650 6200 0    50   ~ 0
FAN_PWM
Wire Wire Line
	5500 6300 5900 6300
Text Label 5550 6300 0    50   ~ 0
FAN_TACH
Text Label 9350 7550 0    50   ~ 0
FAN_PWM
Text Label 9350 7650 0    50   ~ 0
FAN_TACH
$Sheet
S 10500 8150 1000 300 
U 608FCF27
F0 "frontend_GPIO" 50
F1 "frontend_GPIO.sch" 50
F2 "FRONTEND_GPIO[0..15]" B L 10500 8250 50 
F3 "FRONTEND_VIO" O L 10500 8350 50 
$EndSheet
Wire Bus Line
	10500 8250 9250 8250
Wire Wire Line
	10500 8350 9250 8350
Text Label 6250 8350 0    50   ~ 0
LNA_BIAS_IN[0..3]
Text Label 9350 7850 0    50   ~ 0
SDR_GPIO[0..11]
Text Label 9350 8250 0    50   ~ 0
FRONTEND_GPIO[0..15]
Text Label 9350 8350 0    50   ~ 0
FRONTEND_VIO
Wire Wire Line
	6250 7450 7250 7450
Wire Wire Line
	6250 7550 7250 7550
Wire Wire Line
	6250 7750 7250 7750
Wire Wire Line
	6250 7850 7250 7850
Wire Wire Line
	6250 7950 7250 7950
Wire Wire Line
	6250 8050 7250 8050
Wire Wire Line
	6250 8150 7250 8150
Wire Wire Line
	6250 8250 7250 8250
Wire Wire Line
	6250 8550 7250 8550
Wire Wire Line
	6250 8650 7250 8650
Wire Wire Line
	6250 8750 7250 8750
Wire Wire Line
	6250 9050 7250 9050
Wire Wire Line
	6250 9150 7250 9150
Wire Wire Line
	6250 9250 7250 9250
Wire Wire Line
	6250 9350 7250 9350
Wire Wire Line
	6250 9450 7250 9450
Wire Wire Line
	9250 6150 10000 6150
Wire Wire Line
	9250 6050 10000 6050
Wire Wire Line
	9250 5950 10000 5950
Wire Wire Line
	9250 5850 10000 5850
Wire Wire Line
	9250 5750 10000 5750
Wire Wire Line
	9250 5650 10000 5650
Wire Wire Line
	9250 6350 10000 6350
Wire Wire Line
	9250 7250 9550 7250
Wire Wire Line
	9250 6550 10000 6550
Wire Wire Line
	9250 6650 10000 6650
Wire Wire Line
	9250 6750 10000 6750
Wire Wire Line
	9250 7050 10000 7050
Wire Wire Line
	9250 7150 10000 7150
Wire Wire Line
	9600 7250 10000 7250
Wire Wire Line
	9250 7550 10000 7550
Wire Wire Line
	9250 7650 10000 7650
$Comp
L power:PWR_FLAG #FLG?
U 1 1 60F8C932
P 2750 1000
F 0 "#FLG?" H 2750 1075 50  0001 C CNN
F 1 "PWR_FLAG" H 2750 1173 50  0000 C CNN
F 2 "" H 2750 1000 50  0001 C CNN
F 3 "~" H 2750 1000 50  0001 C CNN
	1    2750 1000
	1    0    0    -1  
$EndComp
Wire Wire Line
	2750 1000 2750 1100
Connection ~ 2750 1100
Wire Wire Line
	2750 1100 2250 1100
Wire Bus Line
	7250 9750 7000 9750
Wire Bus Line
	7000 9750 7000 10450
Wire Bus Line
	7000 10450 7500 10450
Wire Bus Line
	7250 9850 7100 9850
Wire Bus Line
	7100 9850 7100 10550
Wire Bus Line
	7100 10550 7500 10550
Wire Bus Line
	9250 9800 9500 9800
Wire Bus Line
	9500 9800 9500 10450
Wire Bus Line
	9500 10450 9000 10450
Text Label 9100 10550 0    50   ~ 0
PG_3_3
Wire Wire Line
	9100 10550 9000 10550
$Comp
L POWDER_Misc:POWDER_Logo_fancy G101
U 1 1 619CC4FE
P 2000 8000
F 0 "G101" H 2025 8046 50  0000 L CNN
F 1 "POWDER_Logo_fancy" H 2025 7955 50  0000 L CNN
F 2 "POWDER_Specific:powder_logo_fancy" H 2000 8000 50  0001 C CNN
F 3 "" H 2000 8000 50  0001 C CNN
	1    2000 8000
	1    0    0    -1  
$EndComp
$Comp
L POWDER_Misc:POWDER_Logo_fancy G102
U 1 1 619CD23D
P 2000 8500
F 0 "G102" H 2025 8546 50  0000 L CNN
F 1 "POWDER_Logo_fancy" H 2025 8455 50  0000 L CNN
F 2 "POWDER_Specific:powder_logo_fancy" H 2000 8500 50  0001 C CNN
F 3 "" H 2000 8500 50  0001 C CNN
	1    2000 8500
	1    0    0    -1  
$EndComp
Text Label 8000 3300 0    50   ~ 0
pa_filt
Text Label 7500 3500 0    50   ~ 0
lna_ant
$Comp
L Device:R R?
U 1 1 61EFAECC
P 1600 1100
AR Path="/60664CFF/61EFAECC" Ref="R?"  Part="1" 
AR Path="/61EFAECC" Ref="R106"  Part="1" 
F 0 "R106" V 1680 1100 50  0000 C CNN
F 1 "10k" V 1600 1100 50  0000 C CNN
F 2 "Resistor_SMD:R_0402_1005Metric" V 1530 1100 50  0001 C CNN
F 3 "~" H 1600 1100 50  0001 C CNN
F 4 "3000-0000000131" V 1600 1100 50  0001 C CNN "PartSpecification"
	1    1600 1100
	0    1    1    0   
$EndComp
Wire Wire Line
	1450 1100 1350 1100
$Comp
L Device:R R?
U 1 1 61F09C5B
P 2000 1100
AR Path="/60664CFF/61F09C5B" Ref="R?"  Part="1" 
AR Path="/61F09C5B" Ref="R107"  Part="1" 
F 0 "R107" V 2080 1100 50  0000 C CNN
F 1 "10k" V 2000 1100 50  0000 C CNN
F 2 "Resistor_SMD:R_0402_1005Metric" V 1930 1100 50  0001 C CNN
F 3 "~" H 2000 1100 50  0001 C CNN
F 4 "3000-0000000131" V 2000 1100 50  0001 C CNN "PartSpecification"
	1    2000 1100
	0    1    1    0   
$EndComp
Wire Wire Line
	1850 1100 1800 1100
$Comp
L Diode:BZX84Cxx D104
U 1 1 61F1CAAF
P 1800 1700
AR Path="/61F1CAAF" Ref="D104"  Part="1" 
AR Path="/6070220E/61F1CAAF" Ref="D?"  Part="1" 
F 0 "D104" V 1754 1779 50  0000 L CNN
F 1 "BZX84Cxx" V 1845 1779 50  0000 L CNN
F 2 "Diode_SMD:D_SOT-23_ANK" H 1800 1700 50  0001 C CNN
F 3 "https://diotec.com/tl_files/diotec/files/pdf/datasheets/bzx84c2v4.pdf" H 1800 1700 50  0001 C CNN
F 4 "ON Semiconductor" H 1800 1700 50  0001 C CNN "Manufacturer"
F 5 "BZX84C10" H 1800 1700 50  0001 C CNN "PartNumber"
F 6 "3000-0000001268" H 1800 1700 50  0001 C CNN "PartSpecification"
	1    1800 1700
	0    1    1    0   
$EndComp
Wire Wire Line
	1800 1850 1800 1950
Connection ~ 1350 1950
Wire Wire Line
	1350 1950 1350 2000
Wire Wire Line
	2250 1000 2250 1100
Connection ~ 2250 1100
Wire Wire Line
	2250 1100 2150 1100
Wire Wire Line
	1350 1500 1650 1500
Wire Wire Line
	1800 1100 1800 1550
Connection ~ 1800 1100
Wire Wire Line
	1800 1100 1750 1100
Wire Wire Line
	1350 1950 1800 1950
$Comp
L Device:L L101
U 1 1 62380765
P 5750 1000
AR Path="/62380765" Ref="L101"  Part="1" 
AR Path="/5D96ADB0/62380765" Ref="L?"  Part="1" 
AR Path="/5E655037/62380765" Ref="L?"  Part="1" 
AR Path="/5E78F576/62380765" Ref="L?"  Part="1" 
F 0 "L101" V 5940 1000 50  0000 C CNN
F 1 "BEAD" V 5849 1000 50  0000 C CNN
F 2 "Inductor_SMD:L_0603_1608Metric" H 5750 1000 50  0001 C CNN
F 3 "~" H 5750 1000 50  0001 C CNN
F 4 "BLM18EG221SZ1" V 5750 1000 50  0001 C CNN "PartNumber"
F 5 "Murata Electronics" H 5750 1000 50  0001 C CNN "Manufacturer"
F 6 "3000-0000000091" H 5750 1000 50  0001 C CNN "PartSpecification"
	1    5750 1000
	0    -1   -1   0   
$EndComp
Wire Wire Line
	5500 900  5500 1000
Wire Wire Line
	5500 1000 5600 1000
Wire Wire Line
	5900 1000 6250 1000
Wire Wire Line
	6250 1000 6750 1000
Connection ~ 6250 1000
Connection ~ 6750 1000
Wire Wire Line
	6750 1000 7850 1000
Text Label 7400 1000 0    50   ~ 0
ANT_V_F
Wire Wire Line
	9250 9200 9600 9200
Wire Wire Line
	9600 9200 9600 10650
Wire Wire Line
	9600 10650 9000 10650
Wire Wire Line
	9250 9300 9700 9300
Wire Wire Line
	9700 9300 9700 10750
Wire Wire Line
	9700 10750 9000 10750
Wire Wire Line
	9250 9400 9800 9400
Wire Wire Line
	9800 9400 9800 10850
Wire Wire Line
	9800 10850 9000 10850
Wire Wire Line
	9250 9500 9900 9500
Wire Wire Line
	9900 9500 9900 10950
Wire Wire Line
	9900 10950 9000 10950
$Comp
L Connector:Conn_Coaxial J106
U 1 1 60650A08
P 2200 5500
F 0 "J106" H 2300 5475 50  0000 L CNN
F 1 "Conn_Coaxial" H 2300 5384 50  0000 L CNN
F 2 "POWDER_RF:SMA_EndLaunch_142-0761-881" H 2200 5500 50  0001 C CNN
F 3 " ~" H 2200 5500 50  0001 C CNN
F 4 "3000-0000000165" H 2200 5500 50  0001 C CNN "PartSpecification"
	1    2200 5500
	1    0    0    -1  
$EndComp
$Comp
L Connector:Conn_Coaxial J105
U 1 1 6065147B
P 1300 5500
F 0 "J105" H 1228 5738 50  0000 C CNN
F 1 "Conn_Coaxial" H 1228 5647 50  0000 C CNN
F 2 "POWDER_RF:SMA_EndLaunch_142-0761-881" H 1300 5500 50  0001 C CNN
F 3 " ~" H 1300 5500 50  0001 C CNN
F 4 "3000-0000000165" H 1300 5500 50  0001 C CNN "PartSpecification"
	1    1300 5500
	-1   0    0    -1  
$EndComp
$Comp
L Connector:Conn_Coaxial J108
U 1 1 606537E2
P 2200 6500
F 0 "J108" H 2300 6475 50  0000 L CNN
F 1 "For_Testing_Only_DNP" H 2300 6384 50  0000 L CNN
F 2 "POWDER_RF:02K80F-40ML5" H 2200 6500 50  0001 C CNN
F 3 " ~" H 2200 6500 50  0001 C CNN
	1    2200 6500
	1    0    0    -1  
$EndComp
$Comp
L Connector:Conn_Coaxial J107
U 1 1 606537E8
P 1300 6500
F 0 "J107" H 1228 6738 50  0000 C CNN
F 1 "For_Testing_Only_DNP" H 1228 6647 50  0000 C CNN
F 2 "POWDER_RF:02K80F-40ML5" H 1300 6500 50  0001 C CNN
F 3 " ~" H 1300 6500 50  0001 C CNN
	1    1300 6500
	-1   0    0    -1  
$EndComp
$Comp
L power:GND #PWR?
U 1 1 60665525
P 1300 5800
F 0 "#PWR?" H 1300 5550 50  0001 C CNN
F 1 "GND" H 1305 5627 50  0000 C CNN
F 2 "" H 1300 5800 50  0001 C CNN
F 3 "" H 1300 5800 50  0001 C CNN
	1    1300 5800
	1    0    0    -1  
$EndComp
$Comp
L power:GND #PWR?
U 1 1 6066588B
P 2200 5800
F 0 "#PWR?" H 2200 5550 50  0001 C CNN
F 1 "GND" H 2205 5627 50  0000 C CNN
F 2 "" H 2200 5800 50  0001 C CNN
F 3 "" H 2200 5800 50  0001 C CNN
	1    2200 5800
	1    0    0    -1  
$EndComp
$Comp
L power:GND #PWR?
U 1 1 60665AEB
P 2200 6800
F 0 "#PWR?" H 2200 6550 50  0001 C CNN
F 1 "GND" H 2205 6627 50  0000 C CNN
F 2 "" H 2200 6800 50  0001 C CNN
F 3 "" H 2200 6800 50  0001 C CNN
	1    2200 6800
	1    0    0    -1  
$EndComp
$Comp
L power:GND #PWR?
U 1 1 60665D1F
P 1300 6800
F 0 "#PWR?" H 1300 6550 50  0001 C CNN
F 1 "GND" H 1305 6627 50  0000 C CNN
F 2 "" H 1300 6800 50  0001 C CNN
F 3 "" H 1300 6800 50  0001 C CNN
	1    1300 6800
	1    0    0    -1  
$EndComp
Wire Wire Line
	1300 5800 1300 5700
Wire Wire Line
	2200 5700 2200 5800
Wire Wire Line
	1500 5500 2000 5500
Wire Wire Line
	2000 6500 1500 6500
Wire Wire Line
	1300 6700 1300 6800
Wire Wire Line
	2200 6700 2200 6800
Text Label 1700 5500 0    50   ~ 0
thru_1
Text Label 1700 6500 0    50   ~ 0
thru_2
$EndSCHEMATC
