EESchema Schematic File Version 4
EELAYER 26 0
EELAYER END
$Descr A4 11693 8268
encoding utf-8
Sheet 1 7
Title ""
Date ""
Rev ""
Comp ""
Comment1 ""
Comment2 ""
Comment3 ""
Comment4 ""
$EndDescr
$Comp
L Connector:Conn_Coaxial J101
U 1 1 5B523A21
P 700 1400
F 0 "J101" H 710 1520 50  0000 C CNN
F 1 "Conn_Coaxial" V 815 1400 50  0000 C CNN
F 2 "rf:SMA_endlaunch_SD-73251-115" H 700 1400 50  0001 C CNN
F 3 "" H 700 1400 50  0001 C CNN
	1    700  1400
	-1   0    0    -1  
$EndComp
Text Notes 500  850  0    60   ~ 0
From SDR TX
Text Notes 700  4000 0    60   ~ 0
To SDR RX
$Comp
L Connector:Conn_Coaxial J102
U 1 1 5B523C69
P 950 4400
F 0 "J102" H 960 4520 50  0000 C CNN
F 1 "Conn_Coaxial" V 1065 4400 50  0000 C CNN
F 2 "rf:SMA_endlaunch_SD-73251-115" H 950 4400 50  0001 C CNN
F 3 "" H 950 4400 50  0001 C CNN
	1    950  4400
	-1   0    0    -1  
$EndComp
Text Notes 4000 1350 0    60   ~ 0
PA (maybe 2xSKY65162-70LF cascade\nor MMZ25333BT1)
Text Notes 4100 4200 0    60   ~ 0
LNA MAAL-011078
Text Notes 5150 4150 0    60   ~ 0
Bandpass Filter\nFI168L2200G9-T
Text Notes 1050 1100 0    60   ~ 0
Bandpass Filter\nFI168L2200G9-T
Text Notes 5800 750  0    60   ~ 0
SP4T TX Switch\nSKY13414-485LF
Text Notes 6350 3750 0    60   ~ 0
SP4T RX Switch\nSKY13414-485LF
$Comp
L Connector:Conn_Coaxial J116
U 1 1 5B5251C0
P 10950 2350
F 0 "J116" H 10960 2470 50  0000 C CNN
F 1 "Conn_Coaxial" V 11065 2350 50  0000 C CNN
F 2 "rf:SMA_endlaunch_SD-73251-115" H 10950 2350 50  0001 C CNN
F 3 "" H 10950 2350 50  0001 C CNN
	1    10950 2350
	1    0    0    -1  
$EndComp
$Comp
L power:GND #PWR?
U 1 1 5B54EB3F
P 700 1800
F 0 "#PWR?" H 700 1550 50  0001 C CNN
F 1 "GND" H 700 1650 50  0000 C CNN
F 2 "" H 700 1800 50  0001 C CNN
F 3 "" H 700 1800 50  0001 C CNN
	1    700  1800
	1    0    0    -1  
$EndComp
Wire Wire Line
	700  1800 700  1600
$Comp
L Device:EMI_Filter_CLC FL101
U 1 1 5B60A1F0
P 1400 1500
F 0 "FL101" H 1400 1817 50  0000 C CNN
F 1 "EMI_Filter_CLC" H 1400 1726 50  0000 C CNN
F 2 "rf:FI168L2200G9-T_SS" V 1400 1500 50  0001 C CNN
F 3 "http://www.murata.com/~/media/webrenewal/support/library/catalog/products/emc/emifil/c31e.ashx?la=en-gb" V 1400 1500 50  0001 C CNN
	1    1400 1500
	1    0    0    -1  
$EndComp
$Comp
L power:GND #PWR?
U 1 1 5B60A273
P 1400 1800
F 0 "#PWR?" H 1400 1550 50  0001 C CNN
F 1 "GND" H 1400 1650 50  0000 C CNN
F 2 "" H 1400 1800 50  0001 C CNN
F 3 "" H 1400 1800 50  0001 C CNN
	1    1400 1800
	1    0    0    -1  
$EndComp
Wire Wire Line
	1400 1800 1400 1600
Wire Wire Line
	1100 1400 900  1400
$Comp
L Device:R R104
U 1 1 5B60A326
P 3650 1100
F 0 "R104" H 3720 1146 50  0000 L CNN
F 1 "0" H 3720 1055 50  0000 L CNN
F 2 "Resistor_SMD:R_0201_0603Metric" V 3580 1100 50  0001 C CNN
F 3 "~" H 3650 1100 50  0001 C CNN
	1    3650 1100
	1    0    0    -1  
$EndComp
$Comp
L Device:R R105
U 1 1 5B60A3C9
P 3650 1700
F 0 "R105" H 3720 1746 50  0000 L CNN
F 1 "0" H 3720 1655 50  0000 L CNN
F 2 "Resistor_SMD:R_0201_0603Metric" V 3580 1700 50  0001 C CNN
F 3 "~" H 3650 1700 50  0001 C CNN
	1    3650 1700
	1    0    0    -1  
$EndComp
Wire Wire Line
	1700 1400 2100 1400
Wire Wire Line
	3650 950  3650 850 
Text Label 3700 850  0    50   ~ 0
PA2_in_1
Wire Wire Line
	3650 1850 3650 1950
Text Label 3700 1950 0    50   ~ 0
PA_in
$Sheet
S 4050 700  550  300 
U 5B60A9BE
F0 "PA2_1" 50
F1 "PA2.sch" 50
F2 "in" I L 4050 850 50 
F3 "out" O R 4600 850 50 
$EndSheet
Wire Wire Line
	3650 850  4050 850 
$Sheet
S 4950 700  550  300 
U 5B60D3AD
F0 "PA2_2" 50
F1 "PA2.sch" 50
F2 "in" I L 4950 850 50 
F3 "out" O R 5500 850 50 
$EndSheet
Wire Wire Line
	4600 850  4950 850 
Text Label 4600 850  0    50   ~ 0
PA2_1_2_2
Wire Wire Line
	3650 1950 3950 1950
$Comp
L Device:R R108
U 1 1 5B610AFF
P 5900 1100
F 0 "R108" H 5970 1146 50  0000 L CNN
F 1 "0" H 5970 1055 50  0000 L CNN
F 2 "Resistor_SMD:R_0201_0603Metric" V 5830 1100 50  0001 C CNN
F 3 "~" H 5900 1100 50  0001 C CNN
	1    5900 1100
	1    0    0    -1  
$EndComp
$Comp
L Device:R R107
U 1 1 5B610B05
P 5800 1750
F 0 "R107" H 5870 1796 50  0000 L CNN
F 1 "0" H 5870 1705 50  0000 L CNN
F 2 "Resistor_SMD:R_0201_0603Metric" V 5730 1750 50  0001 C CNN
F 3 "~" H 5800 1750 50  0001 C CNN
	1    5800 1750
	1    0    0    -1  
$EndComp
Wire Wire Line
	5900 950  5900 850 
Wire Wire Line
	5800 1900 5800 1950
Wire Wire Line
	5900 1250 5900 1400
Wire Wire Line
	5900 850  5500 850 
Wire Wire Line
	5400 1950 5800 1950
$Comp
L POWDER_RF:SKY13414-485LF U103
U 1 1 5B610EF0
P 6700 1400
F 0 "U103" H 6950 1750 50  0000 C CNN
F 1 "SKY13414-485LF" H 6700 1887 50  0000 C CNN
F 2 "POWDER_RF:SKY13414-485LF" H 6700 1400 50  0001 C CNN
F 3 "" H 6700 1400 50  0001 C CNN
	1    6700 1400
	-1   0    0    -1  
$EndComp
Wire Wire Line
	5900 1400 6250 1400
$Comp
L POWDER_RF:SKY13414-485LF U104
U 1 1 5B611460
P 6700 4400
F 0 "U104" H 6950 4750 50  0000 C CNN
F 1 "SKY13414-485LF" H 6700 4887 50  0000 C CNN
F 2 "POWDER_RF:SKY13414-485LF" H 6700 4400 50  0001 C CNN
F 3 "" H 6700 4400 50  0001 C CNN
	1    6700 4400
	-1   0    0    -1  
$EndComp
Wire Wire Line
	10750 2350 10400 2350
$Comp
L power:GND #PWR?
U 1 1 5B612E48
P 10950 2700
F 0 "#PWR?" H 10950 2450 50  0001 C CNN
F 1 "GND" H 10950 2550 50  0000 C CNN
F 2 "" H 10950 2700 50  0001 C CNN
F 3 "" H 10950 2700 50  0001 C CNN
	1    10950 2700
	1    0    0    -1  
$EndComp
Wire Wire Line
	10950 2700 10950 2550
$Comp
L Device:EMI_Filter_CLC FL103
U 1 1 5B61341D
P 5500 4500
F 0 "FL103" H 5500 4817 50  0000 C CNN
F 1 "EMI_Filter_CLC" H 5500 4726 50  0000 C CNN
F 2 "rf:FI168L2200G9-T_SS" V 5500 4500 50  0001 C CNN
F 3 "http://www.murata.com/~/media/webrenewal/support/library/catalog/products/emc/emifil/c31e.ashx?la=en-gb" V 5500 4500 50  0001 C CNN
	1    5500 4500
	1    0    0    -1  
$EndComp
$Comp
L Device:EMI_Filter_CLC FL102
U 1 1 5B6134B5
P 1800 4500
F 0 "FL102" H 1800 4817 50  0000 C CNN
F 1 "EMI_Filter_CLC" H 1800 4726 50  0000 C CNN
F 2 "rf:FI168L2200G9-T_SS" V 1800 4500 50  0001 C CNN
F 3 "http://www.murata.com/~/media/webrenewal/support/library/catalog/products/emc/emifil/c31e.ashx?la=en-gb" V 1800 4500 50  0001 C CNN
	1    1800 4500
	1    0    0    -1  
$EndComp
Wire Wire Line
	1500 4400 1150 4400
$Comp
L power:GND #PWR?
U 1 1 5B613BB8
P 950 4800
F 0 "#PWR?" H 950 4550 50  0001 C CNN
F 1 "GND" H 950 4650 50  0000 C CNN
F 2 "" H 950 4800 50  0001 C CNN
F 3 "" H 950 4800 50  0001 C CNN
	1    950  4800
	1    0    0    -1  
$EndComp
Wire Wire Line
	950  4800 950  4600
$Comp
L power:GND #PWR?
U 1 1 5B61411F
P 1800 4800
F 0 "#PWR?" H 1800 4550 50  0001 C CNN
F 1 "GND" H 1800 4650 50  0000 C CNN
F 2 "" H 1800 4800 50  0001 C CNN
F 3 "" H 1800 4800 50  0001 C CNN
	1    1800 4800
	1    0    0    -1  
$EndComp
Wire Wire Line
	1800 4800 1800 4600
$Comp
L power:GND #PWR?
U 1 1 5B6146E9
P 5500 4750
F 0 "#PWR?" H 5500 4500 50  0001 C CNN
F 1 "GND" H 5500 4600 50  0000 C CNN
F 2 "" H 5500 4750 50  0001 C CNN
F 3 "" H 5500 4750 50  0001 C CNN
	1    5500 4750
	1    0    0    -1  
$EndComp
Wire Wire Line
	5500 4750 5500 4600
Wire Wire Line
	5800 4400 6250 4400
$Sheet
S 4250 4300 500  200 
U 5B62603D
F0 "LNA_1" 50
F1 "LNA.sch" 50
F2 "in" I R 4750 4400 50 
F3 "out" O L 4250 4400 50 
$EndSheet
Wire Wire Line
	4750 4400 5200 4400
Wire Wire Line
	2450 4400 2100 4400
$Comp
L power:GND #PWR?
U 1 1 5B6270C8
P 6450 2000
F 0 "#PWR?" H 6450 1750 50  0001 C CNN
F 1 "GND" H 6450 1850 50  0000 C CNN
F 2 "" H 6450 2000 50  0001 C CNN
F 3 "" H 6450 2000 50  0001 C CNN
	1    6450 2000
	1    0    0    -1  
$EndComp
$Comp
L power:GND #PWR?
U 1 1 5B62711A
P 10200 3050
F 0 "#PWR?" H 10200 2800 50  0001 C CNN
F 1 "GND" H 10200 2900 50  0000 C CNN
F 2 "" H 10200 3050 50  0001 C CNN
F 3 "" H 10200 3050 50  0001 C CNN
	1    10200 3050
	1    0    0    -1  
$EndComp
$Comp
L power:GND #PWR?
U 1 1 5B62716C
P 6450 5000
F 0 "#PWR?" H 6450 4750 50  0001 C CNN
F 1 "GND" H 6450 4850 50  0000 C CNN
F 2 "" H 6450 5000 50  0001 C CNN
F 3 "" H 6450 5000 50  0001 C CNN
	1    6450 5000
	1    0    0    -1  
$EndComp
Wire Wire Line
	6450 5000 6450 4800
Wire Wire Line
	10200 3050 10200 2850
$Comp
L Device:R R109
U 1 1 5B62933D
P 6600 2700
F 0 "R109" H 6670 2746 50  0000 L CNN
F 1 "100" H 6670 2655 50  0000 L CNN
F 2 "Resistor_SMD:R_0603_1608Metric" V 6530 2700 50  0001 C CNN
F 3 "~" H 6600 2700 50  0001 C CNN
	1    6600 2700
	1    0    0    -1  
$EndComp
$Comp
L Device:R R111
U 1 1 5B6293F3
P 6700 3000
F 0 "R111" H 6770 3046 50  0000 L CNN
F 1 "100" H 6770 2955 50  0000 L CNN
F 2 "Resistor_SMD:R_0603_1608Metric" V 6630 3000 50  0001 C CNN
F 3 "~" H 6700 3000 50  0001 C CNN
	1    6700 3000
	1    0    0    -1  
$EndComp
$Comp
L Device:R R113
U 1 1 5B629445
P 6800 3300
F 0 "R113" H 6870 3346 50  0000 L CNN
F 1 "100" H 6870 3255 50  0000 L CNN
F 2 "Resistor_SMD:R_0603_1608Metric" V 6730 3300 50  0001 C CNN
F 3 "~" H 6800 3300 50  0001 C CNN
	1    6800 3300
	1    0    0    -1  
$EndComp
Wire Wire Line
	6800 3150 6800 2750
Wire Wire Line
	6700 1800 6700 2550
Wire Wire Line
	6600 2550 6600 2350
Wire Wire Line
	6450 1800 6450 2000
$Comp
L Device:R R110
U 1 1 5B62E65B
P 6600 5350
F 0 "R110" H 6670 5396 50  0000 L CNN
F 1 "100" H 6670 5305 50  0000 L CNN
F 2 "Resistor_SMD:R_0603_1608Metric" V 6530 5350 50  0001 C CNN
F 3 "~" H 6600 5350 50  0001 C CNN
	1    6600 5350
	1    0    0    -1  
$EndComp
$Comp
L Device:R R112
U 1 1 5B62E661
P 6700 5650
F 0 "R112" H 6770 5696 50  0000 L CNN
F 1 "100" H 6770 5605 50  0000 L CNN
F 2 "Resistor_SMD:R_0603_1608Metric" V 6630 5650 50  0001 C CNN
F 3 "~" H 6700 5650 50  0001 C CNN
	1    6700 5650
	1    0    0    -1  
$EndComp
$Comp
L Device:R R114
U 1 1 5B62E667
P 6800 6100
F 0 "R114" H 6870 6146 50  0000 L CNN
F 1 "100" H 6870 6055 50  0000 L CNN
F 2 "Resistor_SMD:R_0603_1608Metric" V 6730 6100 50  0001 C CNN
F 3 "~" H 6800 6100 50  0001 C CNN
	1    6800 6100
	1    0    0    -1  
$EndComp
Wire Wire Line
	6800 5950 6800 5850
Wire Wire Line
	6700 4800 6700 5450
Wire Wire Line
	6600 5200 6600 5100
$Comp
L Device:R R117
U 1 1 5B6308CC
P 9850 3400
F 0 "R117" H 9920 3446 50  0000 L CNN
F 1 "100" H 9920 3355 50  0000 L CNN
F 2 "Resistor_SMD:R_0603_1608Metric" V 9780 3400 50  0001 C CNN
F 3 "~" H 9850 3400 50  0001 C CNN
	1    9850 3400
	1    0    0    -1  
$EndComp
$Comp
L Device:R R118
U 1 1 5B6308D2
P 9950 3700
F 0 "R118" H 10020 3746 50  0000 L CNN
F 1 "100" H 10020 3655 50  0000 L CNN
F 2 "Resistor_SMD:R_0603_1608Metric" V 9880 3700 50  0001 C CNN
F 3 "~" H 9950 3700 50  0001 C CNN
	1    9950 3700
	1    0    0    -1  
$EndComp
$Comp
L Device:R R119
U 1 1 5B6308D8
P 10050 4000
F 0 "R119" H 10120 4046 50  0000 L CNN
F 1 "100" H 10120 3955 50  0000 L CNN
F 2 "Resistor_SMD:R_0603_1608Metric" V 9980 4000 50  0001 C CNN
F 3 "~" H 10050 4000 50  0001 C CNN
	1    10050 4000
	1    0    0    -1  
$EndComp
Wire Wire Line
	10050 3850 10050 3350
Wire Wire Line
	9950 2850 9950 3150
Wire Wire Line
	9850 3250 9850 2950
Wire Wire Line
	6700 6400 6200 6400
Wire Wire Line
	6200 6300 6600 6300
Wire Wire Line
	6800 6500 6200 6500
Text Label 6300 3300 0    50   ~ 0
TX_sw1
Text Label 6300 3400 0    50   ~ 0
TX_sw2
Text Label 6300 3500 0    50   ~ 0
TX_sw3
Wire Wire Line
	9450 4050 9850 4050
Wire Wire Line
	10050 4150 10050 4250
Wire Wire Line
	9850 3550 9850 4050
Wire Wire Line
	9950 3850 9950 4150
Text Label 6250 6300 0    50   ~ 0
RX_sw1
Text Label 6250 6400 0    50   ~ 0
RX_sw2
Text Label 6250 6500 0    50   ~ 0
RX_sw3
Text Label 9500 4050 0    50   ~ 0
ANT_sw1
Text Label 9500 4150 0    50   ~ 0
ANT_sw2
Text Label 9500 4250 0    50   ~ 0
ANT_sw3
$Comp
L Device:C C105
U 1 1 5B64ACC8
P 7300 850
F 0 "C105" H 7415 896 50  0000 L CNN
F 1 "1u" H 7415 805 50  0000 L CNN
F 2 "Capacitor_SMD:C_0402_1005Metric" H 7338 700 50  0001 C CNN
F 3 "~" H 7300 850 50  0001 C CNN
	1    7300 850 
	1    0    0    -1  
$EndComp
$Comp
L Device:C C106
U 1 1 5B64AD6A
P 7750 850
F 0 "C106" H 7865 896 50  0000 L CNN
F 1 "1n" H 7865 805 50  0000 L CNN
F 2 "Capacitor_SMD:C_0402_1005Metric" H 7788 700 50  0001 C CNN
F 3 "~" H 7750 850 50  0001 C CNN
	1    7750 850 
	1    0    0    -1  
$EndComp
Wire Wire Line
	7300 700  7300 600 
Wire Wire Line
	7300 600  6700 600 
Wire Wire Line
	6700 600  6700 1000
$Comp
L power:GND #PWR?
U 1 1 5B64CB08
P 7300 1100
F 0 "#PWR?" H 7300 850 50  0001 C CNN
F 1 "GND" H 7300 950 50  0000 C CNN
F 2 "" H 7300 1100 50  0001 C CNN
F 3 "" H 7300 1100 50  0001 C CNN
	1    7300 1100
	1    0    0    -1  
$EndComp
Wire Wire Line
	7300 1100 7300 1000
$Comp
L power:GND #PWR?
U 1 1 5B64E836
P 7750 1100
F 0 "#PWR?" H 7750 850 50  0001 C CNN
F 1 "GND" H 7750 950 50  0000 C CNN
F 2 "" H 7750 1100 50  0001 C CNN
F 3 "" H 7750 1100 50  0001 C CNN
	1    7750 1100
	1    0    0    -1  
$EndComp
Wire Wire Line
	7750 1100 7750 1000
Wire Wire Line
	7750 700  7750 600 
Wire Wire Line
	7750 600  7300 600 
Connection ~ 7300 600 
$Comp
L Device:R R115
U 1 1 5B6524AC
P 8150 600
F 0 "R115" V 7943 600 50  0000 C CNN
F 1 "10" V 8034 600 50  0000 C CNN
F 2 "Resistor_SMD:R_0603_1608Metric" V 8080 600 50  0001 C CNN
F 3 "~" H 8150 600 50  0001 C CNN
	1    8150 600 
	0    1    1    0   
$EndComp
Wire Wire Line
	8000 600  7750 600 
Connection ~ 7750 600 
Wire Wire Line
	8300 600  8600 600 
Text Label 8400 600  0    50   ~ 0
VCC_1
$Comp
L Device:C C107
U 1 1 5B657358
P 8400 5750
F 0 "C107" H 8515 5796 50  0000 L CNN
F 1 "1u" H 8515 5705 50  0000 L CNN
F 2 "Capacitor_SMD:C_0402_1005Metric" H 8438 5600 50  0001 C CNN
F 3 "~" H 8400 5750 50  0001 C CNN
	1    8400 5750
	1    0    0    -1  
$EndComp
$Comp
L Device:C C108
U 1 1 5B65735E
P 8850 5750
F 0 "C108" H 8965 5796 50  0000 L CNN
F 1 "1n" H 8965 5705 50  0000 L CNN
F 2 "Capacitor_SMD:C_0402_1005Metric" H 8888 5600 50  0001 C CNN
F 3 "~" H 8850 5750 50  0001 C CNN
	1    8850 5750
	1    0    0    -1  
$EndComp
Wire Wire Line
	8400 5600 8400 5500
Wire Wire Line
	8400 5500 7800 5500
$Comp
L power:GND #PWR?
U 1 1 5B657366
P 8400 6000
F 0 "#PWR?" H 8400 5750 50  0001 C CNN
F 1 "GND" H 8400 5850 50  0000 C CNN
F 2 "" H 8400 6000 50  0001 C CNN
F 3 "" H 8400 6000 50  0001 C CNN
	1    8400 6000
	1    0    0    -1  
$EndComp
Wire Wire Line
	8400 6000 8400 5900
$Comp
L power:GND #PWR?
U 1 1 5B65736D
P 8850 6000
F 0 "#PWR?" H 8850 5750 50  0001 C CNN
F 1 "GND" H 8850 5850 50  0000 C CNN
F 2 "" H 8850 6000 50  0001 C CNN
F 3 "" H 8850 6000 50  0001 C CNN
	1    8850 6000
	1    0    0    -1  
$EndComp
Wire Wire Line
	8850 6000 8850 5900
Wire Wire Line
	8850 5600 8850 5500
Wire Wire Line
	8850 5500 8550 5500
Connection ~ 8400 5500
$Comp
L Device:R R116
U 1 1 5B657377
P 9250 5500
F 0 "R116" V 9043 5500 50  0000 C CNN
F 1 "10" V 9134 5500 50  0000 C CNN
F 2 "Resistor_SMD:R_0603_1608Metric" V 9180 5500 50  0001 C CNN
F 3 "~" H 9250 5500 50  0001 C CNN
	1    9250 5500
	0    1    1    0   
$EndComp
Wire Wire Line
	9100 5500 8850 5500
Connection ~ 8850 5500
Wire Wire Line
	9400 5500 9700 5500
Text Label 9500 5500 0    50   ~ 0
VCC_3
$Comp
L Device:C C109
U 1 1 5B660F3E
P 9700 900
F 0 "C109" H 9815 946 50  0000 L CNN
F 1 "1u" H 9815 855 50  0000 L CNN
F 2 "Capacitor_SMD:C_0402_1005Metric" H 9738 750 50  0001 C CNN
F 3 "~" H 9700 900 50  0001 C CNN
	1    9700 900 
	1    0    0    -1  
$EndComp
$Comp
L Device:C C110
U 1 1 5B660F44
P 10150 900
F 0 "C110" H 10265 946 50  0000 L CNN
F 1 "1n" H 10265 855 50  0000 L CNN
F 2 "Capacitor_SMD:C_0402_1005Metric" H 10188 750 50  0001 C CNN
F 3 "~" H 10150 900 50  0001 C CNN
	1    10150 900 
	1    0    0    -1  
$EndComp
Wire Wire Line
	9700 750  9700 650 
Wire Wire Line
	9700 650  9450 650 
$Comp
L power:GND #PWR?
U 1 1 5B660F4C
P 9700 1150
F 0 "#PWR?" H 9700 900 50  0001 C CNN
F 1 "GND" H 9700 1000 50  0000 C CNN
F 2 "" H 9700 1150 50  0001 C CNN
F 3 "" H 9700 1150 50  0001 C CNN
	1    9700 1150
	1    0    0    -1  
$EndComp
Wire Wire Line
	9700 1150 9700 1050
$Comp
L power:GND #PWR?
U 1 1 5B660F53
P 10150 1150
F 0 "#PWR?" H 10150 900 50  0001 C CNN
F 1 "GND" H 10150 1000 50  0000 C CNN
F 2 "" H 10150 1150 50  0001 C CNN
F 3 "" H 10150 1150 50  0001 C CNN
	1    10150 1150
	1    0    0    -1  
$EndComp
Wire Wire Line
	10150 1150 10150 1050
Wire Wire Line
	10150 750  10150 650 
Wire Wire Line
	10150 650  9700 650 
Connection ~ 9700 650 
$Comp
L Device:R R120
U 1 1 5B660F5D
P 10550 650
F 0 "R120" V 10343 650 50  0000 C CNN
F 1 "10" V 10434 650 50  0000 C CNN
F 2 "Resistor_SMD:R_0603_1608Metric" V 10480 650 50  0001 C CNN
F 3 "~" H 10550 650 50  0001 C CNN
	1    10550 650 
	0    1    1    0   
$EndComp
Wire Wire Line
	10400 650  10150 650 
Connection ~ 10150 650 
Wire Wire Line
	10700 650  11000 650 
Text Label 10800 650  0    50   ~ 0
VCC_2
Wire Wire Line
	9450 650  9450 800 
Wire Wire Line
	9450 1800 9950 1800
Wire Wire Line
	9950 1800 9950 1850
Wire Wire Line
	6700 4000 7800 4000
Wire Wire Line
	7800 4000 7800 5500
Wire Wire Line
	2900 6100 3200 6100
Wire Wire Line
	2900 6700 3200 6700
Wire Wire Line
	2100 6400 2400 6400
Wire Wire Line
	2100 6600 2400 6600
Wire Wire Line
	2900 6600 3200 6600
Wire Wire Line
	2900 6400 3200 6400
Wire Wire Line
	2900 6300 3200 6300
Wire Wire Line
	2900 6200 3200 6200
Text Label 3000 6100 0    50   ~ 0
VCC_1
Text Label 3000 6700 0    50   ~ 0
VCC_2
Text Label 2300 6400 2    50   ~ 0
VCC_3
Text Label 2300 6600 2    50   ~ 0
VCC_4
Text Label 3000 6600 0    50   ~ 0
VCC_5
Text Label 3000 6400 0    50   ~ 0
TX_sw1
Text Label 3000 6300 0    50   ~ 0
TX_sw2
Text Label 3000 6200 0    50   ~ 0
TX_sw3
Wire Wire Line
	2400 6100 2100 6100
Wire Wire Line
	2400 6200 2100 6200
Wire Wire Line
	2400 6300 2100 6300
Text Label 2300 6100 2    50   ~ 0
RX_sw1
Text Label 2300 6200 2    50   ~ 0
RX_sw2
Text Label 2300 6300 2    50   ~ 0
RX_sw3
Wire Wire Line
	3200 6800 2900 6800
Wire Wire Line
	2400 6800 2100 6800
Wire Wire Line
	2400 6700 2100 6700
Text Label 3000 6800 0    50   ~ 0
ANT_sw1
Text Label 2300 6800 2    50   ~ 0
ANT_sw2
Text Label 2300 6700 2    50   ~ 0
ANT_sw3
Wire Wire Line
	3200 6500 2900 6500
Wire Wire Line
	2400 6500 2100 6500
Text Label 3000 6500 0    50   ~ 0
TX_chain_sw
Text Label 2300 6500 2    50   ~ 0
RX_chain_sw
$Comp
L Connector_Generic:Conn_02x09_Odd_Even J103
U 1 1 5B6ADD3D
P 2600 6400
F 0 "J103" H 2650 7050 50  0000 C CNN
F 1 "Conn_02x09_Odd_Even" H 2700 6950 50  0000 C CNN
F 2 "Connector_PinHeader_2.54mm:PinHeader_2x09_P2.54mm_Vertical" H 2600 6400 50  0001 C CNN
F 3 "~" H 2600 6400 50  0001 C CNN
	1    2600 6400
	1    0    0    -1  
$EndComp
$Comp
L power:GND #PWR?
U 1 1 5B6AE1DB
P 3600 6100
F 0 "#PWR?" H 3600 5850 50  0001 C CNN
F 1 "GND" H 3605 5927 50  0000 C CNN
F 2 "" H 3600 6100 50  0001 C CNN
F 3 "" H 3600 6100 50  0001 C CNN
	1    3600 6100
	1    0    0    -1  
$EndComp
Wire Wire Line
	3600 6100 3600 6000
Wire Wire Line
	3600 6000 2900 6000
$Comp
L Connector:Conn_Coaxial J115
U 1 1 5B6B4746
P 9550 3100
F 0 "J115" H 9560 3220 50  0000 C CNN
F 1 "Conn_Coaxial" V 9665 3100 50  0000 C CNN
F 2 "rf:SMA_endlaunch_SD-73251-115" H 9550 3100 50  0001 C CNN
F 3 "" H 9550 3100 50  0001 C CNN
	1    9550 3100
	1    0    0    -1  
$EndComp
Wire Wire Line
	9350 2400 9500 2400
Wire Wire Line
	9150 2300 9500 2300
$Comp
L power:GND #PWR?
U 1 1 5B6C1496
P 9550 3850
F 0 "#PWR?" H 9550 3600 50  0001 C CNN
F 1 "GND" H 9550 3700 50  0000 C CNN
F 2 "" H 9550 3850 50  0001 C CNN
F 3 "" H 9550 3850 50  0001 C CNN
	1    9550 3850
	1    0    0    -1  
$EndComp
Wire Wire Line
	9550 3850 9550 3300
$Comp
L Connector:Conn_Coaxial J105
U 1 1 5B6CE720
P 7400 5100
F 0 "J105" H 7410 5220 50  0000 C CNN
F 1 "Conn_Coaxial" V 7515 5100 50  0000 C CNN
F 2 "rf:SMA_endlaunch_SD-73251-115" H 7400 5100 50  0001 C CNN
F 3 "" H 7400 5100 50  0001 C CNN
	1    7400 5100
	1    0    0    -1  
$EndComp
$Comp
L power:GND #PWR?
U 1 1 5B6CE7A2
P 7400 5400
F 0 "#PWR?" H 7400 5150 50  0001 C CNN
F 1 "GND" H 7400 5250 50  0000 C CNN
F 2 "" H 7400 5400 50  0001 C CNN
F 3 "" H 7400 5400 50  0001 C CNN
	1    7400 5400
	1    0    0    -1  
$EndComp
Wire Wire Line
	7400 4650 7400 4450
Wire Wire Line
	7400 4450 7150 4450
Wire Wire Line
	7150 4550 7200 4550
Wire Wire Line
	7200 4550 7200 5100
Wire Wire Line
	7400 5300 7400 5400
$Comp
L Connector:Conn_Coaxial J107
U 1 1 5B6E9D4E
P 7700 1650
F 0 "J107" H 7710 1770 50  0000 C CNN
F 1 "Conn_Coaxial" V 7815 1650 50  0000 C CNN
F 2 "rf:SMA_endlaunch_SD-73251-115" H 7700 1650 50  0001 C CNN
F 3 "" H 7700 1650 50  0001 C CNN
	1    7700 1650
	1    0    0    -1  
$EndComp
Wire Wire Line
	7500 1650 7500 1450
Wire Wire Line
	7500 1450 7150 1450
Wire Wire Line
	7150 1550 7150 1950
Wire Wire Line
	7200 1950 7150 1950
$Comp
L power:GND #PWR?
U 1 1 5B6F8C7B
P 7700 1950
F 0 "#PWR?" H 7700 1700 50  0001 C CNN
F 1 "GND" H 7700 1800 50  0000 C CNN
F 2 "" H 7700 1950 50  0001 C CNN
F 3 "" H 7700 1950 50  0001 C CNN
	1    7700 1950
	1    0    0    -1  
$EndComp
Wire Wire Line
	7700 1950 7700 1850
Text Label 7450 1450 2    50   ~ 0
TX_p3
Text Label 7150 1900 2    50   ~ 0
TX_p4
Text Label 7400 4450 2    50   ~ 0
RX_p3
Text Label 7150 4550 0    50   ~ 0
RX_p4
Text Label 9450 2300 2    50   ~ 0
ANT_p3
Text Label 9450 2400 2    50   ~ 0
ANT_p4
Text Label 1100 1400 2    50   ~ 0
TX_in
Text Label 1450 4400 2    50   ~ 0
RX_out
Text Label 10600 2350 2    50   ~ 0
ANT
Text Label 9450 2100 2    50   ~ 0
ANT_p1
Text Label 9450 2200 2    50   ~ 0
ANT_p2
Text Label 6200 1400 2    50   ~ 0
TX_mid
Text Label 6100 4400 2    50   ~ 0
RX_mid
Text Label 5150 4400 2    50   ~ 0
LNA_in
Text Label 2400 4400 2    50   ~ 0
LNA_out
Text Label 5900 850  2    50   ~ 0
PA2_out_2
Text Label 5700 1950 2    50   ~ 0
PA_out
Text Label 2100 1400 2    50   ~ 0
TX_filtered
Text Label 7550 1250 2    50   ~ 0
TX_p1
Text Label 7450 1350 2    50   ~ 0
TX_p2
Text Label 7500 4250 2    50   ~ 0
RX_p1
Text Label 7500 4350 2    50   ~ 0
RX_p2
Text Label 7050 600  0    50   ~ 0
VCC_1_filt
Text Label 6600 5200 1    50   ~ 0
RX_sw1_R
Text Label 6700 5200 1    50   ~ 0
RX_sw2_R
Text Label 6800 5200 1    50   ~ 0
RX_sw3_R
Text Label 6800 2200 1    50   ~ 0
TX_sw3_R
Text Label 6700 2200 1    50   ~ 0
TX_sw2_R
Text Label 6600 2200 1    50   ~ 0
TX_sw1_R
Text Label 9850 3200 1    50   ~ 0
ANT_sw1_R
Text Label 9950 3200 1    50   ~ 0
ANT_sw2_R
Text Label 10050 3200 1    50   ~ 0
ANT_sw3_R
Text Label 9550 650  0    50   ~ 0
VCC_2_filt
Text Label 8050 5500 0    50   ~ 0
VCC_3_filt
$Comp
L power:GND #PWR?
U 1 1 5B713404
P 1800 6100
F 0 "#PWR?" H 1800 5850 50  0001 C CNN
F 1 "GND" H 1805 5927 50  0000 C CNN
F 2 "" H 1800 6100 50  0001 C CNN
F 3 "" H 1800 6100 50  0001 C CNN
	1    1800 6100
	1    0    0    -1  
$EndComp
Wire Wire Line
	1800 6000 1800 6100
$Comp
L POWDER_RF:SKY13416-485LF U105
U 1 1 5BB76DFA
P 9950 2350
F 0 "U105" H 9650 2800 50  0000 L CNN
F 1 "SKY13416-485LF" H 10200 2800 50  0000 L CNN
F 2 "POWDER_RF:SKY13414-485LF" H 9950 2350 50  0001 C CNN
F 3 "" H 9950 2350 50  0001 C CNN
	1    9950 2350
	1    0    0    -1  
$EndComp
Wire Wire Line
	9450 4150 9950 4150
Wire Wire Line
	9450 4250 10050 4250
$Comp
L POWDER_RF:SKY13453-385LF U101
U 1 1 5BB8C866
P 2550 1400
F 0 "U101" H 2850 1750 50  0000 C CNN
F 1 "SKY13453-385LF" H 2550 1887 50  0000 C CNN
F 2 "POWDER_RF:SKY13453-385LF" H 3350 800 50  0001 C CNN
F 3 "" H 3350 800 50  0001 C CNN
	1    2550 1400
	-1   0    0    -1  
$EndComp
Wire Wire Line
	5800 1600 6200 1600
Text Label 5900 1600 0    50   ~ 0
ANT_p3
$Comp
L POWDER_RF:SKY13453-385LF U102
U 1 1 5BBCF1A3
P 2900 4400
F 0 "U102" H 3200 4750 50  0000 C CNN
F 1 "SKY13453-385LF" H 2900 4887 50  0000 C CNN
F 2 "POWDER_RF:SKY13453-385LF" H 3700 3800 50  0001 C CNN
F 3 "" H 3700 3800 50  0001 C CNN
	1    2900 4400
	-1   0    0    -1  
$EndComp
$Comp
L Device:EMI_Filter_CLC FL104
U 1 1 5BBEE15E
P 5500 5400
F 0 "FL104" H 5500 5717 50  0000 C CNN
F 1 "EMI_Filter_CLC" H 5500 5626 50  0000 C CNN
F 2 "rf:FI168L2200G9-T_SS" V 5500 5400 50  0001 C CNN
F 3 "http://www.murata.com/~/media/webrenewal/support/library/catalog/products/emc/emifil/c31e.ashx?la=en-gb" V 5500 5400 50  0001 C CNN
	1    5500 5400
	1    0    0    -1  
$EndComp
$Comp
L power:GND #PWR?
U 1 1 5BBEE1FC
P 5500 5600
F 0 "#PWR?" H 5500 5350 50  0001 C CNN
F 1 "GND" H 5500 5450 50  0000 C CNN
F 2 "" H 5500 5600 50  0001 C CNN
F 3 "" H 5500 5600 50  0001 C CNN
	1    5500 5600
	1    0    0    -1  
$EndComp
Wire Wire Line
	5500 5600 5500 5500
$Sheet
S 4250 5200 500  200 
U 5BBFAE41
F0 "LNA_2" 50
F1 "LNA.sch" 50
F2 "in" I R 4750 5300 50 
F3 "out" O L 4250 5300 50 
$EndSheet
Wire Wire Line
	4750 5300 5200 5300
Wire Wire Line
	3900 4400 4250 4400
Wire Wire Line
	3800 5300 4250 5300
Wire Wire Line
	5800 5300 6250 5300
Text Label 5850 5300 0    50   ~ 0
ANT_p2
Wire Wire Line
	9350 2400 9350 3100
$Comp
L Connector:Conn_Coaxial J111
U 1 1 5BC39D5E
P 8450 1250
F 0 "J111" H 8460 1370 50  0000 C CNN
F 1 "Conn_Coaxial" V 8565 1250 50  0000 C CNN
F 2 "rf:SMA_endlaunch_SD-73251-115" H 8450 1250 50  0001 C CNN
F 3 "" H 8450 1250 50  0001 C CNN
	1    8450 1250
	1    0    0    -1  
$EndComp
$Comp
L Connector:Conn_Coaxial J108
U 1 1 5BC39E00
P 8050 1350
F 0 "J108" H 8060 1470 50  0000 C CNN
F 1 "Conn_Coaxial" V 8165 1350 50  0000 C CNN
F 2 "rf:SMA_endlaunch_SD-73251-115" H 8050 1350 50  0001 C CNN
F 3 "" H 8050 1350 50  0001 C CNN
	1    8050 1350
	1    0    0    -1  
$EndComp
Wire Wire Line
	7150 1250 8250 1250
Wire Wire Line
	7150 1350 7850 1350
$Comp
L power:GND #PWR?
U 1 1 5BC478EF
P 8050 1650
F 0 "#PWR?" H 8050 1400 50  0001 C CNN
F 1 "GND" H 8050 1500 50  0000 C CNN
F 2 "" H 8050 1650 50  0001 C CNN
F 3 "" H 8050 1650 50  0001 C CNN
	1    8050 1650
	1    0    0    -1  
$EndComp
$Comp
L power:GND #PWR?
U 1 1 5BC4795C
P 8450 1650
F 0 "#PWR?" H 8450 1400 50  0001 C CNN
F 1 "GND" H 8450 1500 50  0000 C CNN
F 2 "" H 8450 1650 50  0001 C CNN
F 3 "" H 8450 1650 50  0001 C CNN
	1    8450 1650
	1    0    0    -1  
$EndComp
Wire Wire Line
	8450 1650 8450 1450
Wire Wire Line
	8050 1650 8050 1550
$Comp
L Connector:Conn_Coaxial J109
U 1 1 5BC55477
P 8100 4350
F 0 "J109" H 8110 4470 50  0000 C CNN
F 1 "Conn_Coaxial" V 8215 4350 50  0000 C CNN
F 2 "rf:SMA_endlaunch_SD-73251-115" H 8100 4350 50  0001 C CNN
F 3 "" H 8100 4350 50  0001 C CNN
	1    8100 4350
	1    0    0    -1  
$EndComp
$Comp
L Connector:Conn_Coaxial J112
U 1 1 5BC5558F
P 8500 4250
F 0 "J112" H 8510 4370 50  0000 C CNN
F 1 "Conn_Coaxial" V 8615 4250 50  0000 C CNN
F 2 "rf:SMA_endlaunch_SD-73251-115" H 8500 4250 50  0001 C CNN
F 3 "" H 8500 4250 50  0001 C CNN
	1    8500 4250
	1    0    0    -1  
$EndComp
Wire Wire Line
	7150 4250 8300 4250
Wire Wire Line
	7150 4350 7900 4350
$Comp
L power:GND #PWR?
U 1 1 5BC63303
P 8100 4700
F 0 "#PWR?" H 8100 4450 50  0001 C CNN
F 1 "GND" H 8100 4550 50  0000 C CNN
F 2 "" H 8100 4700 50  0001 C CNN
F 3 "" H 8100 4700 50  0001 C CNN
	1    8100 4700
	1    0    0    -1  
$EndComp
$Comp
L power:GND #PWR?
U 1 1 5BC63374
P 8500 4700
F 0 "#PWR?" H 8500 4450 50  0001 C CNN
F 1 "GND" H 8500 4550 50  0000 C CNN
F 2 "" H 8500 4700 50  0001 C CNN
F 3 "" H 8500 4700 50  0001 C CNN
	1    8500 4700
	1    0    0    -1  
$EndComp
Wire Wire Line
	8500 4700 8500 4450
Wire Wire Line
	8100 4700 8100 4550
$Comp
L Connector:Conn_Coaxial J113
U 1 1 5BC710CC
P 8800 2600
F 0 "J113" H 8810 2720 50  0000 C CNN
F 1 "Conn_Coaxial" V 8915 2600 50  0000 C CNN
F 2 "rf:SMA_endlaunch_SD-73251-115" H 8800 2600 50  0001 C CNN
F 3 "" H 8800 2600 50  0001 C CNN
	1    8800 2600
	-1   0    0    -1  
$EndComp
$Comp
L Connector:Conn_Coaxial J110
U 1 1 5BC71228
P 8400 2500
F 0 "J110" H 8410 2620 50  0000 C CNN
F 1 "Conn_Coaxial" V 8515 2500 50  0000 C CNN
F 2 "rf:SMA_endlaunch_SD-73251-115" H 8400 2500 50  0001 C CNN
F 3 "" H 8400 2500 50  0001 C CNN
	1    8400 2500
	-1   0    0    -1  
$EndComp
Wire Wire Line
	9000 2100 9500 2100
Wire Wire Line
	9000 2200 9500 2200
$Comp
L power:GND #PWR?
U 1 1 5BC7F2BF
P 8800 2900
F 0 "#PWR?" H 8800 2650 50  0001 C CNN
F 1 "GND" H 8800 2750 50  0000 C CNN
F 2 "" H 8800 2900 50  0001 C CNN
F 3 "" H 8800 2900 50  0001 C CNN
	1    8800 2900
	1    0    0    -1  
$EndComp
$Comp
L power:GND #PWR?
U 1 1 5BC7F334
P 8400 2900
F 0 "#PWR?" H 8400 2650 50  0001 C CNN
F 1 "GND" H 8400 2750 50  0000 C CNN
F 2 "" H 8400 2900 50  0001 C CNN
F 3 "" H 8400 2900 50  0001 C CNN
	1    8400 2900
	1    0    0    -1  
$EndComp
Wire Wire Line
	8400 2900 8400 2700
Wire Wire Line
	8800 2800 8800 2900
Text Label 4200 3250 0    50   ~ 0
VCC_4
Text Label 3850 600  0    50   ~ 0
VCC_5
Wire Wire Line
	2550 1000 2550 600 
Wire Wire Line
	3650 1450 3650 1550
Wire Wire Line
	3000 1450 3650 1450
Wire Wire Line
	3000 1350 3650 1350
Wire Wire Line
	3650 1350 3650 1250
$Comp
L Device:C C101
U 1 1 5BCFE20C
P 3050 850
F 0 "C101" H 3165 896 50  0000 L CNN
F 1 "1u" H 3165 805 50  0000 L CNN
F 2 "Capacitor_SMD:C_0402_1005Metric" H 3088 700 50  0001 C CNN
F 3 "~" H 3050 850 50  0001 C CNN
	1    3050 850 
	1    0    0    -1  
$EndComp
$Comp
L power:GND #PWR?
U 1 1 5BCFE342
P 3050 1100
F 0 "#PWR?" H 3050 850 50  0001 C CNN
F 1 "GND" H 3050 950 50  0000 C CNN
F 2 "" H 3050 1100 50  0001 C CNN
F 3 "" H 3050 1100 50  0001 C CNN
	1    3050 1100
	1    0    0    -1  
$EndComp
$Comp
L Device:C C103
U 1 1 5BCFE51D
P 3400 850
F 0 "C103" H 3515 896 50  0000 L CNN
F 1 "1n" H 3515 805 50  0000 L CNN
F 2 "Capacitor_SMD:C_0402_1005Metric" H 3438 700 50  0001 C CNN
F 3 "~" H 3400 850 50  0001 C CNN
	1    3400 850 
	1    0    0    -1  
$EndComp
$Comp
L power:GND #PWR?
U 1 1 5BCFE673
P 3400 1100
F 0 "#PWR?" H 3400 850 50  0001 C CNN
F 1 "GND" H 3400 950 50  0000 C CNN
F 2 "" H 3400 1100 50  0001 C CNN
F 3 "" H 3400 1100 50  0001 C CNN
	1    3400 1100
	1    0    0    -1  
$EndComp
Wire Wire Line
	3400 1100 3400 1000
Wire Wire Line
	3050 1100 3050 1000
$Comp
L Device:R R103
U 1 1 5BD0DC36
P 3650 600
F 0 "R103" V 3443 600 50  0000 C CNN
F 1 "10" V 3534 600 50  0000 C CNN
F 2 "Resistor_SMD:R_0603_1608Metric" V 3580 600 50  0001 C CNN
F 3 "~" H 3650 600 50  0001 C CNN
	1    3650 600 
	0    1    1    0   
$EndComp
Wire Wire Line
	2550 600  3050 600 
Wire Wire Line
	3800 600  4100 600 
Wire Wire Line
	3400 700  3400 600 
Connection ~ 3400 600 
Wire Wire Line
	3400 600  3500 600 
Wire Wire Line
	3050 700  3050 600 
Connection ~ 3050 600 
Wire Wire Line
	3050 600  3400 600 
$Comp
L power:GND #PWR?
U 1 1 5BD2DD57
P 2300 1900
F 0 "#PWR?" H 2300 1650 50  0001 C CNN
F 1 "GND" H 2300 1750 50  0000 C CNN
F 2 "" H 2300 1900 50  0001 C CNN
F 3 "" H 2300 1900 50  0001 C CNN
	1    2300 1900
	1    0    0    -1  
$EndComp
Wire Wire Line
	2300 1900 2300 1800
$Comp
L power:GND #PWR?
U 1 1 5BD3EF62
P 2650 4900
F 0 "#PWR?" H 2650 4650 50  0001 C CNN
F 1 "GND" H 2650 4750 50  0000 C CNN
F 2 "" H 2650 4900 50  0001 C CNN
F 3 "" H 2650 4900 50  0001 C CNN
	1    2650 4900
	1    0    0    -1  
$EndComp
Wire Wire Line
	2650 4900 2650 4800
$Comp
L Device:R R101
U 1 1 5BD4794A
P 2550 2050
F 0 "R101" H 2620 2096 50  0000 L CNN
F 1 "100" H 2620 2005 50  0000 L CNN
F 2 "Resistor_SMD:R_0603_1608Metric" V 2480 2050 50  0001 C CNN
F 3 "~" H 2550 2050 50  0001 C CNN
	1    2550 2050
	1    0    0    -1  
$EndComp
Wire Wire Line
	2550 1900 2550 1800
$Comp
L Device:R R102
U 1 1 5BD5058B
P 2900 5050
F 0 "R102" H 2970 5096 50  0000 L CNN
F 1 "100" H 2970 5005 50  0000 L CNN
F 2 "Resistor_SMD:R_0603_1608Metric" V 2830 5050 50  0001 C CNN
F 3 "~" H 2900 5050 50  0001 C CNN
	1    2900 5050
	1    0    0    -1  
$EndComp
Wire Wire Line
	2900 4900 2900 4850
Wire Wire Line
	2550 2200 2550 2300
Wire Wire Line
	2550 2300 3000 2300
Wire Wire Line
	2900 5200 2900 5300
Wire Wire Line
	2900 5300 3300 5300
$Comp
L Device:C C102
U 1 1 5BD6BEFC
P 3250 3600
F 0 "C102" H 3365 3646 50  0000 L CNN
F 1 "1u" H 3365 3555 50  0000 L CNN
F 2 "Capacitor_SMD:C_0402_1005Metric" H 3288 3450 50  0001 C CNN
F 3 "~" H 3250 3600 50  0001 C CNN
	1    3250 3600
	1    0    0    -1  
$EndComp
$Comp
L Device:C C104
U 1 1 5BD6C0DF
P 3550 3600
F 0 "C104" H 3665 3646 50  0000 L CNN
F 1 "1n" H 3665 3555 50  0000 L CNN
F 2 "Capacitor_SMD:C_0402_1005Metric" H 3588 3450 50  0001 C CNN
F 3 "~" H 3550 3600 50  0001 C CNN
	1    3550 3600
	1    0    0    -1  
$EndComp
Wire Wire Line
	3550 3450 3550 3250
Wire Wire Line
	3550 3250 3800 3250
Wire Wire Line
	3250 3450 3250 3250
Wire Wire Line
	3250 3250 3550 3250
Connection ~ 3550 3250
Wire Wire Line
	3250 3250 2900 3250
Wire Wire Line
	2900 3250 2900 4000
Connection ~ 3250 3250
$Comp
L power:GND #PWR?
U 1 1 5BD89688
P 3250 3850
F 0 "#PWR?" H 3250 3600 50  0001 C CNN
F 1 "GND" H 3250 3700 50  0000 C CNN
F 2 "" H 3250 3850 50  0001 C CNN
F 3 "" H 3250 3850 50  0001 C CNN
	1    3250 3850
	1    0    0    -1  
$EndComp
$Comp
L power:GND #PWR?
U 1 1 5BD8970B
P 3550 3850
F 0 "#PWR?" H 3550 3600 50  0001 C CNN
F 1 "GND" H 3550 3700 50  0000 C CNN
F 2 "" H 3550 3850 50  0001 C CNN
F 3 "" H 3550 3850 50  0001 C CNN
	1    3550 3850
	1    0    0    -1  
$EndComp
Wire Wire Line
	3550 3850 3550 3750
Wire Wire Line
	3250 3850 3250 3750
Text Label 3000 5300 0    50   ~ 0
RX_chain_sw
Text Label 2650 2300 0    50   ~ 0
TX_chain_sw
Wire Wire Line
	8600 2500 9500 2500
Wire Wire Line
	9500 2600 9000 2600
$Comp
L Connector:TestPoint TP112
U 1 1 5BDE625F
P 9050 650
F 0 "TP112" H 9108 770 50  0000 L CNN
F 1 "TestPoint" H 9108 679 50  0000 L CNN
F 2 "TestPoint:TestPoint_Pad_D1.0mm" H 9250 650 50  0001 C CNN
F 3 "~" H 9250 650 50  0001 C CNN
	1    9050 650 
	1    0    0    -1  
$EndComp
$Comp
L Connector:TestPoint TP113
U 1 1 5BDE65DA
P 10550 2950
F 0 "TP113" H 10608 3070 50  0000 L CNN
F 1 "TestPoint" H 10608 2979 50  0000 L CNN
F 2 "TestPoint:TestPoint_Pad_D1.0mm" H 10750 2950 50  0001 C CNN
F 3 "~" H 10750 2950 50  0001 C CNN
	1    10550 2950
	1    0    0    -1  
$EndComp
$Comp
L Connector:TestPoint TP114
U 1 1 5BDE6684
P 10650 3150
F 0 "TP114" H 10708 3270 50  0000 L CNN
F 1 "TestPoint" H 10708 3179 50  0000 L CNN
F 2 "TestPoint:TestPoint_Pad_D1.0mm" H 10850 3150 50  0001 C CNN
F 3 "~" H 10850 3150 50  0001 C CNN
	1    10650 3150
	1    0    0    -1  
$EndComp
$Comp
L Connector:TestPoint TP115
U 1 1 5BDE6716
P 10750 3350
F 0 "TP115" H 10808 3470 50  0000 L CNN
F 1 "TestPoint" H 10808 3379 50  0000 L CNN
F 2 "TestPoint:TestPoint_Pad_D1.0mm" H 10950 3350 50  0001 C CNN
F 3 "~" H 10950 3350 50  0001 C CNN
	1    10750 3350
	1    0    0    -1  
$EndComp
Wire Wire Line
	10550 2950 9850 2950
Connection ~ 9850 2950
Wire Wire Line
	9850 2950 9850 2850
Wire Wire Line
	10650 3150 9950 3150
Connection ~ 9950 3150
Wire Wire Line
	9950 3150 9950 3550
Wire Wire Line
	10750 3350 10050 3350
Connection ~ 10050 3350
Wire Wire Line
	10050 3350 10050 2850
$Comp
L Connector:TestPoint TP111
U 1 1 5BE0A5BD
P 8550 5500
F 0 "TP111" H 8608 5620 50  0000 L CNN
F 1 "TestPoint" H 8608 5529 50  0000 L CNN
F 2 "TestPoint:TestPoint_Pad_D1.0mm" H 8750 5500 50  0001 C CNN
F 3 "~" H 8750 5500 50  0001 C CNN
	1    8550 5500
	1    0    0    -1  
$EndComp
Connection ~ 8550 5500
Wire Wire Line
	8550 5500 8400 5500
Wire Wire Line
	6600 5500 6600 6300
Wire Wire Line
	6700 5800 6700 6400
Wire Wire Line
	6800 6250 6800 6500
$Comp
L Connector:TestPoint TP106
U 1 1 5BE3925D
P 6900 5100
F 0 "TP106" H 6958 5220 50  0000 L CNN
F 1 "TestPoint" H 6958 5129 50  0000 L CNN
F 2 "TestPoint:TestPoint_Pad_D1.0mm" H 7100 5100 50  0001 C CNN
F 3 "~" H 7100 5100 50  0001 C CNN
	1    6900 5100
	1    0    0    -1  
$EndComp
$Comp
L Connector:TestPoint TP108
U 1 1 5BE39471
P 7000 5350
F 0 "TP108" H 7058 5470 50  0000 L CNN
F 1 "TestPoint" H 7058 5379 50  0000 L CNN
F 2 "TestPoint:TestPoint_Pad_D1.0mm" H 7200 5350 50  0001 C CNN
F 3 "~" H 7200 5350 50  0001 C CNN
	1    7000 5350
	1    0    0    -1  
$EndComp
$Comp
L Connector:TestPoint TP110
U 1 1 5BE39511
P 7100 5700
F 0 "TP110" H 7158 5820 50  0000 L CNN
F 1 "TestPoint" H 7158 5729 50  0000 L CNN
F 2 "TestPoint:TestPoint_Pad_D1.0mm" H 7300 5700 50  0001 C CNN
F 3 "~" H 7300 5700 50  0001 C CNN
	1    7100 5700
	1    0    0    -1  
$EndComp
Wire Wire Line
	7100 5700 7100 5850
Wire Wire Line
	7100 5850 6800 5850
Connection ~ 6800 5850
Wire Wire Line
	6800 5850 6800 4800
Wire Wire Line
	7000 5350 7000 5450
Wire Wire Line
	7000 5450 6700 5450
Connection ~ 6700 5450
Wire Wire Line
	6700 5450 6700 5500
Wire Wire Line
	6900 5100 6600 5100
Connection ~ 6600 5100
Wire Wire Line
	6600 5100 6600 4800
$Comp
L Device:R R106
U 1 1 5BE567AA
P 3950 3250
F 0 "R106" V 3743 3250 50  0000 C CNN
F 1 "10" V 3834 3250 50  0000 C CNN
F 2 "Resistor_SMD:R_0603_1608Metric" V 3880 3250 50  0001 C CNN
F 3 "~" H 3950 3250 50  0001 C CNN
	1    3950 3250
	0    1    1    0   
$EndComp
Wire Wire Line
	4300 3250 4100 3250
$Comp
L Connector:TestPoint TP103
U 1 1 5BE60C29
P 3250 3250
F 0 "TP103" H 3308 3370 50  0000 L CNN
F 1 "TestPoint" H 3308 3279 50  0000 L CNN
F 2 "TestPoint:TestPoint_Pad_D1.0mm" H 3450 3250 50  0001 C CNN
F 3 "~" H 3450 3250 50  0001 C CNN
	1    3250 3250
	1    0    0    -1  
$EndComp
$Comp
L Connector:TestPoint TP101
U 1 1 5BE60E3D
P 3050 600
F 0 "TP101" H 3108 720 50  0000 L CNN
F 1 "TestPoint" H 3108 629 50  0000 L CNN
F 2 "TestPoint:TestPoint_Pad_D1.0mm" H 3250 600 50  0001 C CNN
F 3 "~" H 3250 600 50  0001 C CNN
	1    3050 600 
	1    0    0    -1  
$EndComp
$Comp
L Connector:TestPoint TP104
U 1 1 5BE6163E
P 3350 4800
F 0 "TP104" H 3408 4920 50  0000 L CNN
F 1 "TestPoint" H 3408 4829 50  0000 L CNN
F 2 "TestPoint:TestPoint_Pad_D1.0mm" H 3550 4800 50  0001 C CNN
F 3 "~" H 3550 4800 50  0001 C CNN
	1    3350 4800
	1    0    0    -1  
$EndComp
Wire Wire Line
	3350 4800 3350 4850
Wire Wire Line
	3350 4850 2900 4850
Connection ~ 2900 4850
Wire Wire Line
	2900 4850 2900 4800
$Comp
L Connector:TestPoint TP102
U 1 1 5BE6BE4C
P 3200 1800
F 0 "TP102" H 3258 1920 50  0000 L CNN
F 1 "TestPoint" H 3258 1829 50  0000 L CNN
F 2 "TestPoint:TestPoint_Pad_D1.0mm" H 3400 1800 50  0001 C CNN
F 3 "~" H 3400 1800 50  0001 C CNN
	1    3200 1800
	1    0    0    -1  
$EndComp
Wire Wire Line
	3200 1800 2550 1800
Wire Wire Line
	6600 2850 6600 3300
Wire Wire Line
	6700 3150 6700 3400
Wire Wire Line
	6800 3450 6800 3500
$Comp
L Connector:TestPoint TP105
U 1 1 5BECDB0B
P 6900 2350
F 0 "TP105" H 6958 2470 50  0000 L CNN
F 1 "TestPoint" H 6958 2379 50  0000 L CNN
F 2 "TestPoint:TestPoint_Pad_D1.0mm" H 7100 2350 50  0001 C CNN
F 3 "~" H 7100 2350 50  0001 C CNN
	1    6900 2350
	1    0    0    -1  
$EndComp
$Comp
L Connector:TestPoint TP107
U 1 1 5BF03307
P 7000 2550
F 0 "TP107" H 7058 2670 50  0000 L CNN
F 1 "TestPoint" H 7058 2579 50  0000 L CNN
F 2 "TestPoint:TestPoint_Pad_D1.0mm" H 7200 2550 50  0001 C CNN
F 3 "~" H 7200 2550 50  0001 C CNN
	1    7000 2550
	1    0    0    -1  
$EndComp
$Comp
L Connector:TestPoint TP109
U 1 1 5BF033B1
P 7100 2750
F 0 "TP109" H 7158 2870 50  0000 L CNN
F 1 "TestPoint" H 7158 2779 50  0000 L CNN
F 2 "TestPoint:TestPoint_Pad_D1.0mm" H 7300 2750 50  0001 C CNN
F 3 "~" H 7300 2750 50  0001 C CNN
	1    7100 2750
	1    0    0    -1  
$EndComp
Wire Wire Line
	6900 2350 6600 2350
Connection ~ 6600 2350
Wire Wire Line
	6600 2350 6600 1800
Wire Wire Line
	7000 2550 6700 2550
Connection ~ 6700 2550
Wire Wire Line
	6700 2550 6700 2850
Wire Wire Line
	7100 2750 6800 2750
Connection ~ 6800 2750
Wire Wire Line
	6800 2750 6800 1800
Wire Wire Line
	6250 3300 6600 3300
Wire Wire Line
	6250 3400 6700 3400
Wire Wire Line
	6250 3500 6800 3500
Text Label 8850 2500 0    50   ~ 0
ANT_p5
Text Label 9200 2600 0    50   ~ 0
ANT_p6
Wire Wire Line
	9050 650  9050 800 
Wire Wire Line
	9050 800  9450 800 
Connection ~ 9450 800 
Wire Wire Line
	9450 800  9450 1800
Text Label 2900 3650 1    50   ~ 0
VCC_4_filt
Text Label 2550 600  0    50   ~ 0
VCC_5_filt
Text Label 2950 4850 0    50   ~ 0
RX_chain_sw_R
Text Label 2600 1800 0    50   ~ 0
TX_chain_sw_R
Text Label 3100 1350 0    50   ~ 0
TX_filtered_out_1
Text Label 3100 1450 0    50   ~ 0
TX_filtered_out_2
$Sheet
S 3950 1800 550  300 
U 5BB89AD3
F0 "PA2_3" 50
F1 "PA2.sch" 50
F2 "in" I L 3950 1950 50 
F3 "out" O R 4500 1950 50 
$EndSheet
$Sheet
S 4850 1800 550  300 
U 5BB89AD7
F0 "PA2_4" 50
F1 "PA2.sch" 50
F2 "in" I L 4850 1950 50 
F3 "out" O R 5400 1950 50 
$EndSheet
Wire Wire Line
	4500 1950 4850 1950
Text Label 4500 1950 0    50   ~ 0
PA2_1_2
Wire Wire Line
	3800 4350 3350 4350
Wire Wire Line
	3800 4350 3800 5300
Wire Wire Line
	3900 4400 3900 4450
Wire Wire Line
	3900 4450 3350 4450
Wire Wire Line
	1800 6000 2400 6000
$Comp
L Connector:TestPoint TP116
U 1 1 5BBC8CCB
P 6700 600
F 0 "TP116" H 6758 720 50  0000 L CNN
F 1 "TestPoint" H 6758 629 50  0000 L CNN
F 2 "TestPoint:TestPoint_Pad_D1.0mm" H 6900 600 50  0001 C CNN
F 3 "~" H 6900 600 50  0001 C CNN
	1    6700 600 
	1    0    0    -1  
$EndComp
Connection ~ 6700 600 
$Comp
L POWDER_RF:D6DA2G132K2D4 U106
U 1 1 5BBDC608
P 5550 2850
F 0 "U106" H 5475 3365 50  0000 C CNN
F 1 "D6DA2G132K2D4" H 5475 3274 50  0000 C CNN
F 2 "POWDER_RF:D6DA2G132K2D4" H 5550 2850 50  0001 C CNN
F 3 "" H 5550 2850 50  0001 C CNN
	1    5550 2850
	1    0    0    -1  
$EndComp
Wire Wire Line
	6050 2850 6100 2850
Text Label 6100 2850 0    50   ~ 0
ANT_p1
$Comp
L power:GND #PWR?
U 1 1 5BBF3A2F
P 5200 3600
F 0 "#PWR?" H 5200 3350 50  0001 C CNN
F 1 "GND" H 5205 3427 50  0000 C CNN
F 2 "" H 5200 3600 50  0001 C CNN
F 3 "" H 5200 3600 50  0001 C CNN
	1    5200 3600
	1    0    0    -1  
$EndComp
$Comp
L power:GND #PWR?
U 1 1 5BBF3ACF
P 5300 3600
F 0 "#PWR?" H 5300 3350 50  0001 C CNN
F 1 "GND" H 5305 3427 50  0000 C CNN
F 2 "" H 5300 3600 50  0001 C CNN
F 3 "" H 5300 3600 50  0001 C CNN
	1    5300 3600
	1    0    0    -1  
$EndComp
$Comp
L power:GND #PWR?
U 1 1 5BBF3B68
P 5400 3600
F 0 "#PWR?" H 5400 3350 50  0001 C CNN
F 1 "GND" H 5405 3427 50  0000 C CNN
F 2 "" H 5400 3600 50  0001 C CNN
F 3 "" H 5400 3600 50  0001 C CNN
	1    5400 3600
	1    0    0    -1  
$EndComp
$Comp
L power:GND #PWR?
U 1 1 5BBF3C01
P 5500 3600
F 0 "#PWR?" H 5500 3350 50  0001 C CNN
F 1 "GND" H 5505 3427 50  0000 C CNN
F 2 "" H 5500 3600 50  0001 C CNN
F 3 "" H 5500 3600 50  0001 C CNN
	1    5500 3600
	1    0    0    -1  
$EndComp
$Comp
L power:GND #PWR?
U 1 1 5BBF3C9A
P 5600 3600
F 0 "#PWR?" H 5600 3350 50  0001 C CNN
F 1 "GND" H 5605 3427 50  0000 C CNN
F 2 "" H 5600 3600 50  0001 C CNN
F 3 "" H 5600 3600 50  0001 C CNN
	1    5600 3600
	1    0    0    -1  
$EndComp
Wire Wire Line
	5600 3600 5600 3450
Wire Wire Line
	5500 3450 5500 3600
Wire Wire Line
	5400 3600 5400 3450
Wire Wire Line
	5300 3450 5300 3600
Wire Wire Line
	5200 3600 5200 3450
Text Label 4600 3050 0    50   ~ 0
TX_p4
$Comp
L Device:L L101
U 1 1 5BC3B78E
P 4450 2850
F 0 "L101" H 4503 2896 50  0000 L CNN
F 1 "9.1n" H 4503 2805 50  0000 L CNN
F 2 "Inductor_SMD:L_0603_1608Metric" H 4450 2850 50  0001 C CNN
F 3 "~" H 4450 2850 50  0001 C CNN
	1    4450 2850
	1    0    0    -1  
$EndComp
$Comp
L Device:L L102
U 1 1 5BC3B8CD
P 6100 3100
F 0 "L102" H 6153 3146 50  0000 L CNN
F 1 "4.3n" H 6153 3055 50  0000 L CNN
F 2 "Inductor_SMD:L_0603_1608Metric" H 6100 3100 50  0001 C CNN
F 3 "~" H 6100 3100 50  0001 C CNN
	1    6100 3100
	1    0    0    -1  
$EndComp
Wire Wire Line
	6100 2850 6100 2950
$Comp
L power:GND #PWR?
U 1 1 5BC60BEA
P 4450 3100
F 0 "#PWR?" H 4450 2850 50  0001 C CNN
F 1 "GND" H 4455 2927 50  0000 C CNN
F 2 "" H 4450 3100 50  0001 C CNN
F 3 "" H 4450 3100 50  0001 C CNN
	1    4450 3100
	1    0    0    -1  
$EndComp
$Comp
L power:GND #PWR?
U 1 1 5BC60C85
P 6100 3600
F 0 "#PWR?" H 6100 3350 50  0001 C CNN
F 1 "GND" H 6105 3427 50  0000 C CNN
F 2 "" H 6100 3600 50  0001 C CNN
F 3 "" H 6100 3600 50  0001 C CNN
	1    6100 3600
	1    0    0    -1  
$EndComp
Wire Wire Line
	6100 3250 6100 3600
Wire Wire Line
	4450 2700 4450 2600
Wire Wire Line
	4450 3000 4450 3100
Connection ~ 6100 2850
Wire Wire Line
	6100 2850 6350 2850
Wire Wire Line
	4300 2600 4450 2600
Text Label 4600 2600 0    50   ~ 0
RX_p3
Connection ~ 4450 2600
Wire Wire Line
	4450 2600 4900 2600
Wire Wire Line
	4550 3050 4900 3050
$EndSCHEMATC
