EESchema Schematic File Version 4
EELAYER 30 0
EELAYER END
$Descr A4 11693 8268
encoding utf-8
Sheet 37 39
Title ""
Date ""
Rev ""
Comp ""
Comment1 ""
Comment2 ""
Comment3 ""
Comment4 ""
$EndDescr
$Comp
L power:GND #PWR?
U 1 1 6192AEA9
P 2250 4150
AR Path="/605746B5/5F8E5420/5F955280/611AB01D/6192AEA9" Ref="#PWR?"  Part="1" 
AR Path="/6192AEA9" Ref="#PWR?"  Part="1" 
AR Path="/61921A24/6192AEA9" Ref="#PWR?"  Part="1" 
F 0 "#PWR?" H 2250 3900 50  0001 C CNN
F 1 "GND" H 2255 3977 50  0000 C CNN
F 2 "" H 2250 4150 50  0001 C CNN
F 3 "" H 2250 4150 50  0001 C CNN
	1    2250 4150
	1    0    0    -1  
$EndComp
Text Label 2750 4450 0    50   ~ 0
GPAI7
Wire Wire Line
	3000 4450 2750 4450
Text Label 2750 4350 0    50   ~ 0
GPAI5
Wire Wire Line
	3000 4350 2750 4350
Text Label 2750 4250 0    50   ~ 0
GPAI3
Wire Wire Line
	3000 4250 2750 4250
Text Label 2750 4150 0    50   ~ 0
GPAI1
Wire Wire Line
	3000 4150 2750 4150
Text Label 3500 4350 0    50   ~ 0
GPAI6
Wire Wire Line
	3500 4350 3750 4350
Text Label 3500 4250 0    50   ~ 0
GPAI4
Wire Wire Line
	3500 4250 3750 4250
Text Label 3500 4150 0    50   ~ 0
GPAI2
Wire Wire Line
	3500 4150 3750 4150
Text Label 3500 4050 0    50   ~ 0
GPAI0
Wire Wire Line
	3500 4050 3750 4050
Wire Wire Line
	3600 4450 3500 4450
Wire Wire Line
	3600 4550 3600 4450
$Comp
L power:GND #PWR?
U 1 1 6192AEC2
P 3600 4550
AR Path="/605746B5/5F8E5420/5F955280/611AB01D/6192AEC2" Ref="#PWR?"  Part="1" 
AR Path="/6192AEC2" Ref="#PWR?"  Part="1" 
AR Path="/61921A24/6192AEC2" Ref="#PWR?"  Part="1" 
F 0 "#PWR?" H 3600 4300 50  0001 C CNN
F 1 "GND" H 3605 4377 50  0000 C CNN
F 2 "" H 3600 4550 50  0001 C CNN
F 3 "" H 3600 4550 50  0001 C CNN
	1    3600 4550
	1    0    0    -1  
$EndComp
Wire Wire Line
	2250 3950 3000 3950
$Comp
L Connector_Generic:Conn_02x05_Odd_Even J?
U 1 1 6192AEC9
P 3200 4250
AR Path="/605746B5/5F8E5420/5F955280/611AB01D/6192AEC9" Ref="J?"  Part="1" 
AR Path="/6192AEC9" Ref="J?"  Part="1" 
AR Path="/61921A24/6192AEC9" Ref="J3601"  Part="1" 
F 0 "J3601" H 3250 4667 50  0000 C CNN
F 1 "Conn_02x05_Odd_Even" H 3250 4576 50  0000 C CNN
F 2 "Connector_PinHeader_2.54mm:PinHeader_2x05_P2.54mm_Vertical" H 3200 4250 50  0001 C CNN
F 3 "~" H 3200 4250 50  0001 C CNN
F 4 "3000-0000001280" H 3200 4250 50  0001 C CNN "PartSpecification"
	1    3200 4250
	1    0    0    -1  
$EndComp
$Comp
L POWDER_ESD:D5V0P4UR6SO U?
U 1 1 6192AECF
P 4450 2450
AR Path="/60834A7B/6083FA27/6192AECF" Ref="U?"  Part="1" 
AR Path="/61921A24/6192AECF" Ref="U3601"  Part="1" 
F 0 "U3601" H 4700 2950 50  0000 C CNN
F 1 "D5V0P4UR6SO" H 4100 2950 50  0000 C CNN
F 2 "Package_TO_SOT_SMD:SOT-23-6" H 5100 3100 50  0001 C CNN
F 3 "" H 4450 2450 50  0001 C CNN
F 4 "3000-0000001313" H 4450 2450 50  0001 C CNN "PartSpecification"
	1    4450 2450
	1    0    0    -1  
$EndComp
$Comp
L POWDER_ESD:D5V0P4UR6SO U?
U 1 1 6192AED5
P 4450 5450
AR Path="/60834A7B/6083FA27/6192AED5" Ref="U?"  Part="1" 
AR Path="/61921A24/6192AED5" Ref="U3602"  Part="1" 
F 0 "U3602" H 4700 5950 50  0000 C CNN
F 1 "D5V0P4UR6SO" H 4100 5950 50  0000 C CNN
F 2 "Package_TO_SOT_SMD:SOT-23-6" H 5100 6100 50  0001 C CNN
F 3 "" H 4450 5450 50  0001 C CNN
F 4 "3000-0000001313" H 4450 5450 50  0001 C CNN "PartSpecification"
	1    4450 5450
	1    0    0    -1  
$EndComp
Text Label 5100 2500 0    50   ~ 0
GPAI0
Text Label 3800 2400 2    50   ~ 0
GPAI2
Text Label 3750 5400 2    50   ~ 0
GPAI1
Text Label 5100 5500 0    50   ~ 0
GPAI3
$Comp
L power:GND #PWR?
U 1 1 61932BC4
P 4450 6100
AR Path="/605746B5/5F8E5420/5F955280/611AB01D/61932BC4" Ref="#PWR?"  Part="1" 
AR Path="/61932BC4" Ref="#PWR?"  Part="1" 
AR Path="/61921A24/61932BC4" Ref="#PWR?"  Part="1" 
F 0 "#PWR?" H 4450 5850 50  0001 C CNN
F 1 "GND" H 4455 5927 50  0000 C CNN
F 2 "" H 4450 6100 50  0001 C CNN
F 3 "" H 4450 6100 50  0001 C CNN
	1    4450 6100
	1    0    0    -1  
$EndComp
Wire Wire Line
	4450 6100 4450 6000
Wire Wire Line
	3750 5400 3900 5400
Wire Wire Line
	3900 5500 3750 5500
Wire Wire Line
	5000 5400 5100 5400
Wire Wire Line
	5100 5500 5000 5500
$Comp
L power:GND #PWR?
U 1 1 619370D5
P 4450 3100
AR Path="/605746B5/5F8E5420/5F955280/611AB01D/619370D5" Ref="#PWR?"  Part="1" 
AR Path="/619370D5" Ref="#PWR?"  Part="1" 
AR Path="/61921A24/619370D5" Ref="#PWR?"  Part="1" 
F 0 "#PWR?" H 4450 2850 50  0001 C CNN
F 1 "GND" H 4455 2927 50  0000 C CNN
F 2 "" H 4450 3100 50  0001 C CNN
F 3 "" H 4450 3100 50  0001 C CNN
	1    4450 3100
	1    0    0    -1  
$EndComp
Wire Wire Line
	4450 3100 4450 3000
Text Label 3800 2500 2    50   ~ 0
GPAI4
Text Label 5100 2400 0    50   ~ 0
GPAI6
Text Label 5100 5400 0    50   ~ 0
GPAI5
Text Label 3750 5500 2    50   ~ 0
GPAI7
Wire Wire Line
	5100 2500 5000 2500
Wire Wire Line
	5100 2400 5000 2400
Wire Wire Line
	3800 2400 3900 2400
Wire Wire Line
	3900 2500 3800 2500
Wire Bus Line
	2650 3500 2000 3500
Wire Bus Line
	3850 3750 2650 3750
Connection ~ 2650 3750
Wire Bus Line
	2650 3750 2650 3500
Entry Wire Line
	2650 4350 2750 4450
Entry Wire Line
	2650 4250 2750 4350
Entry Wire Line
	2650 4150 2750 4250
Entry Wire Line
	2650 4050 2750 4150
Entry Wire Line
	3850 4250 3750 4350
Entry Wire Line
	3850 4150 3750 4250
Entry Wire Line
	3850 4050 3750 4150
Entry Wire Line
	3850 3950 3750 4050
Wire Wire Line
	3000 4050 3000 3950
Wire Wire Line
	2250 3950 2250 4150
Text HLabel 2000 3500 0    50   Output ~ 0
GPAI[0..7]
NoConn ~ 4450 1900
NoConn ~ 4450 4900
Wire Bus Line
	3850 3750 3850 4250
Wire Bus Line
	2650 3750 2650 4350
$EndSCHEMATC
