(module LOGO (layer F.Cu)
  (at 0 0)
 (fp_text reference "G***" (at 0 0) (layer F.SilkS) hide
  (effects (font (thickness 0.3)))
  )
  (fp_text value "LOGO" (at 0.75 0) (layer F.SilkS) hide
  (effects (font (thickness 0.3)))
  )
  (fp_poly (pts (xy 2.349409 -4.118610) (xy 2.400724 -4.014751) (xy 2.445960 -3.920634) (xy 2.482703 -3.841495) (xy 2.508541 -3.782567) (xy 2.521058 -3.749085) (xy 2.521857 -3.744658) (xy 2.513769 -3.720264)
     (xy 2.491188 -3.669093) (xy 2.456633 -3.596413) (xy 2.412627 -3.507497) (xy 2.361689 -3.407614) (xy 2.348204 -3.381619) (xy 2.174552 -3.048000) (xy 1.762649 -3.048000) (xy 1.670539 -2.873035)
     (xy 1.633256 -2.801658) (xy 1.603214 -2.743085) (xy 1.583874 -2.704134) (xy 1.578428 -2.691606) (xy 1.595574 -2.689455) (xy 1.643024 -2.687607) (xy 1.714797 -2.686191) (xy 1.804912 -2.685337)
     (xy 1.877634 -2.685143) (xy 2.176840 -2.685143) (xy 2.278945 -2.481550) (xy 2.381051 -2.277956) (xy 2.279197 -2.073335) (xy 2.177342 -1.868715) (xy 1.991278 -1.866406) (xy 1.886914 -1.864172)
     (xy 1.766444 -1.860168) (xy 1.649966 -1.855104) (xy 1.606503 -1.852799) (xy 1.407792 -1.841500) (xy 1.147700 -1.242786) (xy 1.331314 -0.884603) (xy 1.514928 -0.526419) (xy 1.689160 -0.526281)
     (xy 1.781145 -0.524940) (xy 1.874280 -0.521487) (xy 1.952567 -0.516576) (xy 1.972950 -0.514692) (xy 2.082509 -0.503241) (xy 2.276578 -0.886620) (xy 2.470647 -1.270000) (xy 2.591502 -1.269843)
     (xy 2.672684 -1.267938) (xy 2.755632 -1.263188) (xy 2.804813 -1.258575) (xy 2.897269 -1.247465) (xy 2.994855 -1.049683) (xy 3.092441 -0.851902) (xy 2.794141 -0.254000) (xy 3.173600 -0.254000)
     (xy 3.283195 -0.468963) (xy 3.392790 -0.683927) (xy 3.740125 -0.696718) (xy 3.848972 -0.699974) (xy 3.945291 -0.701425) (xy 4.023246 -0.701099) (xy 4.077003 -0.699027) (xy 4.100725 -0.695236)
     (xy 4.101085 -0.694934) (xy 4.113153 -0.675076) (xy 4.139094 -0.627914) (xy 4.176244 -0.558443) (xy 4.221939 -0.471658) (xy 4.273515 -0.372553) (xy 4.289545 -0.341539) (xy 4.464380 -0.002720)
     (xy 4.109428 0.708294) (xy 3.746535 0.703397) (xy 3.383643 0.698500) (xy 3.278712 0.494393) (xy 3.173782 0.290286) (xy 3.002034 0.290286) (xy 2.928112 0.291195) (xy 2.870148 0.293639)
     (xy 2.836033 0.297192) (xy 2.830285 0.299570) (xy 2.838025 0.317994) (xy 2.859523 0.363502) (xy 2.892201 0.430782) (xy 2.933480 0.514519) (xy 2.977168 0.602188) (xy 3.124050 0.895521)
     (xy 2.911928 1.306581) (xy 2.706075 1.301897) (xy 2.500222 1.297214) (xy 2.306932 0.921167) (xy 2.113643 0.545120) (xy 1.846035 0.541301) (xy 1.747056 0.539860) (xy 1.657494 0.538503)
     (xy 1.585322 0.537355) (xy 1.538509 0.536540) (xy 1.529204 0.536348) (xy 1.511655 0.537997) (xy 1.494694 0.546495) (xy 1.475601 0.565873) (xy 1.451657 0.600161) (xy 1.420143 0.653389)
     (xy 1.378337 0.729588) (xy 1.323521 0.832788) (xy 1.303481 0.870857) (xy 1.250571 0.972509) (xy 1.203897 1.064159) (xy 1.165996 1.140660) (xy 1.139405 1.196869) (xy 1.126660 1.227640)
     (xy 1.125919 1.230977) (xy 1.133168 1.254542) (xy 1.153945 1.304947) (xy 1.185725 1.376489) (xy 1.225982 1.463467) (xy 1.267292 1.550067) (xy 1.409728 1.844681) (xy 1.670971 1.856631)
     (xy 1.777354 1.861095) (xy 1.882655 1.864811) (xy 1.975804 1.867434) (xy 2.045729 1.868615) (xy 2.054778 1.868648) (xy 2.177342 1.868714) (xy 2.279197 2.073335) (xy 2.381051 2.277956)
     (xy 2.278945 2.481549) (xy 2.176840 2.685143) (xy 1.877634 2.685143) (xy 1.778033 2.685513) (xy 1.692478 2.686538) (xy 1.626947 2.688088) (xy 1.587424 2.690035) (xy 1.578428 2.691606)
     (xy 1.586358 2.709284) (xy 1.607839 2.752196) (xy 1.639411 2.813525) (xy 1.670539 2.873034) (xy 1.762649 3.048000) (xy 2.174552 3.048000) (xy 2.348204 3.381619) (xy 2.400477 3.483415)
     (xy 2.446448 3.575559) (xy 2.483595 3.652779) (xy 2.509398 3.709806) (xy 2.521335 3.741369) (xy 2.521857 3.744657) (xy 2.514014 3.769081) (xy 2.492094 3.820593) (xy 2.458510 3.893957)
     (xy 2.415678 3.983940) (xy 2.366009 4.085308) (xy 2.349409 4.118610) (xy 2.176961 4.463143) (xy 1.458259 4.463143) (xy 1.123509 3.739559) (xy 1.233326 3.520489) (xy 1.343142 3.301419)
     (xy 1.244772 3.117777) (xy 1.146401 2.934135) (xy 0.843643 3.528785) (xy 0.436315 3.539037) (xy 0.329167 3.325337) (xy 0.222020 3.111638) (xy 0.410785 2.734434) (xy 0.599550 2.357231)
     (xy 0.431638 2.047039) (xy 0.263726 1.736848) (xy -0.079732 1.745853) (xy -0.204641 1.749644) (xy -0.297816 1.753857) (xy -0.363809 1.758944) (xy -0.407172 1.765358) (xy -0.432457 1.773551)
     (xy -0.442916 1.781946) (xy -0.456273 1.807510) (xy -0.480220 1.860325) (xy -0.511945 1.933920) (xy -0.548635 2.021828) (xy -0.570647 2.075750) (xy -0.678651 2.342466) (xy -0.299357 3.105378)
     (xy -0.401227 3.298939) (xy -0.503096 3.492500) (xy -0.713753 3.497607) (xy -0.924409 3.502715) (xy -1.026802 3.298036) (xy -1.070898 3.210954) (xy -1.113984 3.127719) (xy -1.150947 3.058100)
     (xy -1.175512 3.013853) (xy -1.221828 2.934350) (xy -1.299432 3.086425) (xy -1.333534 3.155804) (xy -1.360255 3.215006) (xy -1.375762 3.255301) (xy -1.378117 3.265714) (xy -1.370939 3.291624)
     (xy -1.350548 3.342892) (xy -1.319959 3.412421) (xy -1.282187 3.493114) (xy -1.276784 3.504305) (xy -1.174369 3.715682) (xy -1.356513 4.066734) (xy -1.538658 4.417786) (xy -1.902984 4.422696)
     (xy -2.267309 4.427606) (xy -2.629433 3.704050) (xy -2.451191 3.362766) (xy -2.387840 3.242906) (xy -2.337947 3.152178) (xy -2.299266 3.086999) (xy -2.269553 3.043788) (xy -2.246562 3.018965)
     (xy -2.229582 3.009335) (xy -2.193613 3.004066) (xy -2.131288 2.999567) (xy -2.052538 2.996429) (xy -1.995273 2.995380) (xy -1.804332 2.993571) (xy -1.634968 2.652627) (xy -1.934520 2.639413)
     (xy -2.234071 2.626200) (xy -2.425227 2.222500) (xy -2.324403 2.018742) (xy -2.223578 1.814984) (xy -1.843357 1.810099) (xy -1.463137 1.805214) (xy -1.327360 1.516991) (xy -1.191583 1.228767)
     (xy -1.361946 0.886526) (xy -1.532308 0.544286) (xy -2.083945 0.544286) (xy -2.271694 0.911678) (xy -2.459443 1.279071) (xy -2.671893 1.284181) (xy -2.884342 1.289291) (xy -2.986459 1.084144)
     (xy -3.088575 0.878997) (xy -2.793787 0.290285) (xy -2.970786 0.290327) (xy -3.147786 0.290369) (xy -3.265712 0.515486) (xy -3.383639 0.740604) (xy -3.728355 0.747659) (xy -3.868317 0.749456)
     (xy -3.975659 0.748490) (xy -4.049312 0.744794) (xy -4.088204 0.738405) (xy -4.093263 0.735678) (xy -4.107346 0.714382) (xy -4.135069 0.665851) (xy -4.173647 0.595208) (xy -4.220293 0.507572)
     (xy -4.272221 0.408067) (xy -4.286184 0.381000) (xy -4.458914 0.045357) (xy -4.277191 -0.322036) (xy -4.095467 -0.689429) (xy -3.376386 -0.689429) (xy -3.262086 -0.472010) (xy -3.147786 -0.254590)
     (xy -2.979965 -0.254295) (xy -2.907111 -0.255528) (xy -2.850440 -0.259081) (xy -2.817874 -0.264321) (xy -2.813099 -0.267607) (xy -2.821219 -0.287509) (xy -2.843138 -0.334207) (xy -2.876174 -0.402171)
     (xy -2.917644 -0.485872) (xy -2.955987 -0.562222) (xy -3.097920 -0.843229) (xy -2.894516 -1.251857) (xy -2.474380 -1.251857) (xy -2.083766 -0.489857) (xy -1.944490 -0.489728) (xy -1.854794 -0.488019)
     (xy -1.759118 -0.483690) (xy -1.686403 -0.478375) (xy -1.567592 -0.467150) (xy -1.218800 -1.152072) (xy -1.563414 -1.814286) (xy -2.313945 -1.814286) (xy -2.417927 -2.023180) (xy -2.521908 -2.232074)
     (xy -2.423133 -2.429027) (xy -2.324358 -2.625979) (xy -2.032126 -2.639222) (xy -1.934300 -2.644445) (xy -1.851069 -2.650398) (xy -1.788332 -2.656538) (xy -1.751984 -2.662319) (xy -1.745340 -2.665739)
     (xy -1.754741 -2.687109) (xy -1.775492 -2.733542) (xy -1.804007 -2.797029) (xy -1.821692 -2.836292) (xy -1.892597 -2.993572) (xy -2.077959 -2.993572) (xy -2.167005 -2.993123) (xy -2.235555 -2.994290)
     (xy -2.288451 -3.000839) (xy -2.330536 -3.016538) (xy -2.366651 -3.045153) (xy -2.401638 -3.090453) (xy -2.440339 -3.156204) (xy -2.487597 -3.246174) (xy -2.544228 -3.356350) (xy -2.720812 -3.697908)
     (xy -2.544228 -4.057847) (xy -2.367643 -4.417786) (xy -2.002769 -4.422689) (xy -1.637895 -4.427593) (xy -1.454404 -4.073497) (xy -1.270912 -3.719401) (xy -1.375882 -3.497093) (xy -1.480852 -3.274786)
     (xy -1.407176 -3.117358) (xy -1.374076 -3.048072) (xy -1.345795 -2.991511) (xy -1.326358 -2.955598) (xy -1.320849 -2.947469) (xy -1.309120 -2.958747) (xy -1.284391 -2.997739) (xy -1.249473 -3.059499)
     (xy -1.207177 -3.139083) (xy -1.166907 -3.218290) (xy -1.025615 -3.501572) (xy -0.598515 -3.501572) (xy -0.496697 -3.297024) (xy -0.394879 -3.092477) (xy -0.776003 -2.330889) (xy -0.609725 -2.086195)
     (xy -0.443447 -1.841500) (xy -0.307902 -1.830264) (xy -0.232479 -1.825423) (xy -0.134890 -1.821148) (xy -0.029257 -1.817981) (xy 0.046790 -1.816657) (xy 0.265937 -1.814286) (xy 0.599445 -2.357442)
     (xy 0.410732 -2.734540) (xy 0.222020 -3.111638) (xy 0.329167 -3.325338) (xy 0.436315 -3.539037) (xy 0.639979 -3.533912) (xy 0.843643 -3.528786) (xy 1.146401 -2.934136) (xy 1.244772 -3.117778)
     (xy 1.343142 -3.301420) (xy 1.233326 -3.520489) (xy 1.123509 -3.739559) (xy 1.458259 -4.463143) (xy 2.176961 -4.463143) (xy 2.349409 -4.118610) )(layer F.SilkS) (width  0.010000)
  )
)
