EESchema Schematic File Version 4
LIBS:medium_voltage-cache
EELAYER 26 0
EELAYER END
$Descr A4 11693 8268
encoding utf-8
Sheet 1 1
Title ""
Date ""
Rev ""
Comp ""
Comment1 ""
Comment2 ""
Comment3 ""
Comment4 ""
$EndDescr
$Comp
L POWDER_Power:TPL7407LA U101
U 1 1 5C32BEF5
P 2650 3550
F 0 "U101" H 2400 4200 50  0000 C CNN
F 1 "TPL7407LA" H 2950 4200 50  0000 C CNN
F 2 "Package_SO:TSSOP-16_4.4x5mm_P0.65mm" H 2650 3450 50  0001 C CNN
F 3 "" H 2650 3450 50  0001 C CNN
	1    2650 3550
	1    0    0    -1  
$EndComp
$Comp
L power:+28V #PWR?
U 1 1 5C32BFC0
P 2650 2450
F 0 "#PWR?" H 2650 2300 50  0001 C CNN
F 1 "+28V" H 2665 2623 50  0000 C CNN
F 2 "" H 2900 2500 50  0001 C CNN
F 3 "" H 2900 2500 50  0001 C CNN
	1    2650 2450
	1    0    0    -1  
$EndComp
Wire Wire Line
	2650 2450 2650 2550
$Comp
L power:GND #PWR?
U 1 1 5C32C068
P 2650 4450
F 0 "#PWR?" H 2650 4200 50  0001 C CNN
F 1 "GND" H 2655 4277 50  0000 C CNN
F 2 "" H 2650 4450 50  0001 C CNN
F 3 "" H 2650 4450 50  0001 C CNN
	1    2650 4450
	1    0    0    -1  
$EndComp
Wire Wire Line
	2650 4450 2650 4200
$Comp
L POWDER_Power:TPS1H200A U102
U 1 1 5C32C09E
P 5950 3500
F 0 "U102" H 5500 4000 50  0000 L CNN
F 1 "TPS1H200A" H 6100 4000 50  0000 L CNN
F 2 "Package_SO:MSOP-8-1EP_3x3mm_P0.65mm_EP1.68x1.88mm" H 5950 3500 50  0001 C CNN
F 3 "" H 5950 3500 50  0001 C CNN
	1    5950 3500
	1    0    0    -1  
$EndComp
$Comp
L power:+28V #PWR?
U 1 1 5C32C106
P 5950 2750
F 0 "#PWR?" H 5950 2600 50  0001 C CNN
F 1 "+28V" H 5965 2923 50  0000 C CNN
F 2 "" H 6200 2800 50  0001 C CNN
F 3 "" H 6200 2800 50  0001 C CNN
	1    5950 2750
	1    0    0    -1  
$EndComp
Wire Wire Line
	5950 2750 5950 2800
$Comp
L power:GND #PWR?
U 1 1 5C32C122
P 5850 4250
F 0 "#PWR?" H 5850 4000 50  0001 C CNN
F 1 "GND" H 5855 4077 50  0000 C CNN
F 2 "" H 5850 4250 50  0001 C CNN
F 3 "" H 5850 4250 50  0001 C CNN
	1    5850 4250
	1    0    0    -1  
$EndComp
Wire Wire Line
	5850 4250 5850 4050
$Comp
L power:GND #PWR?
U 1 1 5C32C14A
P 6050 4250
F 0 "#PWR?" H 6050 4000 50  0001 C CNN
F 1 "GND" H 6055 4077 50  0000 C CNN
F 2 "" H 6050 4250 50  0001 C CNN
F 3 "" H 6050 4250 50  0001 C CNN
	1    6050 4250
	1    0    0    -1  
$EndComp
Wire Wire Line
	6050 4250 6050 4050
$Comp
L Connector:Conn_Coaxial_Power J105
U 1 1 5C32C33E
P 7150 3800
F 0 "J105" H 7238 3796 50  0000 L CNN
F 1 "Conn_Coaxial_Power" H 7238 3705 50  0000 L CNN
F 2 "POWDER_RF:031-5329-51RFX" H 7150 3750 50  0001 C CNN
F 3 "~" H 7150 3750 50  0001 C CNN
	1    7150 3800
	1    0    0    -1  
$EndComp
Wire Wire Line
	7150 3500 7150 3700
$Comp
L power:GND #PWR?
U 1 1 5C32C471
P 7150 4200
F 0 "#PWR?" H 7150 3950 50  0001 C CNN
F 1 "GND" H 7155 4027 50  0000 C CNN
F 2 "" H 7150 4200 50  0001 C CNN
F 3 "" H 7150 4200 50  0001 C CNN
	1    7150 4200
	1    0    0    -1  
$EndComp
Wire Wire Line
	7150 4200 7150 4000
$Comp
L Connector:Conn_01x02_Male J101
U 1 1 5C32C51B
P 1050 2150
F 0 "J101" H 1156 2328 50  0000 C CNN
F 1 "Conn_01x02_Male" H 1156 2237 50  0000 C CNN
F 2 "Connector_PinHeader_2.54mm:PinHeader_1x02_P2.54mm_Vertical" H 1050 2150 50  0001 C CNN
F 3 "~" H 1050 2150 50  0001 C CNN
	1    1050 2150
	1    0    0    -1  
$EndComp
$Comp
L Connector:Conn_01x08_Male J102
U 1 1 5C32C662
P 1150 3550
F 0 "J102" H 1256 4028 50  0000 C CNN
F 1 "Conn_01x08_Male" H 1256 3937 50  0000 C CNN
F 2 "Connector_PinHeader_2.54mm:PinHeader_1x08_P2.54mm_Vertical" H 1150 3550 50  0001 C CNN
F 3 "~" H 1150 3550 50  0001 C CNN
	1    1150 3550
	1    0    0    -1  
$EndComp
$Comp
L power:GND #PWR?
U 1 1 5C32C6FE
P 1550 4100
F 0 "#PWR?" H 1550 3850 50  0001 C CNN
F 1 "GND" H 1555 3927 50  0000 C CNN
F 2 "" H 1550 4100 50  0001 C CNN
F 3 "" H 1550 4100 50  0001 C CNN
	1    1550 4100
	1    0    0    -1  
$EndComp
Wire Wire Line
	1350 3950 1550 3950
Wire Wire Line
	1550 3950 1550 4100
$Comp
L power:+28V #PWR?
U 1 1 5C32C78C
P 1600 1950
F 0 "#PWR?" H 1600 1800 50  0001 C CNN
F 1 "+28V" H 1615 2123 50  0000 C CNN
F 2 "" H 1850 2000 50  0001 C CNN
F 3 "" H 1850 2000 50  0001 C CNN
	1    1600 1950
	1    0    0    -1  
$EndComp
Wire Wire Line
	1250 2150 1600 2150
Wire Wire Line
	1600 2150 1600 2000
$Comp
L power:GND #PWR?
U 1 1 5C32C854
P 1600 2450
F 0 "#PWR?" H 1600 2200 50  0001 C CNN
F 1 "GND" H 1605 2277 50  0000 C CNN
F 2 "" H 1600 2450 50  0001 C CNN
F 3 "" H 1600 2450 50  0001 C CNN
	1    1600 2450
	1    0    0    -1  
$EndComp
Wire Wire Line
	1600 2450 1600 2400
Wire Wire Line
	1600 2250 1250 2250
Wire Wire Line
	1350 3350 2250 3350
Wire Wire Line
	2250 3450 1350 3450
Wire Wire Line
	1350 3550 2250 3550
Wire Wire Line
	2250 3650 1350 3650
Wire Wire Line
	1350 3750 2250 3750
Wire Wire Line
	2250 3850 1350 3850
$Comp
L Connector:Conn_01x08_Male J103
U 1 1 5C32D3EB
P 3600 3550
F 0 "J103" H 3573 3523 50  0000 R CNN
F 1 "Conn_01x08_Male" H 3573 3432 50  0000 R CNN
F 2 "Connector_PinHeader_2.54mm:PinHeader_1x08_P2.54mm_Vertical" H 3600 3550 50  0001 C CNN
F 3 "~" H 3600 3550 50  0001 C CNN
	1    3600 3550
	-1   0    0    -1  
$EndComp
$Comp
L power:GND #PWR?
U 1 1 5C32D49C
P 3300 4050
F 0 "#PWR?" H 3300 3800 50  0001 C CNN
F 1 "GND" H 3305 3877 50  0000 C CNN
F 2 "" H 3300 4050 50  0001 C CNN
F 3 "" H 3300 4050 50  0001 C CNN
	1    3300 4050
	1    0    0    -1  
$EndComp
Wire Wire Line
	3300 4050 3300 3950
Wire Wire Line
	3300 3950 3400 3950
Wire Wire Line
	3050 3850 3400 3850
Wire Wire Line
	3400 3750 3050 3750
Wire Wire Line
	3050 3650 3400 3650
Wire Wire Line
	3400 3550 3050 3550
Wire Wire Line
	3050 3450 3400 3450
Wire Wire Line
	3400 3350 3050 3350
Wire Wire Line
	3050 3250 3250 3250
Wire Wire Line
	5000 3200 5350 3200
Wire Wire Line
	3250 3250 3250 2850
Wire Wire Line
	3250 2850 6800 2850
Connection ~ 3250 3250
Wire Wire Line
	3250 3250 3400 3250
$Comp
L Device:R R102
U 1 1 5C32F599
P 4400 4000
F 0 "R102" H 4470 4046 50  0000 L CNN
F 1 "2k" H 4470 3955 50  0000 L CNN
F 2 "Resistor_SMD:R_0603_1608Metric" V 4330 4000 50  0001 C CNN
F 3 "~" H 4400 4000 50  0001 C CNN
	1    4400 4000
	1    0    0    -1  
$EndComp
Wire Wire Line
	4400 3850 4400 3400
Wire Wire Line
	4400 3400 5350 3400
$Comp
L power:GND #PWR?
U 1 1 5C32FCE2
P 4400 4300
F 0 "#PWR?" H 4400 4050 50  0001 C CNN
F 1 "GND" H 4405 4127 50  0000 C CNN
F 2 "" H 4400 4300 50  0001 C CNN
F 3 "" H 4400 4300 50  0001 C CNN
	1    4400 4300
	1    0    0    -1  
$EndComp
Wire Wire Line
	4400 4300 4400 4150
$Comp
L Device:R R101
U 1 1 5C330470
P 4300 3150
F 0 "R101" H 4370 3196 50  0000 L CNN
F 1 "R" H 4370 3105 50  0000 L CNN
F 2 "Resistor_SMD:R_0603_1608Metric" V 4230 3150 50  0001 C CNN
F 3 "~" H 4300 3150 50  0001 C CNN
	1    4300 3150
	1    0    0    -1  
$EndComp
Wire Wire Line
	4300 3300 4300 3500
Wire Wire Line
	4300 3500 5350 3500
Wire Wire Line
	4300 3000 4300 2900
Wire Wire Line
	4300 2900 5950 2900
Connection ~ 5950 2900
Wire Wire Line
	5950 2900 5950 2950
$Comp
L Connector:Conn_01x04_Male J104
U 1 1 5C3316CB
P 4700 3800
F 0 "J104" H 4806 4078 50  0000 C CNN
F 1 "Conn_01x04_Male" H 4806 3987 50  0000 C CNN
F 2 "Connector_PinHeader_2.54mm:PinHeader_1x04_P2.54mm_Vertical" H 4700 3800 50  0001 C CNN
F 3 "~" H 4700 3800 50  0001 C CNN
	1    4700 3800
	1    0    0    -1  
$EndComp
$Comp
L power:GND #PWR?
U 1 1 5C333482
P 5050 4150
F 0 "#PWR?" H 5050 3900 50  0001 C CNN
F 1 "GND" H 5055 3977 50  0000 C CNN
F 2 "" H 5050 4150 50  0001 C CNN
F 3 "" H 5050 4150 50  0001 C CNN
	1    5050 4150
	1    0    0    -1  
$EndComp
Wire Wire Line
	4900 4000 5050 4000
Wire Wire Line
	5050 4000 5050 4150
$Comp
L Device:C C103
U 1 1 5C33731F
P 4100 3950
F 0 "C103" H 4215 3996 50  0000 L CNN
F 1 "C" H 4215 3905 50  0000 L CNN
F 2 "Capacitor_SMD:C_0603_1608Metric" H 4138 3800 50  0001 C CNN
F 3 "~" H 4100 3950 50  0001 C CNN
	1    4100 3950
	1    0    0    -1  
$EndComp
Wire Wire Line
	4100 3800 4100 3500
Wire Wire Line
	4100 3500 4300 3500
Connection ~ 4300 3500
$Comp
L power:GND #PWR?
U 1 1 5C337EBE
P 4100 4300
F 0 "#PWR?" H 4100 4050 50  0001 C CNN
F 1 "GND" H 4105 4127 50  0000 C CNN
F 2 "" H 4100 4300 50  0001 C CNN
F 3 "" H 4100 4300 50  0001 C CNN
	1    4100 4300
	1    0    0    -1  
$EndComp
Wire Wire Line
	4100 4300 4100 4100
Text Label 1650 3250 0    50   ~ 0
IN1
Text Label 1650 3350 0    50   ~ 0
IN2
Text Label 1650 3450 0    50   ~ 0
IN3
Text Label 1650 3550 0    50   ~ 0
IN4
Text Label 1650 3650 0    50   ~ 0
IN5
Text Label 1650 3750 0    50   ~ 0
IN6
Text Label 1650 3850 0    50   ~ 0
IN7
Text Label 3350 2850 0    50   ~ 0
OUT1
Text Label 3150 3350 0    50   ~ 0
OUT2
Text Label 3150 3450 0    50   ~ 0
OUT3
Text Label 3150 3550 0    50   ~ 0
OUT4
Text Label 3150 3650 0    50   ~ 0
OUT5
Text Label 3150 3750 0    50   ~ 0
OUT6
Text Label 3150 3850 0    50   ~ 0
OUT7
Text Label 4600 3400 0    50   ~ 0
CL
Text Label 4600 3500 0    50   ~ 0
DELAY
Text Label 5150 3700 0    50   ~ 0
~FAULT
Text Label 5050 3800 0    50   ~ 0
DIAG_EN
Wire Wire Line
	4900 3700 5350 3700
Text Label 7050 3500 0    50   ~ 0
OUT
Wire Wire Line
	6550 3500 6800 3500
$Comp
L Device:R R103
U 1 1 5C33CF5C
P 6800 3150
F 0 "R103" H 6870 3196 50  0000 L CNN
F 1 "0" H 6870 3105 50  0000 L CNN
F 2 "Resistor_SMD:R_0603_1608Metric" V 6730 3150 50  0001 C CNN
F 3 "~" H 6800 3150 50  0001 C CNN
	1    6800 3150
	1    0    0    -1  
$EndComp
Wire Wire Line
	6800 3000 6800 2850
Wire Wire Line
	6800 3300 6800 3500
Connection ~ 6800 3500
Wire Wire Line
	6800 3500 7150 3500
Wire Wire Line
	1350 3250 2250 3250
Wire Wire Line
	5000 3200 5000 3800
Wire Wire Line
	5000 3900 4900 3900
Wire Wire Line
	5000 3800 5000 3900
Wire Wire Line
	4900 3800 5350 3800
$Comp
L Device:C C101
U 1 1 5C4F3FFE
P 1950 2200
F 0 "C101" H 2065 2246 50  0000 L CNN
F 1 "1u" H 2065 2155 50  0000 L CNN
F 2 "Capacitor_SMD:C_0402_1005Metric" H 1988 2050 50  0001 C CNN
F 3 "~" H 1950 2200 50  0001 C CNN
	1    1950 2200
	1    0    0    -1  
$EndComp
$Comp
L Device:C C102
U 1 1 5C4F40B4
P 3200 2400
F 0 "C102" H 3315 2446 50  0000 L CNN
F 1 "1n" H 3315 2355 50  0000 L CNN
F 2 "Capacitor_SMD:C_0402_1005Metric" H 3238 2250 50  0001 C CNN
F 3 "~" H 3200 2400 50  0001 C CNN
	1    3200 2400
	1    0    0    -1  
$EndComp
$Comp
L Device:C C104
U 1 1 5C4F411A
P 6400 2500
F 0 "C104" H 6515 2546 50  0000 L CNN
F 1 "1n" H 6515 2455 50  0000 L CNN
F 2 "Capacitor_SMD:C_0402_1005Metric" H 6438 2350 50  0001 C CNN
F 3 "~" H 6400 2500 50  0001 C CNN
	1    6400 2500
	1    0    0    -1  
$EndComp
Wire Wire Line
	1950 2350 1950 2400
Wire Wire Line
	1950 2400 1600 2400
Connection ~ 1600 2400
Wire Wire Line
	1600 2400 1600 2250
Wire Wire Line
	1950 2050 1950 2000
Wire Wire Line
	1950 2000 1600 2000
Connection ~ 1600 2000
Wire Wire Line
	1600 2000 1600 1950
Wire Wire Line
	3200 2250 2800 2250
Wire Wire Line
	2800 2250 2800 2550
Wire Wire Line
	2800 2550 2650 2550
Connection ~ 2650 2550
Wire Wire Line
	2650 2550 2650 2850
$Comp
L power:GND #PWR?
U 1 1 5C4F6D69
P 3200 2600
F 0 "#PWR?" H 3200 2350 50  0001 C CNN
F 1 "GND" H 3205 2427 50  0000 C CNN
F 2 "" H 3200 2600 50  0001 C CNN
F 3 "" H 3200 2600 50  0001 C CNN
	1    3200 2600
	1    0    0    -1  
$EndComp
Wire Wire Line
	3200 2600 3200 2550
$Comp
L power:GND #PWR?
U 1 1 5C4FB440
P 6400 2700
F 0 "#PWR?" H 6400 2450 50  0001 C CNN
F 1 "GND" H 6405 2527 50  0000 C CNN
F 2 "" H 6400 2700 50  0001 C CNN
F 3 "" H 6400 2700 50  0001 C CNN
	1    6400 2700
	1    0    0    -1  
$EndComp
Wire Wire Line
	5950 2800 6150 2800
Wire Wire Line
	6150 2800 6150 2250
Wire Wire Line
	6150 2250 6400 2250
Wire Wire Line
	6400 2250 6400 2350
Connection ~ 5950 2800
Wire Wire Line
	5950 2800 5950 2900
Wire Wire Line
	6400 2650 6400 2700
$EndSCHEMATC
