EESchema Schematic File Version 4
EELAYER 30 0
EELAYER END
$Descr A3 16535 11693
encoding utf-8
Sheet 1 1
Title ""
Date ""
Rev ""
Comp ""
Comment1 ""
Comment2 ""
Comment3 ""
Comment4 ""
$EndDescr
Text Label 4500 2850 0    50   ~ 0
bus_power_present
$Comp
L power:GND #PWR?
U 1 1 5E6BF06E
P 4000 3850
F 0 "#PWR?" H 4000 3600 50  0001 C CNN
F 1 "GND" H 4000 3700 50  0000 C CNN
F 2 "" H 4000 3850 50  0001 C CNN
F 3 "" H 4000 3850 50  0001 C CNN
	1    4000 3850
	1    0    0    -1  
$EndComp
$Comp
L power:GND #PWR?
U 1 1 5E6BF22C
P 3900 3850
F 0 "#PWR?" H 3900 3600 50  0001 C CNN
F 1 "GND" H 3900 3700 50  0000 C CNN
F 2 "" H 3900 3850 50  0001 C CNN
F 3 "" H 3900 3850 50  0001 C CNN
	1    3900 3850
	1    0    0    -1  
$EndComp
Wire Wire Line
	3900 3850 3900 3750
Wire Wire Line
	4000 3750 4000 3850
$Comp
L Device:R R102
U 1 1 5E6BF8B7
P 5500 2600
F 0 "R102" V 5580 2600 50  0000 C CNN
F 1 "100k" V 5500 2600 50  0000 C CNN
F 2 "Resistor_SMD:R_0603_1608Metric_Pad1.05x0.95mm_HandSolder" V 5430 2600 50  0001 C CNN
F 3 "~" H 5500 2600 50  0001 C CNN
F 4 "3000-0000001252" H 5500 2600 50  0001 C CNN "PartSpecification"
	1    5500 2600
	1    0    0    -1  
$EndComp
Wire Wire Line
	5500 1650 5500 2050
Wire Wire Line
	5500 2350 5500 2450
Wire Wire Line
	5500 2750 5500 2850
$Comp
L power:GND #PWR?
U 1 1 5E6C37FD
P 5500 3450
F 0 "#PWR?" H 5500 3200 50  0001 C CNN
F 1 "GND" H 5500 3300 50  0000 C CNN
F 2 "" H 5500 3450 50  0001 C CNN
F 3 "" H 5500 3450 50  0001 C CNN
	1    5500 3450
	1    0    0    -1  
$EndComp
Wire Wire Line
	5500 3450 5500 3350
$Comp
L Device:R R101
U 1 1 5E6C47ED
P 5500 2200
F 0 "R101" V 5580 2200 50  0000 C CNN
F 1 "100k" V 5500 2200 50  0000 C CNN
F 2 "Resistor_SMD:R_0603_1608Metric_Pad1.05x0.95mm_HandSolder" V 5430 2200 50  0001 C CNN
F 3 "~" H 5500 2200 50  0001 C CNN
F 4 "3000-0000001252" H 5500 2200 50  0001 C CNN "PartSpecification"
	1    5500 2200
	1    0    0    -1  
$EndComp
$Comp
L Device:R R103
U 1 1 5E6C4BA7
P 5500 3200
F 0 "R103" V 5580 3200 50  0000 C CNN
F 1 "100k" V 5500 3200 50  0000 C CNN
F 2 "Resistor_SMD:R_0603_1608Metric_Pad1.05x0.95mm_HandSolder" V 5430 3200 50  0001 C CNN
F 3 "~" H 5500 3200 50  0001 C CNN
F 4 "3000-0000001252" H 5500 3200 50  0001 C CNN "PartSpecification"
	1    5500 3200
	1    0    0    -1  
$EndComp
Wire Wire Line
	4400 2850 5500 2850
Connection ~ 5500 2850
Wire Wire Line
	5500 2850 5500 3050
$Comp
L power:GND #PWR?
U 1 1 5E6C5EDD
P 5350 1650
F 0 "#PWR?" H 5350 1400 50  0001 C CNN
F 1 "GND" H 5350 1500 50  0000 C CNN
F 2 "" H 5350 1650 50  0001 C CNN
F 3 "" H 5350 1650 50  0001 C CNN
	1    5350 1650
	1    0    0    -1  
$EndComp
Wire Wire Line
	5350 1650 5350 1550
$Comp
L MCU_Module:Arduino_UNO_R3 A101
U 1 1 5E6C8108
P 3900 2650
F 0 "A101" H 3700 3700 50  0000 R CNN
F 1 "Arduino_UNO_R3" H 3700 3600 50  0000 R CNN
F 2 "Module:Arduino_UNO_R3_WithMountingHoles" H 4050 1600 50  0001 L CNN
F 3 "https://www.arduino.cc/en/Main/arduinoBoardUno" H 3700 3700 50  0001 C CNN
	1    3900 2650
	1    0    0    -1  
$EndComp
$Comp
L power:GND #PWR?
U 1 1 5E6CCBE8
P 3800 3850
F 0 "#PWR?" H 3800 3600 50  0001 C CNN
F 1 "GND" H 3800 3700 50  0000 C CNN
F 2 "" H 3800 3850 50  0001 C CNN
F 3 "" H 3800 3850 50  0001 C CNN
	1    3800 3850
	1    0    0    -1  
$EndComp
Wire Wire Line
	3800 3850 3800 3750
$Comp
L Connector:RJ45 J101
U 1 1 5E6CD3E9
P 6900 950
F 0 "J101" H 6700 1500 50  0000 R CNN
F 1 "RJ45" H 7000 1500 50  0000 L CNN
F 2 "POWDER_Misc:MTJ-88TX1-FSD-PGB" V 6900 975 50  0001 C CNN
F 3 "~" V 6900 975 50  0001 C CNN
F 4 "3000-0000000491" H 6900 950 50  0001 C CNN "PartSpecification"
	1    6900 950 
	0    1    1    0   
$EndComp
Wire Wire Line
	6900 1350 6900 1550
Wire Wire Line
	5350 1550 6900 1550
Wire Wire Line
	6800 1350 6800 1650
Wire Wire Line
	5500 1650 6800 1650
$Comp
L POWDER_Connector:Conn_02x70_Odd_Even J1
U 1 1 5FB59B03
P 10200 5650
F 0 "J1" H 10250 9267 50  0000 C CNN
F 1 "Conn_02x70_Odd_Even" H 10250 9176 50  0000 C CNN
F 2 "POWDER_Connector:Amphenol_ICC_61083-141402LF" H 10200 5650 50  0001 C CNN
F 3 "" H 10200 5650 50  0001 C CNN
F 4 "3000-0000001254" H 10200 5650 50  0001 C CNN "PartSpecification"
	1    10200 5650
	1    0    0    -1  
$EndComp
$Comp
L POWDER_Connector:Conn_02x70_Odd_Even J2
U 1 1 5FB84EC2
P 13200 5650
F 0 "J2" H 13250 9267 50  0000 C CNN
F 1 "Conn_02x70_Odd_Even" H 13250 9176 50  0000 C CNN
F 2 "POWDER_Connector:Amphenol_ICC_61083-141402LF" H 13200 5650 50  0001 C CNN
F 3 "" H 13200 5650 50  0001 C CNN
F 4 "3000-0000001254" H 13200 5650 50  0001 C CNN "PartSpecification"
	1    13200 5650
	1    0    0    -1  
$EndComp
Wire Wire Line
	9600 4950 10000 4950
Wire Wire Line
	10000 5050 9600 5050
Wire Wire Line
	10000 5150 9600 5150
Text Label 9600 4950 0    50   ~ 0
en_cunc
Text Label 9600 5050 0    50   ~ 0
en_exp1
Text Label 9600 5150 0    50   ~ 0
en_byod1
Wire Wire Line
	10500 5050 10900 5050
Wire Wire Line
	10500 5150 10900 5150
Text Label 10900 5050 2    50   ~ 0
en_exp2
Text Label 10900 5150 2    50   ~ 0
en_byod2
Wire Wire Line
	10000 5350 9600 5350
Wire Wire Line
	9600 5450 10000 5450
Wire Wire Line
	10000 5550 9600 5550
Wire Wire Line
	10500 5350 10900 5350
Wire Wire Line
	10900 5450 10500 5450
Text Label 9600 5350 0    50   ~ 0
en_switch
Text Label 9600 5450 0    50   ~ 0
en_b210_1
Text Label 9600 5550 0    50   ~ 0
en_b210_3
Text Label 10900 5350 2    50   ~ 0
en_iris
Wire Wire Line
	10000 2350 9500 2350
Wire Wire Line
	9500 2350 9500 2550
Wire Wire Line
	10500 2250 11000 2250
Wire Wire Line
	11000 2250 11000 2450
Wire Wire Line
	10000 2550 9500 2550
Connection ~ 9500 2550
Wire Wire Line
	9500 2550 9500 2750
Wire Wire Line
	10000 2750 9500 2750
Connection ~ 9500 2750
Wire Wire Line
	9500 2750 9500 2950
Wire Wire Line
	10000 2950 9500 2950
Connection ~ 9500 2950
Wire Wire Line
	9500 2950 9500 3150
Wire Wire Line
	10000 3150 9500 3150
Connection ~ 9500 3150
Wire Wire Line
	9500 3150 9500 3350
Wire Wire Line
	10000 3350 9500 3350
Connection ~ 9500 3350
Wire Wire Line
	9500 3350 9500 3550
Wire Wire Line
	10000 3550 9500 3550
Connection ~ 9500 3550
Wire Wire Line
	9500 3550 9500 3750
Wire Wire Line
	10000 3750 9500 3750
Connection ~ 9500 3750
Wire Wire Line
	9500 3750 9500 3950
Wire Wire Line
	10000 3950 9500 3950
Connection ~ 9500 3950
Wire Wire Line
	9500 3950 9500 4050
Wire Wire Line
	10000 4050 9500 4050
Connection ~ 9500 4050
Wire Wire Line
	9500 4050 9500 4450
Wire Wire Line
	10000 4450 9500 4450
Connection ~ 9500 4450
Wire Wire Line
	9500 4450 9500 4850
Wire Wire Line
	10000 4850 9500 4850
Connection ~ 9500 4850
Wire Wire Line
	9500 4850 9500 5250
Wire Wire Line
	10000 5250 9500 5250
Connection ~ 9500 5250
Wire Wire Line
	9500 5250 9500 5650
Wire Wire Line
	10000 5650 9500 5650
Connection ~ 9500 5650
Wire Wire Line
	9500 5650 9500 6050
Wire Wire Line
	10000 6050 9500 6050
Connection ~ 9500 6050
Wire Wire Line
	9500 6050 9500 6350
Wire Wire Line
	10000 6350 9500 6350
Connection ~ 9500 6350
Wire Wire Line
	9500 6350 9500 6750
Wire Wire Line
	10000 6750 9500 6750
Connection ~ 9500 6750
Wire Wire Line
	9500 6750 9500 6850
Wire Wire Line
	10000 6850 9500 6850
Connection ~ 9500 6850
Wire Wire Line
	9500 6850 9500 6950
Wire Wire Line
	10000 6950 9500 6950
Connection ~ 9500 6950
Wire Wire Line
	9500 6950 9500 7150
Wire Wire Line
	10000 7150 9500 7150
Connection ~ 9500 7150
Wire Wire Line
	9500 7150 9500 8050
Wire Wire Line
	10000 8050 9500 8050
Connection ~ 9500 8050
Wire Wire Line
	9500 8050 9500 8150
Wire Wire Line
	10000 8150 9500 8150
Connection ~ 9500 8150
Wire Wire Line
	9500 8150 9500 9050
Wire Wire Line
	10000 9050 9500 9050
Connection ~ 9500 9050
Wire Wire Line
	9500 9050 9500 9150
Wire Wire Line
	9500 9150 10000 9150
Wire Wire Line
	10500 9150 11000 9150
Wire Wire Line
	10500 9050 11000 9050
Connection ~ 11000 9050
Wire Wire Line
	11000 9050 11000 9150
Wire Wire Line
	10500 8150 11000 8150
Connection ~ 11000 8150
Wire Wire Line
	11000 8150 11000 9050
Wire Wire Line
	10500 8050 11000 8050
Connection ~ 11000 8050
Wire Wire Line
	11000 8050 11000 8150
Wire Wire Line
	10500 7150 11000 7150
Connection ~ 11000 7150
Wire Wire Line
	11000 7150 11000 8050
Wire Wire Line
	10500 7050 11000 7050
Connection ~ 11000 7050
Wire Wire Line
	11000 7050 11000 7150
Wire Wire Line
	10500 6950 11000 6950
Connection ~ 11000 6950
Wire Wire Line
	11000 6950 11000 7050
Wire Wire Line
	10500 6750 11000 6750
Connection ~ 11000 6750
Wire Wire Line
	11000 6750 11000 6950
Wire Wire Line
	10500 6350 11000 6350
Connection ~ 11000 6350
Wire Wire Line
	11000 6350 11000 6750
Wire Wire Line
	10500 6050 11000 6050
Connection ~ 11000 6050
Wire Wire Line
	11000 6050 11000 6350
Wire Wire Line
	10500 5650 11000 5650
Connection ~ 11000 5650
Wire Wire Line
	11000 5650 11000 6050
Wire Wire Line
	10500 5250 11000 5250
Connection ~ 11000 5250
Wire Wire Line
	11000 5250 11000 5650
Wire Wire Line
	10500 4950 11000 4950
Connection ~ 11000 4950
Wire Wire Line
	11000 4950 11000 5250
Wire Wire Line
	11000 4850 10500 4850
Connection ~ 11000 4850
Wire Wire Line
	11000 4850 11000 4950
Wire Wire Line
	10500 4450 11000 4450
Connection ~ 11000 4450
Wire Wire Line
	11000 4450 11000 4850
Wire Wire Line
	10500 4050 11000 4050
Connection ~ 11000 4050
Wire Wire Line
	11000 4050 11000 4450
Wire Wire Line
	10500 3850 11000 3850
Connection ~ 11000 3850
Wire Wire Line
	11000 3850 11000 4050
Wire Wire Line
	10500 3650 11000 3650
Connection ~ 11000 3650
Wire Wire Line
	11000 3650 11000 3850
Wire Wire Line
	10500 3450 11000 3450
Connection ~ 11000 3450
Wire Wire Line
	11000 3450 11000 3650
Wire Wire Line
	11000 3250 10500 3250
Connection ~ 11000 3250
Wire Wire Line
	11000 3250 11000 3450
Wire Wire Line
	10500 3050 11000 3050
Connection ~ 11000 3050
Wire Wire Line
	11000 3050 11000 3250
Wire Wire Line
	10500 2850 11000 2850
Connection ~ 11000 2850
Wire Wire Line
	11000 2850 11000 3050
Wire Wire Line
	11000 2450 10500 2450
Connection ~ 11000 2450
Wire Wire Line
	11000 2450 11000 2650
Wire Wire Line
	10500 2650 11000 2650
Connection ~ 11000 2650
Wire Wire Line
	11000 2650 11000 2850
Wire Wire Line
	13000 2250 12500 2250
Wire Wire Line
	13500 2250 14000 2250
Wire Wire Line
	14000 2250 14000 2450
Wire Wire Line
	13000 2350 12500 2350
Connection ~ 12500 2350
Wire Wire Line
	12500 2350 12500 2250
Wire Wire Line
	12500 2450 13000 2450
Connection ~ 12500 2450
Wire Wire Line
	12500 2450 12500 2350
Wire Wire Line
	13000 2650 12500 2650
Connection ~ 12500 2650
Wire Wire Line
	12500 2650 12500 2450
Wire Wire Line
	12500 2750 13000 2750
Connection ~ 12500 2750
Wire Wire Line
	12500 2750 12500 2650
Wire Wire Line
	13000 2850 12500 2850
Connection ~ 12500 2850
Wire Wire Line
	12500 2850 12500 2750
Wire Wire Line
	12500 3050 13000 3050
Connection ~ 12500 3050
Wire Wire Line
	12500 3050 12500 2850
Wire Wire Line
	13000 3150 12500 3150
Connection ~ 12500 3150
Wire Wire Line
	12500 3150 12500 3050
Wire Wire Line
	12500 3250 13000 3250
Connection ~ 12500 3250
Wire Wire Line
	12500 3250 12500 3150
Wire Wire Line
	13000 3450 12500 3450
Connection ~ 12500 3450
Wire Wire Line
	12500 3450 12500 3250
Wire Wire Line
	12500 3550 13000 3550
Connection ~ 12500 3550
Wire Wire Line
	12500 3550 12500 3450
Wire Wire Line
	13000 3650 12500 3650
Connection ~ 12500 3650
Wire Wire Line
	12500 3650 12500 3550
Wire Wire Line
	12500 3850 13000 3850
Connection ~ 12500 3850
Wire Wire Line
	12500 3850 12500 3650
Wire Wire Line
	13000 3950 12500 3950
Connection ~ 12500 3950
Wire Wire Line
	12500 3950 12500 3850
Wire Wire Line
	12500 4050 13000 4050
Connection ~ 12500 4050
Wire Wire Line
	12500 4050 12500 3950
Wire Wire Line
	13000 4250 12500 4250
Connection ~ 12500 4250
Wire Wire Line
	12500 4250 12500 4050
Wire Wire Line
	12500 4350 13000 4350
Connection ~ 12500 4350
Wire Wire Line
	12500 4350 12500 4250
Wire Wire Line
	13000 4450 12500 4450
Connection ~ 12500 4450
Wire Wire Line
	12500 4450 12500 4350
Wire Wire Line
	13000 9150 12500 9150
Connection ~ 12500 9150
Wire Wire Line
	12500 9150 12500 9050
Wire Wire Line
	13000 9050 12500 9050
Connection ~ 12500 9050
Wire Wire Line
	12500 9050 12500 8850
Wire Wire Line
	13000 8850 12500 8850
Connection ~ 12500 8850
Wire Wire Line
	12500 8850 12500 8650
Wire Wire Line
	13000 8650 12500 8650
Connection ~ 12500 8650
Wire Wire Line
	12500 8650 12500 8450
Wire Wire Line
	13000 8450 12500 8450
Connection ~ 12500 8450
Wire Wire Line
	12500 8450 12500 8250
Wire Wire Line
	13000 8250 12500 8250
Connection ~ 12500 8250
Wire Wire Line
	12500 8250 12500 8150
Wire Wire Line
	13000 8150 12500 8150
Connection ~ 12500 8150
Wire Wire Line
	12500 8150 12500 8050
Wire Wire Line
	13000 8050 12500 8050
Connection ~ 12500 8050
Wire Wire Line
	12500 8050 12500 7850
Wire Wire Line
	13000 7850 12500 7850
Connection ~ 12500 7850
Wire Wire Line
	12500 7850 12500 7650
Wire Wire Line
	13000 7650 12500 7650
Connection ~ 12500 7650
Wire Wire Line
	12500 7650 12500 7450
Wire Wire Line
	13000 7450 12500 7450
Connection ~ 12500 7450
Wire Wire Line
	12500 7450 12500 7250
Wire Wire Line
	13000 7250 12500 7250
Connection ~ 12500 7250
Wire Wire Line
	12500 7250 12500 7150
Wire Wire Line
	12500 7150 13000 7150
Connection ~ 12500 7150
Wire Wire Line
	12500 7150 12500 7050
Wire Wire Line
	12500 7050 13000 7050
Connection ~ 12500 7050
Wire Wire Line
	12500 7050 12500 6850
Wire Wire Line
	13000 6850 12500 6850
Connection ~ 12500 6850
Wire Wire Line
	12500 6850 12500 6750
Wire Wire Line
	12500 6750 13000 6750
Connection ~ 12500 6750
Wire Wire Line
	12500 6750 12500 6650
Wire Wire Line
	13000 6650 12500 6650
Connection ~ 12500 6650
Wire Wire Line
	12500 6650 12500 6450
Wire Wire Line
	12500 6450 13000 6450
Connection ~ 12500 6450
Wire Wire Line
	12500 6450 12500 6350
Wire Wire Line
	13000 6350 12500 6350
Connection ~ 12500 6350
Wire Wire Line
	12500 6350 12500 6250
Wire Wire Line
	12500 6250 13000 6250
Connection ~ 12500 6250
Wire Wire Line
	12500 6250 12500 6050
Wire Wire Line
	13000 6050 12500 6050
Connection ~ 12500 6050
Wire Wire Line
	12500 6050 12500 5950
Wire Wire Line
	12500 5950 13000 5950
Connection ~ 12500 5950
Wire Wire Line
	12500 5950 12500 5850
Wire Wire Line
	13000 5850 12500 5850
Connection ~ 12500 5850
Wire Wire Line
	12500 5850 12500 5650
Wire Wire Line
	12500 5650 13000 5650
Connection ~ 12500 5650
Wire Wire Line
	12500 5650 12500 5550
Wire Wire Line
	13000 5550 12500 5550
Connection ~ 12500 5550
Wire Wire Line
	12500 5550 12500 5450
Wire Wire Line
	12500 5450 13000 5450
Connection ~ 12500 5450
Wire Wire Line
	12500 5450 12500 5250
Wire Wire Line
	13000 5250 12500 5250
Connection ~ 12500 5250
Wire Wire Line
	12500 5250 12500 5150
Wire Wire Line
	12500 5150 13000 5150
Connection ~ 12500 5150
Wire Wire Line
	12500 5150 12500 5050
Wire Wire Line
	13000 5050 12500 5050
Connection ~ 12500 5050
Wire Wire Line
	12500 5050 12500 4850
Wire Wire Line
	12500 4850 13000 4850
Connection ~ 12500 4850
Wire Wire Line
	12500 4850 12500 4750
Wire Wire Line
	13000 4750 12500 4750
Connection ~ 12500 4750
Wire Wire Line
	12500 4750 12500 4650
Wire Wire Line
	12500 4650 13000 4650
Connection ~ 12500 4650
Wire Wire Line
	12500 4650 12500 4450
Wire Wire Line
	13500 9150 14000 9150
Connection ~ 14000 9150
Wire Wire Line
	13500 9050 14000 9050
Connection ~ 14000 9050
Wire Wire Line
	14000 9050 14000 9150
Wire Wire Line
	14000 9050 14000 8950
Connection ~ 14000 8950
Wire Wire Line
	13500 8950 14000 8950
Wire Wire Line
	13500 8750 14000 8750
Connection ~ 14000 8750
Wire Wire Line
	14000 8750 14000 8950
Wire Wire Line
	13500 8550 14000 8550
Connection ~ 14000 8550
Wire Wire Line
	14000 8550 14000 8750
Wire Wire Line
	13500 8350 14000 8350
Connection ~ 14000 8350
Wire Wire Line
	14000 8350 14000 8550
Wire Wire Line
	13500 8150 14000 8150
Connection ~ 14000 8150
Wire Wire Line
	14000 8150 14000 8350
Wire Wire Line
	14000 8050 13500 8050
Connection ~ 14000 8050
Wire Wire Line
	14000 8050 14000 8150
Wire Wire Line
	13500 7950 14000 7950
Connection ~ 14000 7950
Wire Wire Line
	14000 7950 14000 8050
Wire Wire Line
	14000 7750 13500 7750
Connection ~ 14000 7750
Wire Wire Line
	14000 7750 14000 7950
Wire Wire Line
	13500 7550 14000 7550
Connection ~ 14000 7550
Wire Wire Line
	14000 7550 14000 7750
Wire Wire Line
	14000 7350 13500 7350
Connection ~ 14000 7350
Wire Wire Line
	14000 7350 14000 7550
Wire Wire Line
	13500 7150 14000 7150
Connection ~ 14000 7150
Wire Wire Line
	14000 7150 14000 7350
Wire Wire Line
	14000 7050 13500 7050
Connection ~ 14000 7050
Wire Wire Line
	14000 7050 14000 7150
Wire Wire Line
	13500 6950 14000 6950
Connection ~ 14000 6950
Wire Wire Line
	14000 6950 14000 7050
Wire Wire Line
	14000 6850 13500 6850
Connection ~ 14000 6850
Wire Wire Line
	14000 6850 14000 6950
Wire Wire Line
	13500 6650 14000 6650
Connection ~ 14000 6650
Wire Wire Line
	14000 6650 14000 6850
Wire Wire Line
	14000 6550 13500 6550
Connection ~ 14000 6550
Wire Wire Line
	14000 6550 14000 6650
Wire Wire Line
	13500 6450 14000 6450
Connection ~ 14000 6450
Wire Wire Line
	14000 6450 14000 6550
Wire Wire Line
	13500 6250 14000 6250
Connection ~ 14000 6250
Wire Wire Line
	14000 6250 14000 6450
Wire Wire Line
	14000 6150 13500 6150
Connection ~ 14000 6150
Wire Wire Line
	14000 6150 14000 6250
Wire Wire Line
	13500 6050 14000 6050
Connection ~ 14000 6050
Wire Wire Line
	14000 6050 14000 6150
Wire Wire Line
	14000 5850 13500 5850
Connection ~ 14000 5850
Wire Wire Line
	14000 5850 14000 6050
Wire Wire Line
	13500 5750 14000 5750
Connection ~ 14000 5750
Wire Wire Line
	14000 5750 14000 5850
Wire Wire Line
	13500 5650 14000 5650
Connection ~ 14000 5650
Wire Wire Line
	14000 5650 14000 5750
Wire Wire Line
	14000 5450 13500 5450
Connection ~ 14000 5450
Wire Wire Line
	14000 5450 14000 5650
Wire Wire Line
	13500 5350 14000 5350
Connection ~ 14000 5350
Wire Wire Line
	14000 5350 14000 5450
Wire Wire Line
	14000 5250 13500 5250
Connection ~ 14000 5250
Wire Wire Line
	14000 5250 14000 5350
Wire Wire Line
	13500 5050 14000 5050
Connection ~ 14000 5050
Wire Wire Line
	14000 5050 14000 5250
Wire Wire Line
	14000 4950 13500 4950
Connection ~ 14000 4950
Wire Wire Line
	14000 4950 14000 5050
Wire Wire Line
	13500 4850 14000 4850
Connection ~ 14000 4850
Wire Wire Line
	14000 4850 14000 4950
Wire Wire Line
	13500 4650 14000 4650
Connection ~ 14000 4650
Wire Wire Line
	14000 4650 14000 4850
Wire Wire Line
	14000 4550 13500 4550
Connection ~ 14000 4550
Wire Wire Line
	14000 4550 14000 4650
Wire Wire Line
	13500 4450 14000 4450
Connection ~ 14000 4450
Wire Wire Line
	14000 4450 14000 4550
Wire Wire Line
	14000 4250 13500 4250
Connection ~ 14000 4250
Wire Wire Line
	14000 4250 14000 4450
Wire Wire Line
	13500 4150 14000 4150
Connection ~ 14000 4150
Wire Wire Line
	14000 4150 14000 4250
Wire Wire Line
	14000 4050 13500 4050
Connection ~ 14000 4050
Wire Wire Line
	14000 4050 14000 4150
Wire Wire Line
	13500 3850 14000 3850
Connection ~ 14000 3850
Wire Wire Line
	14000 3850 14000 4050
Wire Wire Line
	14000 3750 13500 3750
Connection ~ 14000 3750
Wire Wire Line
	14000 3750 14000 3850
Wire Wire Line
	13500 3650 14000 3650
Connection ~ 14000 3650
Wire Wire Line
	14000 3650 14000 3750
Wire Wire Line
	14000 3450 13500 3450
Connection ~ 14000 3450
Wire Wire Line
	14000 3450 14000 3650
Wire Wire Line
	13500 3350 14000 3350
Connection ~ 14000 3350
Wire Wire Line
	14000 3350 14000 3450
Wire Wire Line
	14000 3250 13500 3250
Connection ~ 14000 3250
Wire Wire Line
	14000 3250 14000 3350
Wire Wire Line
	13500 3050 14000 3050
Connection ~ 14000 3050
Wire Wire Line
	14000 3050 14000 3250
Wire Wire Line
	14000 2950 13500 2950
Connection ~ 14000 2950
Wire Wire Line
	14000 2950 14000 3050
Wire Wire Line
	13500 2850 14000 2850
Connection ~ 14000 2850
Wire Wire Line
	14000 2850 14000 2950
Wire Wire Line
	14000 2650 13500 2650
Connection ~ 14000 2650
Wire Wire Line
	14000 2650 14000 2850
Wire Wire Line
	13500 2550 14000 2550
Connection ~ 14000 2550
Wire Wire Line
	14000 2550 14000 2650
Wire Wire Line
	14000 2450 13500 2450
Connection ~ 14000 2450
Wire Wire Line
	14000 2450 14000 2550
Wire Wire Line
	12500 9150 12500 9500
$Comp
L power:GND #PWR?
U 1 1 604B2597
P 12500 9500
F 0 "#PWR?" H 12500 9250 50  0001 C CNN
F 1 "GND" H 12505 9327 50  0000 C CNN
F 2 "" H 12500 9500 50  0001 C CNN
F 3 "" H 12500 9500 50  0001 C CNN
	1    12500 9500
	1    0    0    -1  
$EndComp
Wire Wire Line
	14000 9150 14000 9500
$Comp
L power:GND #PWR?
U 1 1 604D180F
P 14000 9500
F 0 "#PWR?" H 14000 9250 50  0001 C CNN
F 1 "GND" H 14005 9327 50  0000 C CNN
F 2 "" H 14000 9500 50  0001 C CNN
F 3 "" H 14000 9500 50  0001 C CNN
	1    14000 9500
	1    0    0    -1  
$EndComp
Wire Wire Line
	11000 9150 11000 9500
Connection ~ 11000 9150
Wire Wire Line
	9500 9150 9500 9500
Connection ~ 9500 9150
$Comp
L power:GND #PWR?
U 1 1 60512770
P 9500 9500
F 0 "#PWR?" H 9500 9250 50  0001 C CNN
F 1 "GND" H 9505 9327 50  0000 C CNN
F 2 "" H 9500 9500 50  0001 C CNN
F 3 "" H 9500 9500 50  0001 C CNN
	1    9500 9500
	1    0    0    -1  
$EndComp
$Comp
L power:GND #PWR?
U 1 1 60512D31
P 11000 9500
F 0 "#PWR?" H 11000 9250 50  0001 C CNN
F 1 "GND" H 11005 9327 50  0000 C CNN
F 2 "" H 11000 9500 50  0001 C CNN
F 3 "" H 11000 9500 50  0001 C CNN
	1    11000 9500
	1    0    0    -1  
$EndComp
$Comp
L Connector_Generic:Conn_01x04 J3
U 1 1 6058A493
P 2800 4450
F 0 "J3" H 2880 4442 50  0000 L CNN
F 1 "Conn_01x04" H 2880 4351 50  0000 L CNN
F 2 "Connector_PinHeader_2.54mm:PinHeader_1x04_P2.54mm_Vertical" H 2800 4450 50  0001 C CNN
F 3 "~" H 2800 4450 50  0001 C CNN
F 4 "3000-0000000489" H 2800 4450 50  0001 C CNN "PartSpecification"
	1    2800 4450
	1    0    0    -1  
$EndComp
Wire Wire Line
	4400 3450 4800 3450
Text Label 4800 3450 2    50   ~ 0
SCL
Wire Wire Line
	4400 3350 4800 3350
Text Label 4800 3350 2    50   ~ 0
SDA
Wire Wire Line
	2600 4350 2300 4350
Wire Wire Line
	2600 4450 2300 4450
Text Label 2300 4350 0    50   ~ 0
SDA
Text Label 2300 4450 0    50   ~ 0
SCL
Text Label 2300 4550 0    50   ~ 0
GND
Text Label 2300 4650 0    50   ~ 0
5V
Wire Wire Line
	2100 4650 2100 4150
$Comp
L power:+5V #PWR?
U 1 1 60680145
P 2100 4150
F 0 "#PWR?" H 2100 4000 50  0001 C CNN
F 1 "+5V" H 2115 4323 50  0000 C CNN
F 2 "" H 2100 4150 50  0001 C CNN
F 3 "" H 2100 4150 50  0001 C CNN
	1    2100 4150
	1    0    0    -1  
$EndComp
Wire Wire Line
	4100 1650 4100 1450
$Comp
L power:+5V #PWR?
U 1 1 606A1DBA
P 4100 1450
F 0 "#PWR?" H 4100 1300 50  0001 C CNN
F 1 "+5V" H 4115 1623 50  0000 C CNN
F 2 "" H 4100 1450 50  0001 C CNN
F 3 "" H 4100 1450 50  0001 C CNN
	1    4100 1450
	1    0    0    -1  
$EndComp
Wire Wire Line
	2200 4550 2200 4850
$Comp
L power:GND #PWR?
U 1 1 606C457C
P 2200 4850
F 0 "#PWR?" H 2200 4600 50  0001 C CNN
F 1 "GND" H 2205 4677 50  0000 C CNN
F 2 "" H 2200 4850 50  0001 C CNN
F 3 "" H 2200 4850 50  0001 C CNN
	1    2200 4850
	1    0    0    -1  
$EndComp
Wire Wire Line
	2100 4650 2600 4650
Wire Wire Line
	2200 4550 2600 4550
$Comp
L Device:R R1
U 1 1 608354FC
P 1050 8000
F 0 "R1" H 1120 8046 50  0000 L CNN
F 1 "10k" H 1120 7955 50  0000 L CNN
F 2 "Resistor_SMD:R_0603_1608Metric_Pad1.05x0.95mm_HandSolder" V 980 8000 50  0001 C CNN
F 3 "~" H 1050 8000 50  0001 C CNN
F 4 "3000-0000000549" H 1050 8000 50  0001 C CNN "PartSpecification"
	1    1050 8000
	1    0    0    -1  
$EndComp
$Comp
L Device:R R2
U 1 1 6083BB58
P 1050 8500
F 0 "R2" H 1120 8546 50  0000 L CNN
F 1 "10k" H 1120 8455 50  0000 L CNN
F 2 "Resistor_SMD:R_0603_1608Metric_Pad1.05x0.95mm_HandSolder" V 980 8500 50  0001 C CNN
F 3 "~" H 1050 8500 50  0001 C CNN
F 4 "3000-0000000549" H 1050 8500 50  0001 C CNN "PartSpecification"
	1    1050 8500
	1    0    0    -1  
$EndComp
Wire Wire Line
	1050 8150 1050 8250
Wire Wire Line
	1050 7750 1050 7850
Wire Wire Line
	1050 8650 1050 8750
$Comp
L power:GND #PWR?
U 1 1 6091BE6E
P 1050 8750
F 0 "#PWR?" H 1050 8500 50  0001 C CNN
F 1 "GND" H 1055 8577 50  0000 C CNN
F 2 "" H 1050 8750 50  0001 C CNN
F 3 "" H 1050 8750 50  0001 C CNN
	1    1050 8750
	1    0    0    -1  
$EndComp
Connection ~ 1050 8250
Wire Wire Line
	1050 8250 1050 8350
Wire Wire Line
	650  8250 1050 8250
$Comp
L Device:R R5
U 1 1 609743DE
P 1800 8000
F 0 "R5" H 1870 8046 50  0000 L CNN
F 1 "10k" H 1870 7955 50  0000 L CNN
F 2 "Resistor_SMD:R_0603_1608Metric_Pad1.05x0.95mm_HandSolder" V 1730 8000 50  0001 C CNN
F 3 "~" H 1800 8000 50  0001 C CNN
F 4 "3000-0000000549" H 1800 8000 50  0001 C CNN "PartSpecification"
	1    1800 8000
	1    0    0    -1  
$EndComp
$Comp
L Device:R R6
U 1 1 609743E4
P 1800 8500
F 0 "R6" H 1870 8546 50  0000 L CNN
F 1 "10k" H 1870 8455 50  0000 L CNN
F 2 "Resistor_SMD:R_0603_1608Metric_Pad1.05x0.95mm_HandSolder" V 1730 8500 50  0001 C CNN
F 3 "~" H 1800 8500 50  0001 C CNN
F 4 "3000-0000000549" H 1800 8500 50  0001 C CNN "PartSpecification"
	1    1800 8500
	1    0    0    -1  
$EndComp
Wire Wire Line
	1800 8150 1800 8250
$Comp
L power:+5V #PWR?
U 1 1 609743EB
P 1800 7750
F 0 "#PWR?" H 1800 7600 50  0001 C CNN
F 1 "+5V" H 1815 7923 50  0000 C CNN
F 2 "" H 1800 7750 50  0001 C CNN
F 3 "" H 1800 7750 50  0001 C CNN
	1    1800 7750
	1    0    0    -1  
$EndComp
Wire Wire Line
	1800 7750 1800 7850
Wire Wire Line
	1800 8650 1800 8750
$Comp
L power:GND #PWR?
U 1 1 609743F3
P 1800 8750
F 0 "#PWR?" H 1800 8500 50  0001 C CNN
F 1 "GND" H 1805 8577 50  0000 C CNN
F 2 "" H 1800 8750 50  0001 C CNN
F 3 "" H 1800 8750 50  0001 C CNN
	1    1800 8750
	1    0    0    -1  
$EndComp
Connection ~ 1800 8250
Wire Wire Line
	1800 8250 1800 8350
Wire Wire Line
	1400 8250 1800 8250
$Comp
L Device:R R7
U 1 1 609A4D75
P 1800 9600
F 0 "R7" H 1870 9646 50  0000 L CNN
F 1 "10k" H 1870 9555 50  0000 L CNN
F 2 "Resistor_SMD:R_0603_1608Metric_Pad1.05x0.95mm_HandSolder" V 1730 9600 50  0001 C CNN
F 3 "~" H 1800 9600 50  0001 C CNN
F 4 "3000-0000000549" H 1800 9600 50  0001 C CNN "PartSpecification"
	1    1800 9600
	1    0    0    -1  
$EndComp
$Comp
L Device:R R8
U 1 1 609A4D7B
P 1800 10100
F 0 "R8" H 1870 10146 50  0000 L CNN
F 1 "10k" H 1870 10055 50  0000 L CNN
F 2 "Resistor_SMD:R_0603_1608Metric_Pad1.05x0.95mm_HandSolder" V 1730 10100 50  0001 C CNN
F 3 "~" H 1800 10100 50  0001 C CNN
F 4 "3000-0000000549" H 1800 10100 50  0001 C CNN "PartSpecification"
	1    1800 10100
	1    0    0    -1  
$EndComp
Wire Wire Line
	1800 9750 1800 9850
$Comp
L power:+5V #PWR?
U 1 1 609A4D82
P 1800 9350
F 0 "#PWR?" H 1800 9200 50  0001 C CNN
F 1 "+5V" H 1815 9523 50  0000 C CNN
F 2 "" H 1800 9350 50  0001 C CNN
F 3 "" H 1800 9350 50  0001 C CNN
	1    1800 9350
	1    0    0    -1  
$EndComp
Wire Wire Line
	1800 9350 1800 9450
Wire Wire Line
	1800 10250 1800 10350
$Comp
L power:GND #PWR?
U 1 1 609A4D8A
P 1800 10350
F 0 "#PWR?" H 1800 10100 50  0001 C CNN
F 1 "GND" H 1805 10177 50  0000 C CNN
F 2 "" H 1800 10350 50  0001 C CNN
F 3 "" H 1800 10350 50  0001 C CNN
	1    1800 10350
	1    0    0    -1  
$EndComp
Connection ~ 1800 9850
Wire Wire Line
	1800 9850 1800 9950
Wire Wire Line
	1400 9850 1800 9850
$Comp
L Device:R R11
U 1 1 609A4D93
P 2550 9600
F 0 "R11" H 2620 9646 50  0000 L CNN
F 1 "10k" H 2620 9555 50  0000 L CNN
F 2 "Resistor_SMD:R_0603_1608Metric_Pad1.05x0.95mm_HandSolder" V 2480 9600 50  0001 C CNN
F 3 "~" H 2550 9600 50  0001 C CNN
F 4 "3000-0000000549" H 2550 9600 50  0001 C CNN "PartSpecification"
	1    2550 9600
	1    0    0    -1  
$EndComp
$Comp
L Device:R R12
U 1 1 609A4D99
P 2550 10100
F 0 "R12" H 2620 10146 50  0000 L CNN
F 1 "10k" H 2620 10055 50  0000 L CNN
F 2 "Resistor_SMD:R_0603_1608Metric_Pad1.05x0.95mm_HandSolder" V 2480 10100 50  0001 C CNN
F 3 "~" H 2550 10100 50  0001 C CNN
F 4 "3000-0000000549" H 2550 10100 50  0001 C CNN "PartSpecification"
	1    2550 10100
	1    0    0    -1  
$EndComp
Wire Wire Line
	2550 9750 2550 9850
$Comp
L power:+5V #PWR?
U 1 1 609A4DA0
P 2550 9350
F 0 "#PWR?" H 2550 9200 50  0001 C CNN
F 1 "+5V" H 2565 9523 50  0000 C CNN
F 2 "" H 2550 9350 50  0001 C CNN
F 3 "" H 2550 9350 50  0001 C CNN
	1    2550 9350
	1    0    0    -1  
$EndComp
Wire Wire Line
	2550 9350 2550 9450
Wire Wire Line
	2550 10250 2550 10350
$Comp
L power:GND #PWR?
U 1 1 609A4DA8
P 2550 10350
F 0 "#PWR?" H 2550 10100 50  0001 C CNN
F 1 "GND" H 2555 10177 50  0000 C CNN
F 2 "" H 2550 10350 50  0001 C CNN
F 3 "" H 2550 10350 50  0001 C CNN
	1    2550 10350
	1    0    0    -1  
$EndComp
Connection ~ 2550 9850
Wire Wire Line
	2550 9850 2550 9950
Wire Wire Line
	2150 9850 2550 9850
$Comp
L Device:R R9
U 1 1 60AABB0D
P 2550 8000
F 0 "R9" H 2620 8046 50  0000 L CNN
F 1 "10k" H 2620 7955 50  0000 L CNN
F 2 "Resistor_SMD:R_0603_1608Metric_Pad1.05x0.95mm_HandSolder" V 2480 8000 50  0001 C CNN
F 3 "~" H 2550 8000 50  0001 C CNN
F 4 "3000-0000000549" H 2550 8000 50  0001 C CNN "PartSpecification"
	1    2550 8000
	1    0    0    -1  
$EndComp
$Comp
L Device:R R10
U 1 1 60AABB13
P 2550 8500
F 0 "R10" H 2620 8546 50  0000 L CNN
F 1 "10k" H 2620 8455 50  0000 L CNN
F 2 "Resistor_SMD:R_0603_1608Metric_Pad1.05x0.95mm_HandSolder" V 2480 8500 50  0001 C CNN
F 3 "~" H 2550 8500 50  0001 C CNN
F 4 "3000-0000000549" H 2550 8500 50  0001 C CNN "PartSpecification"
	1    2550 8500
	1    0    0    -1  
$EndComp
Wire Wire Line
	2550 8150 2550 8250
$Comp
L power:+5V #PWR?
U 1 1 60AABB1A
P 2550 7750
F 0 "#PWR?" H 2550 7600 50  0001 C CNN
F 1 "+5V" H 2565 7923 50  0000 C CNN
F 2 "" H 2550 7750 50  0001 C CNN
F 3 "" H 2550 7750 50  0001 C CNN
	1    2550 7750
	1    0    0    -1  
$EndComp
Wire Wire Line
	2550 7750 2550 7850
Wire Wire Line
	2550 8650 2550 8750
$Comp
L power:GND #PWR?
U 1 1 60AABB22
P 2550 8750
F 0 "#PWR?" H 2550 8500 50  0001 C CNN
F 1 "GND" H 2555 8577 50  0000 C CNN
F 2 "" H 2550 8750 50  0001 C CNN
F 3 "" H 2550 8750 50  0001 C CNN
	1    2550 8750
	1    0    0    -1  
$EndComp
Connection ~ 2550 8250
Wire Wire Line
	2550 8250 2550 8350
Wire Wire Line
	2150 8250 2550 8250
$Comp
L Device:R R13
U 1 1 60AABB2B
P 3300 8000
F 0 "R13" H 3370 8046 50  0000 L CNN
F 1 "10k" H 3370 7955 50  0000 L CNN
F 2 "Resistor_SMD:R_0603_1608Metric_Pad1.05x0.95mm_HandSolder" V 3230 8000 50  0001 C CNN
F 3 "~" H 3300 8000 50  0001 C CNN
F 4 "3000-0000000549" H 3300 8000 50  0001 C CNN "PartSpecification"
	1    3300 8000
	1    0    0    -1  
$EndComp
$Comp
L Device:R R14
U 1 1 60AABB31
P 3300 8500
F 0 "R14" H 3370 8546 50  0000 L CNN
F 1 "10k" H 3370 8455 50  0000 L CNN
F 2 "Resistor_SMD:R_0603_1608Metric_Pad1.05x0.95mm_HandSolder" V 3230 8500 50  0001 C CNN
F 3 "~" H 3300 8500 50  0001 C CNN
F 4 "3000-0000000549" H 3300 8500 50  0001 C CNN "PartSpecification"
	1    3300 8500
	1    0    0    -1  
$EndComp
Wire Wire Line
	3300 8150 3300 8250
$Comp
L power:+5V #PWR?
U 1 1 60AABB38
P 3300 7750
F 0 "#PWR?" H 3300 7600 50  0001 C CNN
F 1 "+5V" H 3315 7923 50  0000 C CNN
F 2 "" H 3300 7750 50  0001 C CNN
F 3 "" H 3300 7750 50  0001 C CNN
	1    3300 7750
	1    0    0    -1  
$EndComp
Wire Wire Line
	3300 7750 3300 7850
Wire Wire Line
	3300 8650 3300 8750
$Comp
L power:GND #PWR?
U 1 1 60AABB40
P 3300 8750
F 0 "#PWR?" H 3300 8500 50  0001 C CNN
F 1 "GND" H 3305 8577 50  0000 C CNN
F 2 "" H 3300 8750 50  0001 C CNN
F 3 "" H 3300 8750 50  0001 C CNN
	1    3300 8750
	1    0    0    -1  
$EndComp
Connection ~ 3300 8250
Wire Wire Line
	3300 8250 3300 8350
Wire Wire Line
	2900 8250 3300 8250
$Comp
L Device:R R15
U 1 1 60AABB49
P 3300 9600
F 0 "R15" H 3370 9646 50  0000 L CNN
F 1 "10k" H 3370 9555 50  0000 L CNN
F 2 "Resistor_SMD:R_0603_1608Metric_Pad1.05x0.95mm_HandSolder" V 3230 9600 50  0001 C CNN
F 3 "~" H 3300 9600 50  0001 C CNN
F 4 "3000-0000000549" H 3300 9600 50  0001 C CNN "PartSpecification"
	1    3300 9600
	1    0    0    -1  
$EndComp
$Comp
L Device:R R16
U 1 1 60AABB4F
P 3300 10100
F 0 "R16" H 3370 10146 50  0000 L CNN
F 1 "10k" H 3370 10055 50  0000 L CNN
F 2 "Resistor_SMD:R_0603_1608Metric_Pad1.05x0.95mm_HandSolder" V 3230 10100 50  0001 C CNN
F 3 "~" H 3300 10100 50  0001 C CNN
F 4 "3000-0000000549" H 3300 10100 50  0001 C CNN "PartSpecification"
	1    3300 10100
	1    0    0    -1  
$EndComp
Wire Wire Line
	3300 9750 3300 9850
$Comp
L power:+5V #PWR?
U 1 1 60AABB56
P 3300 9350
F 0 "#PWR?" H 3300 9200 50  0001 C CNN
F 1 "+5V" H 3315 9523 50  0000 C CNN
F 2 "" H 3300 9350 50  0001 C CNN
F 3 "" H 3300 9350 50  0001 C CNN
	1    3300 9350
	1    0    0    -1  
$EndComp
Wire Wire Line
	3300 9350 3300 9450
Wire Wire Line
	3300 10250 3300 10350
$Comp
L power:GND #PWR?
U 1 1 60AABB5E
P 3300 10350
F 0 "#PWR?" H 3300 10100 50  0001 C CNN
F 1 "GND" H 3305 10177 50  0000 C CNN
F 2 "" H 3300 10350 50  0001 C CNN
F 3 "" H 3300 10350 50  0001 C CNN
	1    3300 10350
	1    0    0    -1  
$EndComp
Connection ~ 3300 9850
Wire Wire Line
	3300 9850 3300 9950
Wire Wire Line
	2900 9850 3300 9850
$Comp
L Device:R R19
U 1 1 60AABB67
P 4100 9600
F 0 "R19" H 4170 9646 50  0000 L CNN
F 1 "10k" H 4170 9555 50  0000 L CNN
F 2 "Resistor_SMD:R_0603_1608Metric_Pad1.05x0.95mm_HandSolder" V 4030 9600 50  0001 C CNN
F 3 "~" H 4100 9600 50  0001 C CNN
F 4 "3000-0000000549" H 4100 9600 50  0001 C CNN "PartSpecification"
	1    4100 9600
	1    0    0    -1  
$EndComp
$Comp
L Device:R R20
U 1 1 60AABB6D
P 4100 10100
F 0 "R20" H 4170 10146 50  0000 L CNN
F 1 "10k" H 4170 10055 50  0000 L CNN
F 2 "Resistor_SMD:R_0603_1608Metric_Pad1.05x0.95mm_HandSolder" V 4030 10100 50  0001 C CNN
F 3 "~" H 4100 10100 50  0001 C CNN
F 4 "3000-0000000549" H 4100 10100 50  0001 C CNN "PartSpecification"
	1    4100 10100
	1    0    0    -1  
$EndComp
Wire Wire Line
	4100 9750 4100 9850
$Comp
L power:+5V #PWR?
U 1 1 60AABB74
P 4100 9350
F 0 "#PWR?" H 4100 9200 50  0001 C CNN
F 1 "+5V" H 4115 9523 50  0000 C CNN
F 2 "" H 4100 9350 50  0001 C CNN
F 3 "" H 4100 9350 50  0001 C CNN
	1    4100 9350
	1    0    0    -1  
$EndComp
Wire Wire Line
	4100 9350 4100 9450
Wire Wire Line
	4100 10250 4100 10350
$Comp
L power:GND #PWR?
U 1 1 60AABB7C
P 4100 10350
F 0 "#PWR?" H 4100 10100 50  0001 C CNN
F 1 "GND" H 4105 10177 50  0000 C CNN
F 2 "" H 4100 10350 50  0001 C CNN
F 3 "" H 4100 10350 50  0001 C CNN
	1    4100 10350
	1    0    0    -1  
$EndComp
Connection ~ 4100 9850
Wire Wire Line
	4100 9850 4100 9950
Wire Wire Line
	3700 9850 4100 9850
$Comp
L Device:R R17
U 1 1 60ADA4D1
P 4100 8000
F 0 "R17" H 4170 8046 50  0000 L CNN
F 1 "10k" H 4170 7955 50  0000 L CNN
F 2 "Resistor_SMD:R_0603_1608Metric_Pad1.05x0.95mm_HandSolder" V 4030 8000 50  0001 C CNN
F 3 "~" H 4100 8000 50  0001 C CNN
F 4 "3000-0000000549" H 4100 8000 50  0001 C CNN "PartSpecification"
	1    4100 8000
	1    0    0    -1  
$EndComp
$Comp
L Device:R R18
U 1 1 60ADA4D7
P 4100 8500
F 0 "R18" H 4170 8546 50  0000 L CNN
F 1 "10k" H 4170 8455 50  0000 L CNN
F 2 "Resistor_SMD:R_0603_1608Metric_Pad1.05x0.95mm_HandSolder" V 4030 8500 50  0001 C CNN
F 3 "~" H 4100 8500 50  0001 C CNN
F 4 "3000-0000000549" H 4100 8500 50  0001 C CNN "PartSpecification"
	1    4100 8500
	1    0    0    -1  
$EndComp
Wire Wire Line
	4100 8150 4100 8250
$Comp
L power:+5V #PWR?
U 1 1 60ADA4DE
P 4100 7750
F 0 "#PWR?" H 4100 7600 50  0001 C CNN
F 1 "+5V" H 4115 7923 50  0000 C CNN
F 2 "" H 4100 7750 50  0001 C CNN
F 3 "" H 4100 7750 50  0001 C CNN
	1    4100 7750
	1    0    0    -1  
$EndComp
Wire Wire Line
	4100 7750 4100 7850
Wire Wire Line
	4100 8650 4100 8750
$Comp
L power:GND #PWR?
U 1 1 60ADA4E6
P 4100 8750
F 0 "#PWR?" H 4100 8500 50  0001 C CNN
F 1 "GND" H 4105 8577 50  0000 C CNN
F 2 "" H 4100 8750 50  0001 C CNN
F 3 "" H 4100 8750 50  0001 C CNN
	1    4100 8750
	1    0    0    -1  
$EndComp
Connection ~ 4100 8250
Wire Wire Line
	4100 8250 4100 8350
Wire Wire Line
	3700 8250 4100 8250
$Comp
L Device:R R3
U 1 1 60ADA4EF
P 1050 9600
F 0 "R3" H 1120 9646 50  0000 L CNN
F 1 "10k" H 1120 9555 50  0000 L CNN
F 2 "Resistor_SMD:R_0603_1608Metric_Pad1.05x0.95mm_HandSolder" V 980 9600 50  0001 C CNN
F 3 "~" H 1050 9600 50  0001 C CNN
F 4 "3000-0000000549" H 1050 9600 50  0001 C CNN "PartSpecification"
	1    1050 9600
	1    0    0    -1  
$EndComp
$Comp
L Device:R R4
U 1 1 60ADA4F5
P 1050 10100
F 0 "R4" H 1120 10146 50  0000 L CNN
F 1 "10k" H 1120 10055 50  0000 L CNN
F 2 "Resistor_SMD:R_0603_1608Metric_Pad1.05x0.95mm_HandSolder" V 980 10100 50  0001 C CNN
F 3 "~" H 1050 10100 50  0001 C CNN
F 4 "3000-0000000549" H 1050 10100 50  0001 C CNN "PartSpecification"
	1    1050 10100
	1    0    0    -1  
$EndComp
Wire Wire Line
	1050 9750 1050 9850
$Comp
L power:+5V #PWR?
U 1 1 60ADA4FC
P 1050 9350
F 0 "#PWR?" H 1050 9200 50  0001 C CNN
F 1 "+5V" H 1065 9523 50  0000 C CNN
F 2 "" H 1050 9350 50  0001 C CNN
F 3 "" H 1050 9350 50  0001 C CNN
	1    1050 9350
	1    0    0    -1  
$EndComp
Wire Wire Line
	1050 9350 1050 9450
Wire Wire Line
	1050 10250 1050 10350
$Comp
L power:GND #PWR?
U 1 1 60ADA504
P 1050 10350
F 0 "#PWR?" H 1050 10100 50  0001 C CNN
F 1 "GND" H 1055 10177 50  0000 C CNN
F 2 "" H 1050 10350 50  0001 C CNN
F 3 "" H 1050 10350 50  0001 C CNN
	1    1050 10350
	1    0    0    -1  
$EndComp
Connection ~ 1050 9850
Wire Wire Line
	1050 9850 1050 9950
Wire Wire Line
	650  9850 1050 9850
Text Label 650  8250 0    50   ~ 0
en_cunc
Text Label 1400 8250 0    50   ~ 0
en_exp1
Text Label 2150 8250 0    50   ~ 0
en_byod1
Text Label 2900 8250 0    50   ~ 0
en_exp2
Text Label 3700 8250 0    50   ~ 0
en_byod2
Text Label 650  9850 0    50   ~ 0
en_switch
Text Label 1400 9850 0    50   ~ 0
en_b210_1
Text Label 2150 9850 0    50   ~ 0
en_b210_3
Text Label 2900 9850 0    50   ~ 0
en_iris
Text Label 3700 9850 0    50   ~ 0
en_b210_2
Wire Wire Line
	3400 2850 2850 2850
Wire Wire Line
	3400 2950 2850 2950
Text Label 2850 2850 0    50   ~ 0
en_exp1
Text Label 2850 2950 0    50   ~ 0
en_exp2
$Comp
L power:+3.3V #PWR?
U 1 1 5FC8B75B
P 9000 2750
F 0 "#PWR?" H 9000 2600 50  0001 C CNN
F 1 "+3.3V" H 9015 2923 50  0000 C CNN
F 2 "" H 9000 2750 50  0001 C CNN
F 3 "" H 9000 2750 50  0001 C CNN
	1    9000 2750
	1    0    0    -1  
$EndComp
Wire Wire Line
	9000 2750 9000 3050
Wire Wire Line
	9000 3050 9800 3050
Wire Wire Line
	10000 3850 9800 3850
Wire Wire Line
	9800 3850 9800 3650
Connection ~ 9800 3050
Wire Wire Line
	9800 3050 10000 3050
Wire Wire Line
	9800 3250 10000 3250
Connection ~ 9800 3250
Wire Wire Line
	9800 3250 9800 3050
Wire Wire Line
	10000 3450 9800 3450
Connection ~ 9800 3450
Wire Wire Line
	9800 3450 9800 3250
Wire Wire Line
	9800 3650 10000 3650
Connection ~ 9800 3650
Wire Wire Line
	9800 3650 9800 3450
$Comp
L power:+3.3V #PWR?
U 1 1 5FD889D0
P 11500 3000
F 0 "#PWR?" H 11500 2850 50  0001 C CNN
F 1 "+3.3V" H 11515 3173 50  0000 C CNN
F 2 "" H 11500 3000 50  0001 C CNN
F 3 "" H 11500 3000 50  0001 C CNN
	1    11500 3000
	1    0    0    -1  
$EndComp
Wire Wire Line
	11500 3000 11500 3150
Wire Wire Line
	11500 3150 10750 3150
Wire Wire Line
	10500 3350 10750 3350
Wire Wire Line
	10750 3350 10750 3150
Connection ~ 10750 3150
Wire Wire Line
	10750 3150 10500 3150
Wire Wire Line
	10750 3350 10750 3550
Wire Wire Line
	10750 3950 10500 3950
Connection ~ 10750 3350
Wire Wire Line
	10500 3550 10750 3550
Connection ~ 10750 3550
Wire Wire Line
	10750 3550 10750 3750
Wire Wire Line
	10750 3750 10500 3750
Connection ~ 10750 3750
Wire Wire Line
	10750 3750 10750 3950
$Comp
L power:+3.3V #PWR?
U 1 1 5FE981AA
P 1050 7750
F 0 "#PWR?" H 1050 7600 50  0001 C CNN
F 1 "+3.3V" H 1065 7923 50  0000 C CNN
F 2 "" H 1050 7750 50  0001 C CNN
F 3 "" H 1050 7750 50  0001 C CNN
	1    1050 7750
	1    0    0    -1  
$EndComp
Text Label 10900 5450 2    50   ~ 0
en_b210_2
$Comp
L Mechanical:MountingHole_Pad H1
U 1 1 5FEB3130
P 6000 6850
F 0 "H1" H 6100 6899 50  0000 L CNN
F 1 "MountingHole_Pad" H 6100 6808 50  0000 L CNN
F 2 "MountingHole:MountingHole_4mm_Pad" H 6000 6850 50  0001 C CNN
F 3 "~" H 6000 6850 50  0001 C CNN
	1    6000 6850
	1    0    0    -1  
$EndComp
$Comp
L power:GND #PWR?
U 1 1 5FEB5AF6
P 6000 7050
F 0 "#PWR?" H 6000 6800 50  0001 C CNN
F 1 "GND" H 6005 6877 50  0000 C CNN
F 2 "" H 6000 7050 50  0001 C CNN
F 3 "" H 6000 7050 50  0001 C CNN
	1    6000 7050
	1    0    0    -1  
$EndComp
$Comp
L power:GND #PWR?
U 1 1 5FEB6A4C
P 7000 7050
F 0 "#PWR?" H 7000 6800 50  0001 C CNN
F 1 "GND" H 7005 6877 50  0000 C CNN
F 2 "" H 7000 7050 50  0001 C CNN
F 3 "" H 7000 7050 50  0001 C CNN
	1    7000 7050
	1    0    0    -1  
$EndComp
Wire Wire Line
	7000 7050 7000 6950
Wire Wire Line
	6000 6950 6000 7050
$Comp
L power:GND #PWR?
U 1 1 5FF97AA5
P 7000 8050
F 0 "#PWR?" H 7000 7800 50  0001 C CNN
F 1 "GND" H 7005 7877 50  0000 C CNN
F 2 "" H 7000 8050 50  0001 C CNN
F 3 "" H 7000 8050 50  0001 C CNN
	1    7000 8050
	1    0    0    -1  
$EndComp
$Comp
L power:GND #PWR?
U 1 1 5FF97AB7
P 5950 8050
F 0 "#PWR?" H 5950 7800 50  0001 C CNN
F 1 "GND" H 5955 7877 50  0000 C CNN
F 2 "" H 5950 8050 50  0001 C CNN
F 3 "" H 5950 8050 50  0001 C CNN
	1    5950 8050
	1    0    0    -1  
$EndComp
Wire Wire Line
	5950 8050 5950 7950
Wire Wire Line
	7000 7950 7000 8050
$Comp
L Mechanical:MountingHole_Pad H2
U 1 1 600496FA
P 7000 6850
F 0 "H2" H 7100 6899 50  0000 L CNN
F 1 "MountingHole_Pad" H 7100 6808 50  0000 L CNN
F 2 "MountingHole:MountingHole_3.5mm_Pad" H 7000 6850 50  0001 C CNN
F 3 "~" H 7000 6850 50  0001 C CNN
	1    7000 6850
	1    0    0    -1  
$EndComp
$Comp
L Mechanical:MountingHole_Pad H3
U 1 1 6004A216
P 7000 7850
F 0 "H3" H 7100 7899 50  0000 L CNN
F 1 "MountingHole_Pad" H 7100 7808 50  0000 L CNN
F 2 "MountingHole:MountingHole_4mm_Pad" H 7000 7850 50  0001 C CNN
F 3 "~" H 7000 7850 50  0001 C CNN
	1    7000 7850
	1    0    0    -1  
$EndComp
$Comp
L Mechanical:MountingHole_Pad H4
U 1 1 6004AD5A
P 5950 7850
F 0 "H4" H 6050 7899 50  0000 L CNN
F 1 "MountingHole_Pad" H 6050 7808 50  0000 L CNN
F 2 "MountingHole:MountingHole_3.5mm_Pad" H 5950 7850 50  0001 C CNN
F 3 "~" H 5950 7850 50  0001 C CNN
	1    5950 7850
	1    0    0    -1  
$EndComp
Wire Wire Line
	10000 7050 9600 7050
Text Label 9600 7050 0    50   ~ 0
vs_pwr
Wire Wire Line
	10500 6850 10900 6850
Text Label 10900 6850 2    50   ~ 0
is_pwr
Wire Wire Line
	4400 2650 4900 2650
Text Label 4900 2950 2    50   ~ 0
vs_pwr
Text Label 4900 2650 2    50   ~ 0
is_pwr
NoConn ~ 4400 3050
NoConn ~ 4400 3150
NoConn ~ 3400 2050
NoConn ~ 3400 2150
Wire Wire Line
	4400 2950 4900 2950
Text Label 2850 3150 0    50   ~ 0
en_switch
Text Label 2850 3050 0    50   ~ 0
en_byod1
Wire Wire Line
	2850 3150 3400 3150
Wire Wire Line
	2850 3050 3400 3050
Text Notes 2400 3050 0    50   ~ 0
(frontend)
$Comp
L POWDER_Misc:MCP9808_MSOP U1
U 1 1 602A5B09
P 5100 5650
F 0 "U1" H 4800 6100 50  0000 L CNN
F 1 "MCP9808_MSOP" H 5150 5200 50  0000 L CNN
F 2 "Package_SO:MSOP-8_3x3mm_P0.65mm" H 4100 5150 50  0001 C CNN
F 3 "https://ww1.microchip.com/downloads/en/DeviceDoc/25095A.pdf" H 4850 6100 50  0001 C CNN
	1    5100 5650
	1    0    0    -1  
$EndComp
NoConn ~ 5500 5650
Text Label 4000 5350 0    50   ~ 0
SDA
Text Label 4000 5450 0    50   ~ 0
SCL
Wire Wire Line
	4700 5750 4600 5750
Wire Wire Line
	4600 5750 4600 5850
Wire Wire Line
	4700 5850 4600 5850
Connection ~ 4600 5850
Wire Wire Line
	4600 5850 4600 5950
Wire Wire Line
	4700 5950 4600 5950
Connection ~ 4600 5950
Wire Wire Line
	4600 5950 4600 6250
$Comp
L power:GND #PWR?
U 1 1 6040327F
P 4600 6250
F 0 "#PWR?" H 4600 6000 50  0001 C CNN
F 1 "GND" H 4605 6077 50  0000 C CNN
F 2 "" H 4600 6250 50  0001 C CNN
F 3 "" H 4600 6250 50  0001 C CNN
	1    4600 6250
	1    0    0    -1  
$EndComp
$Comp
L power:GND #PWR?
U 1 1 6040352C
P 5100 6250
F 0 "#PWR?" H 5100 6000 50  0001 C CNN
F 1 "GND" H 5105 6077 50  0000 C CNN
F 2 "" H 5100 6250 50  0001 C CNN
F 3 "" H 5100 6250 50  0001 C CNN
	1    5100 6250
	1    0    0    -1  
$EndComp
Wire Wire Line
	5100 6250 5100 6150
$Comp
L power:+5V #PWR?
U 1 1 6046BACB
P 5100 4750
F 0 "#PWR?" H 5100 4600 50  0001 C CNN
F 1 "+5V" H 5115 4923 50  0000 C CNN
F 2 "" H 5100 4750 50  0001 C CNN
F 3 "" H 5100 4750 50  0001 C CNN
	1    5100 4750
	1    0    0    -1  
$EndComp
$Comp
L Device:C_Small C1
U 1 1 6046FFF0
P 5600 5050
F 0 "C1" H 5692 5096 50  0000 L CNN
F 1 "0.1uF" H 5692 5005 50  0000 L CNN
F 2 "Capacitor_SMD:C_0402_1005Metric" H 5600 5050 50  0001 C CNN
F 3 "~" H 5600 5050 50  0001 C CNN
	1    5600 5050
	1    0    0    -1  
$EndComp
Wire Wire Line
	5600 5150 5600 5250
$Comp
L power:GND #PWR?
U 1 1 604A2BB3
P 5600 5250
F 0 "#PWR?" H 5600 5000 50  0001 C CNN
F 1 "GND" H 5605 5077 50  0000 C CNN
F 2 "" H 5600 5250 50  0001 C CNN
F 3 "" H 5600 5250 50  0001 C CNN
	1    5600 5250
	1    0    0    -1  
$EndComp
Wire Wire Line
	5600 4950 5600 4850
Wire Wire Line
	5100 4750 5100 4850
Wire Wire Line
	5100 4850 5600 4850
Wire Wire Line
	5100 4850 5100 5150
Connection ~ 5100 4850
Wire Wire Line
	4000 5350 4250 5350
Wire Wire Line
	4000 5450 4500 5450
$Comp
L Device:R_Small R21
U 1 1 605AD247
P 4250 5050
F 0 "R21" H 4309 5096 50  0000 L CNN
F 1 "10k" H 4309 5005 50  0000 L CNN
F 2 "Resistor_SMD:R_0603_1608Metric_Pad1.05x0.95mm_HandSolder" H 4250 5050 50  0001 C CNN
F 3 "~" H 4250 5050 50  0001 C CNN
	1    4250 5050
	1    0    0    -1  
$EndComp
$Comp
L Device:R_Small R22
U 1 1 605EAF0E
P 4500 5050
F 0 "R22" H 4559 5096 50  0000 L CNN
F 1 "10k" H 4559 5005 50  0000 L CNN
F 2 "Resistor_SMD:R_0603_1608Metric_Pad1.05x0.95mm_HandSolder" H 4500 5050 50  0001 C CNN
F 3 "~" H 4500 5050 50  0001 C CNN
	1    4500 5050
	1    0    0    -1  
$EndComp
Wire Wire Line
	4250 5150 4250 5350
Connection ~ 4250 5350
Wire Wire Line
	4250 5350 4700 5350
Wire Wire Line
	4500 5150 4500 5450
Connection ~ 4500 5450
Wire Wire Line
	4500 5450 4700 5450
$Comp
L power:+5V #PWR?
U 1 1 606BA588
P 4250 4750
F 0 "#PWR?" H 4250 4600 50  0001 C CNN
F 1 "+5V" H 4265 4923 50  0000 C CNN
F 2 "" H 4250 4750 50  0001 C CNN
F 3 "" H 4250 4750 50  0001 C CNN
	1    4250 4750
	1    0    0    -1  
$EndComp
Wire Wire Line
	4250 4750 4250 4850
Wire Wire Line
	4250 4850 4500 4850
Wire Wire Line
	4500 4850 4500 4950
Connection ~ 4250 4850
Wire Wire Line
	4250 4850 4250 4950
NoConn ~ 4400 2250
NoConn ~ 4400 2050
NoConn ~ 4000 1650
NoConn ~ 3800 1650
NoConn ~ 4400 2450
NoConn ~ 4400 2750
Text Label 2850 2250 0    50   ~ 0
en_b210_1
Text Label 2850 2450 0    50   ~ 0
en_b210_3
Text Label 2850 2650 0    50   ~ 0
en_byod2
Text Label 2850 2550 0    50   ~ 0
en_iris
Text Label 2850 2350 0    50   ~ 0
en_b210_2
Wire Wire Line
	3400 2250 2850 2250
Wire Wire Line
	3400 2350 2850 2350
Wire Wire Line
	3400 2450 2850 2450
Wire Wire Line
	3400 2550 2850 2550
Wire Wire Line
	3400 2650 2850 2650
Text Notes 6200 6450 0    50   ~ 0
BICCMPB Holes
Text Notes 6200 9000 0    50   ~ 0
Arduino Holes
Text Notes 750  850  0    50   ~ 0
Supermicro on pin0 = 8, N300 on pin1 = 9, Frontend on pin2 = 10, Switch on pin3 = 11
NoConn ~ 3400 2750
NoConn ~ 3400 3250
NoConn ~ 3400 3350
NoConn ~ 6600 1350
NoConn ~ 6700 1350
NoConn ~ 7000 1350
NoConn ~ 7100 1350
NoConn ~ 7200 1350
NoConn ~ 7300 1350
NoConn ~ 13500 2350
NoConn ~ 13000 2550
NoConn ~ 13500 2750
NoConn ~ 13000 2950
NoConn ~ 13500 3150
NoConn ~ 13000 3350
NoConn ~ 13500 3550
NoConn ~ 13000 3750
NoConn ~ 13500 3950
NoConn ~ 13000 4150
NoConn ~ 13500 4350
NoConn ~ 13000 4550
NoConn ~ 13500 4750
NoConn ~ 13000 4950
NoConn ~ 13500 5150
NoConn ~ 13000 5350
NoConn ~ 13500 5550
NoConn ~ 13000 5750
NoConn ~ 13500 5950
NoConn ~ 13000 6150
NoConn ~ 13500 6350
NoConn ~ 13000 6550
NoConn ~ 13500 6750
NoConn ~ 13000 6950
NoConn ~ 13500 7250
NoConn ~ 13000 7350
NoConn ~ 13500 7450
NoConn ~ 13000 7550
NoConn ~ 13500 7650
NoConn ~ 13000 7750
NoConn ~ 13500 7850
NoConn ~ 13000 7950
NoConn ~ 13500 8250
NoConn ~ 13000 8350
NoConn ~ 13500 8450
NoConn ~ 13000 8550
NoConn ~ 13500 8650
NoConn ~ 13000 8750
NoConn ~ 13500 8850
NoConn ~ 13000 8950
NoConn ~ 10500 8850
NoConn ~ 10500 8950
NoConn ~ 10500 8750
NoConn ~ 10500 8650
NoConn ~ 10500 8550
NoConn ~ 10500 8450
NoConn ~ 10500 8350
NoConn ~ 10500 8250
NoConn ~ 10000 8250
NoConn ~ 10000 8350
NoConn ~ 10000 8450
NoConn ~ 10000 8550
NoConn ~ 10000 8650
NoConn ~ 10000 8750
NoConn ~ 10000 8850
NoConn ~ 10000 8950
NoConn ~ 10000 7950
NoConn ~ 10000 7850
NoConn ~ 10000 7750
NoConn ~ 10000 7650
NoConn ~ 10000 7550
NoConn ~ 10000 7450
NoConn ~ 10000 7350
NoConn ~ 10000 7250
NoConn ~ 10500 7250
NoConn ~ 10500 7350
NoConn ~ 10500 7450
NoConn ~ 10500 7550
NoConn ~ 10500 7650
NoConn ~ 10500 7750
NoConn ~ 10500 7850
NoConn ~ 10500 7950
NoConn ~ 10500 6650
NoConn ~ 10500 6550
NoConn ~ 10500 6450
NoConn ~ 10000 6450
NoConn ~ 10000 6550
NoConn ~ 10000 6650
NoConn ~ 10000 6250
NoConn ~ 10000 6150
NoConn ~ 10500 6150
NoConn ~ 10500 6250
NoConn ~ 10500 5950
NoConn ~ 10500 5850
NoConn ~ 10500 5750
NoConn ~ 10500 5550
NoConn ~ 10000 5750
NoConn ~ 10000 5850
NoConn ~ 10000 5950
NoConn ~ 10000 4750
NoConn ~ 10000 4650
NoConn ~ 10000 4550
NoConn ~ 10000 4350
NoConn ~ 10000 4250
NoConn ~ 10000 4150
NoConn ~ 10500 4150
NoConn ~ 10500 4250
NoConn ~ 10500 4350
NoConn ~ 10500 4550
NoConn ~ 10500 4650
NoConn ~ 10500 4750
NoConn ~ 10000 2250
NoConn ~ 10500 2350
NoConn ~ 10000 2450
NoConn ~ 10500 2550
NoConn ~ 10000 2650
NoConn ~ 10500 2750
NoConn ~ 10000 2850
NoConn ~ 10500 2950
$EndSCHEMATC
