EESchema Schematic File Version 4
EELAYER 30 0
EELAYER END
$Descr A4 11693 8268
encoding utf-8
Sheet 36 39
Title ""
Date ""
Rev ""
Comp ""
Comment1 ""
Comment2 ""
Comment3 ""
Comment4 ""
$EndDescr
$Comp
L POWDER_Power:TPS7A92 U?
U 1 1 61272B02
P 4500 5400
AR Path="/5D562501/61272B02" Ref="U?"  Part="1" 
AR Path="/5D587C46/61272B02" Ref="U?"  Part="1" 
AR Path="/60664CFF/61272B02" Ref="U?"  Part="1" 
AR Path="/605A4C0E/61272B02" Ref="U?"  Part="1" 
AR Path="/605746B5/61272B02" Ref="U?"  Part="1" 
AR Path="/605746B5/61256AAD/61272B02" Ref="U3603"  Part="1" 
F 0 "U3603" H 4900 5850 50  0000 C CNN
F 1 "TPS7A92" H 4500 5650 50  0000 C CNN
F 2 "POWDER_Power:R-PWSON-N10" H 5250 4350 50  0001 C CNN
F 3 "" H 4500 5400 50  0001 C CNN
F 4 "3000-0000000193" H 4500 5400 50  0001 C CNN "PartSpecification"
	1    4500 5400
	1    0    0    -1  
$EndComp
Wire Wire Line
	3900 5300 3600 5300
Wire Wire Line
	3600 5300 3600 5200
Wire Wire Line
	3600 5200 3900 5200
Connection ~ 3600 5200
$Comp
L power:GND #PWR?
U 1 1 61272B0C
P 4550 6050
AR Path="/5D562501/61272B0C" Ref="#PWR?"  Part="1" 
AR Path="/5D587C46/61272B0C" Ref="#PWR?"  Part="1" 
AR Path="/5D591ABD/61272B0C" Ref="#PWR?"  Part="1" 
AR Path="/60664CFF/61272B0C" Ref="#PWR?"  Part="1" 
AR Path="/605A4C0E/61272B0C" Ref="#PWR?"  Part="1" 
AR Path="/605746B5/61272B0C" Ref="#PWR?"  Part="1" 
AR Path="/605746B5/61256AAD/61272B0C" Ref="#PWR?"  Part="1" 
F 0 "#PWR?" H 4550 5800 50  0001 C CNN
F 1 "GND" H 4555 5877 50  0000 C CNN
F 2 "" H 4550 6050 50  0001 C CNN
F 3 "" H 4550 6050 50  0001 C CNN
	1    4550 6050
	1    0    0    -1  
$EndComp
Wire Wire Line
	4550 6050 4550 5900
$Comp
L power:GND #PWR?
U 1 1 61272B13
P 4450 6050
AR Path="/5D562501/61272B13" Ref="#PWR?"  Part="1" 
AR Path="/5D587C46/61272B13" Ref="#PWR?"  Part="1" 
AR Path="/5D591ABD/61272B13" Ref="#PWR?"  Part="1" 
AR Path="/60664CFF/61272B13" Ref="#PWR?"  Part="1" 
AR Path="/605A4C0E/61272B13" Ref="#PWR?"  Part="1" 
AR Path="/605746B5/61272B13" Ref="#PWR?"  Part="1" 
AR Path="/605746B5/61256AAD/61272B13" Ref="#PWR?"  Part="1" 
F 0 "#PWR?" H 4450 5800 50  0001 C CNN
F 1 "GND" H 4455 5877 50  0000 C CNN
F 2 "" H 4450 6050 50  0001 C CNN
F 3 "" H 4450 6050 50  0001 C CNN
	1    4450 6050
	1    0    0    -1  
$EndComp
Wire Wire Line
	4450 6050 4450 5900
Wire Wire Line
	1750 5500 3900 5500
Text HLabel 5400 5600 2    50   Output ~ 0
LDO_5VA_PG
$Comp
L 000_PreferredParts:C_1uF C?
U 1 1 61272B1D
P 3100 5800
AR Path="/5D562501/61272B1D" Ref="C?"  Part="1" 
AR Path="/5D587C46/61272B1D" Ref="C?"  Part="1" 
AR Path="/60664CFF/61272B1D" Ref="C?"  Part="1" 
AR Path="/605A4C0E/61272B1D" Ref="C?"  Part="1" 
AR Path="/605746B5/61272B1D" Ref="C?"  Part="1" 
AR Path="/605746B5/61256AAD/61272B1D" Ref="C3609"  Part="1" 
F 0 "C3609" H 3125 5900 50  0000 L CNN
F 1 "C_1uF" H 3125 5700 50  0000 L CNN
F 2 "Capacitor_SMD:C_0603_1608Metric" H 3138 5650 50  0001 C CNN
F 3 "~" H 3100 5800 50  0001 C CNN
F 4 "3000-0000000136" H 3100 5800 50  0001 C CNN "PartSpecification"
	1    3100 5800
	1    0    0    -1  
$EndComp
Wire Wire Line
	3100 5650 3100 5400
Wire Wire Line
	3100 5400 3900 5400
$Comp
L power:GND #PWR?
U 1 1 61272B25
P 3100 6100
AR Path="/5D562501/61272B25" Ref="#PWR?"  Part="1" 
AR Path="/5D587C46/61272B25" Ref="#PWR?"  Part="1" 
AR Path="/5D591ABD/61272B25" Ref="#PWR?"  Part="1" 
AR Path="/60664CFF/61272B25" Ref="#PWR?"  Part="1" 
AR Path="/605A4C0E/61272B25" Ref="#PWR?"  Part="1" 
AR Path="/605746B5/61272B25" Ref="#PWR?"  Part="1" 
AR Path="/605746B5/61256AAD/61272B25" Ref="#PWR?"  Part="1" 
F 0 "#PWR?" H 3100 5850 50  0001 C CNN
F 1 "GND" H 3105 5927 50  0000 C CNN
F 2 "" H 3100 6100 50  0001 C CNN
F 3 "" H 3100 6100 50  0001 C CNN
	1    3100 6100
	1    0    0    -1  
$EndComp
Wire Wire Line
	3100 6100 3100 5950
$Comp
L power:GND #PWR?
U 1 1 61272B2C
P 3750 6000
AR Path="/5D562501/61272B2C" Ref="#PWR?"  Part="1" 
AR Path="/5D587C46/61272B2C" Ref="#PWR?"  Part="1" 
AR Path="/5D591ABD/61272B2C" Ref="#PWR?"  Part="1" 
AR Path="/60664CFF/61272B2C" Ref="#PWR?"  Part="1" 
AR Path="/605A4C0E/61272B2C" Ref="#PWR?"  Part="1" 
AR Path="/605746B5/61272B2C" Ref="#PWR?"  Part="1" 
AR Path="/605746B5/61256AAD/61272B2C" Ref="#PWR?"  Part="1" 
F 0 "#PWR?" H 3750 5750 50  0001 C CNN
F 1 "GND" H 3755 5827 50  0000 C CNN
F 2 "" H 3750 6000 50  0001 C CNN
F 3 "" H 3750 6000 50  0001 C CNN
	1    3750 6000
	1    0    0    -1  
$EndComp
Wire Wire Line
	3750 6000 3750 5600
Wire Wire Line
	3750 5600 3900 5600
$Comp
L 000_PreferredParts:C_10uF_0805 C?
U 1 1 61272B37
P 2300 5750
AR Path="/5D562501/61272B37" Ref="C?"  Part="1" 
AR Path="/5D587C46/61272B37" Ref="C?"  Part="1" 
AR Path="/60664CFF/61272B37" Ref="C?"  Part="1" 
AR Path="/605A4C0E/61272B37" Ref="C?"  Part="1" 
AR Path="/605746B5/61272B37" Ref="C?"  Part="1" 
AR Path="/605746B5/61256AAD/61272B37" Ref="C3608"  Part="1" 
F 0 "C3608" H 2415 5796 50  0000 L CNN
F 1 "C_10uF_0805" H 2415 5705 50  0000 L CNN
F 2 "Capacitor_SMD:C_0805_2012Metric" H 2338 5600 50  0001 C CNN
F 3 "~" H 2300 5750 50  0001 C CNN
F 4 "Murata Electronics" H 2300 5750 50  0001 C CNN "Manufacturer"
F 5 "GRM21BC8YA106ME11L" H 2300 5750 50  0001 C CNN "PartNumber"
F 6 "3000-0000000134" H 2300 5750 50  0001 C CNN "PartSpecification"
	1    2300 5750
	1    0    0    -1  
$EndComp
Wire Wire Line
	2300 5600 2300 5200
Wire Wire Line
	2300 5200 3600 5200
$Comp
L power:GND #PWR?
U 1 1 61272B3F
P 2300 6100
AR Path="/5D562501/61272B3F" Ref="#PWR?"  Part="1" 
AR Path="/5D587C46/61272B3F" Ref="#PWR?"  Part="1" 
AR Path="/5D591ABD/61272B3F" Ref="#PWR?"  Part="1" 
AR Path="/60664CFF/61272B3F" Ref="#PWR?"  Part="1" 
AR Path="/605A4C0E/61272B3F" Ref="#PWR?"  Part="1" 
AR Path="/605746B5/61272B3F" Ref="#PWR?"  Part="1" 
AR Path="/605746B5/61256AAD/61272B3F" Ref="#PWR?"  Part="1" 
F 0 "#PWR?" H 2300 5850 50  0001 C CNN
F 1 "GND" H 2305 5927 50  0000 C CNN
F 2 "" H 2300 6100 50  0001 C CNN
F 3 "" H 2300 6100 50  0001 C CNN
	1    2300 6100
	1    0    0    -1  
$EndComp
Wire Wire Line
	2300 6100 2300 5900
$Comp
L power:GND #PWR?
U 1 1 61272B46
P 6350 6250
AR Path="/5D562501/61272B46" Ref="#PWR?"  Part="1" 
AR Path="/5D587C46/61272B46" Ref="#PWR?"  Part="1" 
AR Path="/5D591ABD/61272B46" Ref="#PWR?"  Part="1" 
AR Path="/60664CFF/61272B46" Ref="#PWR?"  Part="1" 
AR Path="/605A4C0E/61272B46" Ref="#PWR?"  Part="1" 
AR Path="/605746B5/61272B46" Ref="#PWR?"  Part="1" 
AR Path="/605746B5/61256AAD/61272B46" Ref="#PWR?"  Part="1" 
F 0 "#PWR?" H 6350 6000 50  0001 C CNN
F 1 "GND" H 6355 6077 50  0000 C CNN
F 2 "" H 6350 6250 50  0001 C CNN
F 3 "" H 6350 6250 50  0001 C CNN
	1    6350 6250
	1    0    0    -1  
$EndComp
Wire Wire Line
	6350 6250 6350 6150
$Comp
L Device:R R?
U 1 1 61272B4E
P 6350 6000
AR Path="/5D562501/61272B4E" Ref="R?"  Part="1" 
AR Path="/5D587C46/61272B4E" Ref="R?"  Part="1" 
AR Path="/60664CFF/61272B4E" Ref="R?"  Part="1" 
AR Path="/605A4C0E/61272B4E" Ref="R?"  Part="1" 
AR Path="/605746B5/61272B4E" Ref="R?"  Part="1" 
AR Path="/605746B5/61256AAD/61272B4E" Ref="R3604"  Part="1" 
F 0 "R3604" V 6430 6000 50  0000 C CNN
F 1 "1.69k" V 6350 6000 50  0000 C CNN
F 2 "Resistor_SMD:R_0402_1005Metric" V 6280 6000 50  0001 C CNN
F 3 "~" H 6350 6000 50  0001 C CNN
F 4 "3000-0000000224" V 6350 6000 50  0001 C CNN "PartSpecification"
	1    6350 6000
	1    0    0    -1  
$EndComp
$Comp
L Device:R R?
U 1 1 61272B55
P 6350 5500
AR Path="/5D562501/61272B55" Ref="R?"  Part="1" 
AR Path="/5D587C46/61272B55" Ref="R?"  Part="1" 
AR Path="/60664CFF/61272B55" Ref="R?"  Part="1" 
AR Path="/605A4C0E/61272B55" Ref="R?"  Part="1" 
AR Path="/605746B5/61272B55" Ref="R?"  Part="1" 
AR Path="/605746B5/61256AAD/61272B55" Ref="R3602"  Part="1" 
F 0 "R3602" V 6430 5500 50  0000 C CNN
F 1 "5.36k" V 6350 5500 50  0000 C CNN
F 2 "Resistor_SMD:R_0402_1005Metric" V 6280 5500 50  0001 C CNN
F 3 "~" H 6350 5500 50  0001 C CNN
F 4 "3000-0000000133" V 6350 5500 50  0001 C CNN "PartSpecification"
	1    6350 5500
	1    0    0    -1  
$EndComp
Wire Wire Line
	5100 5300 5600 5300
Wire Wire Line
	5100 5200 5600 5200
Wire Wire Line
	5600 5200 5600 5300
Wire Wire Line
	5600 5200 6350 5200
Connection ~ 5600 5200
Wire Wire Line
	6350 5200 6350 5350
Wire Wire Line
	6350 5850 6350 5750
Connection ~ 6350 5750
Wire Wire Line
	6350 5750 6350 5650
Wire Wire Line
	5100 5450 6100 5450
Wire Wire Line
	6100 5450 6100 5750
$Comp
L Device:C C?
U 1 1 61272B67
P 6600 5450
AR Path="/5D587C46/61272B67" Ref="C?"  Part="1" 
AR Path="/5D562501/61272B67" Ref="C?"  Part="1" 
AR Path="/60664CFF/61272B67" Ref="C?"  Part="1" 
AR Path="/605A4C0E/61272B67" Ref="C?"  Part="1" 
AR Path="/605746B5/61272B67" Ref="C?"  Part="1" 
AR Path="/605746B5/61256AAD/61272B67" Ref="C3604"  Part="1" 
F 0 "C3604" H 6625 5550 50  0000 L CNN
F 1 "10nF" H 6625 5350 50  0000 L CNN
F 2 "Capacitor_SMD:C_0402_1005Metric" H 6638 5300 50  0001 C CNN
F 3 "~" H 6600 5450 50  0001 C CNN
F 4 "3000-0000000203" H 6600 5450 50  0001 C CNN "PartSpecification"
	1    6600 5450
	1    0    0    -1  
$EndComp
Wire Wire Line
	6600 5300 6600 5200
Wire Wire Line
	6600 5200 6350 5200
Connection ~ 6350 5200
Wire Wire Line
	6600 5600 6600 5750
$Comp
L 000_PreferredParts:C_10uF_0603 C?
U 1 1 61272B74
P 7200 5450
AR Path="/5D587C46/61272B74" Ref="C?"  Part="1" 
AR Path="/5D562501/61272B74" Ref="C?"  Part="1" 
AR Path="/60664CFF/61272B74" Ref="C?"  Part="1" 
AR Path="/605A4C0E/61272B74" Ref="C?"  Part="1" 
AR Path="/605746B5/61272B74" Ref="C?"  Part="1" 
AR Path="/605746B5/61256AAD/61272B74" Ref="C3605"  Part="1" 
F 0 "C3605" H 7225 5550 50  0000 L CNN
F 1 "C_10uF_0603" H 7225 5350 50  0001 L CNN
F 2 "Capacitor_SMD:C_0603_1608Metric" H 7238 5300 50  0001 C CNN
F 3 "~" H 7200 5450 50  0001 C CNN
F 4 "10uF" H 7350 5350 50  0000 C CNN "DisplayValue"
F 5 "0603" H 7350 5250 50  0000 C CNN "DisplayFootprint"
F 6 "3000-0000000135" H -2300 750 50  0001 C CNN "PartSpecification"
	1    7200 5450
	1    0    0    -1  
$EndComp
Wire Wire Line
	7200 5300 7200 5200
Wire Wire Line
	7200 5200 6600 5200
Connection ~ 6600 5200
$Comp
L power:GND #PWR?
U 1 1 61272B7D
P 7200 5750
AR Path="/5D562501/61272B7D" Ref="#PWR?"  Part="1" 
AR Path="/5D587C46/61272B7D" Ref="#PWR?"  Part="1" 
AR Path="/5D591ABD/61272B7D" Ref="#PWR?"  Part="1" 
AR Path="/60664CFF/61272B7D" Ref="#PWR?"  Part="1" 
AR Path="/605A4C0E/61272B7D" Ref="#PWR?"  Part="1" 
AR Path="/605746B5/61272B7D" Ref="#PWR?"  Part="1" 
AR Path="/605746B5/61256AAD/61272B7D" Ref="#PWR?"  Part="1" 
F 0 "#PWR?" H 7200 5500 50  0001 C CNN
F 1 "GND" H 7205 5577 50  0000 C CNN
F 2 "" H 7200 5750 50  0001 C CNN
F 3 "" H 7200 5750 50  0001 C CNN
	1    7200 5750
	-1   0    0    -1  
$EndComp
Wire Wire Line
	7200 5750 7200 5600
$Comp
L 000_PreferredParts:C_10uF_0603 C?
U 1 1 61272B87
P 7700 5450
AR Path="/5D587C46/61272B87" Ref="C?"  Part="1" 
AR Path="/5D562501/61272B87" Ref="C?"  Part="1" 
AR Path="/60664CFF/61272B87" Ref="C?"  Part="1" 
AR Path="/605A4C0E/61272B87" Ref="C?"  Part="1" 
AR Path="/605746B5/61272B87" Ref="C?"  Part="1" 
AR Path="/605746B5/61256AAD/61272B87" Ref="C3606"  Part="1" 
F 0 "C3606" H 7725 5550 50  0000 L CNN
F 1 "C_10uF_0603" H 7725 5350 50  0001 L CNN
F 2 "Capacitor_SMD:C_0603_1608Metric" H 7738 5300 50  0001 C CNN
F 3 "~" H 7700 5450 50  0001 C CNN
F 4 "10uF" H 7850 5350 50  0000 C CNN "DisplayValue"
F 5 "0603" H 7850 5250 50  0000 C CNN "DisplayFootprint"
F 6 "3000-0000000135" H -2300 750 50  0001 C CNN "PartSpecification"
	1    7700 5450
	1    0    0    -1  
$EndComp
Wire Wire Line
	7700 5300 7700 5200
Wire Wire Line
	7700 5200 7200 5200
$Comp
L power:GND #PWR?
U 1 1 61272B8F
P 7700 5750
AR Path="/5D562501/61272B8F" Ref="#PWR?"  Part="1" 
AR Path="/5D587C46/61272B8F" Ref="#PWR?"  Part="1" 
AR Path="/5D591ABD/61272B8F" Ref="#PWR?"  Part="1" 
AR Path="/60664CFF/61272B8F" Ref="#PWR?"  Part="1" 
AR Path="/605A4C0E/61272B8F" Ref="#PWR?"  Part="1" 
AR Path="/605746B5/61272B8F" Ref="#PWR?"  Part="1" 
AR Path="/605746B5/61256AAD/61272B8F" Ref="#PWR?"  Part="1" 
F 0 "#PWR?" H 7700 5500 50  0001 C CNN
F 1 "GND" H 7705 5577 50  0000 C CNN
F 2 "" H 7700 5750 50  0001 C CNN
F 3 "" H 7700 5750 50  0001 C CNN
	1    7700 5750
	-1   0    0    -1  
$EndComp
Wire Wire Line
	7700 5750 7700 5600
Connection ~ 7200 5200
$Comp
L 000_PreferredParts:C_10uF_0603 C?
U 1 1 61272B9A
P 8200 5450
AR Path="/5D587C46/61272B9A" Ref="C?"  Part="1" 
AR Path="/5D562501/61272B9A" Ref="C?"  Part="1" 
AR Path="/60664CFF/61272B9A" Ref="C?"  Part="1" 
AR Path="/605A4C0E/61272B9A" Ref="C?"  Part="1" 
AR Path="/605746B5/61272B9A" Ref="C?"  Part="1" 
AR Path="/605746B5/61256AAD/61272B9A" Ref="C3607"  Part="1" 
F 0 "C3607" H 8225 5550 50  0000 L CNN
F 1 "C_10uF_0603" H 8225 5350 50  0001 L CNN
F 2 "Capacitor_SMD:C_0603_1608Metric" H 8238 5300 50  0001 C CNN
F 3 "~" H 8200 5450 50  0001 C CNN
F 4 "10uF" H 8350 5350 50  0000 C CNN "DisplayValue"
F 5 "0603" H 8350 5250 50  0000 C CNN "DisplayFootprint"
F 6 "3000-0000000135" H -2300 750 50  0001 C CNN "PartSpecification"
	1    8200 5450
	1    0    0    -1  
$EndComp
Wire Wire Line
	8200 5300 8200 5200
Wire Wire Line
	8200 5200 7700 5200
$Comp
L power:GND #PWR?
U 1 1 61272BA2
P 8200 5750
AR Path="/5D562501/61272BA2" Ref="#PWR?"  Part="1" 
AR Path="/5D587C46/61272BA2" Ref="#PWR?"  Part="1" 
AR Path="/5D591ABD/61272BA2" Ref="#PWR?"  Part="1" 
AR Path="/60664CFF/61272BA2" Ref="#PWR?"  Part="1" 
AR Path="/605A4C0E/61272BA2" Ref="#PWR?"  Part="1" 
AR Path="/605746B5/61272BA2" Ref="#PWR?"  Part="1" 
AR Path="/605746B5/61256AAD/61272BA2" Ref="#PWR?"  Part="1" 
F 0 "#PWR?" H 8200 5500 50  0001 C CNN
F 1 "GND" H 8205 5577 50  0000 C CNN
F 2 "" H 8200 5750 50  0001 C CNN
F 3 "" H 8200 5750 50  0001 C CNN
	1    8200 5750
	-1   0    0    -1  
$EndComp
Wire Wire Line
	8200 5750 8200 5600
Connection ~ 7700 5200
$Comp
L 000_PreferredParts:C_10uF_0603 C?
U 1 1 61272BAD
P 6950 4450
AR Path="/5D587C46/61272BAD" Ref="C?"  Part="1" 
AR Path="/5D562501/61272BAD" Ref="C?"  Part="1" 
AR Path="/60664CFF/61272BAD" Ref="C?"  Part="1" 
AR Path="/605A4C0E/61272BAD" Ref="C?"  Part="1" 
AR Path="/605746B5/61272BAD" Ref="C?"  Part="1" 
AR Path="/605746B5/61256AAD/61272BAD" Ref="C3601"  Part="1" 
F 0 "C3601" H 6975 4550 50  0000 L CNN
F 1 "C_10uF_0603" H 6975 4350 50  0001 L CNN
F 2 "Capacitor_SMD:C_0603_1608Metric" H 6988 4300 50  0001 C CNN
F 3 "~" H 6950 4450 50  0001 C CNN
F 4 "10uF" H 7100 4350 50  0000 C CNN "DisplayValue"
F 5 "0603" H 7100 4250 50  0000 C CNN "DisplayFootprint"
F 6 "3000-0000000135" H -2550 750 50  0001 C CNN "PartSpecification"
	1    6950 4450
	1    0    0    -1  
$EndComp
Wire Wire Line
	6950 4300 6950 4200
Wire Wire Line
	6950 4200 6600 4200
$Comp
L power:GND #PWR?
U 1 1 61272BB5
P 6950 4750
AR Path="/5D562501/61272BB5" Ref="#PWR?"  Part="1" 
AR Path="/5D587C46/61272BB5" Ref="#PWR?"  Part="1" 
AR Path="/5D591ABD/61272BB5" Ref="#PWR?"  Part="1" 
AR Path="/60664CFF/61272BB5" Ref="#PWR?"  Part="1" 
AR Path="/605A4C0E/61272BB5" Ref="#PWR?"  Part="1" 
AR Path="/605746B5/61272BB5" Ref="#PWR?"  Part="1" 
AR Path="/605746B5/61256AAD/61272BB5" Ref="#PWR?"  Part="1" 
F 0 "#PWR?" H 6950 4500 50  0001 C CNN
F 1 "GND" H 6955 4577 50  0000 C CNN
F 2 "" H 6950 4750 50  0001 C CNN
F 3 "" H 6950 4750 50  0001 C CNN
	1    6950 4750
	-1   0    0    -1  
$EndComp
Wire Wire Line
	6950 4750 6950 4600
$Comp
L 000_PreferredParts:C_10uF_0603 C?
U 1 1 61272BBF
P 7450 4450
AR Path="/5D587C46/61272BBF" Ref="C?"  Part="1" 
AR Path="/5D562501/61272BBF" Ref="C?"  Part="1" 
AR Path="/60664CFF/61272BBF" Ref="C?"  Part="1" 
AR Path="/605A4C0E/61272BBF" Ref="C?"  Part="1" 
AR Path="/605746B5/61272BBF" Ref="C?"  Part="1" 
AR Path="/605746B5/61256AAD/61272BBF" Ref="C3602"  Part="1" 
F 0 "C3602" H 7475 4550 50  0000 L CNN
F 1 "C_10uF_0603" H 7475 4350 50  0001 L CNN
F 2 "Capacitor_SMD:C_0603_1608Metric" H 7488 4300 50  0001 C CNN
F 3 "~" H 7450 4450 50  0001 C CNN
F 4 "10uF" H 7600 4350 50  0000 C CNN "DisplayValue"
F 5 "0603" H 7600 4250 50  0000 C CNN "DisplayFootprint"
F 6 "3000-0000000135" H -2550 750 50  0001 C CNN "PartSpecification"
	1    7450 4450
	1    0    0    -1  
$EndComp
Wire Wire Line
	7450 4300 7450 4200
Wire Wire Line
	7450 4200 6950 4200
$Comp
L power:GND #PWR?
U 1 1 61272BC7
P 7450 4750
AR Path="/5D562501/61272BC7" Ref="#PWR?"  Part="1" 
AR Path="/5D587C46/61272BC7" Ref="#PWR?"  Part="1" 
AR Path="/5D591ABD/61272BC7" Ref="#PWR?"  Part="1" 
AR Path="/60664CFF/61272BC7" Ref="#PWR?"  Part="1" 
AR Path="/605A4C0E/61272BC7" Ref="#PWR?"  Part="1" 
AR Path="/605746B5/61272BC7" Ref="#PWR?"  Part="1" 
AR Path="/605746B5/61256AAD/61272BC7" Ref="#PWR?"  Part="1" 
F 0 "#PWR?" H 7450 4500 50  0001 C CNN
F 1 "GND" H 7455 4577 50  0000 C CNN
F 2 "" H 7450 4750 50  0001 C CNN
F 3 "" H 7450 4750 50  0001 C CNN
	1    7450 4750
	-1   0    0    -1  
$EndComp
Wire Wire Line
	7450 4750 7450 4600
Connection ~ 6950 4200
$Comp
L 000_PreferredParts:C_10uF_0603 C?
U 1 1 61272BD2
P 7950 4450
AR Path="/5D587C46/61272BD2" Ref="C?"  Part="1" 
AR Path="/5D562501/61272BD2" Ref="C?"  Part="1" 
AR Path="/60664CFF/61272BD2" Ref="C?"  Part="1" 
AR Path="/605A4C0E/61272BD2" Ref="C?"  Part="1" 
AR Path="/605746B5/61272BD2" Ref="C?"  Part="1" 
AR Path="/605746B5/61256AAD/61272BD2" Ref="C3603"  Part="1" 
F 0 "C3603" H 7975 4550 50  0000 L CNN
F 1 "C_10uF_0603" H 7975 4350 50  0001 L CNN
F 2 "Capacitor_SMD:C_0603_1608Metric" H 7988 4300 50  0001 C CNN
F 3 "~" H 7950 4450 50  0001 C CNN
F 4 "10uF" H 8100 4350 50  0000 C CNN "DisplayValue"
F 5 "0603" H 8100 4250 50  0000 C CNN "DisplayFootprint"
F 6 "3000-0000000135" H -2550 750 50  0001 C CNN "PartSpecification"
	1    7950 4450
	1    0    0    -1  
$EndComp
Wire Wire Line
	7950 4300 7950 4200
Wire Wire Line
	7950 4200 7450 4200
$Comp
L power:GND #PWR?
U 1 1 61272BDA
P 7950 4750
AR Path="/5D562501/61272BDA" Ref="#PWR?"  Part="1" 
AR Path="/5D587C46/61272BDA" Ref="#PWR?"  Part="1" 
AR Path="/5D591ABD/61272BDA" Ref="#PWR?"  Part="1" 
AR Path="/60664CFF/61272BDA" Ref="#PWR?"  Part="1" 
AR Path="/605A4C0E/61272BDA" Ref="#PWR?"  Part="1" 
AR Path="/605746B5/61272BDA" Ref="#PWR?"  Part="1" 
AR Path="/605746B5/61256AAD/61272BDA" Ref="#PWR?"  Part="1" 
F 0 "#PWR?" H 7950 4500 50  0001 C CNN
F 1 "GND" H 7955 4577 50  0000 C CNN
F 2 "" H 7950 4750 50  0001 C CNN
F 3 "" H 7950 4750 50  0001 C CNN
	1    7950 4750
	-1   0    0    -1  
$EndComp
Wire Wire Line
	7950 4750 7950 4600
Connection ~ 7450 4200
Wire Wire Line
	6600 4200 6600 5200
Wire Wire Line
	8350 5200 8200 5200
Connection ~ 8200 5200
Text Label 5700 5450 0    50   ~ 0
FB
Text Label 3450 5400 0    50   ~ 0
NR_SS
Wire Wire Line
	2100 5200 2300 5200
Connection ~ 2300 5200
Wire Wire Line
	8350 5100 8350 5200
Wire Wire Line
	1750 4900 1750 5500
Wire Wire Line
	6350 5750 6600 5750
$Comp
L Device:R R?
U 1 1 61272BED
P 8600 5450
AR Path="/61272BED" Ref="R?"  Part="1" 
AR Path="/605A4C0E/61272BED" Ref="R?"  Part="1" 
AR Path="/605746B5/61272BED" Ref="R?"  Part="1" 
AR Path="/605746B5/61256AAD/61272BED" Ref="R3601"  Part="1" 
F 0 "R3601" V 8680 5450 50  0000 C CNN
F 1 "10k" V 8600 5450 50  0000 C CNN
F 2 "Resistor_SMD:R_0402_1005Metric" V 8530 5450 50  0001 C CNN
F 3 "~" H 8600 5450 50  0001 C CNN
F 4 "3000-0000000131" V 8600 5450 50  0001 C CNN "PartSpecification"
	1    8600 5450
	-1   0    0    -1  
$EndComp
$Comp
L Device:R R?
U 1 1 61272BF4
P 8600 5950
AR Path="/605A4C0E/61272BF4" Ref="R?"  Part="1" 
AR Path="/605746B5/61272BF4" Ref="R?"  Part="1" 
AR Path="/605746B5/61256AAD/61272BF4" Ref="R3603"  Part="1" 
F 0 "R3603" V 8680 5950 50  0000 C CNN
F 1 "4.87k" V 8600 5950 50  0000 C CNN
F 2 "Resistor_SMD:R_0402_1005Metric" V 8530 5950 50  0001 C CNN
F 3 "~" H 8600 5950 50  0001 C CNN
F 4 "3000-0000000133" V 8600 5950 50  0001 C CNN "PartSpecification"
	1    8600 5950
	-1   0    0    -1  
$EndComp
$Comp
L power:GND #PWR?
U 1 1 61272BFA
P 8600 6200
AR Path="/605A4C0E/61272BFA" Ref="#PWR?"  Part="1" 
AR Path="/605746B5/61272BFA" Ref="#PWR?"  Part="1" 
AR Path="/605746B5/61256AAD/61272BFA" Ref="#PWR?"  Part="1" 
F 0 "#PWR?" H 8600 5950 50  0001 C CNN
F 1 "GND" H 8605 6027 50  0000 C CNN
F 2 "" H 8600 6200 50  0001 C CNN
F 3 "" H 8600 6200 50  0001 C CNN
	1    8600 6200
	-1   0    0    -1  
$EndComp
Wire Wire Line
	8600 6100 8600 6200
Wire Wire Line
	8600 5800 8600 5700
Connection ~ 8600 5700
Wire Wire Line
	8600 5700 8600 5600
Wire Wire Line
	8600 5200 8600 5300
Wire Wire Line
	8600 5700 8850 5700
Wire Wire Line
	6100 5750 6350 5750
Text HLabel 8850 5700 2    50   Output ~ 0
VSENSE_5VA
Wire Wire Line
	8600 5200 8350 5200
Connection ~ 8350 5200
Wire Wire Line
	5100 5600 5400 5600
Wire Wire Line
	2100 4500 2100 5200
Text HLabel 1600 4900 0    50   Input ~ 0
EN_5VA
Wire Wire Line
	1600 4900 1750 4900
Text HLabel 2000 4500 0    50   Input ~ 0
VIN
Wire Wire Line
	2000 4500 2100 4500
$Comp
L power:+5VA #PWR?
U 1 1 6128E026
P 8350 5100
AR Path="/605746B5/5F8E5420/5F955280/6128E026" Ref="#PWR?"  Part="1" 
AR Path="/605746B5/61256AAD/6128E026" Ref="#PWR?"  Part="1" 
F 0 "#PWR?" H 8350 4950 50  0001 C CNN
F 1 "+5VA" H 8365 5273 50  0000 C CNN
F 2 "" H 8350 5100 50  0001 C CNN
F 3 "" H 8350 5100 50  0001 C CNN
	1    8350 5100
	1    0    0    -1  
$EndComp
$Comp
L Device:R R?
U 1 1 609F4935
P 1750 5750
AR Path="/605746B5/5F853053/609F4935" Ref="R?"  Part="1" 
AR Path="/605746B5/61256AAD/609F4935" Ref="R3605"  Part="1" 
F 0 "R3605" V 1830 5750 50  0000 C CNN
F 1 "10k" V 1750 5750 50  0000 C CNN
F 2 "Resistor_SMD:R_0402_1005Metric" V 1680 5750 50  0001 C CNN
F 3 "~" H 1750 5750 50  0001 C CNN
F 4 "3000-0000000131" H 1750 5750 50  0001 C CNN "PartSpecification"
	1    1750 5750
	1    0    0    -1  
$EndComp
$Comp
L power:GND #PWR?
U 1 1 609F493B
P 1750 6000
AR Path="/605746B5/5F853053/609F493B" Ref="#PWR?"  Part="1" 
AR Path="/605746B5/61256AAD/609F493B" Ref="#PWR?"  Part="1" 
F 0 "#PWR?" H 1750 5750 50  0001 C CNN
F 1 "GND" H 1750 5850 50  0000 C CNN
F 2 "" H 1750 6000 50  0001 C CNN
F 3 "" H 1750 6000 50  0001 C CNN
	1    1750 6000
	1    0    0    -1  
$EndComp
Wire Wire Line
	1750 6000 1750 5900
Wire Wire Line
	1750 5600 1750 5500
Connection ~ 1750 5500
$EndSCHEMATC
