EESchema Schematic File Version 4
LIBS:fdd_frontend_basestation-cache
EELAYER 30 0
EELAYER END
$Descr A4 11693 8268
encoding utf-8
Sheet 7 14
Title ""
Date ""
Rev ""
Comp ""
Comment1 ""
Comment2 ""
Comment3 ""
Comment4 ""
$EndDescr
$Comp
L POWDER_MCU:MSP432E401YTPDTR U501
U 4 1 5D69E129
P 7600 3850
F 0 "U501" H 7600 5238 60  0000 C CNN
F 1 "MSP432E401YTPDTR" H 7600 5132 60  0000 C CNN
F 2 "POWDER_MCU:MSP432E401YTPDTR" H 7600 3390 60  0001 C CNN
F 3 "" H 7600 3450 60  0000 C CNN
F 4 "Texas Instruments" H 7600 3850 50  0001 C CNN "Manufacturer"
F 5 "MSP432E401YTPDTR" H 7600 3850 50  0001 C CNN "PartNumber"
F 6 "3000-0000000080" H 7600 3850 50  0001 C CNN "PartSpecification"
	4    7600 3850
	1    0    0    -1  
$EndComp
$Comp
L power:+3.3V #PWR?
U 1 1 5D69E7B0
P 1500 2550
F 0 "#PWR?" H 1500 2400 50  0001 C CNN
F 1 "+3.3V" H 1515 2723 50  0000 C CNN
F 2 "" H 1500 2550 50  0001 C CNN
F 3 "" H 1500 2550 50  0001 C CNN
	1    1500 2550
	1    0    0    -1  
$EndComp
$Comp
L power:GND #PWR?
U 1 1 5D69E814
P 8550 4450
F 0 "#PWR?" H 8550 4200 50  0001 C CNN
F 1 "GND" H 8555 4277 50  0000 C CNN
F 2 "" H 8550 4450 50  0001 C CNN
F 3 "" H 8550 4450 50  0001 C CNN
	1    8550 4450
	1    0    0    -1  
$EndComp
Wire Wire Line
	8550 4450 8550 4350
Wire Wire Line
	8550 4350 8300 4350
Wire Wire Line
	8300 4250 8550 4250
Wire Wire Line
	8550 4250 8550 4350
Connection ~ 8550 4350
Wire Wire Line
	8300 4150 8550 4150
Wire Wire Line
	8300 4050 8550 4050
Wire Wire Line
	8300 3950 8550 3950
Wire Wire Line
	8300 3850 8550 3850
Wire Wire Line
	8550 3850 8550 3950
Wire Wire Line
	8300 3650 8550 3650
Wire Wire Line
	8550 3650 8550 3850
Connection ~ 8550 3850
Connection ~ 8550 3950
Wire Wire Line
	8550 3950 8550 4050
Connection ~ 8550 4050
Wire Wire Line
	8550 4050 8550 4150
Connection ~ 8550 4150
Wire Wire Line
	8550 4150 8550 4250
Connection ~ 8550 4250
Wire Wire Line
	6900 2750 1500 2750
Wire Wire Line
	1500 2750 1500 2550
Wire Wire Line
	6900 2850 1500 2850
Wire Wire Line
	6900 2950 1500 2950
Wire Wire Line
	6900 4050 1500 4050
Wire Wire Line
	6900 3950 1500 3950
Wire Wire Line
	6900 3850 1500 3850
Wire Wire Line
	6900 3750 1500 3750
Wire Wire Line
	6900 3650 1500 3650
Wire Wire Line
	6900 3550 1500 3550
Wire Wire Line
	6900 3450 1500 3450
Wire Wire Line
	6900 3350 1500 3350
Wire Wire Line
	6900 3250 1500 3250
Wire Wire Line
	6900 3150 1500 3150
Wire Wire Line
	6900 3050 1500 3050
Wire Wire Line
	1500 4050 1500 3950
Connection ~ 1500 2750
Connection ~ 1500 2850
Wire Wire Line
	1500 2850 1500 2750
Connection ~ 1500 2950
Wire Wire Line
	1500 2950 1500 2850
Connection ~ 1500 3050
Wire Wire Line
	1500 3050 1500 2950
Connection ~ 1500 3150
Wire Wire Line
	1500 3150 1500 3050
Connection ~ 1500 3250
Wire Wire Line
	1500 3250 1500 3150
Connection ~ 1500 3350
Wire Wire Line
	1500 3350 1500 3250
Connection ~ 1500 3450
Wire Wire Line
	1500 3450 1500 3350
Connection ~ 1500 3550
Wire Wire Line
	1500 3550 1500 3450
Connection ~ 1500 3650
Wire Wire Line
	1500 3650 1500 3550
Connection ~ 1500 3750
Wire Wire Line
	1500 3750 1500 3650
Connection ~ 1500 3850
Wire Wire Line
	1500 3850 1500 3750
Connection ~ 1500 3950
Wire Wire Line
	1500 3950 1500 3850
$Comp
L Device:L L?
U 1 1 5D6A2BA1
P 2500 4250
AR Path="/5D6A2BA1" Ref="L?"  Part="1" 
AR Path="/5D69DD47/5D6A2BA1" Ref="L701"  Part="1" 
F 0 "L701" V 2690 4250 50  0000 C CNN
F 1 "BEAD" V 2599 4250 50  0000 C CNN
F 2 "Inductor_SMD:L_0603_1608Metric" H 2500 4250 50  0001 C CNN
F 3 "~" H 2500 4250 50  0001 C CNN
F 4 "BLM18EG221SZ1" V 2500 4250 50  0001 C CNN "PartNumber"
F 5 "Murata Electronics" H 2500 4250 50  0001 C CNN "Manufacturer"
F 6 "3000-0000000091" H 2500 4250 50  0001 C CNN "PartSpecification"
	1    2500 4250
	0    -1   -1   0   
$EndComp
$Comp
L Device:C C706
U 1 1 5D6A3C49
P 2750 4500
F 0 "C706" H 2865 4546 50  0000 L CNN
F 1 "0.1uF" H 2865 4455 50  0000 L CNN
F 2 "Capacitor_SMD:C_0402_1005Metric" H 2788 4350 50  0001 C CNN
F 3 "~" H 2750 4500 50  0001 C CNN
F 4 "Murata Electronics" H 2750 4500 50  0001 C CNN "Manufacturer"
F 5 "GRM155R62A104KE14D" H 2750 4500 50  0001 C CNN "PartNumber"
F 6 "3000-0000000125" H 2750 4500 50  0001 C CNN "PartSpecification"
	1    2750 4500
	1    0    0    -1  
$EndComp
$Comp
L power:GND #PWR?
U 1 1 5D6A3CA9
P 2750 4750
F 0 "#PWR?" H 2750 4500 50  0001 C CNN
F 1 "GND" H 2755 4577 50  0000 C CNN
F 2 "" H 2750 4750 50  0001 C CNN
F 3 "" H 2750 4750 50  0001 C CNN
	1    2750 4750
	1    0    0    -1  
$EndComp
Wire Wire Line
	2750 4750 2750 4650
Wire Wire Line
	2650 4250 2750 4250
Wire Wire Line
	2750 4350 2750 4250
Connection ~ 2750 4250
Wire Wire Line
	2750 4250 6900 4250
Wire Wire Line
	2350 4250 1500 4250
Wire Wire Line
	1500 4250 1500 4050
Connection ~ 1500 4050
$Comp
L Device:L L?
U 1 1 5D6A77FA
P 5950 4750
AR Path="/5D6A77FA" Ref="L?"  Part="1" 
AR Path="/5D69DD47/5D6A77FA" Ref="L702"  Part="1" 
F 0 "L702" V 6140 4750 50  0000 C CNN
F 1 "BEAD" V 6049 4750 50  0000 C CNN
F 2 "Inductor_SMD:L_0603_1608Metric" H 5950 4750 50  0001 C CNN
F 3 "~" H 5950 4750 50  0001 C CNN
F 4 "BLM18EG221SZ1" V 5950 4750 50  0001 C CNN "PartNumber"
F 5 "Murata Electronics" H 5950 4750 50  0001 C CNN "Manufacturer"
F 6 "3000-0000000091" H 5950 4750 50  0001 C CNN "PartSpecification"
	1    5950 4750
	0    -1   -1   0   
$EndComp
$Comp
L power:GND #PWR?
U 1 1 5D6A7806
P 6200 5250
F 0 "#PWR?" H 6200 5000 50  0001 C CNN
F 1 "GND" H 6205 5077 50  0000 C CNN
F 2 "" H 6200 5250 50  0001 C CNN
F 3 "" H 6200 5250 50  0001 C CNN
	1    6200 5250
	1    0    0    -1  
$EndComp
Wire Wire Line
	6200 5250 6200 5150
Wire Wire Line
	6100 4750 6200 4750
Wire Wire Line
	6200 4850 6200 4750
Wire Wire Line
	5800 4750 5300 4750
$Comp
L power:GND #PWR?
U 1 1 5D6A8559
P 3850 4950
F 0 "#PWR?" H 3850 4700 50  0001 C CNN
F 1 "GND" H 3855 4777 50  0000 C CNN
F 2 "" H 3850 4950 50  0001 C CNN
F 3 "" H 3850 4950 50  0001 C CNN
	1    3850 4950
	1    0    0    -1  
$EndComp
Wire Wire Line
	3850 4950 3850 4850
$Comp
L power:GND #PWR?
U 1 1 5D6AA053
P 4400 4950
F 0 "#PWR?" H 4400 4700 50  0001 C CNN
F 1 "GND" H 4405 4777 50  0000 C CNN
F 2 "" H 4400 4950 50  0001 C CNN
F 3 "" H 4400 4950 50  0001 C CNN
	1    4400 4950
	1    0    0    -1  
$EndComp
Wire Wire Line
	4400 4950 4400 4850
$Comp
L power:GND #PWR?
U 1 1 5D6AADF2
P 4850 4950
F 0 "#PWR?" H 4850 4700 50  0001 C CNN
F 1 "GND" H 4855 4777 50  0000 C CNN
F 2 "" H 4850 4950 50  0001 C CNN
F 3 "" H 4850 4950 50  0001 C CNN
	1    4850 4950
	1    0    0    -1  
$EndComp
Wire Wire Line
	4850 4950 4850 4850
Wire Wire Line
	4850 4550 4850 4450
Wire Wire Line
	4850 4450 6650 4450
Wire Wire Line
	6900 4550 6650 4550
Wire Wire Line
	6650 4550 6650 4450
Connection ~ 6650 4450
Wire Wire Line
	6650 4450 6900 4450
Wire Wire Line
	4850 4450 4400 4450
Wire Wire Line
	4400 4450 4400 4550
Connection ~ 4850 4450
Wire Wire Line
	4400 4450 3850 4450
Wire Wire Line
	3850 4450 3850 4550
Connection ~ 4400 4450
Wire Wire Line
	6900 4750 6200 4750
Connection ~ 6200 4750
Wire Wire Line
	5300 4750 5300 5350
Wire Wire Line
	5300 5350 5150 5350
Wire Wire Line
	1500 5350 1500 4250
Connection ~ 1500 4250
$Comp
L 000_PreferredParts:C_0_1uF C718
U 1 1 5D6BA7B9
P 5150 5600
F 0 "C718" H 5265 5646 50  0000 L CNN
F 1 "C_0_1uF" H 5265 5555 50  0000 L CNN
F 2 "Capacitor_SMD:C_0402_1005Metric" H 5188 5450 50  0001 C CNN
F 3 "" H 5150 5600 50  0001 C CNN
F 4 "Murata Electronics" H 5150 5600 50  0001 C CNN "Manufacturer"
F 5 "GRM155R62A104KE14D" H 5150 5600 50  0001 C CNN "PartNumber"
F 6 "3000-0000000125" H 0   0   50  0001 C CNN "PartSpecification"
	1    5150 5600
	1    0    0    -1  
$EndComp
$Comp
L 000_PreferredParts:C_0_1uF C715
U 1 1 5D6BA8DD
P 4550 5600
F 0 "C715" H 4665 5646 50  0000 L CNN
F 1 "C_0_1uF" H 4665 5555 50  0000 L CNN
F 2 "Capacitor_SMD:C_0402_1005Metric" H 4588 5450 50  0001 C CNN
F 3 "" H 4550 5600 50  0001 C CNN
F 4 "Murata Electronics" H 4550 5600 50  0001 C CNN "Manufacturer"
F 5 "GRM155R62A104KE14D" H 4550 5600 50  0001 C CNN "PartNumber"
F 6 "3000-0000000125" H 0   0   50  0001 C CNN "PartSpecification"
	1    4550 5600
	1    0    0    -1  
$EndComp
$Comp
L 000_PreferredParts:C_0_1uF C712
U 1 1 5D6BA91D
P 3950 5600
F 0 "C712" H 4065 5646 50  0000 L CNN
F 1 "C_0_1uF" H 4065 5555 50  0000 L CNN
F 2 "Capacitor_SMD:C_0402_1005Metric" H 3988 5450 50  0001 C CNN
F 3 "" H 3950 5600 50  0001 C CNN
F 4 "Murata Electronics" H 3950 5600 50  0001 C CNN "Manufacturer"
F 5 "GRM155R62A104KE14D" H 3950 5600 50  0001 C CNN "PartNumber"
F 6 "3000-0000000125" H 0   0   50  0001 C CNN "PartSpecification"
	1    3950 5600
	1    0    0    -1  
$EndComp
$Comp
L 000_PreferredParts:C_0_1uF C709
U 1 1 5D6BA963
P 3350 5600
F 0 "C709" H 3465 5646 50  0000 L CNN
F 1 "C_0_1uF" H 3465 5555 50  0000 L CNN
F 2 "Capacitor_SMD:C_0402_1005Metric" H 3388 5450 50  0001 C CNN
F 3 "" H 3350 5600 50  0001 C CNN
F 4 "Murata Electronics" H 3350 5600 50  0001 C CNN "Manufacturer"
F 5 "GRM155R62A104KE14D" H 3350 5600 50  0001 C CNN "PartNumber"
F 6 "3000-0000000125" H 0   0   50  0001 C CNN "PartSpecification"
	1    3350 5600
	1    0    0    -1  
$EndComp
$Comp
L 000_PreferredParts:C_0_1uF C705
U 1 1 5D6BA9A3
P 2700 5600
F 0 "C705" H 2815 5646 50  0000 L CNN
F 1 "C_0_1uF" H 2815 5555 50  0000 L CNN
F 2 "Capacitor_SMD:C_0402_1005Metric" H 2738 5450 50  0001 C CNN
F 3 "" H 2700 5600 50  0001 C CNN
F 4 "Murata Electronics" H 2700 5600 50  0001 C CNN "Manufacturer"
F 5 "GRM155R62A104KE14D" H 2700 5600 50  0001 C CNN "PartNumber"
F 6 "3000-0000000125" H 0   0   50  0001 C CNN "PartSpecification"
	1    2700 5600
	1    0    0    -1  
$EndComp
$Comp
L 000_PreferredParts:C_0_1uF C703
U 1 1 5D6BA9EF
P 2100 5600
F 0 "C703" H 2215 5646 50  0000 L CNN
F 1 "C_0_1uF" H 2215 5555 50  0000 L CNN
F 2 "Capacitor_SMD:C_0402_1005Metric" H 2138 5450 50  0001 C CNN
F 3 "" H 2100 5600 50  0001 C CNN
F 4 "Murata Electronics" H 2100 5600 50  0001 C CNN "Manufacturer"
F 5 "GRM155R62A104KE14D" H 2100 5600 50  0001 C CNN "PartNumber"
F 6 "3000-0000000125" H 0   0   50  0001 C CNN "PartSpecification"
	1    2100 5600
	1    0    0    -1  
$EndComp
$Comp
L 000_PreferredParts:C_0_1uF C701
U 1 1 5D6BAA37
P 1500 5600
F 0 "C701" H 1615 5646 50  0000 L CNN
F 1 "C_0_1uF" H 1615 5555 50  0000 L CNN
F 2 "Capacitor_SMD:C_0402_1005Metric" H 1538 5450 50  0001 C CNN
F 3 "" H 1500 5600 50  0001 C CNN
F 4 "Murata Electronics" H 1500 5600 50  0001 C CNN "Manufacturer"
F 5 "GRM155R62A104KE14D" H 1500 5600 50  0001 C CNN "PartNumber"
F 6 "3000-0000000125" H 0   0   50  0001 C CNN "PartSpecification"
	1    1500 5600
	1    0    0    -1  
$EndComp
$Comp
L 000_PreferredParts:C_0_1uF C719
U 1 1 5D6BC10F
P 5600 6000
F 0 "C719" H 5715 6046 50  0000 L CNN
F 1 "C_0_1uF" H 5715 5955 50  0000 L CNN
F 2 "Capacitor_SMD:C_0402_1005Metric" H 5638 5850 50  0001 C CNN
F 3 "" H 5600 6000 50  0001 C CNN
F 4 "Murata Electronics" H 5600 6000 50  0001 C CNN "Manufacturer"
F 5 "GRM155R62A104KE14D" H 5600 6000 50  0001 C CNN "PartNumber"
F 6 "3000-0000000125" H 0   0   50  0001 C CNN "PartSpecification"
	1    5600 6000
	1    0    0    -1  
$EndComp
$Comp
L 000_PreferredParts:C_0_1uF C717
U 1 1 5D6BC116
P 5000 6000
F 0 "C717" H 5115 6046 50  0000 L CNN
F 1 "C_0_1uF" H 5115 5955 50  0000 L CNN
F 2 "Capacitor_SMD:C_0402_1005Metric" H 5038 5850 50  0001 C CNN
F 3 "" H 5000 6000 50  0001 C CNN
F 4 "Murata Electronics" H 5000 6000 50  0001 C CNN "Manufacturer"
F 5 "GRM155R62A104KE14D" H 5000 6000 50  0001 C CNN "PartNumber"
F 6 "3000-0000000125" H 0   0   50  0001 C CNN "PartSpecification"
	1    5000 6000
	1    0    0    -1  
$EndComp
$Comp
L 000_PreferredParts:C_0_1uF C714
U 1 1 5D6BC11D
P 4400 6000
F 0 "C714" H 4515 6046 50  0000 L CNN
F 1 "C_0_1uF" H 4515 5955 50  0000 L CNN
F 2 "Capacitor_SMD:C_0402_1005Metric" H 4438 5850 50  0001 C CNN
F 3 "" H 4400 6000 50  0001 C CNN
F 4 "Murata Electronics" H 4400 6000 50  0001 C CNN "Manufacturer"
F 5 "GRM155R62A104KE14D" H 4400 6000 50  0001 C CNN "PartNumber"
F 6 "3000-0000000125" H 0   0   50  0001 C CNN "PartSpecification"
	1    4400 6000
	1    0    0    -1  
$EndComp
$Comp
L 000_PreferredParts:C_0_1uF C710
U 1 1 5D6BC124
P 3800 6000
F 0 "C710" H 3915 6046 50  0000 L CNN
F 1 "C_0_1uF" H 3915 5955 50  0000 L CNN
F 2 "Capacitor_SMD:C_0402_1005Metric" H 3838 5850 50  0001 C CNN
F 3 "" H 3800 6000 50  0001 C CNN
F 4 "Murata Electronics" H 3800 6000 50  0001 C CNN "Manufacturer"
F 5 "GRM155R62A104KE14D" H 3800 6000 50  0001 C CNN "PartNumber"
F 6 "3000-0000000125" H 0   0   50  0001 C CNN "PartSpecification"
	1    3800 6000
	1    0    0    -1  
$EndComp
$Comp
L 000_PreferredParts:C_0_1uF C707
U 1 1 5D6BC12B
P 3150 6000
F 0 "C707" H 3265 6046 50  0000 L CNN
F 1 "C_0_1uF" H 3265 5955 50  0000 L CNN
F 2 "Capacitor_SMD:C_0402_1005Metric" H 3188 5850 50  0001 C CNN
F 3 "" H 3150 6000 50  0001 C CNN
F 4 "Murata Electronics" H 3150 6000 50  0001 C CNN "Manufacturer"
F 5 "GRM155R62A104KE14D" H 3150 6000 50  0001 C CNN "PartNumber"
F 6 "3000-0000000125" H 0   0   50  0001 C CNN "PartSpecification"
	1    3150 6000
	1    0    0    -1  
$EndComp
$Comp
L 000_PreferredParts:C_0_1uF C704
U 1 1 5D6BC132
P 2550 6000
F 0 "C704" H 2665 6046 50  0000 L CNN
F 1 "C_0_1uF" H 2665 5955 50  0000 L CNN
F 2 "Capacitor_SMD:C_0402_1005Metric" H 2588 5850 50  0001 C CNN
F 3 "" H 2550 6000 50  0001 C CNN
F 4 "Murata Electronics" H 2550 6000 50  0001 C CNN "Manufacturer"
F 5 "GRM155R62A104KE14D" H 2550 6000 50  0001 C CNN "PartNumber"
F 6 "3000-0000000125" H 0   0   50  0001 C CNN "PartSpecification"
	1    2550 6000
	1    0    0    -1  
$EndComp
$Comp
L 000_PreferredParts:C_0_1uF C702
U 1 1 5D6BC139
P 1950 6000
F 0 "C702" H 2065 6046 50  0000 L CNN
F 1 "C_0_1uF" H 2065 5955 50  0000 L CNN
F 2 "Capacitor_SMD:C_0402_1005Metric" H 1988 5850 50  0001 C CNN
F 3 "" H 1950 6000 50  0001 C CNN
F 4 "Murata Electronics" H 1950 6000 50  0001 C CNN "Manufacturer"
F 5 "GRM155R62A104KE14D" H 1950 6000 50  0001 C CNN "PartNumber"
F 6 "3000-0000000125" H 0   0   50  0001 C CNN "PartSpecification"
	1    1950 6000
	1    0    0    -1  
$EndComp
Wire Wire Line
	5150 5450 5150 5350
Connection ~ 5150 5350
Wire Wire Line
	5150 5350 5000 5350
Wire Wire Line
	4550 5450 4550 5350
Connection ~ 4550 5350
Wire Wire Line
	4550 5350 4400 5350
Wire Wire Line
	3950 5450 3950 5350
Connection ~ 3950 5350
Wire Wire Line
	3950 5350 3800 5350
Wire Wire Line
	3350 5450 3350 5350
Connection ~ 3350 5350
Wire Wire Line
	3350 5350 3150 5350
Wire Wire Line
	2700 5450 2700 5350
Connection ~ 2700 5350
Wire Wire Line
	2700 5350 2550 5350
Wire Wire Line
	2100 5450 2100 5350
Connection ~ 2100 5350
Wire Wire Line
	2100 5350 1950 5350
Wire Wire Line
	1500 5450 1500 5350
Connection ~ 1500 5350
Wire Wire Line
	1950 5350 1950 5850
Connection ~ 1950 5350
Wire Wire Line
	1950 5350 1500 5350
Wire Wire Line
	2550 5350 2550 5850
Connection ~ 2550 5350
Wire Wire Line
	2550 5350 2100 5350
Wire Wire Line
	3150 5350 3150 5850
Wire Wire Line
	3800 5350 3800 5850
Wire Wire Line
	4400 5350 4400 5850
Wire Wire Line
	5000 5350 5000 5850
Wire Wire Line
	5600 5350 5600 5850
Wire Wire Line
	5600 5350 5300 5350
Connection ~ 3150 5350
Wire Wire Line
	3150 5350 2700 5350
Connection ~ 3800 5350
Wire Wire Line
	3800 5350 3350 5350
Connection ~ 4400 5350
Wire Wire Line
	4400 5350 3950 5350
Connection ~ 5000 5350
Wire Wire Line
	5000 5350 4550 5350
Connection ~ 5300 5350
$Comp
L power:GND #PWR?
U 1 1 5D6DAD50
P 1950 6300
F 0 "#PWR?" H 1950 6050 50  0001 C CNN
F 1 "GND" H 1955 6127 50  0000 C CNN
F 2 "" H 1950 6300 50  0001 C CNN
F 3 "" H 1950 6300 50  0001 C CNN
	1    1950 6300
	1    0    0    -1  
$EndComp
Wire Wire Line
	1950 6300 1950 6150
$Comp
L power:GND #PWR?
U 1 1 5D6DD677
P 1500 5900
F 0 "#PWR?" H 1500 5650 50  0001 C CNN
F 1 "GND" H 1505 5727 50  0000 C CNN
F 2 "" H 1500 5900 50  0001 C CNN
F 3 "" H 1500 5900 50  0001 C CNN
	1    1500 5900
	1    0    0    -1  
$EndComp
Wire Wire Line
	1500 5900 1500 5750
$Comp
L power:GND #PWR?
U 1 1 5D6DFF9F
P 2400 6300
F 0 "#PWR?" H 2400 6050 50  0001 C CNN
F 1 "GND" H 2405 6127 50  0000 C CNN
F 2 "" H 2400 6300 50  0001 C CNN
F 3 "" H 2400 6300 50  0001 C CNN
	1    2400 6300
	1    0    0    -1  
$EndComp
Wire Wire Line
	2400 5850 2100 5850
Wire Wire Line
	2100 5850 2100 5750
Wire Wire Line
	2400 5850 2400 6300
$Comp
L power:GND #PWR?
U 1 1 5D6E56E9
P 3000 6300
F 0 "#PWR?" H 3000 6050 50  0001 C CNN
F 1 "GND" H 3005 6127 50  0000 C CNN
F 2 "" H 3000 6300 50  0001 C CNN
F 3 "" H 3000 6300 50  0001 C CNN
	1    3000 6300
	1    0    0    -1  
$EndComp
Wire Wire Line
	3000 5850 2700 5850
Wire Wire Line
	2700 5850 2700 5750
Wire Wire Line
	3000 5850 3000 6300
$Comp
L power:GND #PWR?
U 1 1 5D6E85BE
P 3650 6300
F 0 "#PWR?" H 3650 6050 50  0001 C CNN
F 1 "GND" H 3655 6127 50  0000 C CNN
F 2 "" H 3650 6300 50  0001 C CNN
F 3 "" H 3650 6300 50  0001 C CNN
	1    3650 6300
	1    0    0    -1  
$EndComp
Wire Wire Line
	3650 5850 3350 5850
Wire Wire Line
	3350 5850 3350 5750
Wire Wire Line
	3650 5850 3650 6300
$Comp
L power:GND #PWR?
U 1 1 5D6EB7A0
P 4250 6300
F 0 "#PWR?" H 4250 6050 50  0001 C CNN
F 1 "GND" H 4255 6127 50  0000 C CNN
F 2 "" H 4250 6300 50  0001 C CNN
F 3 "" H 4250 6300 50  0001 C CNN
	1    4250 6300
	1    0    0    -1  
$EndComp
Wire Wire Line
	4250 5850 3950 5850
Wire Wire Line
	3950 5850 3950 5750
Wire Wire Line
	4250 5850 4250 6300
$Comp
L power:GND #PWR?
U 1 1 5D6EEBFC
P 4850 6300
F 0 "#PWR?" H 4850 6050 50  0001 C CNN
F 1 "GND" H 4855 6127 50  0000 C CNN
F 2 "" H 4850 6300 50  0001 C CNN
F 3 "" H 4850 6300 50  0001 C CNN
	1    4850 6300
	1    0    0    -1  
$EndComp
Wire Wire Line
	4850 5850 4550 5850
Wire Wire Line
	4550 5850 4550 5750
Wire Wire Line
	4850 5850 4850 6300
$Comp
L power:GND #PWR?
U 1 1 5D6F22FC
P 5450 6300
F 0 "#PWR?" H 5450 6050 50  0001 C CNN
F 1 "GND" H 5455 6127 50  0000 C CNN
F 2 "" H 5450 6300 50  0001 C CNN
F 3 "" H 5450 6300 50  0001 C CNN
	1    5450 6300
	1    0    0    -1  
$EndComp
Wire Wire Line
	5450 5850 5150 5850
Wire Wire Line
	5150 5850 5150 5750
Wire Wire Line
	5450 5850 5450 6300
$Comp
L power:GND #PWR?
U 1 1 5D6F5CCA
P 2550 6300
F 0 "#PWR?" H 2550 6050 50  0001 C CNN
F 1 "GND" H 2555 6127 50  0000 C CNN
F 2 "" H 2550 6300 50  0001 C CNN
F 3 "" H 2550 6300 50  0001 C CNN
	1    2550 6300
	1    0    0    -1  
$EndComp
Wire Wire Line
	2550 6300 2550 6150
$Comp
L power:GND #PWR?
U 1 1 5D6F9780
P 3150 6300
F 0 "#PWR?" H 3150 6050 50  0001 C CNN
F 1 "GND" H 3155 6127 50  0000 C CNN
F 2 "" H 3150 6300 50  0001 C CNN
F 3 "" H 3150 6300 50  0001 C CNN
	1    3150 6300
	1    0    0    -1  
$EndComp
Wire Wire Line
	3150 6300 3150 6150
$Comp
L power:GND #PWR?
U 1 1 5D6FD35F
P 3800 6300
F 0 "#PWR?" H 3800 6050 50  0001 C CNN
F 1 "GND" H 3805 6127 50  0000 C CNN
F 2 "" H 3800 6300 50  0001 C CNN
F 3 "" H 3800 6300 50  0001 C CNN
	1    3800 6300
	1    0    0    -1  
$EndComp
Wire Wire Line
	3800 6300 3800 6150
$Comp
L power:GND #PWR?
U 1 1 5D701058
P 4400 6300
F 0 "#PWR?" H 4400 6050 50  0001 C CNN
F 1 "GND" H 4405 6127 50  0000 C CNN
F 2 "" H 4400 6300 50  0001 C CNN
F 3 "" H 4400 6300 50  0001 C CNN
	1    4400 6300
	1    0    0    -1  
$EndComp
Wire Wire Line
	4400 6300 4400 6150
$Comp
L power:GND #PWR?
U 1 1 5D704E5C
P 5000 6300
F 0 "#PWR?" H 5000 6050 50  0001 C CNN
F 1 "GND" H 5005 6127 50  0000 C CNN
F 2 "" H 5000 6300 50  0001 C CNN
F 3 "" H 5000 6300 50  0001 C CNN
	1    5000 6300
	1    0    0    -1  
$EndComp
Wire Wire Line
	5000 6300 5000 6150
$Comp
L power:GND #PWR?
U 1 1 5D708D56
P 5600 6300
F 0 "#PWR?" H 5600 6050 50  0001 C CNN
F 1 "GND" H 5605 6127 50  0000 C CNN
F 2 "" H 5600 6300 50  0001 C CNN
F 3 "" H 5600 6300 50  0001 C CNN
	1    5600 6300
	1    0    0    -1  
$EndComp
Wire Wire Line
	5600 6300 5600 6150
$Comp
L 000_PreferredParts:C_1uF C713
U 1 1 5D71150C
P 4400 4700
F 0 "C713" H 4515 4746 50  0000 L CNN
F 1 "C_1uF" H 4515 4655 50  0000 L CNN
F 2 "Capacitor_SMD:C_0603_1608Metric" H 4438 4550 50  0001 C CNN
F 3 "~" H 4400 4700 50  0001 C CNN
F 4 "Taiyo Yuden" H 4400 4700 50  0001 C CNN "Manufacturer"
F 5 "GMK107BJ105KAHT" H 4400 4700 50  0001 C CNN "PartNumber"
F 6 "3000-0000000136" H 0   0   50  0001 C CNN "PartSpecification"
	1    4400 4700
	1    0    0    -1  
$EndComp
$Comp
L 000_PreferredParts:C_1uF C711
U 1 1 5D719CEE
P 3850 4700
F 0 "C711" H 3965 4746 50  0000 L CNN
F 1 "C_1uF" H 3965 4655 50  0000 L CNN
F 2 "Capacitor_SMD:C_0603_1608Metric" H 3888 4550 50  0001 C CNN
F 3 "~" H 3850 4700 50  0001 C CNN
F 4 "Taiyo Yuden" H 3850 4700 50  0001 C CNN "Manufacturer"
F 5 "GMK107BJ105KAHT" H 3850 4700 50  0001 C CNN "PartNumber"
F 6 "3000-0000000136" H 0   0   50  0001 C CNN "PartSpecification"
	1    3850 4700
	1    0    0    -1  
$EndComp
$Comp
L power:GND #PWR?
U 1 1 5D71DCFA
P 3300 4950
F 0 "#PWR?" H 3300 4700 50  0001 C CNN
F 1 "GND" H 3305 4777 50  0000 C CNN
F 2 "" H 3300 4950 50  0001 C CNN
F 3 "" H 3300 4950 50  0001 C CNN
	1    3300 4950
	1    0    0    -1  
$EndComp
Wire Wire Line
	3300 4950 3300 4850
Wire Wire Line
	3850 4450 3300 4450
Wire Wire Line
	3300 4450 3300 4550
$Comp
L 000_PreferredParts:C_1uF C708
U 1 1 5D71DD03
P 3300 4700
F 0 "C708" H 3415 4746 50  0000 L CNN
F 1 "C_1uF" H 3415 4655 50  0000 L CNN
F 2 "Capacitor_SMD:C_0603_1608Metric" H 3338 4550 50  0001 C CNN
F 3 "~" H 3300 4700 50  0001 C CNN
F 4 "Taiyo Yuden" H 3300 4700 50  0001 C CNN "Manufacturer"
F 5 "GMK107BJ105KAHT" H 3300 4700 50  0001 C CNN "PartNumber"
F 6 "3000-0000000136" H 0   0   50  0001 C CNN "PartSpecification"
	1    3300 4700
	1    0    0    -1  
$EndComp
Connection ~ 3850 4450
NoConn ~ 6900 5000
$Comp
L 000_PreferredParts:C_0_1uF C720
U 1 1 5D73536F
P 6200 5000
F 0 "C720" H 6315 5046 50  0000 L CNN
F 1 "C_0_1uF" H 6315 4955 50  0000 L CNN
F 2 "Capacitor_SMD:C_0402_1005Metric" H 6238 4850 50  0001 C CNN
F 3 "" H 6200 5000 50  0001 C CNN
F 4 "Murata Electronics" H 6200 5000 50  0001 C CNN "Manufacturer"
F 5 "GRM155R62A104KE14D" H 6200 5000 50  0001 C CNN "PartNumber"
F 6 "3000-0000000125" H 0   0   50  0001 C CNN "PartSpecification"
	1    6200 5000
	1    0    0    -1  
$EndComp
$Comp
L 000_PreferredParts:C_0_1uF C716
U 1 1 5D735404
P 4850 4700
F 0 "C716" H 4965 4746 50  0000 L CNN
F 1 "C_0_1uF" H 4965 4655 50  0000 L CNN
F 2 "Capacitor_SMD:C_0402_1005Metric" H 4888 4550 50  0001 C CNN
F 3 "" H 4850 4700 50  0001 C CNN
F 4 "Murata Electronics" H 4850 4700 50  0001 C CNN "Manufacturer"
F 5 "GRM155R62A104KE14D" H 4850 4700 50  0001 C CNN "PartNumber"
F 6 "3000-0000000125" H 0   0   50  0001 C CNN "PartSpecification"
	1    4850 4700
	1    0    0    -1  
$EndComp
Text Label 5050 4450 0    50   ~ 0
VDDC
Text Label 5050 4250 0    50   ~ 0
VDDA
Text Label 6300 4750 0    50   ~ 0
VREFA
$EndSCHEMATC
