EESchema Schematic File Version 4
EELAYER 30 0
EELAYER END
$Descr A3 16535 11693
encoding utf-8
Sheet 1 14
Title ""
Date ""
Rev ""
Comp ""
Comment1 ""
Comment2 ""
Comment3 ""
Comment4 ""
$EndDescr
$Comp
L POWDER_RF:Qorvo_QPQ1270 U102
U 1 1 5D1C07D9
P 11850 8150
F 0 "U102" H 12000 8400 50  0000 L CNN
F 1 "Qorvo_QPQ1270" H 11200 8450 50  0000 L CNN
F 2 "POWDER_RF:Qorvo_SMP" H 12400 7750 50  0001 C CNN
F 3 "" H 11850 8150 50  0001 C CNN
F 4 "Qorvo" H 11850 8150 50  0001 C CNN "Manufacturer"
F 5 "QPQ1270TR7 " H 11850 8150 50  0001 C CNN "PartNumber"
F 6 "3000-0000000078" H 11850 8150 50  0001 C CNN "PartSpecification"
	1    11850 8150
	0    -1   1    0   
$EndComp
$Comp
L power:GND #PWR?
U 1 1 5D1CD94B
P 12350 8400
F 0 "#PWR?" H 12350 8150 50  0001 C CNN
F 1 "GND" H 12355 8227 50  0000 C CNN
F 2 "" H 12350 8400 50  0001 C CNN
F 3 "" H 12350 8400 50  0001 C CNN
	1    12350 8400
	0    -1   -1   0   
$EndComp
Wire Wire Line
	12200 8400 12350 8400
$Comp
L power:GND #PWR?
U 1 1 5D1D3E09
P 12350 8300
F 0 "#PWR?" H 12350 8050 50  0001 C CNN
F 1 "GND" H 12355 8127 50  0000 C CNN
F 2 "" H 12350 8300 50  0001 C CNN
F 3 "" H 12350 8300 50  0001 C CNN
	1    12350 8300
	0    -1   -1   0   
$EndComp
Wire Wire Line
	12200 8300 12350 8300
$Comp
L power:GND #PWR?
U 1 1 5D1D3F95
P 12350 8200
F 0 "#PWR?" H 12350 7950 50  0001 C CNN
F 1 "GND" H 12355 8027 50  0000 C CNN
F 2 "" H 12350 8200 50  0001 C CNN
F 3 "" H 12350 8200 50  0001 C CNN
	1    12350 8200
	0    -1   -1   0   
$EndComp
Wire Wire Line
	12200 8200 12350 8200
$Comp
L power:GND #PWR?
U 1 1 5D1D41E3
P 12350 8100
F 0 "#PWR?" H 12350 7850 50  0001 C CNN
F 1 "GND" H 12355 7927 50  0000 C CNN
F 2 "" H 12350 8100 50  0001 C CNN
F 3 "" H 12350 8100 50  0001 C CNN
	1    12350 8100
	0    -1   -1   0   
$EndComp
Wire Wire Line
	12200 8100 12350 8100
$Comp
L power:GND #PWR?
U 1 1 5D1D4556
P 12350 8000
F 0 "#PWR?" H 12350 7750 50  0001 C CNN
F 1 "GND" H 12355 7827 50  0000 C CNN
F 2 "" H 12350 8000 50  0001 C CNN
F 3 "" H 12350 8000 50  0001 C CNN
	1    12350 8000
	0    -1   -1   0   
$EndComp
Wire Wire Line
	12200 8000 12350 8000
$Comp
L power:GND #PWR?
U 1 1 5D1D4955
P 12350 7900
F 0 "#PWR?" H 12350 7650 50  0001 C CNN
F 1 "GND" H 12355 7727 50  0000 C CNN
F 2 "" H 12350 7900 50  0001 C CNN
F 3 "" H 12350 7900 50  0001 C CNN
	1    12350 7900
	0    -1   -1   0   
$EndComp
Wire Wire Line
	12200 7900 12350 7900
Wire Wire Line
	1100 4450 1200 4450
$Comp
L Connector:Conn_Coaxial J101
U 1 1 5D23A7CA
P 900 4450
F 0 "J101" H 1000 4700 50  0000 C CNN
F 1 "Conn_Coaxial" H 1050 4600 50  0000 C CNN
F 2 "POWDER_RF:SMA_EndLaunch_142-0761-881" H 900 4450 50  0001 C CNN
F 3 " ~" H 900 4450 50  0001 C CNN
F 4 "Cinch Connectivity Solutions Johnson" H 900 4450 50  0001 C CNN "Manufacturer"
F 5 "142-0761-881" H 900 4450 50  0001 C CNN "PartNumber"
F 6 "3000-0000000165" H 900 4450 50  0001 C CNN "PartSpecification"
	1    900  4450
	-1   0    0    -1  
$EndComp
$Comp
L power:GND #PWR?
U 1 1 5D23AFE1
P 900 4900
F 0 "#PWR?" H 900 4650 50  0001 C CNN
F 1 "GND" H 905 4727 50  0000 C CNN
F 2 "" H 900 4900 50  0001 C CNN
F 3 "" H 900 4900 50  0001 C CNN
	1    900  4900
	1    0    0    -1  
$EndComp
Wire Wire Line
	900  4900 900  4650
$Comp
L Connector:Conn_Coaxial J102
U 1 1 5D23FE0B
P 10750 8150
F 0 "J102" V 11000 8000 50  0000 L CNN
F 1 "Conn_Coaxial" V 10900 7750 50  0000 L CNN
F 2 "POWDER_RF:SMA_EndLaunch_142-0761-881" H 10750 8150 50  0001 C CNN
F 3 " ~" H 10750 8150 50  0001 C CNN
F 4 "Cinch Connectivity Solutions Johnson" H 10750 8150 50  0001 C CNN "Manufacturer"
F 5 "142-0761-881" H 10750 8150 50  0001 C CNN "PartNumber"
F 6 "3000-0000000165" H 10750 8150 50  0001 C CNN "PartSpecification"
	1    10750 8150
	-1   0    0    1   
$EndComp
$Comp
L power:GND #PWR?
U 1 1 5D242F06
P 10900 7400
F 0 "#PWR?" H 10900 7150 50  0001 C CNN
F 1 "GND" H 10905 7227 50  0000 C CNN
F 2 "" H 10900 7400 50  0001 C CNN
F 3 "" H 10900 7400 50  0001 C CNN
	1    10900 7400
	0    -1   -1   0   
$EndComp
Wire Wire Line
	10900 7400 10750 7400
$Comp
L Device:R R104
U 1 1 5D24D1B4
P 8800 4200
F 0 "R104" V 8593 4200 50  0000 C CNN
F 1 "47pF" V 8684 4200 50  0000 C CNN
F 2 "Resistor_SMD:R_0201_0603Metric" V 8730 4200 50  0001 C CNN
F 3 "~" H 8800 4200 50  0001 C CNN
F 4 "" H 8800 4200 50  0001 C CNN "Manufacturer"
F 5 "" H 8800 4200 50  0001 C CNN "PartNumber"
F 6 "3000-0000000161" H 8800 4200 50  0001 C CNN "PartSpecification"
	1    8800 4200
	0    1    1    0   
$EndComp
$Comp
L Device:R R103
U 1 1 5D253390
P 8550 4450
F 0 "R103" H 8480 4404 50  0000 R CNN
F 1 "DNP" H 8480 4495 50  0000 R CNN
F 2 "Resistor_SMD:R_0201_0603Metric" V 8480 4450 50  0001 C CNN
F 3 "~" H 8550 4450 50  0001 C CNN
	1    8550 4450
	-1   0    0    1   
$EndComp
Wire Wire Line
	8550 4200 8550 4300
Connection ~ 8550 4200
Wire Wire Line
	8550 4200 8650 4200
$Comp
L Device:R R105
U 1 1 5D25A0AE
P 9050 4450
F 0 "R105" H 8980 4404 50  0000 R CNN
F 1 "DNP" H 8980 4495 50  0000 R CNN
F 2 "Resistor_SMD:R_0201_0603Metric" V 8980 4450 50  0001 C CNN
F 3 "~" H 9050 4450 50  0001 C CNN
	1    9050 4450
	-1   0    0    1   
$EndComp
Wire Wire Line
	9050 4200 9050 4300
Connection ~ 9050 4200
Wire Wire Line
	9050 4200 8950 4200
$Comp
L power:GND #PWR?
U 1 1 5D25EBC3
P 8550 4700
F 0 "#PWR?" H 8550 4450 50  0001 C CNN
F 1 "GND" H 8555 4527 50  0000 C CNN
F 2 "" H 8550 4700 50  0001 C CNN
F 3 "" H 8550 4700 50  0001 C CNN
	1    8550 4700
	1    0    0    -1  
$EndComp
$Comp
L power:GND #PWR?
U 1 1 5D260511
P 9050 4700
F 0 "#PWR?" H 9050 4450 50  0001 C CNN
F 1 "GND" H 9055 4527 50  0000 C CNN
F 2 "" H 9050 4700 50  0001 C CNN
F 3 "" H 9050 4700 50  0001 C CNN
	1    9050 4700
	1    0    0    -1  
$EndComp
Wire Wire Line
	9050 4600 9050 4700
Wire Wire Line
	8550 4600 8550 4700
Wire Wire Line
	15550 4700 15450 4700
$Comp
L Connector:Conn_Coaxial J103
U 1 1 5D299CC6
P 15750 4700
F 0 "J103" H 15900 4800 50  0000 L CNN
F 1 "Conn_Coaxial" H 15900 4700 50  0000 L CNN
F 2 "POWDER_RF:SMA_EndLaunch_142-0761-881" H 15750 4700 50  0001 C CNN
F 3 " ~" H 15750 4700 50  0001 C CNN
F 4 "Cinch Connectivity Solutions Johnson" H 15750 4700 50  0001 C CNN "Manufacturer"
F 5 "142-0761-881" H 15750 4700 50  0001 C CNN "PartNumber"
F 6 "3000-0000000165" H 15750 4700 50  0001 C CNN "PartSpecification"
	1    15750 4700
	1    0    0    -1  
$EndComp
$Comp
L power:GND #PWR?
U 1 1 5D29D283
P 15750 5150
F 0 "#PWR?" H 15750 4900 50  0001 C CNN
F 1 "GND" H 15755 4977 50  0000 C CNN
F 2 "" H 15750 5150 50  0001 C CNN
F 3 "" H 15750 5150 50  0001 C CNN
	1    15750 5150
	1    0    0    -1  
$EndComp
Wire Wire Line
	15750 5150 15750 4900
Text Label 11100 8150 1    50   ~ 0
ant
Text Label 15550 4700 1    50   ~ 0
pa_in
Text Label 9200 4200 1    50   ~ 0
pa_out_att_1
Text Label 8250 4200 0    50   ~ 0
pa_out
Text Label 9250 5900 0    50   ~ 0
pa_en
$Sheet
S 6000 1400 900  650 
U 5D562501
F0 "vreg_5_1" 50
F1 "voltage_regulator_5.sch" 50
F2 "EN" I L 6000 1700 50 
F3 "PS_SYNC" I L 6000 2000 50 
F4 "VSEL_1" I L 6000 1800 50 
F5 "V_12" I L 6000 1500 50 
F6 "V_OUT" O R 6900 1500 50 
F7 "DCDC_PG" O R 6900 1700 50 
F8 "LDO_PG" O R 6900 1800 50 
F9 "VSEL_2" I L 6000 1900 50 
$EndSheet
$Sheet
S 9100 1650 900  650 
U 5D587C46
F0 "vreg_5_2" 50
F1 "voltage_regulator_5.sch" 50
F2 "EN" I L 9100 1950 50 
F3 "PS_SYNC" I L 9100 2250 50 
F4 "VSEL_1" I L 9100 2050 50 
F5 "V_12" I L 9100 1750 50 
F6 "V_OUT" O R 10000 1750 50 
F7 "DCDC_PG" O R 10000 1950 50 
F8 "LDO_PG" O R 10000 2050 50 
F9 "VSEL_2" I L 9100 2150 50 
$EndSheet
$Sheet
S 4100 1400 900  650 
U 5D591ABD
F0 "vreg_3_3_1" 50
F1 "voltage_regulator_3_3.sch" 50
F2 "PG" O R 5000 1700 50 
F3 "V_12" I L 4100 1500 50 
F4 "V_OUT" O R 5000 1500 50 
$EndSheet
$Comp
L power:+12V #PWR?
U 1 1 5D59A645
P 5750 1300
F 0 "#PWR?" H 5750 1150 50  0001 C CNN
F 1 "+12V" H 5765 1473 50  0000 C CNN
F 2 "" H 5750 1300 50  0001 C CNN
F 3 "" H 5750 1300 50  0001 C CNN
	1    5750 1300
	1    0    0    -1  
$EndComp
Wire Wire Line
	5750 1300 5750 1500
Wire Wire Line
	5750 1500 6000 1500
$Comp
L power:+12V #PWR?
U 1 1 5D5A301C
P 8850 1550
F 0 "#PWR?" H 8850 1400 50  0001 C CNN
F 1 "+12V" H 8865 1723 50  0000 C CNN
F 2 "" H 8850 1550 50  0001 C CNN
F 3 "" H 8850 1550 50  0001 C CNN
	1    8850 1550
	1    0    0    -1  
$EndComp
Wire Wire Line
	8850 1550 8850 1750
Wire Wire Line
	8850 1750 9100 1750
$Comp
L power:+12V #PWR?
U 1 1 5D5ABD69
P 3850 1300
F 0 "#PWR?" H 3850 1150 50  0001 C CNN
F 1 "+12V" H 3865 1473 50  0000 C CNN
F 2 "" H 3850 1300 50  0001 C CNN
F 3 "" H 3850 1300 50  0001 C CNN
	1    3850 1300
	1    0    0    -1  
$EndComp
Wire Wire Line
	3850 1300 3850 1500
Wire Wire Line
	3850 1500 4100 1500
Text Label 7000 1500 0    50   ~ 0
VDD_LNA_REG
Text Label 10100 1750 0    50   ~ 0
VDD_PA
Wire Wire Line
	5000 1500 5250 1500
$Comp
L power:+3.3V #PWR?
U 1 1 5D5D9F95
P 5250 1300
F 0 "#PWR?" H 5250 1150 50  0001 C CNN
F 1 "+3.3V" H 5265 1473 50  0000 C CNN
F 2 "" H 5250 1300 50  0001 C CNN
F 3 "" H 5250 1300 50  0001 C CNN
	1    5250 1300
	1    0    0    -1  
$EndComp
Wire Wire Line
	5250 1300 5250 1500
$Sheet
S 3900 5400 2000 2800
U 5D67C7FD
F0 "microcontroller_gpio" 50
F1 "microcontroller_gpio.sch" 50
F2 "LINK_LED" O R 5900 5500 50 
F3 "ACT_LED" O R 5900 5600 50 
F4 "RST" O R 5900 5800 50 
F5 "PA0" B L 3900 5500 50 
F6 "PA1" B L 3900 5600 50 
F7 "PA2" B L 3900 5700 50 
F8 "PA3" B L 3900 5800 50 
F9 "PN0" B L 3900 7500 50 
F10 "PN1" B L 3900 7600 50 
F11 "PN2" B L 3900 7700 50 
F12 "PN3" B L 3900 7800 50 
F13 "PL0" B L 3900 6200 50 
F14 "PL1" B L 3900 6300 50 
F15 "PL2" B L 3900 6400 50 
F16 "PL3" B L 3900 6500 50 
F17 "PH0" B R 5900 6000 50 
F18 "PH1" B R 5900 6100 50 
F19 "PH2" B R 5900 6200 50 
F20 "PH3" B R 5900 6300 50 
F21 "PK0" B R 5900 6500 50 
F22 "PK1" B R 5900 6600 50 
F23 "PK2" B R 5900 6700 50 
F24 "PK3" B R 5900 6800 50 
F25 "PK4" B R 5900 6900 50 
F26 "PK5" B R 5900 7000 50 
F27 "PK6" B R 5900 7100 50 
F28 "PK7" B R 5900 7200 50 
F29 "ADC0" I L 3900 6700 50 
F30 "ADC1" I L 3900 6800 50 
F31 "ADC2" I L 3900 6900 50 
F32 "ADC3" I L 3900 7000 50 
F33 "ADC9" I L 3900 7300 50 
F34 "ADC8" I L 3900 7200 50 
F35 "PN4" B L 3900 7900 50 
F36 "PN5" B L 3900 8000 50 
F37 "PA4" B L 3900 5900 50 
F38 "PA5" B L 3900 6000 50 
F39 "SSI2RX" B R 5900 7400 50 
F40 "SSI2TX" B R 5900 7500 50 
F41 "SSI2Fss" B R 5900 7600 50 
F42 "SSI2Clk" B R 5900 7700 50 
F43 "SDR_GPIO[0..11]" B R 5900 7900 50 
F44 "ADC4" I L 3900 7100 50 
F45 "MODE_SW" O R 5900 8000 50 
F46 "MODE_SW_B" O R 5900 8100 50 
$EndSheet
$Sheet
S 6150 5400 650  500 
U 5D69D382
F0 "microcontroller_ethernet" 50
F1 "microcontroller_ethernet.sch" 50
F2 "G_LED" I L 6150 5500 50 
F3 "Y_LED" I L 6150 5600 50 
F4 "RST" I L 6150 5800 50 
$EndSheet
$Sheet
S 5500 8500 1000 850 
U 5D69DD47
F0 "microcontroller_power" 50
F1 "microcontroller_power.sch" 50
$EndSheet
$Comp
L Device:D_TVS D101
U 1 1 5D88D993
P 1200 4700
F 0 "D101" V 1154 4779 50  0000 L CNN
F 1 "D_TVS" V 1245 4779 50  0000 L CNN
F 2 "Capacitor_SMD:C_0201_0603Metric" H 1200 4700 50  0001 C CNN
F 3 "~" H 1200 4700 50  0001 C CNN
F 4 "LXES03AAA1-134" V 1200 4700 50  0001 C CNN "PartNumber"
F 5 "Murata Electronics" H 1200 4700 50  0001 C CNN "Manufacturer"
F 6 "3000-0000000088" H 1200 4700 50  0001 C CNN "PartSpecification"
	1    1200 4700
	0    1    1    0   
$EndComp
$Comp
L power:GND #PWR?
U 1 1 5D8A2378
P 1200 4900
F 0 "#PWR?" H 1200 4650 50  0001 C CNN
F 1 "GND" H 1205 4727 50  0000 C CNN
F 2 "" H 1200 4900 50  0001 C CNN
F 3 "" H 1200 4900 50  0001 C CNN
	1    1200 4900
	1    0    0    -1  
$EndComp
Wire Wire Line
	1200 4900 1200 4850
Wire Wire Line
	1200 4550 1200 4450
$Comp
L Device:D_TVS D102
U 1 1 5D8B7F82
P 11150 7850
F 0 "D102" H 11150 7634 50  0000 C CNN
F 1 "D_TVS" H 11150 7725 50  0000 C CNN
F 2 "Capacitor_SMD:C_0201_0603Metric" H 11150 7850 50  0001 C CNN
F 3 "~" H 11150 7850 50  0001 C CNN
F 4 "LXES03AAA1-134" V 11150 7850 50  0001 C CNN "PartNumber"
F 5 "Murata Electronics" H 11150 7850 50  0001 C CNN "Manufacturer"
F 6 "3000-0000000088" H 11150 7850 50  0001 C CNN "PartSpecification"
	1    11150 7850
	0    1    1    0   
$EndComp
Wire Wire Line
	11150 8000 11150 8150
Connection ~ 11150 8150
Wire Wire Line
	11150 8150 11550 8150
$Comp
L power:GND #PWR?
U 1 1 5D8C2D1F
P 11150 7600
F 0 "#PWR?" H 11150 7350 50  0001 C CNN
F 1 "GND" H 11155 7427 50  0000 C CNN
F 2 "" H 11150 7600 50  0001 C CNN
F 3 "" H 11150 7600 50  0001 C CNN
	1    11150 7600
	-1   0    0    1   
$EndComp
Wire Wire Line
	11150 7600 11150 7700
$Comp
L Device:D_TVS D103
U 1 1 5D8CDC3E
P 15450 4950
F 0 "D103" V 15496 4871 50  0000 R CNN
F 1 "D_TVS" V 15405 4871 50  0000 R CNN
F 2 "Capacitor_SMD:C_0201_0603Metric" H 15450 4950 50  0001 C CNN
F 3 "~" H 15450 4950 50  0001 C CNN
F 4 "LXES03AAA1-134" V 15450 4950 50  0001 C CNN "PartNumber"
F 5 "Murata Electronics" H 15450 4950 50  0001 C CNN "Manufacturer"
F 6 "3000-0000000088" H 15450 4950 50  0001 C CNN "PartSpecification"
	1    15450 4950
	0    -1   -1   0   
$EndComp
Wire Wire Line
	15450 4800 15450 4700
$Comp
L power:GND #PWR?
U 1 1 5D8E3D8F
P 15450 5150
F 0 "#PWR?" H 15450 4900 50  0001 C CNN
F 1 "GND" H 15455 4977 50  0000 C CNN
F 2 "" H 15450 5150 50  0001 C CNN
F 3 "" H 15450 5150 50  0001 C CNN
	1    15450 5150
	1    0    0    -1  
$EndComp
Wire Wire Line
	15450 5150 15450 5100
Wire Wire Line
	5900 5500 6150 5500
Wire Wire Line
	6150 5600 5900 5600
Wire Wire Line
	5900 5800 6150 5800
Wire Wire Line
	5750 1700 6000 1700
Wire Wire Line
	6000 1800 5750 1800
Wire Wire Line
	5750 1900 6000 1900
Wire Wire Line
	3900 5500 3500 5500
Text Label 3550 5500 0    50   ~ 0
PA0
Wire Wire Line
	3900 5600 3500 5600
Text Label 3550 5600 0    50   ~ 0
PA1
Wire Wire Line
	3900 5700 3500 5700
Text Label 3550 5700 0    50   ~ 0
PA2
Wire Wire Line
	3900 5800 3500 5800
Text Label 3550 5800 0    50   ~ 0
PA3
Wire Wire Line
	3900 7500 3500 7500
Text Label 3550 7500 0    50   ~ 0
PN0
Wire Wire Line
	3900 7600 3500 7600
Text Label 3550 7600 0    50   ~ 0
PN1
Wire Wire Line
	3900 7700 3500 7700
Text Label 3550 7700 0    50   ~ 0
PN2
Wire Wire Line
	3900 7800 3500 7800
Text Label 3550 7800 0    50   ~ 0
PN3
Wire Wire Line
	3900 6200 3500 6200
Wire Wire Line
	3900 6300 3500 6300
Wire Wire Line
	3900 6500 3500 6500
Text Label 3550 6500 0    50   ~ 0
PG_3
Text Label 5800 1700 0    50   ~ 0
PA0
Text Label 5800 1800 0    50   ~ 0
PA1
Text Label 5800 2000 0    50   ~ 0
PA3
Wire Wire Line
	7200 1700 6900 1700
Text Label 5800 1900 0    50   ~ 0
PA2
Wire Wire Line
	8850 1950 9100 1950
Wire Wire Line
	9100 2050 8850 2050
Wire Wire Line
	8850 2150 9100 2150
Text Label 10100 2050 0    50   ~ 0
PN0
Text Label 8850 2150 0    50   ~ 0
PN1
Text Label 10100 1950 0    50   ~ 0
PN2
Text Label 8850 2250 0    50   ~ 0
PN3
Wire Wire Line
	10300 1950 10000 1950
Text Label 5100 1700 0    50   ~ 0
PG_3
Wire Wire Line
	5300 1700 5000 1700
$Comp
L Device:R R126
U 1 1 5DA747DB
P 8200 6000
F 0 "R126" H 8130 5954 50  0000 R CNN
F 1 "10k" H 8130 6045 50  0000 R CNN
F 2 "Resistor_SMD:R_0402_1005Metric" V 8130 6000 50  0001 C CNN
F 3 "~" H 8200 6000 50  0001 C CNN
F 4 "Delta Electronics/Cyntec" H 8200 6000 50  0001 C CNN "Manufacturer"
F 5 "PFR05S-103-FNH" H 8200 6000 50  0001 C CNN "PartNumber"
F 6 "3000-0000000131" H 8200 6000 50  0001 C CNN "PartSpecification"
	1    8200 6000
	0    -1   -1   0   
$EndComp
$Comp
L Device:R R127
U 1 1 5DAAE07F
P 9450 6650
F 0 "R127" H 9380 6604 50  0000 R CNN
F 1 "10k" H 9380 6695 50  0000 R CNN
F 2 "Resistor_SMD:R_0402_1005Metric" V 9380 6650 50  0001 C CNN
F 3 "~" H 9450 6650 50  0001 C CNN
F 4 "Delta Electronics/Cyntec" H 9450 6650 50  0001 C CNN "Manufacturer"
F 5 "PFR05S-103-FNH" H 9450 6650 50  0001 C CNN "PartNumber"
F 6 "3000-0000000131" H 9450 6650 50  0001 C CNN "PartSpecification"
	1    9450 6650
	-1   0    0    1   
$EndComp
$Comp
L Device:R R128
U 1 1 5DAAE1A7
P 9450 7050
F 0 "R128" H 9380 7004 50  0000 R CNN
F 1 "10k" H 9380 7095 50  0000 R CNN
F 2 "Resistor_SMD:R_0402_1005Metric" V 9380 7050 50  0001 C CNN
F 3 "~" H 9450 7050 50  0001 C CNN
F 4 "Delta Electronics/Cyntec" H 9450 7050 50  0001 C CNN "Manufacturer"
F 5 "PFR05S-103-FNH" H 9450 7050 50  0001 C CNN "PartNumber"
F 6 "3000-0000000131" H 9450 7050 50  0001 C CNN "PartSpecification"
	1    9450 7050
	-1   0    0    1   
$EndComp
Wire Wire Line
	9450 6800 9450 6900
$Comp
L power:GND #PWR?
U 1 1 5DACB190
P 9450 7300
F 0 "#PWR?" H 9450 7050 50  0001 C CNN
F 1 "GND" H 9455 7127 50  0000 C CNN
F 2 "" H 9450 7300 50  0001 C CNN
F 3 "" H 9450 7300 50  0001 C CNN
	1    9450 7300
	1    0    0    -1  
$EndComp
Wire Wire Line
	9450 7300 9450 7200
Wire Wire Line
	5900 6500 6300 6500
Wire Wire Line
	5900 6700 7300 6700
$Comp
L Device:R R112
U 1 1 5DB64C13
P 6450 6500
F 0 "R112" H 6520 6546 50  0000 L CNN
F 1 "400" H 6520 6455 50  0000 L CNN
F 2 "Resistor_SMD:R_0402_1005Metric" V 6380 6500 50  0001 C CNN
F 3 "~" H 6450 6500 50  0001 C CNN
F 4 "Stackpole Electronics Inc" H 6450 6500 50  0001 C CNN "Manufacturer"
F 5 "RMCF0402FT402R" H 6450 6500 50  0001 C CNN "PartNumber"
F 6 "3000-0000000159" H 6450 6500 50  0001 C CNN "PartSpecification"
	1    6450 6500
	0    1    1    0   
$EndComp
$Comp
L Device:R R114
U 1 1 5DB64E19
P 6750 6600
F 0 "R114" H 6820 6646 50  0000 L CNN
F 1 "400" H 6820 6555 50  0000 L CNN
F 2 "Resistor_SMD:R_0402_1005Metric" V 6680 6600 50  0001 C CNN
F 3 "~" H 6750 6600 50  0001 C CNN
F 4 "Stackpole Electronics Inc" H 6750 6600 50  0001 C CNN "Manufacturer"
F 5 "RMCF0402FT402R" H 6750 6600 50  0001 C CNN "PartNumber"
F 6 "3000-0000000159" H 6750 6600 50  0001 C CNN "PartSpecification"
	1    6750 6600
	0    1    1    0   
$EndComp
$Comp
L Device:R R118
U 1 1 5DB64EC1
P 7450 6700
F 0 "R118" H 7520 6746 50  0000 L CNN
F 1 "400" H 7520 6655 50  0000 L CNN
F 2 "Resistor_SMD:R_0402_1005Metric" V 7380 6700 50  0001 C CNN
F 3 "~" H 7450 6700 50  0001 C CNN
F 4 "Stackpole Electronics Inc" H 7450 6700 50  0001 C CNN "Manufacturer"
F 5 "RMCF0402FT402R" H 7450 6700 50  0001 C CNN "PartNumber"
F 6 "3000-0000000159" H 7450 6700 50  0001 C CNN "PartSpecification"
	1    7450 6700
	0    1    1    0   
$EndComp
Wire Wire Line
	5900 6800 6000 6800
Wire Wire Line
	5900 6600 6600 6600
Text Label 7150 6500 0    50   ~ 0
lna_v_bias
$Comp
L Device:R R116
U 1 1 5DC4EED3
P 7150 6600
F 0 "R116" H 7220 6646 50  0000 L CNN
F 1 "400" H 7220 6555 50  0000 L CNN
F 2 "Resistor_SMD:R_0402_1005Metric" V 7080 6600 50  0001 C CNN
F 3 "~" H 7150 6600 50  0001 C CNN
F 4 "Stackpole Electronics Inc" H 7150 6600 50  0001 C CNN "Manufacturer"
F 5 "RMCF0402FT402R" H 7150 6600 50  0001 C CNN "PartNumber"
F 6 "3000-0000000159" H 7150 6600 50  0001 C CNN "PartSpecification"
	1    7150 6600
	0    1    1    0   
$EndComp
$Comp
L Device:R R120
U 1 1 5DC5F017
P 7850 6700
F 0 "R120" H 7920 6746 50  0000 L CNN
F 1 "400" H 7920 6655 50  0000 L CNN
F 2 "Resistor_SMD:R_0402_1005Metric" V 7780 6700 50  0001 C CNN
F 3 "~" H 7850 6700 50  0001 C CNN
F 4 "Stackpole Electronics Inc" H 7850 6700 50  0001 C CNN "Manufacturer"
F 5 "RMCF0402FT402R" H 7850 6700 50  0001 C CNN "PartNumber"
F 6 "3000-0000000159" H 7850 6700 50  0001 C CNN "PartSpecification"
	1    7850 6700
	0    1    1    0   
$EndComp
$Comp
L Device:R R122
U 1 1 5DC5F0CB
P 8250 6700
F 0 "R122" H 8320 6746 50  0000 L CNN
F 1 "400" H 8320 6655 50  0000 L CNN
F 2 "Resistor_SMD:R_0402_1005Metric" V 8180 6700 50  0001 C CNN
F 3 "~" H 8250 6700 50  0001 C CNN
F 4 "Stackpole Electronics Inc" H 8250 6700 50  0001 C CNN "Manufacturer"
F 5 "RMCF0402FT402R" H 8250 6700 50  0001 C CNN "PartNumber"
F 6 "3000-0000000159" H 8250 6700 50  0001 C CNN "PartSpecification"
	1    8250 6700
	0    1    1    0   
$EndComp
$Comp
L Device:R R124
U 1 1 5DC5F18B
P 8650 6700
F 0 "R124" H 8720 6746 50  0000 L CNN
F 1 "400" H 8720 6655 50  0000 L CNN
F 2 "Resistor_SMD:R_0402_1005Metric" V 8580 6700 50  0001 C CNN
F 3 "~" H 8650 6700 50  0001 C CNN
F 4 "Stackpole Electronics Inc" H 8650 6700 50  0001 C CNN "Manufacturer"
F 5 "RMCF0402FT402R" H 8650 6700 50  0001 C CNN "PartNumber"
F 6 "3000-0000000159" H 8650 6700 50  0001 C CNN "PartSpecification"
	1    8650 6700
	0    1    1    0   
$EndComp
$Comp
L Device:R R125
U 1 1 5DC9DE68
P 8950 6900
F 0 "R125" H 9020 6946 50  0000 L CNN
F 1 "400" H 9020 6855 50  0000 L CNN
F 2 "Resistor_SMD:R_0402_1005Metric" V 8880 6900 50  0001 C CNN
F 3 "~" H 8950 6900 50  0001 C CNN
F 4 "Stackpole Electronics Inc" H 8950 6900 50  0001 C CNN "Manufacturer"
F 5 "RMCF0402FT402R" H 8950 6900 50  0001 C CNN "PartNumber"
F 6 "3000-0000000159" H 8950 6900 50  0001 C CNN "PartSpecification"
	1    8950 6900
	0    1    1    0   
$EndComp
Wire Wire Line
	6000 6900 6000 6800
Wire Wire Line
	6300 6900 6400 6900
Wire Wire Line
	6700 6900 6800 6900
Wire Wire Line
	8800 6900 8700 6900
Wire Wire Line
	9100 6900 9100 6500
Wire Wire Line
	6600 6500 7400 6500
Wire Wire Line
	7300 6600 7400 6600
Wire Wire Line
	7400 6600 7400 6500
Connection ~ 7400 6500
Wire Wire Line
	7400 6500 8900 6500
Wire Wire Line
	7600 6700 7700 6700
Wire Wire Line
	7000 6600 6900 6600
Wire Wire Line
	7200 6900 7100 6900
Wire Wire Line
	7500 6900 7600 6900
Wire Wire Line
	7900 6900 8000 6900
Wire Wire Line
	8100 6700 8000 6700
Wire Wire Line
	8400 6700 8500 6700
Wire Wire Line
	8800 6700 8900 6700
Wire Wire Line
	8900 6700 8900 6500
Connection ~ 8900 6500
Wire Wire Line
	8900 6500 9100 6500
Wire Wire Line
	8400 6900 8300 6900
$Comp
L Device:R R123
U 1 1 5DDA9600
P 8550 6900
F 0 "R123" H 8620 6946 50  0000 L CNN
F 1 "400" H 8620 6855 50  0000 L CNN
F 2 "Resistor_SMD:R_0402_1005Metric" V 8480 6900 50  0001 C CNN
F 3 "~" H 8550 6900 50  0001 C CNN
F 4 "Stackpole Electronics Inc" H 8550 6900 50  0001 C CNN "Manufacturer"
F 5 "RMCF0402FT402R" H 8550 6900 50  0001 C CNN "PartNumber"
F 6 "3000-0000000159" H 8550 6900 50  0001 C CNN "PartSpecification"
	1    8550 6900
	0    1    1    0   
$EndComp
$Comp
L Device:R R121
U 1 1 5DDA96BC
P 8150 6900
F 0 "R121" H 8220 6946 50  0000 L CNN
F 1 "400" H 8220 6855 50  0000 L CNN
F 2 "Resistor_SMD:R_0402_1005Metric" V 8080 6900 50  0001 C CNN
F 3 "~" H 8150 6900 50  0001 C CNN
F 4 "Stackpole Electronics Inc" H 8150 6900 50  0001 C CNN "Manufacturer"
F 5 "RMCF0402FT402R" H 8150 6900 50  0001 C CNN "PartNumber"
F 6 "3000-0000000159" H 8150 6900 50  0001 C CNN "PartSpecification"
	1    8150 6900
	0    1    1    0   
$EndComp
$Comp
L Device:R R119
U 1 1 5DDA977A
P 7750 6900
F 0 "R119" H 7820 6946 50  0000 L CNN
F 1 "400" H 7820 6855 50  0000 L CNN
F 2 "Resistor_SMD:R_0402_1005Metric" V 7680 6900 50  0001 C CNN
F 3 "~" H 7750 6900 50  0001 C CNN
F 4 "Stackpole Electronics Inc" H 7750 6900 50  0001 C CNN "Manufacturer"
F 5 "RMCF0402FT402R" H 7750 6900 50  0001 C CNN "PartNumber"
F 6 "3000-0000000159" H 7750 6900 50  0001 C CNN "PartSpecification"
	1    7750 6900
	0    1    1    0   
$EndComp
$Comp
L Device:R R117
U 1 1 5DDA982E
P 7350 6900
F 0 "R117" H 7420 6946 50  0000 L CNN
F 1 "400" H 7420 6855 50  0000 L CNN
F 2 "Resistor_SMD:R_0402_1005Metric" V 7280 6900 50  0001 C CNN
F 3 "~" H 7350 6900 50  0001 C CNN
F 4 "Stackpole Electronics Inc" H 7350 6900 50  0001 C CNN "Manufacturer"
F 5 "RMCF0402FT402R" H 7350 6900 50  0001 C CNN "PartNumber"
F 6 "3000-0000000159" H 7350 6900 50  0001 C CNN "PartSpecification"
	1    7350 6900
	0    1    1    0   
$EndComp
$Comp
L Device:R R115
U 1 1 5DDA98F0
P 6950 6900
F 0 "R115" H 7020 6946 50  0000 L CNN
F 1 "400" H 7020 6855 50  0000 L CNN
F 2 "Resistor_SMD:R_0402_1005Metric" V 6880 6900 50  0001 C CNN
F 3 "~" H 6950 6900 50  0001 C CNN
F 4 "Stackpole Electronics Inc" H 6950 6900 50  0001 C CNN "Manufacturer"
F 5 "RMCF0402FT402R" H 6950 6900 50  0001 C CNN "PartNumber"
F 6 "3000-0000000159" H 6950 6900 50  0001 C CNN "PartSpecification"
	1    6950 6900
	0    1    1    0   
$EndComp
$Comp
L Device:R R113
U 1 1 5DDA99B0
P 6550 6900
F 0 "R113" H 6620 6946 50  0000 L CNN
F 1 "400" H 6620 6855 50  0000 L CNN
F 2 "Resistor_SMD:R_0402_1005Metric" V 6480 6900 50  0001 C CNN
F 3 "~" H 6550 6900 50  0001 C CNN
F 4 "Stackpole Electronics Inc" H 6550 6900 50  0001 C CNN "Manufacturer"
F 5 "RMCF0402FT402R" H 6550 6900 50  0001 C CNN "PartNumber"
F 6 "3000-0000000159" H 6550 6900 50  0001 C CNN "PartSpecification"
	1    6550 6900
	0    1    1    0   
$EndComp
$Comp
L Device:R R111
U 1 1 5DDA9A6E
P 6150 6900
F 0 "R111" H 6220 6946 50  0000 L CNN
F 1 "400" H 6220 6855 50  0000 L CNN
F 2 "Resistor_SMD:R_0402_1005Metric" V 6080 6900 50  0001 C CNN
F 3 "~" H 6150 6900 50  0001 C CNN
F 4 "Stackpole Electronics Inc" H 6150 6900 50  0001 C CNN "Manufacturer"
F 5 "RMCF0402FT402R" H 6150 6900 50  0001 C CNN "PartNumber"
F 6 "3000-0000000159" H 6150 6900 50  0001 C CNN "PartSpecification"
	1    6150 6900
	0    1    1    0   
$EndComp
Wire Wire Line
	3900 6700 3450 6700
Text Label 3550 6700 0    50   ~ 0
ADC0
Text Label 3550 6800 0    50   ~ 0
ADC1
Text Label 3550 6900 0    50   ~ 0
ADC2
Text Label 3550 7000 0    50   ~ 0
ADC3
Wire Wire Line
	3350 7000 3900 7000
Wire Wire Line
	3350 6800 3900 6800
Wire Wire Line
	3250 6900 3900 6900
Text Label 6000 6500 0    50   ~ 0
lna_b0
Text Label 6000 6600 0    50   ~ 0
lna_b1
Text Label 6000 6700 0    50   ~ 0
lna_b2
Text Label 6000 6800 0    50   ~ 0
lna_b3
Text Label 6950 6600 1    50   ~ 0
lna_b1_1
Text Label 7650 6700 1    50   ~ 0
lba_b2_1
Text Label 8050 6700 1    50   ~ 0
lba_b2_2
Text Label 8450 6700 1    50   ~ 0
lba_b2_3
Text Label 6350 6900 3    50   ~ 0
lba_b3_1
Text Label 6750 6900 3    50   ~ 0
lba_b3_2
Text Label 7150 6900 3    50   ~ 0
lba_b3_3
Text Label 7550 6900 3    50   ~ 0
lba_b3_4
Text Label 7950 6900 3    50   ~ 0
lba_b3_5
Text Label 8350 6900 3    50   ~ 0
lba_b3_6
Text Label 8750 6900 3    50   ~ 0
lba_b3_7
Text Label 9450 6850 0    50   ~ 0
pa_en_half
$Comp
L Connector_Generic:Conn_01x02 J104
U 1 1 5D6B88F4
P 1800 1100
F 0 "J104" H 1880 1092 50  0000 L CNN
F 1 "Conn_01x02" H 1880 1001 50  0000 L CNN
F 2 "TerminalBlock:TerminalBlock_bornier-2_P5.08mm" H 1800 1100 50  0001 C CNN
F 3 "~" H 1800 1100 50  0001 C CNN
F 4 "Molex" H 1800 1100 50  0001 C CNN "Manufacturer"
F 5 "0398800302" H 1800 1100 50  0001 C CNN "PartNumber"
F 6 "3000-0000000184" H 1800 1100 50  0001 C CNN "PartSpecification"
	1    1800 1100
	1    0    0    -1  
$EndComp
$Comp
L power:+12V #PWR?
U 1 1 5D6B9142
P 1500 1000
F 0 "#PWR?" H 1500 850 50  0001 C CNN
F 1 "+12V" H 1515 1173 50  0000 C CNN
F 2 "" H 1500 1000 50  0001 C CNN
F 3 "" H 1500 1000 50  0001 C CNN
	1    1500 1000
	1    0    0    -1  
$EndComp
$Comp
L power:GND #PWR?
U 1 1 5D6B9F88
P 1500 1300
F 0 "#PWR?" H 1500 1050 50  0001 C CNN
F 1 "GND" H 1505 1127 50  0000 C CNN
F 2 "" H 1500 1300 50  0001 C CNN
F 3 "" H 1500 1300 50  0001 C CNN
	1    1500 1300
	1    0    0    -1  
$EndComp
Wire Wire Line
	1500 1300 1500 1200
Wire Wire Line
	1500 1200 1600 1200
Wire Wire Line
	1600 1100 1500 1100
Wire Wire Line
	1500 1100 1500 1000
$Comp
L Connector_Generic:Conn_01x03 J105
U 1 1 5D6E680F
P 2300 6300
F 0 "J105" H 2380 6342 50  0000 L CNN
F 1 "Conn_01x03" H 2380 6251 50  0000 L CNN
F 2 "Connector:FanPinHeader_1x03_P2.54mm_Vertical" H 2300 6300 50  0001 C CNN
F 3 "~" H 2300 6300 50  0001 C CNN
F 4 "Sullins Connector Solutions" H 2300 6300 50  0001 C CNN "Manufacturer"
F 5 "SWR25X-NRTC-S03-ST-BA" H 2300 6300 50  0001 C CNN "PartNumber"
F 6 "3000-0000000172" H 2300 6300 50  0001 C CNN "PartSpecification"
	1    2300 6300
	1    0    0    -1  
$EndComp
$Comp
L power:GND #PWR?
U 1 1 5D6E884B
P 1250 6400
F 0 "#PWR?" H 1250 6150 50  0001 C CNN
F 1 "GND" H 1255 6227 50  0000 C CNN
F 2 "" H 1250 6400 50  0001 C CNN
F 3 "" H 1250 6400 50  0001 C CNN
	1    1250 6400
	1    0    0    -1  
$EndComp
$Comp
L power:+12V #PWR?
U 1 1 5D6E909F
P 1500 6100
F 0 "#PWR?" H 1500 5950 50  0001 C CNN
F 1 "+12V" H 1515 6273 50  0000 C CNN
F 2 "" H 1500 6100 50  0001 C CNN
F 3 "" H 1500 6100 50  0001 C CNN
	1    1500 6100
	1    0    0    -1  
$EndComp
Wire Wire Line
	2100 6400 2000 6400
Text Label 3550 6400 0    50   ~ 0
fan_tach
$Comp
L Device:R R129
U 1 1 5D73A757
P 1500 6550
F 0 "R129" V 1293 6550 50  0000 C CNN
F 1 "10k" V 1384 6550 50  0000 C CNN
F 2 "Resistor_SMD:R_0402_1005Metric" V 1430 6550 50  0001 C CNN
F 3 "~" H 1500 6550 50  0001 C CNN
F 4 "Delta Electronics/Cyntec" H 1500 6550 50  0001 C CNN "Manufacturer"
F 5 "PFR05S-103-FNH" H 1500 6550 50  0001 C CNN "PartNumber"
F 6 "3000-0000000131" H 1500 6550 50  0001 C CNN "PartSpecification"
	1    1500 6550
	-1   0    0    1   
$EndComp
$Comp
L Device:R R130
U 1 1 5D73B5BF
P 2000 6950
F 0 "R130" V 1793 6950 50  0000 C CNN
F 1 "1k" V 1884 6950 50  0000 C CNN
F 2 "Resistor_SMD:R_0402_1005Metric" V 1930 6950 50  0001 C CNN
F 3 "~" H 2000 6950 50  0001 C CNN
F 4 "Delta Electronics/Cyntec" H 2000 6950 50  0001 C CNN "Manufacturer"
F 5 "PFR05S-102-FNH" H 2000 6950 50  0001 C CNN "PartNumber"
F 6 "3000-0000000156" H 2000 6950 50  0001 C CNN "PartSpecification"
	1    2000 6950
	-1   0    0    1   
$EndComp
Wire Wire Line
	2000 6400 2000 6750
$Comp
L Diode:BZX84Cxx D104
U 1 1 5D7C38DC
P 2000 7700
F 0 "D104" V 1954 7779 50  0000 L CNN
F 1 "BZX84Cxx" V 2045 7779 50  0000 L CNN
F 2 "Diode_SMD:D_SOT-23_ANK" H 2000 7700 50  0001 C CNN
F 3 "https://diotec.com/tl_files/diotec/files/pdf/datasheets/bzx84c2v4.pdf" H 2000 7700 50  0001 C CNN
F 4 "ON Semiconductor" H 2000 7700 50  0001 C CNN "Manufacturer"
F 5 "BZX84C2V7LT1G" H 2000 7700 50  0001 C CNN "PartNumber"
F 6 "3000-0000000084" H 2000 7700 50  0001 C CNN "PartSpecification"
	1    2000 7700
	0    1    1    0   
$EndComp
$Comp
L Device:R R131
U 1 1 5D7C3FC2
P 2000 7300
F 0 "R131" V 1793 7300 50  0000 C CNN
F 1 "1k" V 1884 7300 50  0000 C CNN
F 2 "Resistor_SMD:R_0402_1005Metric" V 1930 7300 50  0001 C CNN
F 3 "~" H 2000 7300 50  0001 C CNN
F 4 "Delta Electronics/Cyntec" H 2000 7300 50  0001 C CNN "Manufacturer"
F 5 "PFR05S-102-FNH" H 2000 7300 50  0001 C CNN "PartNumber"
F 6 "3000-0000000156" H 2000 7300 50  0001 C CNN "PartSpecification"
	1    2000 7300
	-1   0    0    1   
$EndComp
Wire Wire Line
	2000 7550 2000 7500
$Comp
L power:GND #PWR?
U 1 1 5D7F22B0
P 2000 7900
F 0 "#PWR?" H 2000 7650 50  0001 C CNN
F 1 "GND" H 2005 7727 50  0000 C CNN
F 2 "" H 2000 7900 50  0001 C CNN
F 3 "" H 2000 7900 50  0001 C CNN
	1    2000 7900
	1    0    0    -1  
$EndComp
Wire Wire Line
	2000 7900 2000 7850
Text Label 2150 7500 0    50   ~ 0
fan_tach
Text Label 2000 6600 0    50   ~ 0
fan_tach_in
Text Label 2000 7150 2    50   ~ 0
fan_tach_mid
$Sheet
S 1500 9600 750  400 
U 5D614D04
F0 "mounting_holes" 50
F1 "mounting_holes.sch" 50
$EndSheet
Connection ~ 15450 4700
$Sheet
S 9350 3800 1000 1000
U 5D96ADB0
F0 "PA" 50
F1 "PA.sch" 50
F2 "VBIAS" I R 10350 4750 50 
F3 "VCC3" I R 10350 4650 50 
F4 "VCC2" I R 10350 4550 50 
F5 "VCC1" I R 10350 4450 50 
F6 "RF_IN" I R 10350 4200 50 
F7 "RF_OUT" O L 9350 4200 50 
F8 "PA_EN" I L 9350 4700 50 
$EndSheet
Wire Wire Line
	9050 4200 9350 4200
Wire Wire Line
	10650 4650 10350 4650
Wire Wire Line
	10650 4550 10350 4550
Wire Wire Line
	10650 4450 10350 4450
Wire Wire Line
	10350 4750 10650 4750
Text Label 10350 4750 0    50   ~ 0
PA_VBIAS
Text Label 10350 4650 0    50   ~ 0
PA_VCC3
Text Label 10350 4550 0    50   ~ 0
PA_VCC2
Text Label 10350 4450 0    50   ~ 0
PA_VCC1
$Sheet
S 6200 3700 1000 1000
U 5E073A72
F0 "LNA" 50
F1 "LNA.sch" 50
F2 "VDD" I R 7200 3800 50 
F3 "VBIAS" I R 7200 4600 50 
F4 "RF_IN" I R 7200 4200 50 
F5 "RF_OUT" O L 6200 4200 50 
$EndSheet
$Comp
L Device:R R106
U 1 1 5E0C674E
P 7500 3300
AR Path="/5E0C674E" Ref="R106"  Part="1" 
AR Path="/5E073A72/5E0C674E" Ref="R?"  Part="1" 
F 0 "R106" H 7430 3254 50  0000 R CNN
F 1 "51m" H 7430 3345 50  0000 R CNN
F 2 "POWDER_Power:R_0508_1220Metric" V 7430 3300 50  0001 C CNN
F 3 "~" H 7500 3300 50  0001 C CNN
F 4 "" H 7500 3300 50  0001 C CNN "Manufacturer"
F 5 "" H 7500 3300 50  0001 C CNN "PartNumber"
F 6 "3000-0000000587" H 7500 3300 50  0001 C CNN "PartSpecification"
	1    7500 3300
	-1   0    0    1   
$EndComp
$Comp
L Connector:TestPoint TP103
U 1 1 5E0C6755
P 6950 2500
AR Path="/5E0C6755" Ref="TP103"  Part="1" 
AR Path="/5E073A72/5E0C6755" Ref="TP?"  Part="1" 
F 0 "TP103" H 7008 2618 50  0000 L CNN
F 1 "TestPoint" H 7008 2527 50  0000 L CNN
F 2 "TestPoint:TestPoint_Pad_D1.0mm" H 7150 2500 50  0001 C CNN
F 3 "~" H 7150 2500 50  0001 C CNN
	1    6950 2500
	1    0    0    -1  
$EndComp
Wire Wire Line
	6950 2500 7500 2500
Wire Wire Line
	7500 2500 7500 1500
Wire Wire Line
	6900 1500 7500 1500
Connection ~ 7500 2500
Wire Wire Line
	7200 4200 7650 4200
Wire Wire Line
	7500 3800 7200 3800
Wire Wire Line
	1500 6100 1500 6300
Wire Wire Line
	1250 6200 1250 6400
Wire Wire Line
	2100 6300 1500 6300
$Sheet
S 10750 3700 1000 950 
U 5E655037
F0 "TX_attenuator" 50
F1 "TX_attenuator.sch" 50
F2 "RF_IN" I R 11750 4200 50 
F3 "RF_OUT" O L 10750 4200 50 
F4 "VDD" I R 11750 3850 50 
F5 "LE" I R 11750 4550 50 
F6 "CLK" I R 11750 4450 50 
F7 "SI" I R 11750 4350 50 
$EndSheet
Wire Wire Line
	10350 4200 10750 4200
Wire Wire Line
	11750 3850 13950 3850
Wire Wire Line
	13950 3850 13950 3450
Text Label 10400 4200 0    50   ~ 0
pa_att_in
$Sheet
S 4800 3700 1000 1000
U 5E78F576
F0 "RX_attenuator" 50
F1 "RX_attenuator.sch" 50
F2 "RF_IN" I R 5800 4200 50 
F3 "RF_OUT" O L 4800 4200 50 
F4 "VDD" I R 5800 3850 50 
F5 "LE" I R 5800 4600 50 
F6 "CLK" I R 5800 4500 50 
F7 "SI" I R 5800 4400 50 
$EndSheet
Wire Wire Line
	7200 4600 7500 4600
Text Label 7250 4600 0    50   ~ 0
lna_v_bias
Wire Wire Line
	6000 3850 5800 3850
Wire Wire Line
	11750 4350 11950 4350
Wire Wire Line
	11750 4450 11950 4450
Wire Wire Line
	11950 4550 11750 4550
Text Label 11800 4550 0    50   ~ 0
ATT_LE
Text Label 11800 4450 0    50   ~ 0
ATT_CLK
Text Label 11800 4350 0    50   ~ 0
ATT_SI
Wire Wire Line
	6050 4600 5800 4600
Wire Wire Line
	6050 4500 5800 4500
Wire Wire Line
	6050 4400 5800 4400
Text Label 5850 4600 0    50   ~ 0
ATT_LE
Text Label 5850 4500 0    50   ~ 0
ATT_CLK
Text Label 5850 4400 0    50   ~ 0
ATT_SI
Wire Wire Line
	1250 6200 2100 6200
Wire Wire Line
	10950 8150 11150 8150
Text Label 7350 4200 0    50   ~ 0
lna_in
Text Label 5850 4200 0    50   ~ 0
lna_out
Text Label 4250 4200 0    50   ~ 0
lna_att_out
Wire Wire Line
	6000 2000 5750 2000
Wire Wire Line
	6900 1800 7200 1800
Text Label 7000 1700 0    50   ~ 0
PA4
Text Label 7000 1800 0    50   ~ 0
PA5
Wire Wire Line
	9100 2250 8850 2250
Wire Wire Line
	10000 2050 10300 2050
Text Label 8850 2050 0    50   ~ 0
PN4
Text Label 8850 1950 0    50   ~ 0
PN5
Connection ~ 13950 3450
Text Label 12650 2550 0    50   ~ 0
PA_VCC1
Text Label 12650 2850 0    50   ~ 0
PA_VCC2
Text Label 12650 3150 0    50   ~ 0
PA_VCC3
Text Label 12650 3450 0    50   ~ 0
PA_VBIAS
Connection ~ 13500 2550
Wire Wire Line
	13950 2550 13950 2850
Connection ~ 13950 2550
Wire Wire Line
	13850 2550 13950 2550
Wire Wire Line
	13950 3150 13950 3450
Connection ~ 13950 3150
Wire Wire Line
	13850 3150 13950 3150
Wire Wire Line
	13950 1750 13950 2550
Connection ~ 13950 1750
Wire Wire Line
	13950 2850 13950 3150
Connection ~ 13950 2850
Connection ~ 13500 2850
Connection ~ 13500 3450
Connection ~ 13500 3150
$Comp
L Connector:TestPoint TP111
U 1 1 5D715194
P 13500 2550
F 0 "TP111" H 13558 2668 50  0000 L CNN
F 1 "TestPoint" H 13558 2577 50  0000 L CNN
F 2 "TestPoint:TestPoint_Pad_D1.0mm" H 13700 2550 50  0001 C CNN
F 3 "~" H 13700 2550 50  0001 C CNN
	1    13500 2550
	-1   0    0    -1  
$EndComp
$Comp
L Connector:TestPoint TP110
U 1 1 5D714D69
P 13500 2850
F 0 "TP110" H 13558 2968 50  0000 L CNN
F 1 "TestPoint" H 13558 2877 50  0000 L CNN
F 2 "TestPoint:TestPoint_Pad_D1.0mm" H 13700 2850 50  0001 C CNN
F 3 "~" H 13700 2850 50  0001 C CNN
	1    13500 2850
	-1   0    0    -1  
$EndComp
$Comp
L Connector:TestPoint TP109
U 1 1 5D714A15
P 13500 3150
F 0 "TP109" H 13558 3268 50  0000 L CNN
F 1 "TestPoint" H 13558 3177 50  0000 L CNN
F 2 "TestPoint:TestPoint_Pad_D1.0mm" H 13700 3150 50  0001 C CNN
F 3 "~" H 13700 3150 50  0001 C CNN
	1    13500 3150
	-1   0    0    -1  
$EndComp
$Comp
L Connector:TestPoint TP108
U 1 1 5D714556
P 13500 3450
F 0 "TP108" H 13558 3568 50  0000 L CNN
F 1 "TestPoint" H 13558 3477 50  0000 L CNN
F 2 "TestPoint:TestPoint_Pad_D1.0mm" H 13700 3450 50  0001 C CNN
F 3 "~" H 13700 3450 50  0001 C CNN
	1    13500 3450
	-1   0    0    -1  
$EndComp
Wire Wire Line
	13550 2550 13500 2550
Wire Wire Line
	13550 2850 13500 2850
Wire Wire Line
	13550 3150 13500 3150
Wire Wire Line
	13550 3450 13500 3450
Wire Wire Line
	13950 1650 13950 1750
$Comp
L Connector:TestPoint TP107
U 1 1 5D6D7453
P 13950 1650
F 0 "TP107" H 14008 1768 50  0000 L CNN
F 1 "TestPoint" H 14008 1677 50  0000 L CNN
F 2 "TestPoint:TestPoint_Pad_D1.0mm" H 14150 1650 50  0001 C CNN
F 3 "~" H 14150 1650 50  0001 C CNN
	1    13950 1650
	-1   0    0    -1  
$EndComp
$Comp
L Device:R R133
U 1 1 5D6BA276
P 13700 3450
F 0 "R133" V 13493 3450 50  0000 C CNN
F 1 "51m" V 13584 3450 50  0000 C CNN
F 2 "POWDER_Power:R_0508_1220Metric" V 13630 3450 50  0001 C CNN
F 3 "~" H 13700 3450 50  0001 C CNN
F 4 "Panasonic Electronic Components" H 13700 3450 50  0001 C CNN "Manufacturer"
F 5 "ERJ-B2CFR05V" H 13700 3450 50  0001 C CNN "PartNumber"
F 6 "3000-0000000587" V 13700 3450 50  0001 C CNN "PartSpecification"
	1    13700 3450
	0    -1   1    0   
$EndComp
$Comp
L Device:R R134
U 1 1 5D6B9B01
P 13700 3150
F 0 "R134" V 13493 3150 50  0000 C CNN
F 1 "5m" V 13584 3150 50  0000 C CNN
F 2 "POWDER_Power:R_0508_1220Metric" V 13630 3150 50  0001 C CNN
F 3 "~" H 13700 3150 50  0001 C CNN
F 4 "Bourns Inc." H 13700 3150 50  0001 C CNN "Manufacturer"
F 5 "" H 13700 3150 50  0001 C CNN "PartNumber"
F 6 "3000-0000000584" V 13700 3150 50  0001 C CNN "PartSpecification"
	1    13700 3150
	0    -1   1    0   
$EndComp
$Comp
L Device:R R135
U 1 1 5D6B924F
P 13700 2850
F 0 "R135" V 13493 2850 50  0000 C CNN
F 1 "51m" V 13584 2850 50  0000 C CNN
F 2 "POWDER_Power:R_0508_1220Metric" V 13630 2850 50  0001 C CNN
F 3 "~" H 13700 2850 50  0001 C CNN
F 4 "Panasonic Electronic Components" H 13700 2850 50  0001 C CNN "Manufacturer"
F 5 "ERJ-B2CFR05V" H 13700 2850 50  0001 C CNN "PartNumber"
F 6 "3000-0000000587" V 13700 2850 50  0001 C CNN "PartSpecification"
	1    13700 2850
	0    -1   1    0   
$EndComp
Wire Wire Line
	13850 3450 13950 3450
Wire Wire Line
	13850 2850 13950 2850
$Comp
L Device:R R136
U 1 1 5D5FB67C
P 13700 2550
F 0 "R136" V 13493 2550 50  0000 C CNN
F 1 "51m" V 13584 2550 50  0000 C CNN
F 2 "POWDER_Power:R_0508_1220Metric" V 13630 2550 50  0001 C CNN
F 3 "~" H 13700 2550 50  0001 C CNN
F 4 "Panasonic Electronic Components" H 13700 2550 50  0001 C CNN "Manufacturer"
F 5 "ERJ-B2CFR05V" H 13700 2550 50  0001 C CNN "PartNumber"
F 6 "3000-0000000587" V 13700 2550 50  0001 C CNN "PartSpecification"
	1    13700 2550
	0    -1   1    0   
$EndComp
$Comp
L POWDER_Power:INA180-Q1 U103
U 1 1 5ED022B9
P 6050 3200
F 0 "U103" H 6200 3500 50  0000 L CNN
F 1 "INA180-Q1" H 6200 2950 50  0000 L CNN
F 2 "Package_TO_SOT_SMD:SOT-23-5" H 6200 3850 100 0001 C CNN
F 3 "" H 6300 3550 100 0001 C CNN
F 4 "3000-0000000197" H 6050 3200 50  0001 C CNN "PartSpecification"
	1    6050 3200
	-1   0    0    -1  
$EndComp
$Comp
L power:GND #PWR?
U 1 1 5ED2C263
P 6050 3600
F 0 "#PWR?" H 6050 3350 50  0001 C CNN
F 1 "GND" H 6055 3427 50  0000 C CNN
F 2 "" H 6050 3600 50  0001 C CNN
F 3 "" H 6050 3600 50  0001 C CNN
	1    6050 3600
	1    0    0    -1  
$EndComp
Wire Wire Line
	6050 3600 6050 3500
$Comp
L power:+3.3V #PWR?
U 1 1 5ED37543
P 6050 2750
F 0 "#PWR?" H 6050 2600 50  0001 C CNN
F 1 "+3.3V" H 6065 2923 50  0000 C CNN
F 2 "" H 6050 2750 50  0001 C CNN
F 3 "" H 6050 2750 50  0001 C CNN
	1    6050 2750
	1    0    0    -1  
$EndComp
Wire Wire Line
	6050 2750 6050 2800
Wire Wire Line
	3500 7200 3900 7200
Wire Wire Line
	3500 7300 3900 7300
Text Label 3550 7200 0    50   ~ 0
ADC8
Text Label 3550 7300 0    50   ~ 0
ADC9
Wire Wire Line
	5600 3200 5350 3200
Text Label 5350 3200 0    50   ~ 0
ADC8
Wire Wire Line
	3900 5900 3500 5900
Text Label 3550 5900 0    50   ~ 0
PA4
Wire Wire Line
	3900 6000 3500 6000
Text Label 3550 6000 0    50   ~ 0
PA5
Wire Wire Line
	1500 6400 1500 6300
Connection ~ 1500 6300
Wire Wire Line
	1500 6700 1500 6750
Wire Wire Line
	1500 6750 2000 6750
Wire Wire Line
	2000 7150 2000 7100
Wire Wire Line
	2000 6800 2000 6750
Connection ~ 2000 6750
Wire Wire Line
	2250 7500 2000 7500
Connection ~ 2000 7500
Wire Wire Line
	2000 7500 2000 7450
Wire Wire Line
	3900 7900 3500 7900
Text Label 3550 7900 0    50   ~ 0
PN4
Wire Wire Line
	3900 8000 3500 8000
Text Label 3550 8000 0    50   ~ 0
PN5
Wire Wire Line
	5900 7500 6150 7500
Wire Wire Line
	5900 7600 6150 7600
Wire Wire Line
	6150 7700 5900 7700
Text Label 6000 7600 0    50   ~ 0
ATT_LE
Text Label 6000 7700 0    50   ~ 0
ATT_CLK
Text Label 6000 7500 0    50   ~ 0
ATT_SI
$Sheet
S 11000 2100 1000 1000
U 5D949534
F0 "PA_power_monitor" 50
F1 "PA_power_monitor.sch" 50
F2 "OUT_1" O L 11000 2450 50 
F3 "OUT_2" O L 11000 2550 50 
F4 "OUT_3" O L 11000 2650 50 
F5 "OUT_4" O L 11000 2750 50 
F6 "IN_P" I R 12000 2350 50 
F7 "IN_M_1" I R 12000 2550 50 
F8 "IN_M_2" I R 12000 2650 50 
F9 "IN_M_3" I R 12000 2750 50 
F10 "IN_M_4" I R 12000 2850 50 
$EndSheet
Wire Wire Line
	10000 1750 10500 1750
Wire Wire Line
	12300 3450 13500 3450
Wire Wire Line
	12000 2350 12300 2350
Wire Wire Line
	12300 2350 12300 1750
Connection ~ 12300 1750
Wire Wire Line
	12300 1750 13950 1750
Wire Wire Line
	11000 2450 10750 2450
Wire Wire Line
	11000 2550 10750 2550
Wire Wire Line
	11000 2650 10750 2650
Wire Wire Line
	11000 2750 10750 2750
Text Label 10750 2450 0    50   ~ 0
ADC0
Text Label 10750 2550 0    50   ~ 0
ADC1
Text Label 10750 2650 0    50   ~ 0
ADC2
Text Label 10750 2750 0    50   ~ 0
ADC3
$Comp
L POWDER_RF:Qorvo_QPQ1270 U101
U 1 1 5DBC60F8
P 4100 4550
F 0 "U101" H 4250 4800 50  0000 L CNN
F 1 "Qorvo_QPQ1270" H 3450 4800 50  0000 L CNN
F 2 "POWDER_RF:Qorvo_SMP" H 4650 4150 50  0001 C CNN
F 3 "" H 4100 4550 50  0001 C CNN
F 4 "Qorvo" H 4100 4550 50  0001 C CNN "Manufacturer"
F 5 "QPQ1270TR7 " H 4100 4550 50  0001 C CNN "PartNumber"
F 6 "3000-0000000078" H 4100 4550 50  0001 C CNN "PartSpecification"
	1    4100 4550
	-1   0    0    -1  
$EndComp
$Comp
L power:GND #PWR?
U 1 1 5DBC6102
P 3850 5000
F 0 "#PWR?" H 3850 4750 50  0001 C CNN
F 1 "GND" H 3855 4827 50  0000 C CNN
F 2 "" H 3850 5000 50  0001 C CNN
F 3 "" H 3850 5000 50  0001 C CNN
	1    3850 5000
	1    0    0    -1  
$EndComp
Wire Wire Line
	3850 4900 3850 5000
$Comp
L power:GND #PWR?
U 1 1 5DBC610D
P 3950 5000
F 0 "#PWR?" H 3950 4750 50  0001 C CNN
F 1 "GND" H 3955 4827 50  0000 C CNN
F 2 "" H 3950 5000 50  0001 C CNN
F 3 "" H 3950 5000 50  0001 C CNN
	1    3950 5000
	1    0    0    -1  
$EndComp
Wire Wire Line
	3950 4900 3950 5000
$Comp
L power:GND #PWR?
U 1 1 5DBC6118
P 4050 5000
F 0 "#PWR?" H 4050 4750 50  0001 C CNN
F 1 "GND" H 4055 4827 50  0000 C CNN
F 2 "" H 4050 5000 50  0001 C CNN
F 3 "" H 4050 5000 50  0001 C CNN
	1    4050 5000
	1    0    0    -1  
$EndComp
Wire Wire Line
	4050 4900 4050 5000
$Comp
L power:GND #PWR?
U 1 1 5DBC6123
P 4150 5000
F 0 "#PWR?" H 4150 4750 50  0001 C CNN
F 1 "GND" H 4155 4827 50  0000 C CNN
F 2 "" H 4150 5000 50  0001 C CNN
F 3 "" H 4150 5000 50  0001 C CNN
	1    4150 5000
	1    0    0    -1  
$EndComp
Wire Wire Line
	4150 4900 4150 5000
$Comp
L power:GND #PWR?
U 1 1 5DBC612E
P 4250 5000
F 0 "#PWR?" H 4250 4750 50  0001 C CNN
F 1 "GND" H 4255 4827 50  0000 C CNN
F 2 "" H 4250 5000 50  0001 C CNN
F 3 "" H 4250 5000 50  0001 C CNN
	1    4250 5000
	1    0    0    -1  
$EndComp
Wire Wire Line
	4250 4900 4250 5000
$Comp
L power:GND #PWR?
U 1 1 5DBC6139
P 4350 5000
F 0 "#PWR?" H 4350 4750 50  0001 C CNN
F 1 "GND" H 4355 4827 50  0000 C CNN
F 2 "" H 4350 5000 50  0001 C CNN
F 3 "" H 4350 5000 50  0001 C CNN
	1    4350 5000
	1    0    0    -1  
$EndComp
Wire Wire Line
	4350 4900 4350 5000
Wire Wire Line
	4100 4200 4100 4250
Wire Wire Line
	4500 4550 4600 4550
Wire Wire Line
	4600 4550 4600 4650
Wire Wire Line
	1200 4450 1400 4450
Connection ~ 1200 4450
Wire Wire Line
	5800 4200 6200 4200
$Comp
L POWDER_RF:Qorvo_QPQ1270 U104
U 1 1 5DCE87F8
P 12750 4600
F 0 "U104" H 12900 4850 50  0000 L CNN
F 1 "Qorvo_QPQ1270" H 12100 4850 50  0000 L CNN
F 2 "POWDER_RF:Qorvo_SMP" H 13300 4200 50  0001 C CNN
F 3 "" H 12750 4600 50  0001 C CNN
F 4 "Qorvo" H 12750 4600 50  0001 C CNN "Manufacturer"
F 5 "QPQ1270TR7 " H 12750 4600 50  0001 C CNN "PartNumber"
F 6 "3000-0000000078" H 12750 4600 50  0001 C CNN "PartSpecification"
	1    12750 4600
	-1   0    0    -1  
$EndComp
$Comp
L power:GND #PWR?
U 1 1 5DCE8802
P 13000 5050
F 0 "#PWR?" H 13000 4800 50  0001 C CNN
F 1 "GND" H 13005 4877 50  0000 C CNN
F 2 "" H 13000 5050 50  0001 C CNN
F 3 "" H 13000 5050 50  0001 C CNN
	1    13000 5050
	-1   0    0    -1  
$EndComp
Wire Wire Line
	13000 4950 13000 5050
$Comp
L power:GND #PWR?
U 1 1 5DCE880D
P 12900 5050
F 0 "#PWR?" H 12900 4800 50  0001 C CNN
F 1 "GND" H 12905 4877 50  0000 C CNN
F 2 "" H 12900 5050 50  0001 C CNN
F 3 "" H 12900 5050 50  0001 C CNN
	1    12900 5050
	-1   0    0    -1  
$EndComp
Wire Wire Line
	12900 4950 12900 5050
$Comp
L power:GND #PWR?
U 1 1 5DCE8818
P 12800 5050
F 0 "#PWR?" H 12800 4800 50  0001 C CNN
F 1 "GND" H 12805 4877 50  0000 C CNN
F 2 "" H 12800 5050 50  0001 C CNN
F 3 "" H 12800 5050 50  0001 C CNN
	1    12800 5050
	-1   0    0    -1  
$EndComp
Wire Wire Line
	12800 4950 12800 5050
$Comp
L power:GND #PWR?
U 1 1 5DCE8823
P 12700 5050
F 0 "#PWR?" H 12700 4800 50  0001 C CNN
F 1 "GND" H 12705 4877 50  0000 C CNN
F 2 "" H 12700 5050 50  0001 C CNN
F 3 "" H 12700 5050 50  0001 C CNN
	1    12700 5050
	-1   0    0    -1  
$EndComp
Wire Wire Line
	12700 4950 12700 5050
$Comp
L power:GND #PWR?
U 1 1 5DCE882E
P 12600 5050
F 0 "#PWR?" H 12600 4800 50  0001 C CNN
F 1 "GND" H 12605 4877 50  0000 C CNN
F 2 "" H 12600 5050 50  0001 C CNN
F 3 "" H 12600 5050 50  0001 C CNN
	1    12600 5050
	-1   0    0    -1  
$EndComp
Wire Wire Line
	12600 4950 12600 5050
$Comp
L power:GND #PWR?
U 1 1 5DCE8839
P 12500 5050
F 0 "#PWR?" H 12500 4800 50  0001 C CNN
F 1 "GND" H 12505 4877 50  0000 C CNN
F 2 "" H 12500 5050 50  0001 C CNN
F 3 "" H 12500 5050 50  0001 C CNN
	1    12500 5050
	-1   0    0    -1  
$EndComp
Wire Wire Line
	12500 4950 12500 5050
Wire Wire Line
	11750 4200 12750 4200
Wire Wire Line
	12750 4300 12750 4200
Wire Wire Line
	4100 4200 4800 4200
$Sheet
S 7000 7800 700  200 
U 5E243016
F0 "SDR_GPIO" 50
F1 "SDR_GPIO.sch" 50
F2 "SDR_GPIO[0..11]" B L 7000 7900 50 
$EndSheet
Wire Bus Line
	5900 7900 7000 7900
Text Label 1100 4450 0    50   ~ 0
LNA_out_f
$Comp
L 000_PreferredParts:C_100nF C?
U 1 1 5E7A8B44
P 6800 3200
AR Path="/5D949534/5E7A8B44" Ref="C?"  Part="1" 
AR Path="/5E7A8B44" Ref="C101"  Part="1" 
F 0 "C101" H 6825 3300 50  0000 L CNN
F 1 "C_100nF" H 6825 3100 50  0001 L CNN
F 2 "Capacitor_SMD:C_0402_1005Metric" H 6838 3050 50  0001 C CNN
F 3 "~" H 6800 3200 50  0001 C CNN
F 4 "100nF" H 6950 3100 50  0000 C CNN "DisplayValue"
F 5 "3000-0000000125" H 2500 500 50  0001 C CNN "PartSpecification"
	1    6800 3200
	-1   0    0    1   
$EndComp
$Comp
L Device:R R?
U 1 1 5E7A8B4C
P 7050 3350
AR Path="/5D69D382/5E7A8B4C" Ref="R?"  Part="1" 
AR Path="/5E7A8B4C" Ref="R108"  Part="1" 
AR Path="/5D949534/5E7A8B4C" Ref="R?"  Part="1" 
F 0 "R108" H 7120 3396 50  0000 L CNN
F 1 "100" H 7120 3305 50  0000 L CNN
F 2 "Resistor_SMD:R_0402_1005Metric" V 6980 3350 50  0001 C CNN
F 3 "~" H 7050 3350 50  0001 C CNN
F 4 "" H 7050 3350 50  0001 C CNN "Manufacturer"
F 5 "" H 7050 3350 50  0001 C CNN "PartNumber"
F 6 "3000-0000000149" H 7050 3350 50  0001 C CNN "PartSpecification"
	1    7050 3350
	0    1    1    0   
$EndComp
Wire Wire Line
	7500 2500 7500 3100
Wire Wire Line
	7500 3450 7500 3500
$Comp
L Device:R R?
U 1 1 5E7F6F10
P 7050 3050
AR Path="/5D69D382/5E7F6F10" Ref="R?"  Part="1" 
AR Path="/5E7F6F10" Ref="R102"  Part="1" 
AR Path="/5D949534/5E7F6F10" Ref="R?"  Part="1" 
F 0 "R102" H 7120 3096 50  0000 L CNN
F 1 "100" H 7120 3005 50  0000 L CNN
F 2 "Resistor_SMD:R_0402_1005Metric" V 6980 3050 50  0001 C CNN
F 3 "~" H 7050 3050 50  0001 C CNN
F 4 "" H 7050 3050 50  0001 C CNN "Manufacturer"
F 5 "" H 7050 3050 50  0001 C CNN "PartNumber"
F 6 "3000-0000000149" H 7050 3050 50  0001 C CNN "PartSpecification"
	1    7050 3050
	0    1    1    0   
$EndComp
Wire Wire Line
	6800 3050 6600 3050
Wire Wire Line
	6600 3050 6600 3150
Wire Wire Line
	6600 3150 6500 3150
Wire Wire Line
	6800 3350 6550 3350
Wire Wire Line
	6550 3350 6550 3250
Wire Wire Line
	6550 3250 6500 3250
Wire Wire Line
	6900 3350 6800 3350
Connection ~ 6800 3350
Wire Wire Line
	6900 3050 6800 3050
Connection ~ 6800 3050
Text Label 5850 3850 0    50   ~ 0
VDD_LNA_REG
Wire Wire Line
	7200 3050 7400 3050
Wire Wire Line
	7400 3050 7400 3500
Wire Wire Line
	7400 3500 7500 3500
Connection ~ 7500 3500
Wire Wire Line
	7500 3500 7500 3800
Wire Wire Line
	7200 3350 7300 3350
Wire Wire Line
	7300 3350 7300 3100
Wire Wire Line
	7300 3100 7500 3100
Connection ~ 7500 3100
Wire Wire Line
	7500 3100 7500 3150
Text Label 6600 3050 0    50   ~ 0
LNA_M_F
Text Label 6550 3300 3    50   ~ 0
LNA_P_F
Text Label 11850 4200 0    50   ~ 0
pa_in_f
Text Label 3550 7100 0    50   ~ 0
ADC4
Wire Wire Line
	3500 7100 3900 7100
$Comp
L Device:R R109
U 1 1 5EA4B85F
P 7800 1100
F 0 "R109" V 7880 1100 50  0000 C CNN
F 1 "10k" V 7800 1100 50  0000 C CNN
F 2 "Resistor_SMD:R_0402_1005Metric" V 7730 1100 50  0001 C CNN
F 3 "~" H 7800 1100 50  0001 C CNN
F 4 "3000-0000000131" V 7800 1100 50  0001 C CNN "PartSpecification"
	1    7800 1100
	1    0    0    -1  
$EndComp
Wire Wire Line
	10750 7400 10750 7950
$Comp
L Device:R R110
U 1 1 5EAB9E10
P 7800 1500
F 0 "R110" V 7880 1500 50  0000 C CNN
F 1 "4.87k" V 7800 1500 50  0000 C CNN
F 2 "Resistor_SMD:R_0402_1005Metric" V 7730 1500 50  0001 C CNN
F 3 "~" H 7800 1500 50  0001 C CNN
F 4 "3000-0000000133" V 7800 1500 50  0001 C CNN "PartSpecification"
	1    7800 1500
	1    0    0    -1  
$EndComp
$Comp
L power:GND #PWR?
U 1 1 5EABA402
P 7800 1750
F 0 "#PWR?" H 7800 1500 50  0001 C CNN
F 1 "GND" H 7805 1577 50  0000 C CNN
F 2 "" H 7800 1750 50  0001 C CNN
F 3 "" H 7800 1750 50  0001 C CNN
	1    7800 1750
	1    0    0    -1  
$EndComp
Text Label 7250 3800 0    50   ~ 0
VDD_LNA
Wire Wire Line
	7800 1650 7800 1750
Wire Wire Line
	7800 1350 7800 1300
Wire Wire Line
	7800 750  7600 750 
Wire Wire Line
	7800 750  7800 950 
Text Label 7700 750  0    50   ~ 0
VDD_LNA
Wire Wire Line
	7800 1300 8000 1300
Connection ~ 7800 1300
Wire Wire Line
	7800 1300 7800 1250
Text Label 7900 1300 0    50   ~ 0
ADC9
$Comp
L Device:R R132
U 1 1 5EB52F8C
P 10500 2850
F 0 "R132" V 10580 2850 50  0000 C CNN
F 1 "10k" V 10500 2850 50  0000 C CNN
F 2 "Resistor_SMD:R_0402_1005Metric" V 10430 2850 50  0001 C CNN
F 3 "~" H 10500 2850 50  0001 C CNN
F 4 "3000-0000000131" V 10500 2850 50  0001 C CNN "PartSpecification"
	1    10500 2850
	1    0    0    -1  
$EndComp
$Comp
L Device:R R137
U 1 1 5EB52F96
P 10500 3250
F 0 "R137" V 10580 3250 50  0000 C CNN
F 1 "4.87k" V 10500 3250 50  0000 C CNN
F 2 "Resistor_SMD:R_0402_1005Metric" V 10430 3250 50  0001 C CNN
F 3 "~" H 10500 3250 50  0001 C CNN
F 4 "3000-0000000133" V 10500 3250 50  0001 C CNN "PartSpecification"
	1    10500 3250
	1    0    0    -1  
$EndComp
$Comp
L power:GND #PWR?
U 1 1 5EB52FA0
P 10500 3500
F 0 "#PWR?" H 10500 3250 50  0001 C CNN
F 1 "GND" H 10505 3327 50  0000 C CNN
F 2 "" H 10500 3500 50  0001 C CNN
F 3 "" H 10500 3500 50  0001 C CNN
	1    10500 3500
	1    0    0    -1  
$EndComp
Wire Wire Line
	10500 3400 10500 3500
Wire Wire Line
	10500 3100 10500 3050
Connection ~ 10500 3050
Wire Wire Line
	10500 3050 10500 3000
Connection ~ 10500 1750
Wire Wire Line
	10500 1750 12300 1750
Wire Wire Line
	10500 1750 10500 2700
Text Label 10750 3050 2    50   ~ 0
ADC4
Wire Wire Line
	10500 3050 10750 3050
Wire Wire Line
	12200 2850 12200 2550
Wire Wire Line
	12200 2550 13500 2550
Wire Wire Line
	12000 2850 12200 2850
Wire Wire Line
	12000 2750 12300 2750
Wire Wire Line
	12300 2750 12300 3450
Wire Wire Line
	12000 2550 12100 2550
Wire Wire Line
	12100 2550 12100 3150
Wire Wire Line
	12100 3150 13500 3150
Wire Wire Line
	12000 2650 12400 2650
Wire Wire Line
	12400 2650 12400 2850
Wire Wire Line
	12400 2850 13500 2850
Wire Wire Line
	9350 4700 9250 4700
$Comp
L 000_PreferredParts:C_0_1uF C102
U 1 1 5ECD9D0F
P 5600 2600
F 0 "C102" H 5625 2700 50  0000 L CNN
F 1 "C_0_1uF" H 5625 2500 50  0001 L CNN
F 2 "Capacitor_SMD:C_0402_1005Metric" H 5638 2450 50  0001 C CNN
F 3 "~" H 5600 2600 50  0001 C CNN
F 4 "0.1uF" H 5750 2500 50  0000 C CNN "DisplayValue"
F 5 "3000-0000000125" H 5600 2600 50  0001 C CNN "PartSpecification"
	1    5600 2600
	1    0    0    -1  
$EndComp
$Comp
L power:GND #PWR?
U 1 1 5ECDA3DA
P 5600 2850
F 0 "#PWR?" H 5600 2600 50  0001 C CNN
F 1 "GND" H 5605 2677 50  0000 C CNN
F 2 "" H 5600 2850 50  0001 C CNN
F 3 "" H 5600 2850 50  0001 C CNN
	1    5600 2850
	1    0    0    -1  
$EndComp
Wire Wire Line
	5600 2850 5600 2750
Wire Wire Line
	6050 2800 5900 2800
Wire Wire Line
	5900 2800 5900 2400
Wire Wire Line
	5900 2400 5600 2400
Wire Wire Line
	5600 2400 5600 2450
Connection ~ 6050 2800
Wire Wire Line
	6050 2800 6050 2850
Text Notes 11500 5950 0    50   ~ 0
Attenuators have 0 DC because antenna ports are\nDC shorted to ground, LNA matching circuit has a\ncapacitor in line with it and PA datasheet states there\nis a DC blocking cap internal to the module.
$Comp
L POWDER_RF:BGSX22G5A10 U105
U 1 1 5D941A51
P 13350 7800
F 0 "U105" H 13650 8150 50  0000 C CNN
F 1 "BGSX22G5A10" H 13350 7650 50  0000 C CNN
F 2 "POWDER_RF:BGSX22G5A10" H 13900 8450 50  0001 C CNN
F 3 "" H 13350 8250 50  0001 C CNN
F 4 "Infineon Technologies" H 13800 8350 50  0001 C CNN "Manufacturer"
F 5 "BGSX22G5A10E6327XTSA1" H 13900 8250 50  0001 C CNN "PartNumber"
F 6 "3000-0000000180" H 13350 7800 50  0001 C CNN "PartSpecification"
	1    13350 7800
	1    0    0    -1  
$EndComp
$Comp
L power:GND #PWR?
U 1 1 5D9B0F00
P 13200 8400
F 0 "#PWR?" H 13200 8150 50  0001 C CNN
F 1 "GND" H 13205 8227 50  0000 C CNN
F 2 "" H 13200 8400 50  0001 C CNN
F 3 "" H 13200 8400 50  0001 C CNN
	1    13200 8400
	1    0    0    -1  
$EndComp
$Comp
L power:GND #PWR?
U 1 1 5D9B182F
P 13300 8400
F 0 "#PWR?" H 13300 8150 50  0001 C CNN
F 1 "GND" H 13305 8227 50  0000 C CNN
F 2 "" H 13300 8400 50  0001 C CNN
F 3 "" H 13300 8400 50  0001 C CNN
	1    13300 8400
	1    0    0    -1  
$EndComp
$Comp
L power:GND #PWR?
U 1 1 5D9B1AE0
P 13400 8400
F 0 "#PWR?" H 13400 8150 50  0001 C CNN
F 1 "GND" H 13405 8227 50  0000 C CNN
F 2 "" H 13400 8400 50  0001 C CNN
F 3 "" H 13400 8400 50  0001 C CNN
	1    13400 8400
	1    0    0    -1  
$EndComp
$Comp
L power:GND #PWR?
U 1 1 5D9B1D06
P 13500 8400
F 0 "#PWR?" H 13500 8150 50  0001 C CNN
F 1 "GND" H 13505 8227 50  0000 C CNN
F 2 "" H 13500 8400 50  0001 C CNN
F 3 "" H 13500 8400 50  0001 C CNN
	1    13500 8400
	1    0    0    -1  
$EndComp
Wire Wire Line
	13500 8400 13500 8300
Wire Wire Line
	13400 8300 13400 8400
Wire Wire Line
	13300 8400 13300 8300
Wire Wire Line
	13200 8300 13200 8400
Wire Wire Line
	13800 7750 14000 7750
Wire Wire Line
	13800 7850 14000 7850
Text Label 13850 7750 0    50   ~ 0
lna_in
Text Label 13850 7850 0    50   ~ 0
pa_out
$Comp
L power:+3.3V #PWR?
U 1 1 5DA91728
P 13350 6750
F 0 "#PWR?" H 13350 6600 50  0001 C CNN
F 1 "+3.3V" H 13365 6923 50  0000 C CNN
F 2 "" H 13350 6750 50  0001 C CNN
F 3 "" H 13350 6750 50  0001 C CNN
	1    13350 6750
	1    0    0    -1  
$EndComp
Wire Wire Line
	5900 8000 6250 8000
Text Label 6000 8000 0    50   ~ 0
mode_sw
Text Label 12500 7600 0    50   ~ 0
mode_sw_f
Text Label 12800 7850 0    50   ~ 0
UL
Text Label 12800 7750 0    50   ~ 0
DL
$Comp
L POWDER_RF:SKY13286-359LF U106
U 1 1 5DB5DEEC
P 2550 4450
F 0 "U106" H 1950 4950 50  0000 C CNN
F 1 "SKY13286-359LF" H 2950 4950 50  0000 C CNN
F 2 "POWDER_RF:SKY13286-359LF" H 1950 5050 50  0001 C CNN
F 3 "" H 2450 4450 50  0001 C CNN
F 4 "3000-0000000195" H 2550 4450 50  0001 C CNN "PartSpecification"
	1    2550 4450
	1    0    0    -1  
$EndComp
$Comp
L POWDER_RF:SKY13286-359LF U107
U 1 1 5DB5EAE5
P 14200 4700
F 0 "U107" H 13600 5200 50  0000 C CNN
F 1 "SKY13286-359LF" H 14600 5200 50  0000 C CNN
F 2 "POWDER_RF:SKY13286-359LF" H 13600 5300 50  0001 C CNN
F 3 "" H 14100 4700 50  0001 C CNN
F 4 "3000-0000000195" H 14200 4700 50  0001 C CNN "PartSpecification"
	1    14200 4700
	-1   0    0    -1  
$EndComp
Wire Wire Line
	3700 4550 3300 4550
Text Label 3600 4550 2    50   ~ 0
LNA_UL
Text Label 4550 4550 0    50   ~ 0
LNA_DL
Text Label 3350 4350 0    50   ~ 0
LNA_DL
Wire Wire Line
	3600 4350 3300 4350
$Comp
L power:+3.3V #PWR?
U 1 1 5DBD1354
P 2550 3050
F 0 "#PWR?" H 2550 2900 50  0001 C CNN
F 1 "+3.3V" H 2565 3223 50  0000 C CNN
F 2 "" H 2550 3050 50  0001 C CNN
F 3 "" H 2550 3050 50  0001 C CNN
	1    2550 3050
	1    0    0    -1  
$EndComp
Wire Wire Line
	2550 3050 2550 3250
$Comp
L power:GND #PWR?
U 1 1 5DBE64A9
P 2600 5100
F 0 "#PWR?" H 2600 4850 50  0001 C CNN
F 1 "GND" H 2605 4927 50  0000 C CNN
F 2 "" H 2600 5100 50  0001 C CNN
F 3 "" H 2600 5100 50  0001 C CNN
	1    2600 5100
	1    0    0    -1  
$EndComp
Wire Wire Line
	2600 5000 2600 5100
$Comp
L power:GND #PWR?
U 1 1 5DBE64B0
P 2700 5100
F 0 "#PWR?" H 2700 4850 50  0001 C CNN
F 1 "GND" H 2705 4927 50  0000 C CNN
F 2 "" H 2700 5100 50  0001 C CNN
F 3 "" H 2700 5100 50  0001 C CNN
	1    2700 5100
	1    0    0    -1  
$EndComp
Wire Wire Line
	2700 5000 2700 5100
$Comp
L power:GND #PWR?
U 1 1 5DBE64B7
P 2800 5100
F 0 "#PWR?" H 2800 4850 50  0001 C CNN
F 1 "GND" H 2805 4927 50  0000 C CNN
F 2 "" H 2800 5100 50  0001 C CNN
F 3 "" H 2800 5100 50  0001 C CNN
	1    2800 5100
	1    0    0    -1  
$EndComp
Wire Wire Line
	2800 5000 2800 5100
$Comp
L power:GND #PWR?
U 1 1 5DBE64BE
P 2900 5100
F 0 "#PWR?" H 2900 4850 50  0001 C CNN
F 1 "GND" H 2905 4927 50  0000 C CNN
F 2 "" H 2900 5100 50  0001 C CNN
F 3 "" H 2900 5100 50  0001 C CNN
	1    2900 5100
	1    0    0    -1  
$EndComp
Wire Wire Line
	2900 5000 2900 5100
$Comp
L power:GND #PWR?
U 1 1 5DBE64C5
P 3000 5100
F 0 "#PWR?" H 3000 4850 50  0001 C CNN
F 1 "GND" H 3005 4927 50  0000 C CNN
F 2 "" H 3000 5100 50  0001 C CNN
F 3 "" H 3000 5100 50  0001 C CNN
	1    3000 5100
	1    0    0    -1  
$EndComp
Wire Wire Line
	3000 5000 3000 5100
$Comp
L power:GND #PWR?
U 1 1 5DBE64CC
P 3100 5100
F 0 "#PWR?" H 3100 4850 50  0001 C CNN
F 1 "GND" H 3105 4927 50  0000 C CNN
F 2 "" H 3100 5100 50  0001 C CNN
F 3 "" H 3100 5100 50  0001 C CNN
	1    3100 5100
	1    0    0    -1  
$EndComp
Wire Wire Line
	3100 5000 3100 5100
$Comp
L power:GND #PWR?
U 1 1 5DBFAD78
P 2000 5100
F 0 "#PWR?" H 2000 4850 50  0001 C CNN
F 1 "GND" H 2005 4927 50  0000 C CNN
F 2 "" H 2000 5100 50  0001 C CNN
F 3 "" H 2000 5100 50  0001 C CNN
	1    2000 5100
	1    0    0    -1  
$EndComp
Wire Wire Line
	2000 5000 2000 5100
$Comp
L power:GND #PWR?
U 1 1 5DBFAD7F
P 2100 5100
F 0 "#PWR?" H 2100 4850 50  0001 C CNN
F 1 "GND" H 2105 4927 50  0000 C CNN
F 2 "" H 2100 5100 50  0001 C CNN
F 3 "" H 2100 5100 50  0001 C CNN
	1    2100 5100
	1    0    0    -1  
$EndComp
Wire Wire Line
	2100 5000 2100 5100
$Comp
L power:GND #PWR?
U 1 1 5DBFAD86
P 2200 5100
F 0 "#PWR?" H 2200 4850 50  0001 C CNN
F 1 "GND" H 2205 4927 50  0000 C CNN
F 2 "" H 2200 5100 50  0001 C CNN
F 3 "" H 2200 5100 50  0001 C CNN
	1    2200 5100
	1    0    0    -1  
$EndComp
Wire Wire Line
	2200 5000 2200 5100
$Comp
L power:GND #PWR?
U 1 1 5DBFAD8D
P 2300 5100
F 0 "#PWR?" H 2300 4850 50  0001 C CNN
F 1 "GND" H 2305 4927 50  0000 C CNN
F 2 "" H 2300 5100 50  0001 C CNN
F 3 "" H 2300 5100 50  0001 C CNN
	1    2300 5100
	1    0    0    -1  
$EndComp
Wire Wire Line
	2300 5000 2300 5100
$Comp
L power:GND #PWR?
U 1 1 5DBFAD94
P 2400 5100
F 0 "#PWR?" H 2400 4850 50  0001 C CNN
F 1 "GND" H 2405 4927 50  0000 C CNN
F 2 "" H 2400 5100 50  0001 C CNN
F 3 "" H 2400 5100 50  0001 C CNN
	1    2400 5100
	1    0    0    -1  
$EndComp
Wire Wire Line
	2400 5000 2400 5100
$Comp
L power:GND #PWR?
U 1 1 5DBFAD9B
P 2500 5100
F 0 "#PWR?" H 2500 4850 50  0001 C CNN
F 1 "GND" H 2505 4927 50  0000 C CNN
F 2 "" H 2500 5100 50  0001 C CNN
F 3 "" H 2500 5100 50  0001 C CNN
	1    2500 5100
	1    0    0    -1  
$EndComp
Wire Wire Line
	2500 5000 2500 5100
Wire Wire Line
	1800 4300 1450 4300
Text Label 1450 4300 0    50   ~ 0
mode_sw
Wire Wire Line
	13450 4600 13150 4600
Wire Wire Line
	14950 4550 15350 4550
Text Label 15350 4550 2    50   ~ 0
mode_sw_b
Text Label 13200 4600 0    50   ~ 0
PA_DL
Text Label 13200 4800 0    50   ~ 0
PA_UL
Wire Wire Line
	13200 4800 13450 4800
Text Label 12100 4600 0    50   ~ 0
PA_UL
Wire Wire Line
	12100 4600 12350 4600
$Comp
L power:GND #PWR?
U 1 1 5DD37191
P 14250 5350
F 0 "#PWR?" H 14250 5100 50  0001 C CNN
F 1 "GND" H 14255 5177 50  0000 C CNN
F 2 "" H 14250 5350 50  0001 C CNN
F 3 "" H 14250 5350 50  0001 C CNN
	1    14250 5350
	1    0    0    -1  
$EndComp
Wire Wire Line
	14250 5250 14250 5350
$Comp
L power:GND #PWR?
U 1 1 5DD37198
P 14350 5350
F 0 "#PWR?" H 14350 5100 50  0001 C CNN
F 1 "GND" H 14355 5177 50  0000 C CNN
F 2 "" H 14350 5350 50  0001 C CNN
F 3 "" H 14350 5350 50  0001 C CNN
	1    14350 5350
	1    0    0    -1  
$EndComp
Wire Wire Line
	14350 5250 14350 5350
$Comp
L power:GND #PWR?
U 1 1 5DD3719F
P 14450 5350
F 0 "#PWR?" H 14450 5100 50  0001 C CNN
F 1 "GND" H 14455 5177 50  0000 C CNN
F 2 "" H 14450 5350 50  0001 C CNN
F 3 "" H 14450 5350 50  0001 C CNN
	1    14450 5350
	1    0    0    -1  
$EndComp
Wire Wire Line
	14450 5250 14450 5350
$Comp
L power:GND #PWR?
U 1 1 5DD371A6
P 14550 5350
F 0 "#PWR?" H 14550 5100 50  0001 C CNN
F 1 "GND" H 14555 5177 50  0000 C CNN
F 2 "" H 14550 5350 50  0001 C CNN
F 3 "" H 14550 5350 50  0001 C CNN
	1    14550 5350
	1    0    0    -1  
$EndComp
Wire Wire Line
	14550 5250 14550 5350
$Comp
L power:GND #PWR?
U 1 1 5DD371AD
P 14650 5350
F 0 "#PWR?" H 14650 5100 50  0001 C CNN
F 1 "GND" H 14655 5177 50  0000 C CNN
F 2 "" H 14650 5350 50  0001 C CNN
F 3 "" H 14650 5350 50  0001 C CNN
	1    14650 5350
	1    0    0    -1  
$EndComp
Wire Wire Line
	14650 5250 14650 5350
$Comp
L power:GND #PWR?
U 1 1 5DD371B4
P 14750 5350
F 0 "#PWR?" H 14750 5100 50  0001 C CNN
F 1 "GND" H 14755 5177 50  0000 C CNN
F 2 "" H 14750 5350 50  0001 C CNN
F 3 "" H 14750 5350 50  0001 C CNN
	1    14750 5350
	1    0    0    -1  
$EndComp
Wire Wire Line
	14750 5250 14750 5350
$Comp
L power:GND #PWR?
U 1 1 5DD371BB
P 13650 5350
F 0 "#PWR?" H 13650 5100 50  0001 C CNN
F 1 "GND" H 13655 5177 50  0000 C CNN
F 2 "" H 13650 5350 50  0001 C CNN
F 3 "" H 13650 5350 50  0001 C CNN
	1    13650 5350
	1    0    0    -1  
$EndComp
Wire Wire Line
	13650 5250 13650 5350
$Comp
L power:GND #PWR?
U 1 1 5DD371C2
P 13750 5350
F 0 "#PWR?" H 13750 5100 50  0001 C CNN
F 1 "GND" H 13755 5177 50  0000 C CNN
F 2 "" H 13750 5350 50  0001 C CNN
F 3 "" H 13750 5350 50  0001 C CNN
	1    13750 5350
	1    0    0    -1  
$EndComp
Wire Wire Line
	13750 5250 13750 5350
$Comp
L power:GND #PWR?
U 1 1 5DD371C9
P 13850 5350
F 0 "#PWR?" H 13850 5100 50  0001 C CNN
F 1 "GND" H 13855 5177 50  0000 C CNN
F 2 "" H 13850 5350 50  0001 C CNN
F 3 "" H 13850 5350 50  0001 C CNN
	1    13850 5350
	1    0    0    -1  
$EndComp
Wire Wire Line
	13850 5250 13850 5350
$Comp
L power:GND #PWR?
U 1 1 5DD371D0
P 13950 5350
F 0 "#PWR?" H 13950 5100 50  0001 C CNN
F 1 "GND" H 13955 5177 50  0000 C CNN
F 2 "" H 13950 5350 50  0001 C CNN
F 3 "" H 13950 5350 50  0001 C CNN
	1    13950 5350
	1    0    0    -1  
$EndComp
Wire Wire Line
	13950 5250 13950 5350
$Comp
L power:GND #PWR?
U 1 1 5DD371D7
P 14050 5350
F 0 "#PWR?" H 14050 5100 50  0001 C CNN
F 1 "GND" H 14055 5177 50  0000 C CNN
F 2 "" H 14050 5350 50  0001 C CNN
F 3 "" H 14050 5350 50  0001 C CNN
	1    14050 5350
	1    0    0    -1  
$EndComp
Wire Wire Line
	14050 5250 14050 5350
$Comp
L power:GND #PWR?
U 1 1 5DD371DE
P 14150 5350
F 0 "#PWR?" H 14150 5100 50  0001 C CNN
F 1 "GND" H 14155 5177 50  0000 C CNN
F 2 "" H 14150 5350 50  0001 C CNN
F 3 "" H 14150 5350 50  0001 C CNN
	1    14150 5350
	1    0    0    -1  
$EndComp
Wire Wire Line
	14150 5250 14150 5350
$Comp
L Device:C C103
U 1 1 5DD6AF7F
P 1550 4450
F 0 "C103" H 1575 4550 50  0000 L CNN
F 1 "47pF" H 1575 4350 50  0000 L CNN
F 2 "Capacitor_SMD:C_0201_0603Metric" H 1588 4300 50  0001 C CNN
F 3 "~" H 1550 4450 50  0001 C CNN
F 4 "3000-0000000161" H 1550 4450 50  0001 C CNN "PartSpecification"
	1    1550 4450
	0    1    1    0   
$EndComp
Wire Wire Line
	1700 4450 1800 4450
$Comp
L Device:C C104
U 1 1 5DD9B573
P 15200 4700
F 0 "C104" H 15225 4800 50  0000 L CNN
F 1 "47pF" H 15225 4600 50  0000 L CNN
F 2 "Capacitor_SMD:C_0201_0603Metric" H 15238 4550 50  0001 C CNN
F 3 "~" H 15200 4700 50  0001 C CNN
F 4 "3000-0000000161" H 15200 4700 50  0001 C CNN "PartSpecification"
	1    15200 4700
	0    1    1    0   
$EndComp
Wire Wire Line
	15350 4700 15450 4700
Wire Wire Line
	15050 4700 14950 4700
Wire Wire Line
	5900 8100 6250 8100
Text Label 6000 8100 0    50   ~ 0
mode_sw_b
$Comp
L power:+3.3V #PWR?
U 1 1 5DE3494D
P 14200 3350
F 0 "#PWR?" H 14200 3200 50  0001 C CNN
F 1 "+3.3V" H 14215 3523 50  0000 C CNN
F 2 "" H 14200 3350 50  0001 C CNN
F 3 "" H 14200 3350 50  0001 C CNN
	1    14200 3350
	1    0    0    -1  
$EndComp
Wire Wire Line
	14200 3350 14200 3400
Text Label 1750 4450 3    50   ~ 0
LNA_out_decoup
Text Label 15000 4700 3    50   ~ 0
PA_in_decouple
$Comp
L Device:R R101
U 1 1 5DE9F253
P 12050 7000
F 0 "R101" V 12130 7000 50  0000 C CNN
F 1 "1" V 12050 7000 50  0000 C CNN
F 2 "Resistor_SMD:R_0402_1005Metric" V 11980 7000 50  0001 C CNN
F 3 "~" H 12050 7000 50  0001 C CNN
F 4 "3000-0000000221" V 12050 7000 50  0001 C CNN "PartSpecification"
	1    12050 7000
	0    1    1    0   
$EndComp
$Comp
L 000_PreferredParts:C_100nF C105
U 1 1 5DEA27BD
P 12250 7200
F 0 "C105" H 12275 7300 50  0000 L CNN
F 1 "C_100nF" H 12275 7100 50  0001 L CNN
F 2 "Capacitor_SMD:C_0402_1005Metric" H 12288 7050 50  0001 C CNN
F 3 "~" H 12250 7200 50  0001 C CNN
F 4 "100nF" H 12400 7100 50  0000 C CNN "DisplayValue"
F 5 "3000-0000000125" H 6850 4750 50  0001 C CNN "PartSpecification"
	1    12250 7200
	1    0    0    -1  
$EndComp
$Comp
L power:GND #PWR?
U 1 1 5DEA2EE4
P 12250 7400
F 0 "#PWR?" H 12250 7150 50  0001 C CNN
F 1 "GND" H 12255 7227 50  0000 C CNN
F 2 "" H 12250 7400 50  0001 C CNN
F 3 "" H 12250 7400 50  0001 C CNN
	1    12250 7400
	1    0    0    -1  
$EndComp
Wire Wire Line
	12250 7400 12250 7350
Wire Wire Line
	12200 7000 12250 7000
Wire Wire Line
	12250 7000 12250 7050
Text Label 11500 7000 0    50   ~ 0
mode_sw
Wire Wire Line
	11400 7000 11900 7000
$Comp
L 000_PreferredParts:C_10pF C106
U 1 1 5DF11B36
P 13500 7000
F 0 "C106" H 13525 7100 50  0000 L CNN
F 1 "C_10pF" H 13525 6900 50  0000 L CNN
F 2 "Capacitor_SMD:C_0402_1005Metric" H 13538 6850 50  0001 C CNN
F 3 "~" H 13500 7000 50  0001 C CNN
F 4 "3000-0000000582" H 6500 4650 50  0001 C CNN "PartSpecification"
	1    13500 7000
	1    0    0    -1  
$EndComp
$Comp
L 000_PreferredParts:C_1nF C107
U 1 1 5DF124C4
P 13850 7000
F 0 "C107" H 13875 7100 50  0000 L CNN
F 1 "C_1nF" H 13875 6900 50  0000 L CNN
F 2 "Capacitor_SMD:C_0402_1005Metric" H 13888 6850 50  0001 C CNN
F 3 "~" H 13850 7000 50  0001 C CNN
F 4 "3000-0000000128" H 6500 4650 50  0001 C CNN "PartSpecification"
	1    13850 7000
	1    0    0    -1  
$EndComp
$Comp
L power:GND #PWR?
U 1 1 5DF128BF
P 13850 7250
F 0 "#PWR?" H 13850 7000 50  0001 C CNN
F 1 "GND" H 13855 7077 50  0000 C CNN
F 2 "" H 13850 7250 50  0001 C CNN
F 3 "" H 13850 7250 50  0001 C CNN
	1    13850 7250
	1    0    0    -1  
$EndComp
Wire Wire Line
	13850 7250 13850 7200
Wire Wire Line
	13850 7200 13500 7200
Wire Wire Line
	13500 7200 13500 7150
Connection ~ 13850 7200
Wire Wire Line
	13850 7200 13850 7150
Wire Wire Line
	13500 6850 13500 6800
Wire Wire Line
	13500 6800 13850 6800
Wire Wire Line
	13850 6800 13850 6850
$Comp
L 000_PreferredParts:C_10pF C108
U 1 1 5DF9178F
P 1900 3450
F 0 "C108" H 1925 3550 50  0000 L CNN
F 1 "C_10pF" H 1925 3350 50  0000 L CNN
F 2 "Capacitor_SMD:C_0402_1005Metric" H 1938 3300 50  0001 C CNN
F 3 "~" H 1900 3450 50  0001 C CNN
F 4 "3000-0000000582" H 3050 250 50  0001 C CNN "PartSpecification"
	1    1900 3450
	1    0    0    -1  
$EndComp
$Comp
L 000_PreferredParts:C_1nF C109
U 1 1 5DF91795
P 2250 3450
F 0 "C109" H 2275 3550 50  0000 L CNN
F 1 "C_1nF" H 2275 3350 50  0000 L CNN
F 2 "Capacitor_SMD:C_0402_1005Metric" H 2288 3300 50  0001 C CNN
F 3 "~" H 2250 3450 50  0001 C CNN
F 4 "3000-0000000128" H 3050 250 50  0001 C CNN "PartSpecification"
	1    2250 3450
	1    0    0    -1  
$EndComp
$Comp
L power:GND #PWR?
U 1 1 5DF9179B
P 2250 3700
F 0 "#PWR?" H 2250 3450 50  0001 C CNN
F 1 "GND" H 2255 3527 50  0000 C CNN
F 2 "" H 2250 3700 50  0001 C CNN
F 3 "" H 2250 3700 50  0001 C CNN
	1    2250 3700
	1    0    0    -1  
$EndComp
Wire Wire Line
	2250 3700 2250 3650
Wire Wire Line
	2250 3650 1900 3650
Wire Wire Line
	1900 3650 1900 3600
Connection ~ 2250 3650
Wire Wire Line
	2250 3650 2250 3600
Wire Wire Line
	1900 3300 1900 3250
Wire Wire Line
	1900 3250 2250 3250
Wire Wire Line
	2250 3250 2250 3300
$Comp
L 000_PreferredParts:C_10pF C110
U 1 1 5DFAF679
P 14400 3600
F 0 "C110" H 14425 3700 50  0000 L CNN
F 1 "C_10pF" H 14425 3500 50  0000 L CNN
F 2 "Capacitor_SMD:C_0402_1005Metric" H 14438 3450 50  0001 C CNN
F 3 "~" H 14400 3600 50  0001 C CNN
F 4 "3000-0000000582" H 1950 150 50  0001 C CNN "PartSpecification"
	1    14400 3600
	1    0    0    -1  
$EndComp
$Comp
L 000_PreferredParts:C_1nF C111
U 1 1 5DFAF67F
P 14750 3600
F 0 "C111" H 14775 3700 50  0000 L CNN
F 1 "C_1nF" H 14775 3500 50  0000 L CNN
F 2 "Capacitor_SMD:C_0402_1005Metric" H 14788 3450 50  0001 C CNN
F 3 "~" H 14750 3600 50  0001 C CNN
F 4 "3000-0000000128" H 1950 150 50  0001 C CNN "PartSpecification"
	1    14750 3600
	1    0    0    -1  
$EndComp
$Comp
L power:GND #PWR?
U 1 1 5DFAF685
P 14750 3850
F 0 "#PWR?" H 14750 3600 50  0001 C CNN
F 1 "GND" H 14755 3677 50  0000 C CNN
F 2 "" H 14750 3850 50  0001 C CNN
F 3 "" H 14750 3850 50  0001 C CNN
	1    14750 3850
	1    0    0    -1  
$EndComp
Wire Wire Line
	14750 3850 14750 3800
Wire Wire Line
	14750 3800 14400 3800
Connection ~ 14750 3800
Wire Wire Line
	14750 3800 14750 3750
Wire Wire Line
	14400 3450 14400 3400
Wire Wire Line
	14400 3400 14750 3400
Wire Wire Line
	14750 3400 14750 3450
Connection ~ 2250 3250
Wire Wire Line
	2250 3250 2550 3250
Connection ~ 2550 3250
Wire Wire Line
	2550 3250 2550 3900
Wire Wire Line
	14200 3400 14400 3400
Connection ~ 14200 3400
Wire Wire Line
	14200 3400 14200 4150
Connection ~ 14400 3400
Wire Wire Line
	14400 3800 14400 3750
Wire Wire Line
	8350 6000 9250 6000
Wire Wire Line
	5900 6000 8050 6000
Connection ~ 9250 6000
Wire Wire Line
	9250 6000 9450 6000
Wire Wire Line
	9250 4700 9250 6000
Wire Wire Line
	9450 6000 9450 6500
Wire Wire Line
	3900 6400 3500 6400
Wire Wire Line
	13350 6800 13500 6800
Wire Wire Line
	12650 7850 12900 7850
Wire Wire Line
	12500 7600 12900 7600
Connection ~ 13500 6800
Wire Wire Line
	13350 6750 13350 6800
Connection ~ 13350 6800
Wire Wire Line
	13350 6800 13350 7400
Wire Wire Line
	11850 7750 12900 7750
Wire Wire Line
	11850 8550 12650 8550
Wire Wire Line
	12650 7850 12650 8550
Wire Wire Line
	12250 7000 12500 7000
Wire Wire Line
	12500 7000 12500 7600
Connection ~ 12250 7000
Wire Wire Line
	8250 4200 8550 4200
$EndSCHEMATC
