EESchema Schematic File Version 4
EELAYER 26 0
EELAYER END
$Descr A4 11693 8268
encoding utf-8
Sheet 1 1
Title ""
Date ""
Rev ""
Comp ""
Comment1 ""
Comment2 ""
Comment3 ""
Comment4 ""
$EndDescr
$Comp
L rf:SKY13414-485LF U1
U 1 1 5B57B785
P 5800 3350
F 0 "U1" H 5450 3700 50  0000 L CNN
F 1 "SKY13414-485LF" H 6150 3000 50  0000 L CNN
F 2 "rf:SKY13414-485LF" H 5800 3350 50  0001 C CNN
F 3 "" H 5800 3350 50  0001 C CNN
	1    5800 3350
	1    0    0    -1  
$EndComp
$Comp
L Device:R R2
U 1 1 5B57B888
P 5800 2300
F 0 "R2" H 5870 2346 50  0000 L CNN
F 1 "10" H 5870 2255 50  0000 L CNN
F 2 "Resistor_SMD:R_0603_1608Metric" V 5730 2300 50  0001 C CNN
F 3 "~" H 5800 2300 50  0001 C CNN
	1    5800 2300
	1    0    0    -1  
$EndComp
$Comp
L Device:R R1
U 1 1 5B57B8B0
P 5700 4100
F 0 "R1" H 5770 4146 50  0000 L CNN
F 1 "100" H 5770 4055 50  0000 L CNN
F 2 "Resistor_SMD:R_0603_1608Metric" V 5630 4100 50  0001 C CNN
F 3 "~" H 5700 4100 50  0001 C CNN
	1    5700 4100
	1    0    0    -1  
$EndComp
$Comp
L Device:R R3
U 1 1 5B57B912
P 5800 4450
F 0 "R3" H 5870 4496 50  0000 L CNN
F 1 "100" H 5870 4405 50  0000 L CNN
F 2 "Resistor_SMD:R_0603_1608Metric" V 5730 4450 50  0001 C CNN
F 3 "~" H 5800 4450 50  0001 C CNN
	1    5800 4450
	1    0    0    -1  
$EndComp
$Comp
L Device:R R4
U 1 1 5B57B938
P 5900 4800
F 0 "R4" H 5970 4846 50  0000 L CNN
F 1 "100" H 5970 4755 50  0000 L CNN
F 2 "Resistor_SMD:R_0603_1608Metric" V 5830 4800 50  0001 C CNN
F 3 "~" H 5900 4800 50  0001 C CNN
	1    5900 4800
	1    0    0    -1  
$EndComp
Wire Wire Line
	5900 4650 5900 3750
Wire Wire Line
	5800 4300 5800 3750
Wire Wire Line
	5700 3950 5700 3750
Wire Wire Line
	5700 5150 5700 4250
Wire Wire Line
	5800 2150 5800 1950
$Comp
L power:GND #PWR?
U 1 1 5B57BC3C
P 6050 3950
F 0 "#PWR?" H 6050 3700 50  0001 C CNN
F 1 "GND" H 6055 3777 50  0000 C CNN
F 2 "" H 6050 3950 50  0001 C CNN
F 3 "" H 6050 3950 50  0001 C CNN
	1    6050 3950
	1    0    0    -1  
$EndComp
Wire Wire Line
	6050 3950 6050 3750
$Comp
L Device:C C1
U 1 1 5B57BD25
P 6400 2650
F 0 "C1" H 6515 2696 50  0000 L CNN
F 1 "1u" H 6515 2605 50  0000 L CNN
F 2 "Capacitor_SMD:C_0402_1005Metric" H 6438 2500 50  0001 C CNN
F 3 "~" H 6400 2650 50  0001 C CNN
	1    6400 2650
	1    0    0    -1  
$EndComp
Wire Wire Line
	5800 2450 5800 2500
Wire Wire Line
	6400 2500 5800 2500
Connection ~ 5800 2500
Wire Wire Line
	5800 2500 5800 2950
$Comp
L power:GND #PWR?
U 1 1 5B57BFF3
P 6400 2900
F 0 "#PWR?" H 6400 2650 50  0001 C CNN
F 1 "GND" H 6405 2727 50  0000 C CNN
F 2 "" H 6400 2900 50  0001 C CNN
F 3 "" H 6400 2900 50  0001 C CNN
	1    6400 2900
	1    0    0    -1  
$EndComp
Wire Wire Line
	6400 2900 6400 2800
$Comp
L Device:C C2
U 1 1 5B57C138
P 6750 2650
F 0 "C2" H 6865 2696 50  0000 L CNN
F 1 "1n" H 6865 2605 50  0000 L CNN
F 2 "Capacitor_SMD:C_0402_1005Metric" H 6788 2500 50  0001 C CNN
F 3 "~" H 6750 2650 50  0001 C CNN
	1    6750 2650
	1    0    0    -1  
$EndComp
Wire Wire Line
	6750 2500 6400 2500
Connection ~ 6400 2500
$Comp
L power:GND #PWR?
U 1 1 5B57C24E
P 6750 2900
F 0 "#PWR?" H 6750 2650 50  0001 C CNN
F 1 "GND" H 6755 2727 50  0000 C CNN
F 2 "" H 6750 2900 50  0001 C CNN
F 3 "" H 6750 2900 50  0001 C CNN
	1    6750 2900
	1    0    0    -1  
$EndComp
Wire Wire Line
	6750 2900 6750 2800
$Comp
L power:VDD #PWR?
U 1 1 5B57C3F2
P 5800 1950
F 0 "#PWR?" H 5800 1800 50  0001 C CNN
F 1 "VDD" H 5817 2123 50  0000 C CNN
F 2 "" H 5800 1950 50  0001 C CNN
F 3 "" H 5800 1950 50  0001 C CNN
	1    5800 1950
	1    0    0    -1  
$EndComp
Wire Wire Line
	5800 5250 5400 5250
Wire Wire Line
	5800 4600 5800 5250
Wire Wire Line
	5700 5150 5400 5150
Wire Wire Line
	5900 4950 5900 5350
Wire Wire Line
	5400 5350 5900 5350
Text Label 5450 5150 0    50   ~ 0
V3
Text Label 5450 5250 0    50   ~ 0
V2
Text Label 5450 5350 0    50   ~ 0
V1
$Comp
L Connector:Conn_Coaxial J1
U 1 1 5B57C991
P 3200 3200
F 0 "J1" H 3130 3438 50  0000 C CNN
F 1 "Conn_Coaxial" H 3130 3347 50  0000 C CNN
F 2 "rf:SMA_endlaunch_SD-73251-115" H 3200 3200 50  0001 C CNN
F 3 " ~" H 3200 3200 50  0001 C CNN
	1    3200 3200
	-1   0    0    -1  
$EndComp
$Comp
L Connector:Conn_Coaxial J2
U 1 1 5B57CA7D
P 3650 3300
F 0 "J2" H 3580 3538 50  0000 C CNN
F 1 "Conn_Coaxial" H 3580 3447 50  0000 C CNN
F 2 "rf:SMA_endlaunch_SD-73251-115" H 3650 3300 50  0001 C CNN
F 3 " ~" H 3650 3300 50  0001 C CNN
	1    3650 3300
	-1   0    0    -1  
$EndComp
$Comp
L Connector:Conn_Coaxial J4
U 1 1 5B57CAB5
P 4100 3400
F 0 "J4" H 4030 3638 50  0000 C CNN
F 1 "Conn_Coaxial" H 4030 3547 50  0000 C CNN
F 2 "rf:SMA_endlaunch_SD-73251-115" H 4100 3400 50  0001 C CNN
F 3 " ~" H 4100 3400 50  0001 C CNN
	1    4100 3400
	-1   0    0    -1  
$EndComp
$Comp
L Connector:Conn_Coaxial J5
U 1 1 5B57CB05
P 4550 3500
F 0 "J5" H 4480 3738 50  0000 C CNN
F 1 "Conn_Coaxial" H 4480 3647 50  0000 C CNN
F 2 "rf:SMA_endlaunch_SD-73251-115" H 4550 3500 50  0001 C CNN
F 3 " ~" H 4550 3500 50  0001 C CNN
	1    4550 3500
	-1   0    0    -1  
$EndComp
Wire Wire Line
	4750 3500 5350 3500
Wire Wire Line
	5350 3400 4300 3400
Wire Wire Line
	5350 3300 3850 3300
Wire Wire Line
	3400 3200 5350 3200
$Comp
L power:GND #PWR?
U 1 1 5B57D1A2
P 4550 3800
F 0 "#PWR?" H 4550 3550 50  0001 C CNN
F 1 "GND" H 4555 3627 50  0000 C CNN
F 2 "" H 4550 3800 50  0001 C CNN
F 3 "" H 4550 3800 50  0001 C CNN
	1    4550 3800
	1    0    0    -1  
$EndComp
$Comp
L power:GND #PWR?
U 1 1 5B57D1C3
P 4100 3800
F 0 "#PWR?" H 4100 3550 50  0001 C CNN
F 1 "GND" H 4105 3627 50  0000 C CNN
F 2 "" H 4100 3800 50  0001 C CNN
F 3 "" H 4100 3800 50  0001 C CNN
	1    4100 3800
	1    0    0    -1  
$EndComp
$Comp
L power:GND #PWR?
U 1 1 5B57D1E4
P 3650 3800
F 0 "#PWR?" H 3650 3550 50  0001 C CNN
F 1 "GND" H 3655 3627 50  0000 C CNN
F 2 "" H 3650 3800 50  0001 C CNN
F 3 "" H 3650 3800 50  0001 C CNN
	1    3650 3800
	1    0    0    -1  
$EndComp
$Comp
L power:GND #PWR?
U 1 1 5B57D205
P 3200 3800
F 0 "#PWR?" H 3200 3550 50  0001 C CNN
F 1 "GND" H 3205 3627 50  0000 C CNN
F 2 "" H 3200 3800 50  0001 C CNN
F 3 "" H 3200 3800 50  0001 C CNN
	1    3200 3800
	1    0    0    -1  
$EndComp
Wire Wire Line
	3200 3800 3200 3400
Wire Wire Line
	3650 3500 3650 3800
Wire Wire Line
	4100 3800 4100 3600
Wire Wire Line
	4550 3700 4550 3800
$Comp
L Connector:Conn_Coaxial J6
U 1 1 5B57DC74
P 7250 3350
F 0 "J6" H 7349 3326 50  0000 L CNN
F 1 "Conn_Coaxial" H 7349 3235 50  0000 L CNN
F 2 "rf:SMA_endlaunch_SD-73251-115" H 7250 3350 50  0001 C CNN
F 3 " ~" H 7250 3350 50  0001 C CNN
	1    7250 3350
	1    0    0    -1  
$EndComp
Wire Wire Line
	7050 3350 6250 3350
$Comp
L power:GND #PWR?
U 1 1 5B57E04B
P 7250 3800
F 0 "#PWR?" H 7250 3550 50  0001 C CNN
F 1 "GND" H 7255 3627 50  0000 C CNN
F 2 "" H 7250 3800 50  0001 C CNN
F 3 "" H 7250 3800 50  0001 C CNN
	1    7250 3800
	1    0    0    -1  
$EndComp
Wire Wire Line
	7250 3800 7250 3550
$Comp
L Connector:Conn_01x05_Male J3
U 1 1 5B57E43F
P 4000 2000
F 0 "J3" H 4106 2378 50  0000 C CNN
F 1 "Conn_01x05_Male" H 4106 2287 50  0000 C CNN
F 2 "Connector_PinHeader_2.54mm:PinHeader_1x05_P2.54mm_Vertical" H 4000 2000 50  0001 C CNN
F 3 "~" H 4000 2000 50  0001 C CNN
	1    4000 2000
	1    0    0    -1  
$EndComp
$Comp
L power:VDD #PWR?
U 1 1 5B57E5DF
P 4500 1650
F 0 "#PWR?" H 4500 1500 50  0001 C CNN
F 1 "VDD" H 4517 1823 50  0000 C CNN
F 2 "" H 4500 1650 50  0001 C CNN
F 3 "" H 4500 1650 50  0001 C CNN
	1    4500 1650
	1    0    0    -1  
$EndComp
$Comp
L power:GND #PWR?
U 1 1 5B57E604
P 4500 2300
F 0 "#PWR?" H 4500 2050 50  0001 C CNN
F 1 "GND" H 4505 2127 50  0000 C CNN
F 2 "" H 4500 2300 50  0001 C CNN
F 3 "" H 4500 2300 50  0001 C CNN
	1    4500 2300
	1    0    0    -1  
$EndComp
Wire Wire Line
	4500 2300 4500 2200
Wire Wire Line
	4500 2200 4200 2200
Wire Wire Line
	4200 1800 4500 1800
Wire Wire Line
	4500 1800 4500 1650
Wire Wire Line
	4200 1900 4450 1900
Wire Wire Line
	4200 2000 4450 2000
Wire Wire Line
	4200 2100 4450 2100
Text Label 4300 2100 0    50   ~ 0
V1
Text Label 4300 2000 0    50   ~ 0
V2
Text Label 4300 1900 0    50   ~ 0
V3
Text Label 4950 3200 0    50   ~ 0
RF1
Text Label 4950 3300 0    50   ~ 0
RF2
Text Label 4950 3400 0    50   ~ 0
RF3
Text Label 4950 3500 0    50   ~ 0
RF4
Text Label 6700 3350 0    50   ~ 0
ANT
$Comp
L Connector:Conn_Coaxial TL1
U 1 1 5B5808CB
P 2150 4650
F 0 "TL1" H 2080 4888 50  0000 C CNN
F 1 "Conn_Coaxial" H 2080 4797 50  0000 C CNN
F 2 "rf:oshpark4_cbcpw_50" H 2150 4650 50  0001 C CNN
F 3 " ~" H 2150 4650 50  0001 C CNN
	1    2150 4650
	-1   0    0    -1  
$EndComp
$Comp
L Connector:Conn_Coaxial TL2
U 1 1 5B5808D1
P 2600 4750
F 0 "TL2" H 2530 4988 50  0000 C CNN
F 1 "Conn_Coaxial" H 2530 4897 50  0000 C CNN
F 2 "rf:oshpark4_cbcpw_50" H 2600 4750 50  0001 C CNN
F 3 " ~" H 2600 4750 50  0001 C CNN
	1    2600 4750
	-1   0    0    -1  
$EndComp
$Comp
L Connector:Conn_Coaxial TL3
U 1 1 5B5808D7
P 3050 4850
F 0 "TL3" H 2980 5088 50  0000 C CNN
F 1 "Conn_Coaxial" H 2980 4997 50  0000 C CNN
F 2 "rf:oshpark4_cbcpw_50" H 3050 4850 50  0001 C CNN
F 3 " ~" H 3050 4850 50  0001 C CNN
	1    3050 4850
	-1   0    0    -1  
$EndComp
$Comp
L Connector:Conn_Coaxial TL4
U 1 1 5B5808DD
P 3500 4950
F 0 "TL4" H 3430 5188 50  0000 C CNN
F 1 "Conn_Coaxial" H 3430 5097 50  0000 C CNN
F 2 "rf:oshpark4_cbcpw_50" H 3500 4950 50  0001 C CNN
F 3 " ~" H 3500 4950 50  0001 C CNN
	1    3500 4950
	-1   0    0    -1  
$EndComp
$Comp
L Connector:Conn_Coaxial TL5
U 1 1 5B5812F1
P 8450 3000
F 0 "TL5" H 8549 2976 50  0000 L CNN
F 1 "Conn_Coaxial" H 8549 2885 50  0000 L CNN
F 2 "rf:oshpark4_cbcpw_50" H 8450 3000 50  0001 C CNN
F 3 " ~" H 8450 3000 50  0001 C CNN
	1    8450 3000
	1    0    0    -1  
$EndComp
Wire Wire Line
	3700 4950 4300 4950
Wire Wire Line
	4300 4850 3250 4850
Wire Wire Line
	4300 4750 2800 4750
Wire Wire Line
	2350 4650 4300 4650
Text Label 3900 4650 0    50   ~ 0
RF1
Text Label 3900 4750 0    50   ~ 0
RF2
Text Label 3900 4850 0    50   ~ 0
RF3
Text Label 3900 4950 0    50   ~ 0
RF4
$Comp
L power:GND #PWR?
U 1 1 5B581E90
P 3500 5250
F 0 "#PWR?" H 3500 5000 50  0001 C CNN
F 1 "GND" H 3505 5077 50  0000 C CNN
F 2 "" H 3500 5250 50  0001 C CNN
F 3 "" H 3500 5250 50  0001 C CNN
	1    3500 5250
	1    0    0    -1  
$EndComp
$Comp
L power:GND #PWR?
U 1 1 5B581E96
P 3050 5250
F 0 "#PWR?" H 3050 5000 50  0001 C CNN
F 1 "GND" H 3055 5077 50  0000 C CNN
F 2 "" H 3050 5250 50  0001 C CNN
F 3 "" H 3050 5250 50  0001 C CNN
	1    3050 5250
	1    0    0    -1  
$EndComp
$Comp
L power:GND #PWR?
U 1 1 5B581E9C
P 2600 5250
F 0 "#PWR?" H 2600 5000 50  0001 C CNN
F 1 "GND" H 2605 5077 50  0000 C CNN
F 2 "" H 2600 5250 50  0001 C CNN
F 3 "" H 2600 5250 50  0001 C CNN
	1    2600 5250
	1    0    0    -1  
$EndComp
$Comp
L power:GND #PWR?
U 1 1 5B581EA2
P 2150 5250
F 0 "#PWR?" H 2150 5000 50  0001 C CNN
F 1 "GND" H 2155 5077 50  0000 C CNN
F 2 "" H 2150 5250 50  0001 C CNN
F 3 "" H 2150 5250 50  0001 C CNN
	1    2150 5250
	1    0    0    -1  
$EndComp
Wire Wire Line
	2150 5250 2150 4850
Wire Wire Line
	2600 4950 2600 5250
Wire Wire Line
	3050 5250 3050 5050
Wire Wire Line
	3500 5150 3500 5250
Wire Wire Line
	8250 3000 7450 3000
Text Label 7900 3000 0    50   ~ 0
ANT
$Comp
L power:GND #PWR?
U 1 1 5B583211
P 8450 3450
F 0 "#PWR?" H 8450 3200 50  0001 C CNN
F 1 "GND" H 8455 3277 50  0000 C CNN
F 2 "" H 8450 3450 50  0001 C CNN
F 3 "" H 8450 3450 50  0001 C CNN
	1    8450 3450
	1    0    0    -1  
$EndComp
Wire Wire Line
	8450 3450 8450 3200
$EndSCHEMATC
