(kicad_sch (version 20211123) (generator eeschema)

  (uuid 71297b9a-b803-43f6-a73f-5f06d119bc8a)

  (paper "A4")

  (lib_symbols
    (symbol "000_PreferredParts:C_0_1uF" (pin_numbers hide) (pin_names (offset 0.254)) (in_bom yes) (on_board yes)
      (property "Reference" "C" (id 0) (at 0.635 2.54 0)
        (effects (font (size 1.27 1.27)) (justify left))
      )
      (property "Value" "C_0_1uF" (id 1) (at 0.635 -2.54 0)
        (effects (font (size 1.27 1.27)) (justify left) hide)
      )
      (property "Footprint" "Capacitor_SMD:C_0402_1005Metric" (id 2) (at 0.9652 -3.81 0)
        (effects (font (size 1.27 1.27)) hide)
      )
      (property "Datasheet" "~" (id 3) (at 0 0 0)
        (effects (font (size 1.27 1.27)) hide)
      )
      (property "DisplayValue" "0.1uF" (id 4) (at 3.81 -2.54 0)
        (effects (font (size 1.27 1.27)))
      )
      (property "PartSpecification" "3000-0000000125" (id 5) (at 0 0 0)
        (effects (font (size 1.27 1.27)) hide)
      )
      (property "Voltage" "100V" (id 6) (at 0 0 0)
        (effects (font (size 1.27 1.27)) hide)
      )
      (property "ki_keywords" "cap capacitor" (id 7) (at 0 0 0)
        (effects (font (size 1.27 1.27)) hide)
      )
      (property "ki_description" "Unpolarized capacitor" (id 8) (at 0 0 0)
        (effects (font (size 1.27 1.27)) hide)
      )
      (property "ki_fp_filters" "C_*" (id 9) (at 0 0 0)
        (effects (font (size 1.27 1.27)) hide)
      )
      (symbol "C_0_1uF_0_1"
        (polyline
          (pts
            (xy -2.032 -0.762)
            (xy 2.032 -0.762)
          )
          (stroke (width 0.508) (type default) (color 0 0 0 0))
          (fill (type none))
        )
        (polyline
          (pts
            (xy -2.032 0.762)
            (xy 2.032 0.762)
          )
          (stroke (width 0.508) (type default) (color 0 0 0 0))
          (fill (type none))
        )
      )
      (symbol "C_0_1uF_1_1"
        (pin passive line (at 0 3.81 270) (length 2.794)
          (name "~" (effects (font (size 1.27 1.27))))
          (number "1" (effects (font (size 1.27 1.27))))
        )
        (pin passive line (at 0 -3.81 90) (length 2.794)
          (name "~" (effects (font (size 1.27 1.27))))
          (number "2" (effects (font (size 1.27 1.27))))
        )
      )
    )
    (symbol "000_PreferredParts:C_100nF" (pin_numbers hide) (pin_names (offset 0.254)) (in_bom yes) (on_board yes)
      (property "Reference" "C" (id 0) (at 0.635 2.54 0)
        (effects (font (size 1.27 1.27)) (justify left))
      )
      (property "Value" "C_100nF" (id 1) (at 0.635 -2.54 0)
        (effects (font (size 1.27 1.27)) (justify left) hide)
      )
      (property "Footprint" "Capacitor_SMD:C_0402_1005Metric" (id 2) (at 0.9652 -3.81 0)
        (effects (font (size 1.27 1.27)) hide)
      )
      (property "Datasheet" "~" (id 3) (at 0 0 0)
        (effects (font (size 1.27 1.27)) hide)
      )
      (property "DisplayValue" "100nF" (id 4) (at 3.81 -2.54 0)
        (effects (font (size 1.27 1.27)))
      )
      (property "PartSpecification" "3000-0000000125" (id 5) (at 0 0 0)
        (effects (font (size 1.27 1.27)) hide)
      )
      (property "ki_keywords" "cap capacitor" (id 6) (at 0 0 0)
        (effects (font (size 1.27 1.27)) hide)
      )
      (property "ki_description" "Unpolarized capacitor" (id 7) (at 0 0 0)
        (effects (font (size 1.27 1.27)) hide)
      )
      (property "ki_fp_filters" "C_*" (id 8) (at 0 0 0)
        (effects (font (size 1.27 1.27)) hide)
      )
      (symbol "C_100nF_0_1"
        (polyline
          (pts
            (xy -2.032 -0.762)
            (xy 2.032 -0.762)
          )
          (stroke (width 0.508) (type default) (color 0 0 0 0))
          (fill (type none))
        )
        (polyline
          (pts
            (xy -2.032 0.762)
            (xy 2.032 0.762)
          )
          (stroke (width 0.508) (type default) (color 0 0 0 0))
          (fill (type none))
        )
      )
      (symbol "C_100nF_1_1"
        (pin passive line (at 0 3.81 270) (length 2.794)
          (name "~" (effects (font (size 1.27 1.27))))
          (number "1" (effects (font (size 1.27 1.27))))
        )
        (pin passive line (at 0 -3.81 90) (length 2.794)
          (name "~" (effects (font (size 1.27 1.27))))
          (number "2" (effects (font (size 1.27 1.27))))
        )
      )
    )
    (symbol "000_PreferredParts:C_10nF" (pin_numbers hide) (pin_names (offset 0.254)) (in_bom yes) (on_board yes)
      (property "Reference" "C" (id 0) (at 0.635 2.54 0)
        (effects (font (size 1.27 1.27)) (justify left))
      )
      (property "Value" "C_10nF" (id 1) (at 0.635 -2.54 0)
        (effects (font (size 1.27 1.27)) (justify left) hide)
      )
      (property "Footprint" "Capacitor_SMD:C_0402_1005Metric" (id 2) (at 0.9652 -3.81 0)
        (effects (font (size 1.27 1.27)) hide)
      )
      (property "Datasheet" "~" (id 3) (at 0 0 0)
        (effects (font (size 1.27 1.27)) hide)
      )
      (property "DisplayValue" "10nF" (id 4) (at 3.81 -2.54 0)
        (effects (font (size 1.27 1.27)))
      )
      (property "PartSpecification" "3000-0000000203" (id 5) (at 0 0 0)
        (effects (font (size 1.27 1.27)) hide)
      )
      (property "Voltage" "50V" (id 6) (at 0 0 0)
        (effects (font (size 1.27 1.27)) hide)
      )
      (property "ki_keywords" "cap capacitor" (id 7) (at 0 0 0)
        (effects (font (size 1.27 1.27)) hide)
      )
      (property "ki_description" "Unpolarized capacitor" (id 8) (at 0 0 0)
        (effects (font (size 1.27 1.27)) hide)
      )
      (property "ki_fp_filters" "C_*" (id 9) (at 0 0 0)
        (effects (font (size 1.27 1.27)) hide)
      )
      (symbol "C_10nF_0_1"
        (polyline
          (pts
            (xy -2.032 -0.762)
            (xy 2.032 -0.762)
          )
          (stroke (width 0.508) (type default) (color 0 0 0 0))
          (fill (type none))
        )
        (polyline
          (pts
            (xy -2.032 0.762)
            (xy 2.032 0.762)
          )
          (stroke (width 0.508) (type default) (color 0 0 0 0))
          (fill (type none))
        )
      )
      (symbol "C_10nF_1_1"
        (pin passive line (at 0 3.81 270) (length 2.794)
          (name "~" (effects (font (size 1.27 1.27))))
          (number "1" (effects (font (size 1.27 1.27))))
        )
        (pin passive line (at 0 -3.81 90) (length 2.794)
          (name "~" (effects (font (size 1.27 1.27))))
          (number "2" (effects (font (size 1.27 1.27))))
        )
      )
    )
    (symbol "000_PreferredParts:C_1nF" (pin_numbers hide) (pin_names (offset 0.254)) (in_bom yes) (on_board yes)
      (property "Reference" "C" (id 0) (at 0.635 2.54 0)
        (effects (font (size 1.27 1.27)) (justify left))
      )
      (property "Value" "C_1nF" (id 1) (at 0.635 -2.54 0)
        (effects (font (size 1.27 1.27)) (justify left))
      )
      (property "Footprint" "Capacitor_SMD:C_0402_1005Metric" (id 2) (at 0.9652 -3.81 0)
        (effects (font (size 1.27 1.27)) hide)
      )
      (property "Datasheet" "~" (id 3) (at 0 0 0)
        (effects (font (size 1.27 1.27)) hide)
      )
      (property "PartSpecification" "3000-0000000128" (id 4) (at 0 0 0)
        (effects (font (size 1.27 1.27)) hide)
      )
      (property "ki_keywords" "cap capacitor" (id 5) (at 0 0 0)
        (effects (font (size 1.27 1.27)) hide)
      )
      (property "ki_description" "Unpolarized capacitor" (id 6) (at 0 0 0)
        (effects (font (size 1.27 1.27)) hide)
      )
      (property "ki_fp_filters" "C_*" (id 7) (at 0 0 0)
        (effects (font (size 1.27 1.27)) hide)
      )
      (symbol "C_1nF_0_1"
        (polyline
          (pts
            (xy -2.032 -0.762)
            (xy 2.032 -0.762)
          )
          (stroke (width 0.508) (type default) (color 0 0 0 0))
          (fill (type none))
        )
        (polyline
          (pts
            (xy -2.032 0.762)
            (xy 2.032 0.762)
          )
          (stroke (width 0.508) (type default) (color 0 0 0 0))
          (fill (type none))
        )
      )
      (symbol "C_1nF_1_1"
        (pin passive line (at 0 3.81 270) (length 2.794)
          (name "~" (effects (font (size 1.27 1.27))))
          (number "1" (effects (font (size 1.27 1.27))))
        )
        (pin passive line (at 0 -3.81 90) (length 2.794)
          (name "~" (effects (font (size 1.27 1.27))))
          (number "2" (effects (font (size 1.27 1.27))))
        )
      )
    )
    (symbol "4xxx:4017" (pin_names (offset 1.016)) (in_bom yes) (on_board yes)
      (property "Reference" "U" (id 0) (at -7.62 16.51 0)
        (effects (font (size 1.27 1.27)))
      )
      (property "Value" "4017" (id 1) (at -7.62 -19.05 0)
        (effects (font (size 1.27 1.27)))
      )
      (property "Footprint" "" (id 2) (at 0 0 0)
        (effects (font (size 1.27 1.27)) hide)
      )
      (property "Datasheet" "http://www.intersil.com/content/dam/Intersil/documents/cd40/cd4017bms-22bms.pdf" (id 3) (at 0 0 0)
        (effects (font (size 1.27 1.27)) hide)
      )
      (property "ki_locked" "" (id 4) (at 0 0 0)
        (effects (font (size 1.27 1.27)))
      )
      (property "ki_keywords" "CNT CNT10" (id 5) (at 0 0 0)
        (effects (font (size 1.27 1.27)) hide)
      )
      (property "ki_description" "Johnson Counter ( 10 outputs )" (id 6) (at 0 0 0)
        (effects (font (size 1.27 1.27)) hide)
      )
      (property "ki_fp_filters" "DIP?16*" (id 7) (at 0 0 0)
        (effects (font (size 1.27 1.27)) hide)
      )
      (symbol "4017_1_0"
        (pin output line (at 12.7 0 180) (length 5.08)
          (name "Q5" (effects (font (size 1.27 1.27))))
          (number "1" (effects (font (size 1.27 1.27))))
        )
        (pin output line (at 12.7 2.54 180) (length 5.08)
          (name "Q4" (effects (font (size 1.27 1.27))))
          (number "10" (effects (font (size 1.27 1.27))))
        )
        (pin output line (at 12.7 -10.16 180) (length 5.08)
          (name "Q9" (effects (font (size 1.27 1.27))))
          (number "11" (effects (font (size 1.27 1.27))))
        )
        (pin output line (at 12.7 -15.24 180) (length 5.08)
          (name "Cout" (effects (font (size 1.27 1.27))))
          (number "12" (effects (font (size 1.27 1.27))))
        )
        (pin input inverted (at -12.7 10.16 0) (length 5.08)
          (name "CKEN" (effects (font (size 1.27 1.27))))
          (number "13" (effects (font (size 1.27 1.27))))
        )
        (pin input clock (at -12.7 12.7 0) (length 5.08)
          (name "CLK" (effects (font (size 1.27 1.27))))
          (number "14" (effects (font (size 1.27 1.27))))
        )
        (pin input line (at -12.7 5.08 0) (length 5.08)
          (name "Reset" (effects (font (size 1.27 1.27))))
          (number "15" (effects (font (size 1.27 1.27))))
        )
        (pin power_in line (at 0 20.32 270) (length 5.08)
          (name "VDD" (effects (font (size 1.27 1.27))))
          (number "16" (effects (font (size 1.27 1.27))))
        )
        (pin output line (at 12.7 10.16 180) (length 5.08)
          (name "Q1" (effects (font (size 1.27 1.27))))
          (number "2" (effects (font (size 1.27 1.27))))
        )
        (pin output line (at 12.7 12.7 180) (length 5.08)
          (name "Q0" (effects (font (size 1.27 1.27))))
          (number "3" (effects (font (size 1.27 1.27))))
        )
        (pin output line (at 12.7 7.62 180) (length 5.08)
          (name "Q2" (effects (font (size 1.27 1.27))))
          (number "4" (effects (font (size 1.27 1.27))))
        )
        (pin output line (at 12.7 -2.54 180) (length 5.08)
          (name "Q6" (effects (font (size 1.27 1.27))))
          (number "5" (effects (font (size 1.27 1.27))))
        )
        (pin output line (at 12.7 -5.08 180) (length 5.08)
          (name "Q7" (effects (font (size 1.27 1.27))))
          (number "6" (effects (font (size 1.27 1.27))))
        )
        (pin output line (at 12.7 5.08 180) (length 5.08)
          (name "Q3" (effects (font (size 1.27 1.27))))
          (number "7" (effects (font (size 1.27 1.27))))
        )
        (pin power_in line (at 0 -22.86 90) (length 5.08)
          (name "VSS" (effects (font (size 1.27 1.27))))
          (number "8" (effects (font (size 1.27 1.27))))
        )
        (pin output line (at 12.7 -7.62 180) (length 5.08)
          (name "Q8" (effects (font (size 1.27 1.27))))
          (number "9" (effects (font (size 1.27 1.27))))
        )
      )
      (symbol "4017_1_1"
        (rectangle (start -7.62 15.24) (end 7.62 -17.78)
          (stroke (width 0.254) (type default) (color 0 0 0 0))
          (fill (type background))
        )
      )
    )
    (symbol "Device:R" (pin_numbers hide) (pin_names (offset 0)) (in_bom yes) (on_board yes)
      (property "Reference" "R" (id 0) (at 2.032 0 90)
        (effects (font (size 1.27 1.27)))
      )
      (property "Value" "R" (id 1) (at 0 0 90)
        (effects (font (size 1.27 1.27)))
      )
      (property "Footprint" "" (id 2) (at -1.778 0 90)
        (effects (font (size 1.27 1.27)) hide)
      )
      (property "Datasheet" "~" (id 3) (at 0 0 0)
        (effects (font (size 1.27 1.27)) hide)
      )
      (property "ki_keywords" "R res resistor" (id 4) (at 0 0 0)
        (effects (font (size 1.27 1.27)) hide)
      )
      (property "ki_description" "Resistor" (id 5) (at 0 0 0)
        (effects (font (size 1.27 1.27)) hide)
      )
      (property "ki_fp_filters" "R_*" (id 6) (at 0 0 0)
        (effects (font (size 1.27 1.27)) hide)
      )
      (symbol "R_0_1"
        (rectangle (start -1.016 -2.54) (end 1.016 2.54)
          (stroke (width 0.254) (type default) (color 0 0 0 0))
          (fill (type none))
        )
      )
      (symbol "R_1_1"
        (pin passive line (at 0 3.81 270) (length 1.27)
          (name "~" (effects (font (size 1.27 1.27))))
          (number "1" (effects (font (size 1.27 1.27))))
        )
        (pin passive line (at 0 -3.81 90) (length 1.27)
          (name "~" (effects (font (size 1.27 1.27))))
          (number "2" (effects (font (size 1.27 1.27))))
        )
      )
    )
    (symbol "POWDER_Misc:CB3LV-3I-3M579545" (pin_names (offset 1.016)) (in_bom yes) (on_board yes)
      (property "Reference" "U" (id 0) (at 3.81 7.62 0)
        (effects (font (size 1.27 1.27)))
      )
      (property "Value" "CB3LV-3I-3M579545" (id 1) (at 11.43 -7.62 0)
        (effects (font (size 1.27 1.27)))
      )
      (property "Footprint" "" (id 2) (at 0 8.89 0)
        (effects (font (size 1.27 1.27)) hide)
      )
      (property "Datasheet" "" (id 3) (at 0 8.89 0)
        (effects (font (size 1.27 1.27)) hide)
      )
      (property "ki_description" "Crystal Oscillator 3.579545MHz HCMOS" (id 4) (at 0 0 0)
        (effects (font (size 1.27 1.27)) hide)
      )
      (symbol "CB3LV-3I-3M579545_0_1"
        (rectangle (start -6.35 6.35) (end 6.35 -6.35)
          (stroke (width 0) (type default) (color 0 0 0 0))
          (fill (type background))
        )
      )
      (symbol "CB3LV-3I-3M579545_1_1"
        (pin input line (at -8.89 0 0) (length 2.54)
          (name "EN" (effects (font (size 1.27 1.27))))
          (number "1" (effects (font (size 1.27 1.27))))
        )
        (pin power_in line (at 0 -8.89 90) (length 2.54)
          (name "GND" (effects (font (size 1.27 1.27))))
          (number "2" (effects (font (size 1.27 1.27))))
        )
        (pin output line (at 8.89 0 180) (length 2.54)
          (name "OUT" (effects (font (size 1.27 1.27))))
          (number "3" (effects (font (size 1.27 1.27))))
        )
        (pin power_in line (at 0 8.89 270) (length 2.54)
          (name "VCC" (effects (font (size 1.27 1.27))))
          (number "4" (effects (font (size 1.27 1.27))))
        )
      )
    )
    (symbol "POWDER_Power:TPS7A1633-Q1" (pin_names (offset 1.016)) (in_bom yes) (on_board yes)
      (property "Reference" "U" (id 0) (at 5.08 -11.43 0)
        (effects (font (size 1.27 1.27)))
      )
      (property "Value" "TPS7A1633-Q1" (id 1) (at 0 11.43 0)
        (effects (font (size 1.27 1.27)))
      )
      (property "Footprint" "POWDER_Power:DGN0008C" (id 2) (at 10.16 13.97 0)
        (effects (font (size 1.27 1.27)) hide)
      )
      (property "Datasheet" "" (id 3) (at 10.16 13.97 0)
        (effects (font (size 1.27 1.27)) hide)
      )
      (property "ki_description" "60-V, 5-μA IQ, 100-mA,Low-Dropout Voltage Regulator With Enable and Power-Good" (id 4) (at 0 0 0)
        (effects (font (size 1.27 1.27)) hide)
      )
      (symbol "TPS7A1633-Q1_0_1"
        (rectangle (start -7.62 10.16) (end 6.35 -10.16)
          (stroke (width 0) (type default) (color 0 0 0 0))
          (fill (type background))
        )
      )
      (symbol "TPS7A1633-Q1_1_1"
        (pin power_out line (at 8.89 7.62 180) (length 2.54)
          (name "OUT" (effects (font (size 1.27 1.27))))
          (number "1" (effects (font (size 1.27 1.27))))
        )
        (pin output line (at 8.89 -3.81 180) (length 2.54)
          (name "PG" (effects (font (size 1.27 1.27))))
          (number "3" (effects (font (size 1.27 1.27))))
        )
        (pin power_in line (at 1.27 -12.7 90) (length 2.54)
          (name "GND" (effects (font (size 1.27 1.27))))
          (number "4" (effects (font (size 1.27 1.27))))
        )
        (pin input line (at -10.16 -1.27 0) (length 2.54)
          (name "EN" (effects (font (size 1.27 1.27))))
          (number "5" (effects (font (size 1.27 1.27))))
        )
        (pin output line (at -10.16 -3.81 0) (length 2.54)
          (name "DELAY" (effects (font (size 1.27 1.27))))
          (number "7" (effects (font (size 1.27 1.27))))
        )
        (pin power_in line (at -10.16 7.62 0) (length 2.54)
          (name "IN" (effects (font (size 1.27 1.27))))
          (number "8" (effects (font (size 1.27 1.27))))
        )
        (pin power_in line (at -1.27 -12.7 90) (length 2.54)
          (name "GND" (effects (font (size 1.27 1.27))))
          (number "9" (effects (font (size 1.27 1.27))))
        )
      )
    )
    (symbol "power:GND" (power) (pin_names (offset 0)) (in_bom yes) (on_board yes)
      (property "Reference" "#PWR" (id 0) (at 0 -6.35 0)
        (effects (font (size 1.27 1.27)) hide)
      )
      (property "Value" "GND" (id 1) (at 0 -3.81 0)
        (effects (font (size 1.27 1.27)))
      )
      (property "Footprint" "" (id 2) (at 0 0 0)
        (effects (font (size 1.27 1.27)) hide)
      )
      (property "Datasheet" "" (id 3) (at 0 0 0)
        (effects (font (size 1.27 1.27)) hide)
      )
      (property "ki_keywords" "power-flag" (id 4) (at 0 0 0)
        (effects (font (size 1.27 1.27)) hide)
      )
      (property "ki_description" "Power symbol creates a global label with name \"GND\" , ground" (id 5) (at 0 0 0)
        (effects (font (size 1.27 1.27)) hide)
      )
      (symbol "GND_0_1"
        (polyline
          (pts
            (xy 0 0)
            (xy 0 -1.27)
            (xy 1.27 -1.27)
            (xy 0 -2.54)
            (xy -1.27 -1.27)
            (xy 0 -1.27)
          )
          (stroke (width 0) (type default) (color 0 0 0 0))
          (fill (type none))
        )
      )
      (symbol "GND_1_1"
        (pin power_in line (at 0 0 270) (length 0) hide
          (name "GND" (effects (font (size 1.27 1.27))))
          (number "1" (effects (font (size 1.27 1.27))))
        )
      )
    )
  )

  (junction (at 82.55 60.96) (diameter 0) (color 0 0 0 0)
    (uuid 0f26525d-6ebd-4ccb-9933-e7e978c818cb)
  )
  (junction (at 76.2 66.04) (diameter 0) (color 0 0 0 0)
    (uuid 6c4df89f-3e00-4225-bbc0-a2965aba83f3)
  )
  (junction (at 180.34 57.15) (diameter 0) (color 0 0 0 0)
    (uuid 75c7b8fa-09d0-4c8d-8186-d196cdbbf96e)
  )
  (junction (at 139.7 57.15) (diameter 0) (color 0 0 0 0)
    (uuid a728848e-b749-48b6-b6e4-17f79b9e1d95)
  )
  (junction (at 132.08 57.15) (diameter 0) (color 0 0 0 0)
    (uuid cf39a180-4fb4-4982-b456-855b51b11f8f)
  )
  (junction (at 92.71 60.96) (diameter 0) (color 0 0 0 0)
    (uuid d80132aa-8339-406b-b6a5-e49d1a134c53)
  )

  (no_connect (at 193.04 85.09) (uuid 694b6c59-664b-4970-918e-7b154b9d770f))
  (no_connect (at 193.04 87.63) (uuid 737daa71-2bad-45bd-a91c-b344b05e07b6))
  (no_connect (at 193.04 92.71) (uuid 83ea18c9-5827-4bb6-8849-94542e00a597))
  (no_connect (at 193.04 90.17) (uuid c9da105a-9c63-461b-ac3c-5a874def8862))
  (no_connect (at 193.04 97.79) (uuid ede3ec3c-0b56-4def-80e0-c47dd49379d3))

  (wire (pts (xy 43.18 77.47) (xy 48.26 77.47))
    (stroke (width 0) (type default) (color 0 0 0 0))
    (uuid 024d2e78-c84c-4d7d-9ccd-cb4154d9dc0c)
  )
  (wire (pts (xy 76.2 66.04) (xy 67.31 66.04))
    (stroke (width 0) (type default) (color 0 0 0 0))
    (uuid 07457542-5967-4614-ad30-a460b3a44e0a)
  )
  (wire (pts (xy 57.15 86.36) (xy 57.15 88.9))
    (stroke (width 0) (type default) (color 0 0 0 0))
    (uuid 0bf64ae5-66b3-42e0-9c87-9ef222791adf)
  )
  (wire (pts (xy 86.36 69.85) (xy 76.2 69.85))
    (stroke (width 0) (type default) (color 0 0 0 0))
    (uuid 0d3e0d13-c487-4580-9ecc-1a5885b01710)
  )
  (wire (pts (xy 139.7 78.74) (xy 139.7 57.15))
    (stroke (width 0) (type default) (color 0 0 0 0))
    (uuid 125932d2-3e57-40ae-b4af-a99117edf248)
  )
  (wire (pts (xy 180.34 57.15) (xy 180.34 62.23))
    (stroke (width 0) (type default) (color 0 0 0 0))
    (uuid 12c8f1aa-2a06-4c54-a531-87b46a0f5317)
  )
  (wire (pts (xy 82.55 60.96) (xy 76.2 60.96))
    (stroke (width 0) (type default) (color 0 0 0 0))
    (uuid 135ec428-13a3-48c2-842f-486df925e10d)
  )
  (wire (pts (xy 59.69 88.9) (xy 59.69 86.36))
    (stroke (width 0) (type default) (color 0 0 0 0))
    (uuid 136d1d26-5c82-4d42-ac70-e2ac8e36c964)
  )
  (wire (pts (xy 95.25 88.9) (xy 95.25 78.74))
    (stroke (width 0) (type default) (color 0 0 0 0))
    (uuid 1db37f20-c13a-45fc-b233-92b743501bfc)
  )
  (wire (pts (xy 132.08 57.15) (xy 139.7 57.15))
    (stroke (width 0) (type default) (color 0 0 0 0))
    (uuid 2c891672-be84-4a78-8485-4af04eec8eb4)
  )
  (wire (pts (xy 132.08 78.74) (xy 132.08 57.15))
    (stroke (width 0) (type default) (color 0 0 0 0))
    (uuid 3326c2ef-d3ff-4d38-af03-875fd6afeed9)
  )
  (wire (pts (xy 92.71 57.15) (xy 132.08 57.15))
    (stroke (width 0) (type default) (color 0 0 0 0))
    (uuid 33df6f97-2cd6-48d0-a855-a8760db6a273)
  )
  (wire (pts (xy 198.12 72.39) (xy 193.04 72.39))
    (stroke (width 0) (type default) (color 0 0 0 0))
    (uuid 364a3be9-5372-412b-ab5d-fc44d7008543)
  )
  (wire (pts (xy 139.7 57.15) (xy 180.34 57.15))
    (stroke (width 0) (type default) (color 0 0 0 0))
    (uuid 429cfdf9-da5c-4aef-ad0d-e6c0207440f4)
  )
  (wire (pts (xy 76.2 77.47) (xy 67.31 77.47))
    (stroke (width 0) (type default) (color 0 0 0 0))
    (uuid 4d2425ec-bbbf-4593-863c-ca595e28b3ce)
  )
  (wire (pts (xy 139.7 88.9) (xy 139.7 86.36))
    (stroke (width 0) (type default) (color 0 0 0 0))
    (uuid 5bca2c0c-edfe-4fd9-927e-d801c4441f4a)
  )
  (wire (pts (xy 43.18 78.74) (xy 43.18 77.47))
    (stroke (width 0) (type default) (color 0 0 0 0))
    (uuid 5bd1a150-e3d0-4390-a99d-ce14ddf2cb25)
  )
  (wire (pts (xy 193.04 69.85) (xy 198.12 69.85))
    (stroke (width 0) (type default) (color 0 0 0 0))
    (uuid 62a58b43-c2f1-4601-9a83-20c17ed89f46)
  )
  (wire (pts (xy 198.12 113.03) (xy 165.1 113.03))
    (stroke (width 0) (type default) (color 0 0 0 0))
    (uuid 7d05b4d4-4084-4f68-9571-b03dd29e320d)
  )
  (wire (pts (xy 165.1 77.47) (xy 165.1 113.03))
    (stroke (width 0) (type default) (color 0 0 0 0))
    (uuid 7d5c52ac-853f-4e25-ada3-56463b866293)
  )
  (wire (pts (xy 95.25 60.96) (xy 92.71 60.96))
    (stroke (width 0) (type default) (color 0 0 0 0))
    (uuid 885d0e67-f6f5-4bc1-91bd-f6943987e958)
  )
  (wire (pts (xy 43.18 88.9) (xy 43.18 86.36))
    (stroke (width 0) (type default) (color 0 0 0 0))
    (uuid 8d886e71-c7ee-4f6e-b223-d89c135a2da3)
  )
  (wire (pts (xy 193.04 80.01) (xy 198.12 80.01))
    (stroke (width 0) (type default) (color 0 0 0 0))
    (uuid 8e58dab5-c55f-4b99-a922-a8e2e5f99fd5)
  )
  (wire (pts (xy 38.1 66.04) (xy 48.26 66.04))
    (stroke (width 0) (type default) (color 0 0 0 0))
    (uuid a44f929d-b39c-43c3-97e3-b7b0fa226856)
  )
  (wire (pts (xy 180.34 57.15) (xy 190.5 57.15))
    (stroke (width 0) (type default) (color 0 0 0 0))
    (uuid a4c75147-a5ae-4e9c-975a-3d2349d16eb6)
  )
  (wire (pts (xy 92.71 60.96) (xy 82.55 60.96))
    (stroke (width 0) (type default) (color 0 0 0 0))
    (uuid ad725d25-c5ec-451a-876d-5632cca56794)
  )
  (wire (pts (xy 82.55 88.9) (xy 82.55 86.36))
    (stroke (width 0) (type default) (color 0 0 0 0))
    (uuid adf1083b-9845-4b71-8f35-33fa04e27778)
  )
  (wire (pts (xy 198.12 82.55) (xy 198.12 113.03))
    (stroke (width 0) (type default) (color 0 0 0 0))
    (uuid b566c713-45f9-4b0d-92b5-caf86be3234b)
  )
  (wire (pts (xy 193.04 82.55) (xy 198.12 82.55))
    (stroke (width 0) (type default) (color 0 0 0 0))
    (uuid ba27a781-0f77-4a17-8d33-6e783b62352f)
  )
  (wire (pts (xy 104.14 69.85) (xy 167.64 69.85))
    (stroke (width 0) (type default) (color 0 0 0 0))
    (uuid bc529be7-619a-47a0-8389-c4ddc2ce0e47)
  )
  (wire (pts (xy 160.02 80.01) (xy 160.02 81.28))
    (stroke (width 0) (type default) (color 0 0 0 0))
    (uuid c3376fbe-d02d-42a1-9ab7-c50f8410b5d3)
  )
  (wire (pts (xy 76.2 60.96) (xy 76.2 66.04))
    (stroke (width 0) (type default) (color 0 0 0 0))
    (uuid c9c9d9c8-eccb-4718-a3d1-f6cbb67368b6)
  )
  (wire (pts (xy 198.12 77.47) (xy 193.04 77.47))
    (stroke (width 0) (type default) (color 0 0 0 0))
    (uuid cd252f56-591b-4177-949f-27164861ba54)
  )
  (wire (pts (xy 160.02 72.39) (xy 167.64 72.39))
    (stroke (width 0) (type default) (color 0 0 0 0))
    (uuid ce58f3f4-c646-4764-af9a-96be957fdad5)
  )
  (wire (pts (xy 180.34 107.95) (xy 180.34 105.41))
    (stroke (width 0) (type default) (color 0 0 0 0))
    (uuid d506e20d-7e43-4f1f-9705-59ad94e7a418)
  )
  (wire (pts (xy 38.1 74.93) (xy 48.26 74.93))
    (stroke (width 0) (type default) (color 0 0 0 0))
    (uuid d63cea5a-3f39-48f7-bab4-b791e6598dc3)
  )
  (wire (pts (xy 76.2 69.85) (xy 76.2 66.04))
    (stroke (width 0) (type default) (color 0 0 0 0))
    (uuid dc595ca2-91a0-4e5d-8436-b6be4b3feb89)
  )
  (wire (pts (xy 132.08 88.9) (xy 132.08 86.36))
    (stroke (width 0) (type default) (color 0 0 0 0))
    (uuid e6082908-e30b-4631-a8d0-7ca3ea6ae98f)
  )
  (wire (pts (xy 82.55 78.74) (xy 82.55 60.96))
    (stroke (width 0) (type default) (color 0 0 0 0))
    (uuid e684cd3d-2a33-486a-a2f0-b83c21a43eff)
  )
  (wire (pts (xy 193.04 74.93) (xy 198.12 74.93))
    (stroke (width 0) (type default) (color 0 0 0 0))
    (uuid efcda8bf-7a9c-4fef-a7bf-21b17371bca4)
  )
  (wire (pts (xy 165.1 77.47) (xy 167.64 77.47))
    (stroke (width 0) (type default) (color 0 0 0 0))
    (uuid f02711a3-8355-4a1d-b9eb-970f774eddf4)
  )
  (wire (pts (xy 92.71 60.96) (xy 92.71 57.15))
    (stroke (width 0) (type default) (color 0 0 0 0))
    (uuid f1734c07-fc76-4eb5-98d5-9c33c7441628)
  )

  (label "v_3_3_osc" (at 78.74 60.96 0)
    (effects (font (size 1.27 1.27)) (justify left bottom))
    (uuid 3d8fdd87-e1a5-4633-b4d0-74136602df18)
  )
  (label "clk" (at 119.38 69.85 0)
    (effects (font (size 1.27 1.27)) (justify left bottom))
    (uuid 4a9a09ca-d9a1-4655-bf1c-0e02986c42e4)
  )
  (label "delay" (at 43.18 77.47 0)
    (effects (font (size 1.27 1.27)) (justify left bottom))
    (uuid 6e29863c-e3fe-4be9-956a-7fd647438bfb)
  )
  (label "reset" (at 165.1 96.52 90)
    (effects (font (size 1.27 1.27)) (justify left bottom))
    (uuid ce90471a-359c-4db3-b519-4b0eda516fc0)
  )
  (label "cken_b" (at 161.29 72.39 0)
    (effects (font (size 1.27 1.27)) (justify left bottom))
    (uuid f3b1bb5d-0bfa-41d3-b47a-75d13d2a2f70)
  )

  (hierarchical_label "v_in" (shape input) (at 38.1 66.04 180)
    (effects (font (size 1.27 1.27)) (justify right))
    (uuid 1a01d791-1116-48f3-8499-5799715ceb97)
  )
  (hierarchical_label "p1" (shape output) (at 198.12 69.85 0)
    (effects (font (size 1.27 1.27)) (justify left))
    (uuid 1b4bc390-50d0-4581-855c-3e3d718441d8)
  )
  (hierarchical_label "p4" (shape output) (at 198.12 77.47 0)
    (effects (font (size 1.27 1.27)) (justify left))
    (uuid 3e108055-c3c7-4b17-9767-275f47dcaa73)
  )
  (hierarchical_label "p2" (shape output) (at 198.12 72.39 0)
    (effects (font (size 1.27 1.27)) (justify left))
    (uuid 55684892-7e02-4ea4-88a6-b7d89b99cddc)
  )
  (hierarchical_label "p5" (shape output) (at 198.12 80.01 0)
    (effects (font (size 1.27 1.27)) (justify left))
    (uuid 79c4875d-0de4-4fcd-86c9-bd41a3387a8f)
  )
  (hierarchical_label "pg" (shape output) (at 76.2 77.47 0)
    (effects (font (size 1.27 1.27)) (justify left))
    (uuid 9336ef4a-482e-4662-98c5-01bef6c9535f)
  )
  (hierarchical_label "en" (shape input) (at 38.1 74.93 180)
    (effects (font (size 1.27 1.27)) (justify right))
    (uuid c79ced91-9b14-4c60-9372-5c159b35ff2f)
  )
  (hierarchical_label "v_3_3_pre" (shape output) (at 190.5 57.15 0)
    (effects (font (size 1.27 1.27)) (justify left))
    (uuid de470fe5-8a3f-4431-aae7-49ef3ed9cae5)
  )
  (hierarchical_label "p3" (shape output) (at 198.12 74.93 0)
    (effects (font (size 1.27 1.27)) (justify left))
    (uuid eeecfe51-82fe-49aa-a17e-13b5a7b97056)
  )

  (symbol (lib_id "POWDER_Power:TPS7A1633-Q1") (at 58.42 73.66 0) (unit 1)
    (in_bom yes) (on_board yes)
    (uuid 00000000-0000-0000-0000-00005e47e7f9)
    (property "Reference" "U301" (id 0) (at 63.5 85.09 0))
    (property "Value" "TPS7A1633-Q1" (id 1) (at 58.42 62.23 0))
    (property "Footprint" "POWDER_Power:DGN0008C" (id 2) (at 68.58 59.69 0)
      (effects (font (size 1.27 1.27)) hide)
    )
    (property "Datasheet" "" (id 3) (at 68.58 59.69 0)
      (effects (font (size 1.27 1.27)) hide)
    )
    (property "PartSpecification" "3000-0000000505" (id 4) (at 58.42 73.66 0)
      (effects (font (size 1.27 1.27)) hide)
    )
    (pin "1" (uuid 884a97d2-d083-4fb6-a1fa-ad6cc4a525b8))
    (pin "3" (uuid 6159cf88-c977-445a-845e-84688236e8f9))
    (pin "4" (uuid 957f06ca-7c84-44d6-9fb6-4371f9f292a3))
    (pin "5" (uuid 58ad08e3-3784-45a9-bdc1-334e26f9ef2d))
    (pin "7" (uuid 0dc2536c-5746-4ea7-8e95-a766c63f24be))
    (pin "8" (uuid 60c32160-bdb8-48ae-9e66-fc583b7abe6c))
    (pin "9" (uuid 7ae6a3dd-6401-4af0-bd67-c7d3bccd677c))
  )

  (symbol (lib_id "000_PreferredParts:C_100nF") (at 43.18 82.55 0) (unit 1)
    (in_bom yes) (on_board yes)
    (uuid 00000000-0000-0000-0000-00005e480ac3)
    (property "Reference" "C301" (id 0) (at 43.815 80.01 0)
      (effects (font (size 1.27 1.27)) (justify left))
    )
    (property "Value" "C_100nF" (id 1) (at 43.815 85.09 0)
      (effects (font (size 1.27 1.27)) (justify left) hide)
    )
    (property "Footprint" "Capacitor_SMD:C_0402_1005Metric" (id 2) (at 44.1452 86.36 0)
      (effects (font (size 1.27 1.27)) hide)
    )
    (property "Datasheet" "~" (id 3) (at 43.18 82.55 0)
      (effects (font (size 1.27 1.27)) hide)
    )
    (property "DisplayValue" "100nF" (id 4) (at 46.99 85.09 0))
    (property "PartSpecification" "3000-0000000125" (id 5) (at 43.18 82.55 0)
      (effects (font (size 1.27 1.27)) hide)
    )
    (pin "1" (uuid 4f17e4aa-9696-4eb5-8d6c-a31a18ae2df8))
    (pin "2" (uuid 51a4b9a8-827c-48d2-94cf-b25ecbdc375d))
  )

  (symbol (lib_id "power:GND") (at 43.18 88.9 0) (unit 1)
    (in_bom yes) (on_board yes)
    (uuid 00000000-0000-0000-0000-00005e481217)
    (property "Reference" "#PWR?" (id 0) (at 43.18 95.25 0)
      (effects (font (size 1.27 1.27)) hide)
    )
    (property "Value" "GND" (id 1) (at 43.18 92.71 0))
    (property "Footprint" "" (id 2) (at 43.18 88.9 0)
      (effects (font (size 1.27 1.27)) hide)
    )
    (property "Datasheet" "" (id 3) (at 43.18 88.9 0)
      (effects (font (size 1.27 1.27)) hide)
    )
    (pin "1" (uuid 7e70018d-388b-4594-b565-4234d9e6801f))
  )

  (symbol (lib_id "power:GND") (at 57.15 88.9 0) (unit 1)
    (in_bom yes) (on_board yes)
    (uuid 00000000-0000-0000-0000-00005e481db8)
    (property "Reference" "#PWR?" (id 0) (at 57.15 95.25 0)
      (effects (font (size 1.27 1.27)) hide)
    )
    (property "Value" "GND" (id 1) (at 57.15 92.71 0))
    (property "Footprint" "" (id 2) (at 57.15 88.9 0)
      (effects (font (size 1.27 1.27)) hide)
    )
    (property "Datasheet" "" (id 3) (at 57.15 88.9 0)
      (effects (font (size 1.27 1.27)) hide)
    )
    (pin "1" (uuid 1a6a15ac-57b3-4148-97bd-9a60a4fc98b3))
  )

  (symbol (lib_id "power:GND") (at 59.69 88.9 0) (unit 1)
    (in_bom yes) (on_board yes)
    (uuid 00000000-0000-0000-0000-00005e481ec5)
    (property "Reference" "#PWR?" (id 0) (at 59.69 95.25 0)
      (effects (font (size 1.27 1.27)) hide)
    )
    (property "Value" "GND" (id 1) (at 59.69 92.71 0))
    (property "Footprint" "" (id 2) (at 59.69 88.9 0)
      (effects (font (size 1.27 1.27)) hide)
    )
    (property "Datasheet" "" (id 3) (at 59.69 88.9 0)
      (effects (font (size 1.27 1.27)) hide)
    )
    (pin "1" (uuid 5cb16bbb-f11a-4121-8c91-b548e1b69ab0))
  )

  (symbol (lib_id "POWDER_Misc:CB3LV-3I-3M579545") (at 95.25 69.85 0) (unit 1)
    (in_bom yes) (on_board yes)
    (uuid 00000000-0000-0000-0000-00005e484498)
    (property "Reference" "U302" (id 0) (at 99.06 62.23 0))
    (property "Value" "SG-210STF 3.0000ML" (id 1) (at 106.68 77.47 0))
    (property "Footprint" "Crystal:Crystal_SMD_2520-4Pin_2.5x2.0mm" (id 2) (at 95.25 60.96 0)
      (effects (font (size 1.27 1.27)) hide)
    )
    (property "Datasheet" "" (id 3) (at 95.25 60.96 0)
      (effects (font (size 1.27 1.27)) hide)
    )
    (property "PartSpecification" "3000-0000000507" (id 4) (at 95.25 69.85 0)
      (effects (font (size 1.27 1.27)) hide)
    )
    (pin "1" (uuid 7ec242d9-61bd-4bb5-b77d-7198c47fa565))
    (pin "2" (uuid 058fea6d-9524-4fef-9620-0e97d0de024b))
    (pin "3" (uuid b2cb4a70-7177-42bd-8b7e-d8b7432205ad))
    (pin "4" (uuid f45dd172-5df9-4b34-81bd-4bc5befad55f))
  )

  (symbol (lib_id "power:GND") (at 95.25 88.9 0) (unit 1)
    (in_bom yes) (on_board yes)
    (uuid 00000000-0000-0000-0000-00005e484ca4)
    (property "Reference" "#PWR?" (id 0) (at 95.25 95.25 0)
      (effects (font (size 1.27 1.27)) hide)
    )
    (property "Value" "GND" (id 1) (at 95.25 92.71 0))
    (property "Footprint" "" (id 2) (at 95.25 88.9 0)
      (effects (font (size 1.27 1.27)) hide)
    )
    (property "Datasheet" "" (id 3) (at 95.25 88.9 0)
      (effects (font (size 1.27 1.27)) hide)
    )
    (pin "1" (uuid fb87014f-52f5-458c-bf5d-f4b18b9192b8))
  )

  (symbol (lib_id "4xxx:4017") (at 180.34 82.55 0) (unit 1)
    (in_bom yes) (on_board yes)
    (uuid 00000000-0000-0000-0000-00005e49bae9)
    (property "Reference" "U303" (id 0) (at 172.72 66.04 0))
    (property "Value" "4017" (id 1) (at 172.72 101.6 0))
    (property "Footprint" "Package_SO:TSSOP-16_4.4x5mm_P0.65mm" (id 2) (at 180.34 82.55 0)
      (effects (font (size 1.27 1.27)) hide)
    )
    (property "Datasheet" "http://www.intersil.com/content/dam/Intersil/documents/cd40/cd4017bms-22bms.pdf" (id 3) (at 180.34 82.55 0)
      (effects (font (size 1.27 1.27)) hide)
    )
    (property "PartNumber" "CD74HC4017-Q1" (id 4) (at 180.34 82.55 0)
      (effects (font (size 1.27 1.27)) hide)
    )
    (property "PartSpecification" "3000-0000000509" (id 5) (at 180.34 82.55 0)
      (effects (font (size 1.27 1.27)) hide)
    )
    (pin "1" (uuid 0c75251c-518b-4bb2-982c-f0283a66844e))
    (pin "10" (uuid adf146ef-0d53-46bb-98bd-faa01c48af74))
    (pin "11" (uuid 1dae51bd-bb52-4ff7-b7ac-31ced4f23107))
    (pin "12" (uuid 1a53e61f-2fa5-44bc-bf21-a3221948495d))
    (pin "13" (uuid 39b93b83-ff5d-46fe-8826-d1e0a840c4a8))
    (pin "14" (uuid 27f205c2-5f95-4280-9135-816840235c7b))
    (pin "15" (uuid a91e1f04-8051-48ee-8c64-1a9fcd253915))
    (pin "16" (uuid 5c3231d4-9b1b-4b89-9a77-0259ac65a919))
    (pin "2" (uuid e714c3ca-4f4f-46d8-8535-f83ed6a7e3f1))
    (pin "3" (uuid ad944895-6a81-45b9-91fd-a247355b8511))
    (pin "4" (uuid 5d45e43b-63d8-4e0f-894f-23984aa6538f))
    (pin "5" (uuid 46acd21d-3449-4a05-bc67-619d366649bf))
    (pin "6" (uuid 9a9c221b-f0c5-442f-891d-698dbf3c3884))
    (pin "7" (uuid 60946650-4d42-4d53-832a-3331b3337230))
    (pin "8" (uuid 911a72eb-0645-411e-a262-a65c32251c2a))
    (pin "9" (uuid d8993b3b-2817-431a-ad23-b0d0f00b8e4f))
  )

  (symbol (lib_id "power:GND") (at 160.02 81.28 0) (unit 1)
    (in_bom yes) (on_board yes)
    (uuid 00000000-0000-0000-0000-00005e49c674)
    (property "Reference" "#PWR?" (id 0) (at 160.02 87.63 0)
      (effects (font (size 1.27 1.27)) hide)
    )
    (property "Value" "GND" (id 1) (at 160.02 85.09 0))
    (property "Footprint" "" (id 2) (at 160.02 81.28 0)
      (effects (font (size 1.27 1.27)) hide)
    )
    (property "Datasheet" "" (id 3) (at 160.02 81.28 0)
      (effects (font (size 1.27 1.27)) hide)
    )
    (pin "1" (uuid 9060c4a2-10ea-4a5a-96d0-f7e5b3e94833))
  )

  (symbol (lib_id "Device:R") (at 160.02 76.2 0) (unit 1)
    (in_bom yes) (on_board yes)
    (uuid 00000000-0000-0000-0000-00005e4a0548)
    (property "Reference" "R301" (id 0) (at 162.052 76.2 90))
    (property "Value" "1k" (id 1) (at 160.02 76.2 90))
    (property "Footprint" "Resistor_SMD:R_0402_1005Metric" (id 2) (at 158.242 76.2 90)
      (effects (font (size 1.27 1.27)) hide)
    )
    (property "Datasheet" "~" (id 3) (at 160.02 76.2 0)
      (effects (font (size 1.27 1.27)) hide)
    )
    (property "PartSpecification" "3000-0000000156" (id 4) (at 160.02 76.2 0)
      (effects (font (size 1.27 1.27)) hide)
    )
    (pin "1" (uuid a0eec817-03c4-40b0-b31e-435c73f4c8b5))
    (pin "2" (uuid c3686042-0209-4023-a9e6-5408b9a0d4cf))
  )

  (symbol (lib_id "power:GND") (at 180.34 107.95 0) (unit 1)
    (in_bom yes) (on_board yes)
    (uuid 00000000-0000-0000-0000-00005e4a5d2a)
    (property "Reference" "#PWR?" (id 0) (at 180.34 114.3 0)
      (effects (font (size 1.27 1.27)) hide)
    )
    (property "Value" "GND" (id 1) (at 180.34 111.76 0))
    (property "Footprint" "" (id 2) (at 180.34 107.95 0)
      (effects (font (size 1.27 1.27)) hide)
    )
    (property "Datasheet" "" (id 3) (at 180.34 107.95 0)
      (effects (font (size 1.27 1.27)) hide)
    )
    (pin "1" (uuid f4bd5928-ea98-4386-beb8-2ef01b6ef1ee))
  )

  (symbol (lib_id "000_PreferredParts:C_0_1uF") (at 139.7 82.55 0) (unit 1)
    (in_bom yes) (on_board yes)
    (uuid 00000000-0000-0000-0000-00005e5ecf0b)
    (property "Reference" "C304" (id 0) (at 140.335 80.01 0)
      (effects (font (size 1.27 1.27)) (justify left))
    )
    (property "Value" "C_0_1uF" (id 1) (at 140.335 85.09 0)
      (effects (font (size 1.27 1.27)) (justify left) hide)
    )
    (property "Footprint" "Capacitor_SMD:C_0402_1005Metric" (id 2) (at 140.6652 86.36 0)
      (effects (font (size 1.27 1.27)) hide)
    )
    (property "Datasheet" "~" (id 3) (at 139.7 82.55 0)
      (effects (font (size 1.27 1.27)) hide)
    )
    (property "DisplayValue" "0.1uF" (id 4) (at 143.51 85.09 0))
    (property "PartSpecification" "3000-0000000125" (id 5) (at 139.7 82.55 0)
      (effects (font (size 1.27 1.27)) hide)
    )
    (property "Voltage" "100V" (id 6) (at 139.7 82.55 0)
      (effects (font (size 1.27 1.27)) hide)
    )
    (pin "1" (uuid 90b8b225-f822-4feb-a062-43fb3f64047f))
    (pin "2" (uuid b54d0eb9-36bf-409a-a938-b823df7b3b53))
  )

  (symbol (lib_id "power:GND") (at 139.7 88.9 0) (unit 1)
    (in_bom yes) (on_board yes)
    (uuid 00000000-0000-0000-0000-00005e5ed9bd)
    (property "Reference" "#PWR?" (id 0) (at 139.7 95.25 0)
      (effects (font (size 1.27 1.27)) hide)
    )
    (property "Value" "GND" (id 1) (at 139.7 92.71 0))
    (property "Footprint" "" (id 2) (at 139.7 88.9 0)
      (effects (font (size 1.27 1.27)) hide)
    )
    (property "Datasheet" "" (id 3) (at 139.7 88.9 0)
      (effects (font (size 1.27 1.27)) hide)
    )
    (pin "1" (uuid 5a6f8c53-5884-4f85-9ea4-642784d370e1))
  )

  (symbol (lib_id "000_PreferredParts:C_10nF") (at 82.55 82.55 0) (unit 1)
    (in_bom yes) (on_board yes)
    (uuid 00000000-0000-0000-0000-00005e5ee4e6)
    (property "Reference" "C302" (id 0) (at 83.185 80.01 0)
      (effects (font (size 1.27 1.27)) (justify left))
    )
    (property "Value" "C_10nF" (id 1) (at 83.185 85.09 0)
      (effects (font (size 1.27 1.27)) (justify left) hide)
    )
    (property "Footprint" "Capacitor_SMD:C_0402_1005Metric" (id 2) (at 83.5152 86.36 0)
      (effects (font (size 1.27 1.27)) hide)
    )
    (property "Datasheet" "~" (id 3) (at 82.55 82.55 0)
      (effects (font (size 1.27 1.27)) hide)
    )
    (property "DisplayValue" "10nF" (id 4) (at 86.36 85.09 0))
    (property "PartSpecification" "3000-0000000203" (id 5) (at 82.55 82.55 0)
      (effects (font (size 1.27 1.27)) hide)
    )
    (property "Voltage" "50V" (id 6) (at 82.55 82.55 0)
      (effects (font (size 1.27 1.27)) hide)
    )
    (pin "1" (uuid aef28ea9-74f4-45f8-9cab-55d1acd00382))
    (pin "2" (uuid 5f39df03-df94-45e2-a6e9-cbb6662889c2))
  )

  (symbol (lib_id "power:GND") (at 82.55 88.9 0) (unit 1)
    (in_bom yes) (on_board yes)
    (uuid 00000000-0000-0000-0000-00005e5ef101)
    (property "Reference" "#PWR?" (id 0) (at 82.55 95.25 0)
      (effects (font (size 1.27 1.27)) hide)
    )
    (property "Value" "GND" (id 1) (at 82.55 92.71 0))
    (property "Footprint" "" (id 2) (at 82.55 88.9 0)
      (effects (font (size 1.27 1.27)) hide)
    )
    (property "Datasheet" "" (id 3) (at 82.55 88.9 0)
      (effects (font (size 1.27 1.27)) hide)
    )
    (pin "1" (uuid 43b74bb2-cbec-4af1-a8e9-0aac580e5ab8))
  )

  (symbol (lib_id "000_PreferredParts:C_1nF") (at 132.08 82.55 0) (unit 1)
    (in_bom yes) (on_board yes)
    (uuid 00000000-0000-0000-0000-00005e5f15cf)
    (property "Reference" "C303" (id 0) (at 132.715 80.01 0)
      (effects (font (size 1.27 1.27)) (justify left))
    )
    (property "Value" "C_1nF" (id 1) (at 132.715 85.09 0)
      (effects (font (size 1.27 1.27)) (justify left))
    )
    (property "Footprint" "Capacitor_SMD:C_0402_1005Metric" (id 2) (at 133.0452 86.36 0)
      (effects (font (size 1.27 1.27)) hide)
    )
    (property "Datasheet" "~" (id 3) (at 132.08 82.55 0)
      (effects (font (size 1.27 1.27)) hide)
    )
    (property "PartSpecification" "3000-0000000128" (id 4) (at 132.08 82.55 0)
      (effects (font (size 1.27 1.27)) hide)
    )
    (pin "1" (uuid 61c2db50-b5fe-4fb9-88e9-b0aface46cc7))
    (pin "2" (uuid 5230273f-ddfd-4b14-961a-340cec3c0fce))
  )

  (symbol (lib_id "power:GND") (at 132.08 88.9 0) (unit 1)
    (in_bom yes) (on_board yes)
    (uuid 00000000-0000-0000-0000-00005e5f20bc)
    (property "Reference" "#PWR?" (id 0) (at 132.08 95.25 0)
      (effects (font (size 1.27 1.27)) hide)
    )
    (property "Value" "GND" (id 1) (at 132.08 92.71 0))
    (property "Footprint" "" (id 2) (at 132.08 88.9 0)
      (effects (font (size 1.27 1.27)) hide)
    )
    (property "Datasheet" "" (id 3) (at 132.08 88.9 0)
      (effects (font (size 1.27 1.27)) hide)
    )
    (pin "1" (uuid 2c3702ee-9103-4de9-830a-9f6a54e477c5))
  )
)
