EESchema Schematic File Version 4
LIBS:power_supply-cache
EELAYER 29 0
EELAYER END
$Descr A4 11693 8268
encoding utf-8
Sheet 5 5
Title ""
Date ""
Rev ""
Comp ""
Comment1 ""
Comment2 ""
Comment3 ""
Comment4 ""
$EndDescr
$Comp
L POWDER_Power:TPS54561-Q1 U?
U 1 1 5C6D9C4A
P 5400 3200
AR Path="/5C6D9C4A" Ref="U?"  Part="1" 
AR Path="/5C66EB2D/5C6D9C4A" Ref="U?"  Part="1" 
AR Path="/5C67E09D/5C6D9C4A" Ref="U?"  Part="1" 
AR Path="/5C6D92EC/5C6D9C4A" Ref="U503"  Part="1" 
F 0 "U503" H 5400 3815 50  0000 C CNN
F 1 "TPS54561-Q1" H 5400 3724 50  0000 C CNN
F 2 "POWDER_Power:TPS54561-Q1" H 5400 2500 50  0001 C CNN
F 3 "" H 5050 3700 50  0001 C CNN
F 4 "TPS54561QDPRTQ1" H 5400 3200 50  0001 C CNN "PartNumber"
F 5 "Texas Instruments" H 5400 3200 50  0001 C CNN "Manufacturer"
	1    5400 3200
	1    0    0    -1  
$EndComp
$Comp
L Device:C C?
U 1 1 5C6D9C51
P 4600 3900
AR Path="/5C6D9C51" Ref="C?"  Part="1" 
AR Path="/5C66EB2D/5C6D9C51" Ref="C?"  Part="1" 
AR Path="/5C67E09D/5C6D9C51" Ref="C?"  Part="1" 
AR Path="/5C6D92EC/5C6D9C51" Ref="C508"  Part="1" 
F 0 "C508" H 4715 3946 50  0000 L CNN
F 1 "47pF" H 4715 3855 50  0000 L CNN
F 2 "Capacitor_SMD:C_0402_1005Metric" H 4638 3750 50  0001 C CNN
F 3 "~" H 4600 3900 50  0001 C CNN
F 4 "KEMET" H 4600 3900 50  0001 C CNN "Manufacturer"
F 5 "C0402C470J3GACTU" H 4600 3900 50  0001 C CNN "PartNumber"
	1    4600 3900
	1    0    0    -1  
$EndComp
$Comp
L Device:C C?
U 1 1 5C6D9C58
P 4200 4150
AR Path="/5C6D9C58" Ref="C?"  Part="1" 
AR Path="/5C66EB2D/5C6D9C58" Ref="C?"  Part="1" 
AR Path="/5C67E09D/5C6D9C58" Ref="C?"  Part="1" 
AR Path="/5C6D92EC/5C6D9C58" Ref="C507"  Part="1" 
F 0 "C507" H 4315 4196 50  0000 L CNN
F 1 "15nF" H 4315 4105 50  0000 L CNN
F 2 "Capacitor_SMD:C_0402_1005Metric" H 4238 4000 50  0001 C CNN
F 3 "~" H 4200 4150 50  0001 C CNN
F 4 "CL05B153KO5NNNC" H 4200 4150 50  0001 C CNN "PartNumber"
F 5 "Samsung Electro-Mechanics" H 4200 4150 50  0001 C CNN "Manufacturer"
	1    4200 4150
	1    0    0    -1  
$EndComp
$Comp
L Device:R R?
U 1 1 5C6D9C5F
P 4200 3800
AR Path="/5C6D9C5F" Ref="R?"  Part="1" 
AR Path="/5C66EB2D/5C6D9C5F" Ref="R?"  Part="1" 
AR Path="/5C67E09D/5C6D9C5F" Ref="R?"  Part="1" 
AR Path="/5C6D92EC/5C6D9C5F" Ref="R506"  Part="1" 
F 0 "R506" H 4270 3846 50  0000 L CNN
F 1 "17.4k" H 4270 3755 50  0000 L CNN
F 2 "Resistor_SMD:R_0402_1005Metric" V 4130 3800 50  0001 C CNN
F 3 "~" H 4200 3800 50  0001 C CNN
F 4 "RMCF0402FT17K4" H 4200 3800 50  0001 C CNN "PartNumber"
F 5 "Stackpole Electronics Inc" H 4200 3800 50  0001 C CNN "Manufacturer"
	1    4200 3800
	1    0    0    -1  
$EndComp
Wire Wire Line
	4200 3650 4200 3550
Wire Wire Line
	4200 3550 4600 3550
Wire Wire Line
	4600 3750 4600 3550
Connection ~ 4600 3550
Wire Wire Line
	4600 3550 4900 3550
Wire Wire Line
	4200 3950 4200 4000
$Comp
L Device:C C?
U 1 1 5C6D9C6C
P 3800 3800
AR Path="/5C6D9C6C" Ref="C?"  Part="1" 
AR Path="/5C66EB2D/5C6D9C6C" Ref="C?"  Part="1" 
AR Path="/5C67E09D/5C6D9C6C" Ref="C?"  Part="1" 
AR Path="/5C6D92EC/5C6D9C6C" Ref="C506"  Part="1" 
F 0 "C506" H 3915 3846 50  0000 L CNN
F 1 "2.7nF" H 3915 3755 50  0000 L CNN
F 2 "Capacitor_SMD:C_0402_1005Metric" H 3838 3650 50  0001 C CNN
F 3 "~" H 3800 3800 50  0001 C CNN
F 4 "CL05B272KB5NNNC" H 3800 3800 50  0001 C CNN "PartNumber"
F 5 "Samsung Electro-Mechanics" H 3800 3800 50  0001 C CNN "Manufacturer"
	1    3800 3800
	1    0    0    -1  
$EndComp
Wire Wire Line
	3800 3650 3800 3350
Wire Wire Line
	3800 3350 4900 3350
$Comp
L Device:R R?
U 1 1 5C6D9C75
P 3350 3800
AR Path="/5C6D9C75" Ref="R?"  Part="1" 
AR Path="/5C66EB2D/5C6D9C75" Ref="R?"  Part="1" 
AR Path="/5C67E09D/5C6D9C75" Ref="R?"  Part="1" 
AR Path="/5C6D92EC/5C6D9C75" Ref="R505"  Part="1" 
F 0 "R505" H 3420 3846 50  0000 L CNN
F 1 "243k" H 3420 3755 50  0000 L CNN
F 2 "Resistor_SMD:R_0402_1005Metric" V 3280 3800 50  0001 C CNN
F 3 "~" H 3350 3800 50  0001 C CNN
F 4 "Stackpole Electronics Inc" H 3350 3800 50  0001 C CNN "Manufacturer"
F 5 "RMCF0402FT243K" H 3350 3800 50  0001 C CNN "PartNumber"
	1    3350 3800
	1    0    0    -1  
$EndComp
Wire Wire Line
	3350 3650 3350 3250
Wire Wire Line
	3350 3250 4900 3250
$Comp
L Device:R R?
U 1 1 5C6D9C7E
P 3050 2850
AR Path="/5C6D9C7E" Ref="R?"  Part="1" 
AR Path="/5C66EB2D/5C6D9C7E" Ref="R?"  Part="1" 
AR Path="/5C67E09D/5C6D9C7E" Ref="R?"  Part="1" 
AR Path="/5C6D92EC/5C6D9C7E" Ref="R503"  Part="1" 
F 0 "R503" H 3120 2896 50  0000 L CNN
F 1 "DNP" H 3120 2805 50  0000 L CNN
F 2 "Resistor_SMD:R_0402_1005Metric" V 2980 2850 50  0001 C CNN
F 3 "~" H 3050 2850 50  0001 C CNN
F 4 "A" H 3050 2850 50  0001 C CNN "Manufacturer"
F 5 "A" H 3050 2850 50  0001 C CNN "PartNumber"
	1    3050 2850
	1    0    0    -1  
$EndComp
$Comp
L Device:R R?
U 1 1 5C6D9C85
P 3050 3450
AR Path="/5C6D9C85" Ref="R?"  Part="1" 
AR Path="/5C66EB2D/5C6D9C85" Ref="R?"  Part="1" 
AR Path="/5C67E09D/5C6D9C85" Ref="R?"  Part="1" 
AR Path="/5C6D92EC/5C6D9C85" Ref="R504"  Part="1" 
F 0 "R504" H 3120 3496 50  0000 L CNN
F 1 "DNP" H 3120 3405 50  0000 L CNN
F 2 "Resistor_SMD:R_0402_1005Metric" V 2980 3450 50  0001 C CNN
F 3 "~" H 3050 3450 50  0001 C CNN
F 4 "A" H 3050 3450 50  0001 C CNN "PartNumber"
F 5 "A" H 3050 3450 50  0001 C CNN "Manufacturer"
	1    3050 3450
	1    0    0    -1  
$EndComp
Wire Wire Line
	3050 3300 3050 3050
Wire Wire Line
	4900 3050 3050 3050
Connection ~ 3050 3050
Wire Wire Line
	3050 3050 3050 3000
Wire Wire Line
	4900 2850 4350 2850
Wire Wire Line
	4350 2850 4350 2200
$Comp
L power:GND #PWR?
U 1 1 5C6D9C92
P 4600 4550
AR Path="/5C6D9C92" Ref="#PWR?"  Part="1" 
AR Path="/5C66EB2D/5C6D9C92" Ref="#PWR?"  Part="1" 
AR Path="/5C67E09D/5C6D9C92" Ref="#PWR?"  Part="1" 
AR Path="/5C6D92EC/5C6D9C92" Ref="#PWR?"  Part="1" 
F 0 "#PWR?" H 4600 4300 50  0001 C CNN
F 1 "GND" H 4605 4377 50  0000 C CNN
F 2 "" H 4600 4550 50  0001 C CNN
F 3 "" H 4600 4550 50  0001 C CNN
	1    4600 4550
	1    0    0    -1  
$EndComp
Wire Wire Line
	4600 4550 4600 4450
Wire Wire Line
	4200 4300 4200 4450
Wire Wire Line
	4200 4450 4600 4450
Connection ~ 4600 4450
Wire Wire Line
	4600 4450 4600 4050
Wire Wire Line
	3800 3950 3800 4450
Wire Wire Line
	3800 4450 4200 4450
Connection ~ 4200 4450
Wire Wire Line
	3350 3950 3350 4450
Wire Wire Line
	3350 4450 3800 4450
Connection ~ 3800 4450
Wire Wire Line
	3050 3600 3050 4450
Wire Wire Line
	3050 4450 3350 4450
Connection ~ 3350 4450
$Comp
L Device:C C?
U 1 1 5C6D9CA8
P 1050 2550
AR Path="/5C6D9CA8" Ref="C?"  Part="1" 
AR Path="/5C66EB2D/5C6D9CA8" Ref="C?"  Part="1" 
AR Path="/5C67E09D/5C6D9CA8" Ref="C?"  Part="1" 
AR Path="/5C6D92EC/5C6D9CA8" Ref="C502"  Part="1" 
F 0 "C502" H 1165 2596 50  0000 L CNN
F 1 "2.2uF" H 1165 2505 50  0000 L CNN
F 2 "Capacitor_SMD:C_1206_3216Metric" H 1088 2400 50  0001 C CNN
F 3 "~" H 1050 2550 50  0001 C CNN
F 4 "TDK" H 1050 2550 50  0001 C CNN "Manufacturer"
F 5 "CGA5L3X7S2A225M160AB" H 1050 2550 50  0001 C CNN "PartNumber"
	1    1050 2550
	1    0    0    -1  
$EndComp
Wire Wire Line
	2300 2200 2300 2400
Wire Wire Line
	2300 2700 2300 2950
Wire Wire Line
	2300 2950 1850 2950
Wire Wire Line
	1650 2950 1650 3050
Wire Wire Line
	1850 2950 1850 2700
Connection ~ 1850 2950
Wire Wire Line
	1850 2950 1650 2950
Wire Wire Line
	2300 2200 1850 2200
Wire Wire Line
	1850 2200 1850 2400
Connection ~ 2300 2200
Wire Wire Line
	1450 2400 1450 2200
Wire Wire Line
	1450 2200 1850 2200
Connection ~ 1850 2200
Wire Wire Line
	1050 2400 1050 2200
Wire Wire Line
	1050 2200 1450 2200
Connection ~ 1450 2200
Wire Wire Line
	1450 2700 1450 2950
Wire Wire Line
	1450 2950 1650 2950
Connection ~ 1650 2950
Wire Wire Line
	1050 2700 1050 2950
Wire Wire Line
	1050 2950 1450 2950
Connection ~ 1450 2950
$Comp
L power:GND #PWR?
U 1 1 5C6D9CC5
P 1650 3050
AR Path="/5C6D9CC5" Ref="#PWR?"  Part="1" 
AR Path="/5C66EB2D/5C6D9CC5" Ref="#PWR?"  Part="1" 
AR Path="/5C67E09D/5C6D9CC5" Ref="#PWR?"  Part="1" 
AR Path="/5C6D92EC/5C6D9CC5" Ref="#PWR?"  Part="1" 
F 0 "#PWR?" H 1650 2800 50  0001 C CNN
F 1 "GND" H 1655 2877 50  0000 C CNN
F 2 "" H 1650 3050 50  0001 C CNN
F 3 "" H 1650 3050 50  0001 C CNN
	1    1650 3050
	1    0    0    -1  
$EndComp
$Comp
L power:VDD #PWR?
U 1 1 5C6D9CCB
P 1450 1950
AR Path="/5C6D9CCB" Ref="#PWR?"  Part="1" 
AR Path="/5C66EB2D/5C6D9CCB" Ref="#PWR?"  Part="1" 
AR Path="/5C67E09D/5C6D9CCB" Ref="#PWR?"  Part="1" 
AR Path="/5C6D92EC/5C6D9CCB" Ref="#PWR?"  Part="1" 
F 0 "#PWR?" H 1450 1800 50  0001 C CNN
F 1 "VDD" H 1467 2123 50  0000 C CNN
F 2 "" H 1450 1950 50  0001 C CNN
F 3 "" H 1450 1950 50  0001 C CNN
	1    1450 1950
	1    0    0    -1  
$EndComp
Wire Wire Line
	1450 1950 1450 2200
$Comp
L Device:C C?
U 1 1 5C6D9CD4
P 1450 2550
AR Path="/5C6D9CD4" Ref="C?"  Part="1" 
AR Path="/5C66EB2D/5C6D9CD4" Ref="C?"  Part="1" 
AR Path="/5C67E09D/5C6D9CD4" Ref="C?"  Part="1" 
AR Path="/5C6D92EC/5C6D9CD4" Ref="C503"  Part="1" 
F 0 "C503" H 1565 2596 50  0000 L CNN
F 1 "2.2uF" H 1565 2505 50  0000 L CNN
F 2 "Capacitor_SMD:C_1206_3216Metric" H 1488 2400 50  0001 C CNN
F 3 "~" H 1450 2550 50  0001 C CNN
F 4 "TDK" H 1450 2550 50  0001 C CNN "Manufacturer"
F 5 "CGA5L3X7S2A225M160AB" H 1450 2550 50  0001 C CNN "PartNumber"
	1    1450 2550
	1    0    0    -1  
$EndComp
$Comp
L Device:C C?
U 1 1 5C6D9CDD
P 1850 2550
AR Path="/5C6D9CDD" Ref="C?"  Part="1" 
AR Path="/5C66EB2D/5C6D9CDD" Ref="C?"  Part="1" 
AR Path="/5C67E09D/5C6D9CDD" Ref="C?"  Part="1" 
AR Path="/5C6D92EC/5C6D9CDD" Ref="C504"  Part="1" 
F 0 "C504" H 1965 2596 50  0000 L CNN
F 1 "2.2uF" H 1965 2505 50  0000 L CNN
F 2 "Capacitor_SMD:C_1206_3216Metric" H 1888 2400 50  0001 C CNN
F 3 "~" H 1850 2550 50  0001 C CNN
F 4 "TDK" H 1850 2550 50  0001 C CNN "Manufacturer"
F 5 "CGA5L3X7S2A225M160AB" H 1850 2550 50  0001 C CNN "PartNumber"
	1    1850 2550
	1    0    0    -1  
$EndComp
$Comp
L Device:C C?
U 1 1 5C6D9CE6
P 2300 2550
AR Path="/5C6D9CE6" Ref="C?"  Part="1" 
AR Path="/5C66EB2D/5C6D9CE6" Ref="C?"  Part="1" 
AR Path="/5C67E09D/5C6D9CE6" Ref="C?"  Part="1" 
AR Path="/5C6D92EC/5C6D9CE6" Ref="C505"  Part="1" 
F 0 "C505" H 2415 2596 50  0000 L CNN
F 1 "2.2uF" H 2415 2505 50  0000 L CNN
F 2 "Capacitor_SMD:C_1206_3216Metric" H 2338 2400 50  0001 C CNN
F 3 "~" H 2300 2550 50  0001 C CNN
F 4 "TDK" H 2300 2550 50  0001 C CNN "Manufacturer"
F 5 "CGA5L3X7S2A225M160AB" H 2300 2550 50  0001 C CNN "PartNumber"
	1    2300 2550
	1    0    0    -1  
$EndComp
$Comp
L Device:C C?
U 1 1 5C6D9CED
P 6250 3050
AR Path="/5C6D9CED" Ref="C?"  Part="1" 
AR Path="/5C66EB2D/5C6D9CED" Ref="C?"  Part="1" 
AR Path="/5C67E09D/5C6D9CED" Ref="C?"  Part="1" 
AR Path="/5C6D92EC/5C6D9CED" Ref="C509"  Part="1" 
F 0 "C509" V 5998 3050 50  0000 C CNN
F 1 "0.1uF" V 6089 3050 50  0000 C CNN
F 2 "Capacitor_SMD:C_0402_1005Metric" H 6288 2900 50  0001 C CNN
F 3 "~" H 6250 3050 50  0001 C CNN
F 4 "CL05F104ZO5NNNC" V 6250 3050 50  0001 C CNN "PartNumber"
F 5 "Samsung Electro-Mechanics" V 6250 3050 50  0001 C CNN "Manufacturer"
	1    6250 3050
	0    1    1    0   
$EndComp
Wire Wire Line
	6100 3050 5900 3050
$Comp
L Device:R R?
U 1 1 5C6D9CF5
P 6100 2400
AR Path="/5C6D9CF5" Ref="R?"  Part="1" 
AR Path="/5C66EB2D/5C6D9CF5" Ref="R?"  Part="1" 
AR Path="/5C67E09D/5C6D9CF5" Ref="R?"  Part="1" 
AR Path="/5C6D92EC/5C6D9CF5" Ref="R507"  Part="1" 
F 0 "R507" H 6170 2446 50  0000 L CNN
F 1 "1k" H 6170 2355 50  0000 L CNN
F 2 "Resistor_SMD:R_0402_1005Metric" V 6030 2400 50  0001 C CNN
F 3 "~" H 6100 2400 50  0001 C CNN
F 4 "3000-0000000156" H 6100 2400 50  0001 C CNN "PartSpecification"
	1    6100 2400
	1    0    0    -1  
$EndComp
Wire Wire Line
	6100 2550 6100 2700
Wire Wire Line
	6100 2850 5900 2850
Wire Wire Line
	6100 2250 6100 2050
Wire Wire Line
	5900 3250 6650 3250
Wire Wire Line
	6650 3250 6650 3050
Wire Wire Line
	6650 3050 6400 3050
$Comp
L power:GND #PWR?
U 1 1 5C6D9D02
P 6100 3900
AR Path="/5C6D9D02" Ref="#PWR?"  Part="1" 
AR Path="/5C66EB2D/5C6D9D02" Ref="#PWR?"  Part="1" 
AR Path="/5C67E09D/5C6D9D02" Ref="#PWR?"  Part="1" 
AR Path="/5C6D92EC/5C6D9D02" Ref="#PWR?"  Part="1" 
F 0 "#PWR?" H 6100 3650 50  0001 C CNN
F 1 "GND" H 6105 3727 50  0000 C CNN
F 2 "" H 6100 3900 50  0001 C CNN
F 3 "" H 6100 3900 50  0001 C CNN
	1    6100 3900
	1    0    0    -1  
$EndComp
Wire Wire Line
	6100 3900 6100 3750
Wire Wire Line
	6100 3750 5900 3750
Wire Wire Line
	5900 3650 6100 3650
Wire Wire Line
	6100 3650 6100 3750
Connection ~ 6100 3750
$Comp
L Device:D_Schottky_AAK D?
U 1 1 5C6D9D0F
P 6950 3300
AR Path="/5C6D9D0F" Ref="D?"  Part="1" 
AR Path="/5C66EB2D/5C6D9D0F" Ref="D?"  Part="1" 
AR Path="/5C67E09D/5C6D9D0F" Ref="D?"  Part="1" 
AR Path="/5C6D92EC/5C6D9D0F" Ref="D501"  Part="1" 
F 0 "D501" V 6929 3441 50  0000 L CNN
F 1 "D_Schottky_AAK" V 7020 3441 50  0000 L CNN
F 2 "Package_TO_SOT_SMD:TO-277B" H 6950 3300 50  0001 C CNN
F 3 "~" H 6950 3300 50  0001 C CNN
F 4 "ON Semiconductor" V 6950 3300 50  0001 C CNN "Manufacturer"
F 5 "FSV8100V" V 6950 3300 50  0001 C CNN "PartNumber"
	1    6950 3300
	0    1    1    0   
$EndComp
$Comp
L power:GND #PWR?
U 1 1 5C6D9D16
P 6950 3700
AR Path="/5C6D9D16" Ref="#PWR?"  Part="1" 
AR Path="/5C66EB2D/5C6D9D16" Ref="#PWR?"  Part="1" 
AR Path="/5C67E09D/5C6D9D16" Ref="#PWR?"  Part="1" 
AR Path="/5C6D92EC/5C6D9D16" Ref="#PWR?"  Part="1" 
F 0 "#PWR?" H 6950 3450 50  0001 C CNN
F 1 "GND" H 6955 3527 50  0000 C CNN
F 2 "" H 6950 3700 50  0001 C CNN
F 3 "" H 6950 3700 50  0001 C CNN
	1    6950 3700
	1    0    0    -1  
$EndComp
Wire Wire Line
	6950 3700 6950 3600
Wire Wire Line
	6950 3600 7050 3600
Wire Wire Line
	7050 3600 7050 3500
Connection ~ 6950 3600
Wire Wire Line
	6950 3600 6950 3500
Wire Wire Line
	6950 3150 6950 3050
Wire Wire Line
	6950 3050 6650 3050
Connection ~ 6650 3050
$Comp
L Device:L L?
U 1 1 5C6D9D26
P 7300 3050
AR Path="/5C6D9D26" Ref="L?"  Part="1" 
AR Path="/5C66EB2D/5C6D9D26" Ref="L?"  Part="1" 
AR Path="/5C67E09D/5C6D9D26" Ref="L?"  Part="1" 
AR Path="/5C6D92EC/5C6D9D26" Ref="L501"  Part="1" 
F 0 "L501" V 7490 3050 50  0000 C CNN
F 1 "22uH" V 7399 3050 50  0000 C CNN
F 2 "Inductor_SMD:L_Bourns_SRP1245A" H 7300 3050 50  0001 C CNN
F 3 "~" H 7300 3050 50  0001 C CNN
F 4 "Bourns" V 7300 3050 50  0001 C CNN "Manufacturer"
F 5 "SRP1265A-220M" V 7300 3050 50  0001 C CNN "PartNumber"
	1    7300 3050
	0    -1   -1   0   
$EndComp
Wire Wire Line
	7150 3050 6950 3050
Connection ~ 6950 3050
$Comp
L Device:C C?
U 1 1 5C6D9D32
P 8100 3400
AR Path="/5C6D9D32" Ref="C?"  Part="1" 
AR Path="/5C66EB2D/5C6D9D32" Ref="C?"  Part="1" 
AR Path="/5C67E09D/5C6D9D32" Ref="C?"  Part="1" 
AR Path="/5C6D92EC/5C6D9D32" Ref="C510"  Part="1" 
F 0 "C510" H 8215 3446 50  0000 L CNN
F 1 "22uF" H 8215 3355 50  0000 L CNN
F 2 "Capacitor_SMD:C_0805_2012Metric" H 8138 3250 50  0001 C CNN
F 3 "~" H 8100 3400 50  0001 C CNN
F 4 "Murata" H 8100 3400 50  0001 C CNN "Manufacturer"
F 5 "GRM21BR61E226ME44K" H 8100 3400 50  0001 C CNN "PartNumber"
F 6 "2m" H 8100 3400 50  0001 C CNN "ESR"
	1    8100 3400
	1    0    0    -1  
$EndComp
$Comp
L Device:C C?
U 1 1 5C6D9D3B
P 600 2550
AR Path="/5C6D9D3B" Ref="C?"  Part="1" 
AR Path="/5C66EB2D/5C6D9D3B" Ref="C?"  Part="1" 
AR Path="/5C67E09D/5C6D9D3B" Ref="C?"  Part="1" 
AR Path="/5C6D92EC/5C6D9D3B" Ref="C501"  Part="1" 
F 0 "C501" H 715 2596 50  0000 L CNN
F 1 "2.2uF" H 715 2505 50  0000 L CNN
F 2 "Capacitor_SMD:C_1206_3216Metric" H 638 2400 50  0001 C CNN
F 3 "~" H 600 2550 50  0001 C CNN
F 4 "TDK" H 600 2550 50  0001 C CNN "Manufacturer"
F 5 "CGA5L3X7S2A225M160AB" H 600 2550 50  0001 C CNN "PartNumber"
	1    600  2550
	1    0    0    -1  
$EndComp
Wire Wire Line
	600  2700 600  2950
Wire Wire Line
	600  2950 1050 2950
Connection ~ 1050 2950
Wire Wire Line
	600  2400 600  2200
Wire Wire Line
	600  2200 1050 2200
Connection ~ 1050 2200
Wire Wire Line
	8100 3250 8100 3050
Wire Wire Line
	8100 3050 7650 3050
$Comp
L power:GND #PWR?
U 1 1 5C6D9D4A
P 8100 3700
AR Path="/5C6D9D4A" Ref="#PWR?"  Part="1" 
AR Path="/5C66EB2D/5C6D9D4A" Ref="#PWR?"  Part="1" 
AR Path="/5C67E09D/5C6D9D4A" Ref="#PWR?"  Part="1" 
AR Path="/5C6D92EC/5C6D9D4A" Ref="#PWR?"  Part="1" 
F 0 "#PWR?" H 8100 3450 50  0001 C CNN
F 1 "GND" H 8105 3527 50  0000 C CNN
F 2 "" H 8100 3700 50  0001 C CNN
F 3 "" H 8100 3700 50  0001 C CNN
	1    8100 3700
	1    0    0    -1  
$EndComp
$Comp
L power:GND #PWR?
U 1 1 5C6D9D50
P 8500 3700
AR Path="/5C6D9D50" Ref="#PWR?"  Part="1" 
AR Path="/5C66EB2D/5C6D9D50" Ref="#PWR?"  Part="1" 
AR Path="/5C67E09D/5C6D9D50" Ref="#PWR?"  Part="1" 
AR Path="/5C6D92EC/5C6D9D50" Ref="#PWR?"  Part="1" 
F 0 "#PWR?" H 8500 3450 50  0001 C CNN
F 1 "GND" H 8505 3527 50  0000 C CNN
F 2 "" H 8500 3700 50  0001 C CNN
F 3 "" H 8500 3700 50  0001 C CNN
	1    8500 3700
	1    0    0    -1  
$EndComp
$Comp
L power:GND #PWR?
U 1 1 5C6D9D56
P 8900 3700
AR Path="/5C6D9D56" Ref="#PWR?"  Part="1" 
AR Path="/5C66EB2D/5C6D9D56" Ref="#PWR?"  Part="1" 
AR Path="/5C67E09D/5C6D9D56" Ref="#PWR?"  Part="1" 
AR Path="/5C6D92EC/5C6D9D56" Ref="#PWR?"  Part="1" 
F 0 "#PWR?" H 8900 3450 50  0001 C CNN
F 1 "GND" H 8905 3527 50  0000 C CNN
F 2 "" H 8900 3700 50  0001 C CNN
F 3 "" H 8900 3700 50  0001 C CNN
	1    8900 3700
	1    0    0    -1  
$EndComp
Wire Wire Line
	8100 3700 8100 3550
Wire Wire Line
	8500 3550 8500 3700
Wire Wire Line
	8900 3700 8900 3550
Connection ~ 8100 3050
Wire Wire Line
	8500 3050 8500 3250
Connection ~ 8500 3050
Wire Wire Line
	8500 3050 8100 3050
Wire Wire Line
	8900 3050 8900 3250
Wire Wire Line
	8900 3050 8500 3050
Text Notes 8500 2900 0    50   ~ 0
C=30 uF
$Comp
L Device:R R?
U 1 1 5C6D9D66
P 7650 3350
AR Path="/5C6D9D66" Ref="R?"  Part="1" 
AR Path="/5C66EB2D/5C6D9D66" Ref="R?"  Part="1" 
AR Path="/5C67E09D/5C6D9D66" Ref="R?"  Part="1" 
AR Path="/5C6D92EC/5C6D9D66" Ref="R508"  Part="1" 
F 0 "R508" H 7720 3396 50  0000 L CNN
F 1 "140k" H 7720 3305 50  0000 L CNN
F 2 "Resistor_SMD:R_0402_1005Metric" V 7580 3350 50  0001 C CNN
F 3 "~" H 7650 3350 50  0001 C CNN
F 4 "RMCF0402FT140K" H 7650 3350 50  0001 C CNN "PartNumber"
F 5 "Stackpole Electronics Inc" H 7650 3350 50  0001 C CNN "Manufacturer"
	1    7650 3350
	1    0    0    -1  
$EndComp
Wire Wire Line
	7650 3200 7650 3050
Connection ~ 7650 3050
Wire Wire Line
	7650 3050 7450 3050
$Comp
L Device:R R?
U 1 1 5C6D9D70
P 7650 4200
AR Path="/5C6D9D70" Ref="R?"  Part="1" 
AR Path="/5C66EB2D/5C6D9D70" Ref="R?"  Part="1" 
AR Path="/5C67E09D/5C6D9D70" Ref="R?"  Part="1" 
AR Path="/5C6D92EC/5C6D9D70" Ref="R509"  Part="1" 
F 0 "R509" H 7720 4246 50  0000 L CNN
F 1 "10k" H 7720 4155 50  0000 L CNN
F 2 "Resistor_SMD:R_0402_1005Metric" V 7580 4200 50  0001 C CNN
F 3 "~" H 7650 4200 50  0001 C CNN
F 4 "Stackpole Electronics Inc" H 7650 4200 50  0001 C CNN "Manufacturer"
F 5 "RMCF0402FT10K0" H 7650 4200 50  0001 C CNN "PartNumber"
	1    7650 4200
	1    0    0    -1  
$EndComp
Wire Wire Line
	7650 4050 7650 3950
$Comp
L power:GND #PWR?
U 1 1 5C6D9D78
P 7650 4500
AR Path="/5C6D9D78" Ref="#PWR?"  Part="1" 
AR Path="/5C66EB2D/5C6D9D78" Ref="#PWR?"  Part="1" 
AR Path="/5C67E09D/5C6D9D78" Ref="#PWR?"  Part="1" 
AR Path="/5C6D92EC/5C6D9D78" Ref="#PWR?"  Part="1" 
F 0 "#PWR?" H 7650 4250 50  0001 C CNN
F 1 "GND" H 7655 4327 50  0000 C CNN
F 2 "" H 7650 4500 50  0001 C CNN
F 3 "" H 7650 4500 50  0001 C CNN
	1    7650 4500
	1    0    0    -1  
$EndComp
Wire Wire Line
	7650 4500 7650 4350
Wire Wire Line
	6350 3950 6350 3450
Wire Wire Line
	5900 3450 6350 3450
Connection ~ 7650 3950
Wire Wire Line
	7650 3950 7650 3500
$Comp
L Device:C C?
U 1 1 5C6D9D85
P 8500 3400
AR Path="/5C6D9D85" Ref="C?"  Part="1" 
AR Path="/5C66EB2D/5C6D9D85" Ref="C?"  Part="1" 
AR Path="/5C67E09D/5C6D9D85" Ref="C?"  Part="1" 
AR Path="/5C6D92EC/5C6D9D85" Ref="C511"  Part="1" 
F 0 "C511" H 8615 3446 50  0000 L CNN
F 1 "22uF" H 8615 3355 50  0000 L CNN
F 2 "Capacitor_SMD:C_0805_2012Metric" H 8538 3250 50  0001 C CNN
F 3 "~" H 8500 3400 50  0001 C CNN
F 4 "Murata" H 8500 3400 50  0001 C CNN "Manufacturer"
F 5 "GRM21BR61E226ME44K" H 8500 3400 50  0001 C CNN "PartNumber"
	1    8500 3400
	1    0    0    -1  
$EndComp
$Comp
L Device:C C?
U 1 1 5C6D9D8E
P 8900 3400
AR Path="/5C6D9D8E" Ref="C?"  Part="1" 
AR Path="/5C66EB2D/5C6D9D8E" Ref="C?"  Part="1" 
AR Path="/5C67E09D/5C6D9D8E" Ref="C?"  Part="1" 
AR Path="/5C6D92EC/5C6D9D8E" Ref="C512"  Part="1" 
F 0 "C512" H 9015 3446 50  0000 L CNN
F 1 "22uF" H 9015 3355 50  0000 L CNN
F 2 "Capacitor_SMD:C_0805_2012Metric" H 8938 3250 50  0001 C CNN
F 3 "~" H 8900 3400 50  0001 C CNN
F 4 "Murata" H 8900 3400 50  0001 C CNN "Manufacturer"
F 5 "GRM21BR61E226ME44K" H 8900 3400 50  0001 C CNN "PartNumber"
	1    8900 3400
	1    0    0    -1  
$EndComp
Text Notes 3800 1750 0    50   ~ 0
42V UVLO stop voltage\n45V start voltage
Text Label 3800 3050 0    50   ~ 0
EN_Control
Text Label 3950 3250 0    50   ~ 0
RT_Control
Text Label 4150 3350 0    50   ~ 0
SS_Control
Text Label 4350 3550 0    50   ~ 0
COMP_Control
Text Label 4200 4000 0    50   ~ 0
COMP_RC_Control
Text Label 7250 3950 0    50   ~ 0
FB_Control
Text Label 6550 3050 0    50   ~ 0
SW_Control
Text Label 6100 2700 0    50   ~ 0
PWRGD_Control
Text Label 6000 3050 0    50   ~ 0
BOOT_Control
Text Label 7950 3050 0    50   ~ 0
VOUT_Control
Text HLabel 6750 2700 2    100  Output ~ 0
PWRGD
Wire Wire Line
	6750 2700 6100 2700
Connection ~ 6100 2700
Wire Wire Line
	6100 2700 6100 2850
Wire Wire Line
	2300 2200 3050 2200
$Comp
L POWDER_Power:EL3H7-G U?
U 1 1 5C6D9DA5
P 2850 2450
AR Path="/5C67E09D/5C6D9DA5" Ref="U?"  Part="1" 
AR Path="/5C6D92EC/5C6D9DA5" Ref="U502"  Part="1" 
F 0 "U502" H 2850 2725 50  0000 C CNN
F 1 "DNP" H 2850 2634 50  0000 C CNN
F 2 "POWDER_Power:EL3H7-G" H 2850 2150 50  0001 C CNN
F 3 "" H 2850 2450 50  0001 C CNN
F 4 "Everlight Electronics Co Ltd" H 2850 2450 50  0001 C CNN "Manufacturer"
F 5 "EL3H7(B)(TA)-VG" H 2850 2450 50  0001 C CNN "PartNumber"
	1    2850 2450
	1    0    0    -1  
$EndComp
Wire Wire Line
	7650 3950 6350 3950
Wire Wire Line
	3050 2500 3050 2700
Wire Wire Line
	3050 2400 3050 2200
Connection ~ 3050 2200
Wire Wire Line
	3050 2200 4350 2200
$Comp
L Device:R R?
U 1 1 5C6D9DB1
P 2150 3350
AR Path="/5C6D9DB1" Ref="R?"  Part="1" 
AR Path="/5C66EB2D/5C6D9DB1" Ref="R?"  Part="1" 
AR Path="/5C67E09D/5C6D9DB1" Ref="R?"  Part="1" 
AR Path="/5C6D92EC/5C6D9DB1" Ref="R502"  Part="1" 
F 0 "R502" V 1943 3350 50  0000 C CNN
F 1 "DNP" V 2034 3350 50  0000 C CNN
F 2 "Resistor_SMD:R_0402_1005Metric" V 2080 3350 50  0001 C CNN
F 3 "~" H 2150 3350 50  0001 C CNN
F 4 "RMCF0402FT200R" V 2150 3350 50  0001 C CNN "PartNumber"
F 5 "Stackpole Electronics Inc" V 2150 3350 50  0001 C CNN "Manufacturer"
	1    2150 3350
	0    1    1    0   
$EndComp
Wire Wire Line
	2650 2400 2500 2400
Wire Wire Line
	2500 2400 2500 3350
Wire Wire Line
	2500 3350 2300 3350
Wire Wire Line
	2000 3350 1800 3350
$Comp
L power:GND #PWR?
U 1 1 5C6D9DBC
P 2650 3050
AR Path="/5C6D9DBC" Ref="#PWR?"  Part="1" 
AR Path="/5C66EB2D/5C6D9DBC" Ref="#PWR?"  Part="1" 
AR Path="/5C67E09D/5C6D9DBC" Ref="#PWR?"  Part="1" 
AR Path="/5C6D92EC/5C6D9DBC" Ref="#PWR?"  Part="1" 
F 0 "#PWR?" H 2650 2800 50  0001 C CNN
F 1 "GND" H 2655 2877 50  0000 C CNN
F 2 "" H 2650 3050 50  0001 C CNN
F 3 "" H 2650 3050 50  0001 C CNN
	1    2650 3050
	1    0    0    -1  
$EndComp
Wire Wire Line
	2650 3050 2650 2500
Text HLabel 1800 3350 0    100  Input ~ 0
START
$Comp
L POWDER_Power:EL3H7-G U?
U 1 1 5C6D9DC4
P 2350 3900
AR Path="/5C67E09D/5C6D9DC4" Ref="U?"  Part="1" 
AR Path="/5C6D92EC/5C6D9DC4" Ref="U501"  Part="1" 
F 0 "U501" H 2350 4175 50  0000 C CNN
F 1 "EL3H7-G" H 2350 4084 50  0000 C CNN
F 2 "POWDER_Power:EL3H7-G" H 2350 3600 50  0001 C CNN
F 3 "" H 2350 3900 50  0001 C CNN
F 4 "EL3H7(B)(TA)-VG" H 2350 3900 50  0001 C CNN "PartNumber"
F 5 "Everlight Electronics Co Ltd" H 2350 3900 50  0001 C CNN "Manufacturer"
	1    2350 3900
	1    0    0    -1  
$EndComp
Wire Wire Line
	2550 3850 2900 3850
Wire Wire Line
	2900 3850 2900 3050
Wire Wire Line
	2900 3050 3050 3050
Wire Wire Line
	2550 3950 2900 3950
Wire Wire Line
	2900 3950 2900 4450
Wire Wire Line
	2900 4450 3050 4450
Connection ~ 3050 4450
$Comp
L Device:R R?
U 1 1 5C6D9DD2
P 1850 3850
AR Path="/5C6D9DD2" Ref="R?"  Part="1" 
AR Path="/5C66EB2D/5C6D9DD2" Ref="R?"  Part="1" 
AR Path="/5C67E09D/5C6D9DD2" Ref="R?"  Part="1" 
AR Path="/5C6D92EC/5C6D9DD2" Ref="R501"  Part="1" 
F 0 "R501" V 1643 3850 50  0000 C CNN
F 1 "2.0k" V 1734 3850 50  0000 C CNN
F 2 "Resistor_SMD:R_0402_1005Metric" V 1780 3850 50  0001 C CNN
F 3 "~" H 1850 3850 50  0001 C CNN
F 4 "RMCF0402FT2K00" V 1850 3850 50  0001 C CNN "PartNumber"
F 5 "Stackpole Electronics Inc" V 1850 3850 50  0001 C CNN "Manurfacturer"
	1    1850 3850
	0    1    1    0   
$EndComp
$Comp
L power:GND #PWR?
U 1 1 5C6D9DD9
P 2000 4550
AR Path="/5C6D9DD9" Ref="#PWR?"  Part="1" 
AR Path="/5C66EB2D/5C6D9DD9" Ref="#PWR?"  Part="1" 
AR Path="/5C67E09D/5C6D9DD9" Ref="#PWR?"  Part="1" 
AR Path="/5C6D92EC/5C6D9DD9" Ref="#PWR?"  Part="1" 
F 0 "#PWR?" H 2000 4300 50  0001 C CNN
F 1 "GND" H 2005 4377 50  0000 C CNN
F 2 "" H 2000 4550 50  0001 C CNN
F 3 "" H 2000 4550 50  0001 C CNN
	1    2000 4550
	1    0    0    -1  
$EndComp
Wire Wire Line
	2000 4550 2000 3950
Wire Wire Line
	2000 3950 2150 3950
Wire Wire Line
	2000 3850 2150 3850
Wire Wire Line
	1700 3850 1550 3850
Text HLabel 1550 3850 0    100  Input ~ 0
DISABLE
$Comp
L power:+5V #PWR?
U 1 1 5C6D9DE4
P 6100 2050
AR Path="/5C67E09D/5C6D9DE4" Ref="#PWR?"  Part="1" 
AR Path="/5C6D92EC/5C6D9DE4" Ref="#PWR?"  Part="1" 
F 0 "#PWR?" H 6100 1900 50  0001 C CNN
F 1 "+5V" H 6115 2223 50  0000 C CNN
F 2 "" H 6100 2050 50  0001 C CNN
F 3 "" H 6100 2050 50  0001 C CNN
	1    6100 2050
	1    0    0    -1  
$EndComp
$Comp
L power:GND #PWR?
U 1 1 5C6D9DEA
P 9350 3700
AR Path="/5C6D9DEA" Ref="#PWR?"  Part="1" 
AR Path="/5C66EB2D/5C6D9DEA" Ref="#PWR?"  Part="1" 
AR Path="/5C67E09D/5C6D9DEA" Ref="#PWR?"  Part="1" 
AR Path="/5C6D92EC/5C6D9DEA" Ref="#PWR?"  Part="1" 
F 0 "#PWR?" H 9350 3450 50  0001 C CNN
F 1 "GND" H 9355 3527 50  0000 C CNN
F 2 "" H 9350 3700 50  0001 C CNN
F 3 "" H 9350 3700 50  0001 C CNN
	1    9350 3700
	1    0    0    -1  
$EndComp
Wire Wire Line
	9350 3550 9350 3700
Wire Wire Line
	9350 3250 9350 3050
Wire Wire Line
	9350 3050 8900 3050
$Comp
L power:GND #PWR?
U 1 1 5C6D9DF3
P 9850 3700
AR Path="/5C6D9DF3" Ref="#PWR?"  Part="1" 
AR Path="/5C66EB2D/5C6D9DF3" Ref="#PWR?"  Part="1" 
AR Path="/5C67E09D/5C6D9DF3" Ref="#PWR?"  Part="1" 
AR Path="/5C6D92EC/5C6D9DF3" Ref="#PWR?"  Part="1" 
F 0 "#PWR?" H 9850 3450 50  0001 C CNN
F 1 "GND" H 9855 3527 50  0000 C CNN
F 2 "" H 9850 3700 50  0001 C CNN
F 3 "" H 9850 3700 50  0001 C CNN
	1    9850 3700
	1    0    0    -1  
$EndComp
$Comp
L Connector:Screw_Terminal_01x02 J?
U 1 1 5C6D9DF9
P 10600 3050
AR Path="/5C6D9DF9" Ref="J?"  Part="1" 
AR Path="/5C66EB2D/5C6D9DF9" Ref="J?"  Part="1" 
AR Path="/5C67E09D/5C6D9DF9" Ref="J?"  Part="1" 
AR Path="/5C6D92EC/5C6D9DF9" Ref="J501"  Part="1" 
F 0 "J501" H 10680 3042 50  0000 L CNN
F 1 "Screw_Terminal_01x02" H 10680 2951 50  0000 L CNN
F 2 "TerminalBlock:TerminalBlock_bornier-2_P5.08mm" H 10600 3050 50  0001 C CNN
F 3 "~" H 10600 3050 50  0001 C CNN
F 4 "Molex" H 10600 3050 50  0001 C CNN "Manufacturer"
F 5 "0398800302" H 10600 3050 50  0001 C CNN "PartNumber"
	1    10600 3050
	1    0    0    -1  
$EndComp
Wire Wire Line
	9850 3150 9850 3700
$Comp
L Device:C C?
U 1 1 5C6D9E04
P 9350 3400
AR Path="/5C6D9E04" Ref="C?"  Part="1" 
AR Path="/5C66EB2D/5C6D9E04" Ref="C?"  Part="1" 
AR Path="/5C67E09D/5C6D9E04" Ref="C?"  Part="1" 
AR Path="/5C6D92EC/5C6D9E04" Ref="C513"  Part="1" 
F 0 "C513" H 9465 3446 50  0000 L CNN
F 1 "22uF" H 9465 3355 50  0000 L CNN
F 2 "Capacitor_SMD:C_0805_2012Metric" H 9388 3250 50  0001 C CNN
F 3 "~" H 9350 3400 50  0001 C CNN
F 4 "Murata" H 9350 3400 50  0001 C CNN "Manufacturer"
F 5 "GRM21BR61E226ME44K" H 9350 3400 50  0001 C CNN "PartNumber"
	1    9350 3400
	1    0    0    -1  
$EndComp
$Comp
L Device:R R?
U 1 1 5C6D9E0B
P 9650 3050
AR Path="/5C6D9E0B" Ref="R?"  Part="1" 
AR Path="/5C66EB2D/5C6D9E0B" Ref="R?"  Part="1" 
AR Path="/5C67E09D/5C6D9E0B" Ref="R?"  Part="1" 
AR Path="/5C6D92EC/5C6D9E0B" Ref="R510"  Part="1" 
F 0 "R510" V 9443 3050 50  0000 C CNN
F 1 "5m" V 9534 3050 50  0000 C CNN
F 2 "Resistor_SMD:R_0612_1632Metric" V 9580 3050 50  0001 C CNN
F 3 "~" H 9650 3050 50  0001 C CNN
F 4 "FCSL32R005FER" V 9650 3050 50  0001 C CNN "PartNumber"
F 5 "Ohmite" V 9650 3050 50  0001 C CNN "Manufacturer"
	1    9650 3050
	0    1    1    0   
$EndComp
Wire Wire Line
	9500 3050 9350 3050
Connection ~ 9350 3050
Wire Wire Line
	9800 3050 9900 3050
Text HLabel 10000 2650 2    100  Output ~ 0
RSM
Text HLabel 10000 2500 2    100  Output ~ 0
RSP
Wire Wire Line
	10000 2650 9900 2650
Wire Wire Line
	9900 2650 9900 3050
Connection ~ 9900 3050
Wire Wire Line
	9900 3050 9950 3050
Wire Wire Line
	10000 2500 9350 2500
Wire Wire Line
	9350 2500 9350 3050
Connection ~ 8900 3050
$Comp
L Device:Fuse F501
U 1 1 5C937510
P 10100 3050
F 0 "F501" V 9903 3050 50  0000 C CNN
F 1 "Fuse" V 9994 3050 50  0000 C CNN
F 2 "Fuse:Fuseholder_Cylinder-5x20mm_Stelvio-Kontek_PTF78_Horizontal_Open" V 10030 3050 50  0001 C CNN
F 3 "~" H 10100 3050 50  0001 C CNN
	1    10100 3050
	0    1    1    0   
$EndComp
Wire Wire Line
	10250 3050 10400 3050
Wire Wire Line
	9850 3150 10400 3150
Text Label 10350 3050 1    50   ~ 0
IRIS_OUT
$EndSCHEMATC
