EESchema Schematic File Version 4
LIBS:fdd_frontend_ue-cache
EELAYER 30 0
EELAYER END
$Descr A4 11693 8268
encoding utf-8
Sheet 4 7
Title ""
Date ""
Rev ""
Comp ""
Comment1 ""
Comment2 ""
Comment3 ""
Comment4 ""
$EndDescr
$Comp
L POWDER_Power:TPS63070RNM U?
U 1 1 5D56AE7E
P 5500 3750
AR Path="/5D562501/5D56AE7E" Ref="U?"  Part="1" 
AR Path="/5D587C46/5D56AE7E" Ref="U?"  Part="1" 
AR Path="/5D591ABD/5D56AE7E" Ref="U401"  Part="1" 
F 0 "U401" H 5850 4350 60  0000 C CNN
F 1 "TPS63070RNM" H 5500 3950 60  0000 C CNN
F 2 "POWDER_Power:TPS63070RNMR" H 5500 3690 60  0001 C CNN
F 3 "" H 5500 3750 60  0000 C CNN
F 4 "Texas Instruments" H 5500 3750 50  0001 C CNN "Manufacturer"
F 5 "TPS63070RNMR" H 5500 3750 50  0001 C CNN "PartNumber"
	1    5500 3750
	1    0    0    -1  
$EndComp
Text HLabel 6200 4050 2    50   Output ~ 0
PG
Wire Wire Line
	6200 4050 6100 4050
Wire Wire Line
	4600 4150 4900 4150
$Comp
L power:GND #PWR?
U 1 1 5D67CCCB
P 5400 4600
AR Path="/5D562501/5D67CCCB" Ref="#PWR?"  Part="1" 
AR Path="/5D587C46/5D67CCCB" Ref="#PWR?"  Part="1" 
AR Path="/5D591ABD/5D67CCCB" Ref="#PWR?"  Part="1" 
F 0 "#PWR?" H 5400 4350 50  0001 C CNN
F 1 "GND" H 5405 4427 50  0000 C CNN
F 2 "" H 5400 4600 50  0001 C CNN
F 3 "" H 5400 4600 50  0001 C CNN
	1    5400 4600
	1    0    0    -1  
$EndComp
$Comp
L power:GND #PWR?
U 1 1 5D67CCCC
P 5600 4600
AR Path="/5D562501/5D67CCCC" Ref="#PWR?"  Part="1" 
AR Path="/5D587C46/5D67CCCC" Ref="#PWR?"  Part="1" 
AR Path="/5D591ABD/5D67CCCC" Ref="#PWR?"  Part="1" 
F 0 "#PWR?" H 5600 4350 50  0001 C CNN
F 1 "GND" H 5605 4427 50  0000 C CNN
F 2 "" H 5600 4600 50  0001 C CNN
F 3 "" H 5600 4600 50  0001 C CNN
	1    5600 4600
	1    0    0    -1  
$EndComp
Wire Wire Line
	5600 4600 5600 4450
Wire Wire Line
	5400 4450 5400 4600
$Comp
L 000_PreferredParts:C_100nF C?
U 1 1 5D67CCCD
P 3800 4000
AR Path="/5D562501/5D67CCCD" Ref="C?"  Part="1" 
AR Path="/5D587C46/5D67CCCD" Ref="C?"  Part="1" 
AR Path="/5D591ABD/5D67CCCD" Ref="C404"  Part="1" 
F 0 "C404" H 3915 4046 50  0000 L CNN
F 1 "C_100nF" H 3825 3900 50  0001 L CNN
F 2 "Capacitor_SMD:C_0402_1005Metric" H 3838 3850 50  0001 C CNN
F 3 "~" H 3800 4000 50  0001 C CNN
F 4 "100nF" H 3950 3900 50  0000 C CNN "DisplayValue"
F 5 "Murata Electronics" H 3800 4000 50  0001 C CNN "Manufacturer"
F 6 "GRM155R62A104KE14D" H 3800 4000 50  0001 C CNN "PartNumber"
	1    3800 4000
	1    0    0    -1  
$EndComp
Wire Wire Line
	3800 3850 3800 3700
$Comp
L power:GND #PWR?
U 1 1 5D67CCCE
P 3800 4300
AR Path="/5D562501/5D67CCCE" Ref="#PWR?"  Part="1" 
AR Path="/5D587C46/5D67CCCE" Ref="#PWR?"  Part="1" 
AR Path="/5D591ABD/5D67CCCE" Ref="#PWR?"  Part="1" 
F 0 "#PWR?" H 3800 4050 50  0001 C CNN
F 1 "GND" H 3805 4127 50  0000 C CNN
F 2 "" H 3800 4300 50  0001 C CNN
F 3 "" H 3800 4300 50  0001 C CNN
	1    3800 4300
	1    0    0    -1  
$EndComp
Wire Wire Line
	3800 4300 3800 4150
$Comp
L 000_PreferredParts:C_10uF_0603 C?
U 1 1 5D56CB56
P 3400 3800
AR Path="/5D562501/5D56CB56" Ref="C?"  Part="1" 
AR Path="/5D587C46/5D56CB56" Ref="C?"  Part="1" 
AR Path="/5D591ABD/5D56CB56" Ref="C403"  Part="1" 
F 0 "C403" H 3515 3846 50  0000 L CNN
F 1 "C_10uF_0603" H 3425 3700 50  0001 L CNN
F 2 "Capacitor_SMD:C_0603_1608Metric" H 3438 3650 50  0001 C CNN
F 3 "~" H 3400 3800 50  0001 C CNN
F 4 "0603" H 3550 3600 50  0000 C CNN "DisplayFootprint"
F 5 "10uF" H 3550 3700 50  0000 C CNN "DisplayValue"
F 6 "Murata Electronics" H 3400 3800 50  0001 C CNN "Manufacturer"
F 7 "GRM188R6YA106MA73D" H 3400 3800 50  0001 C CNN "PartNumber"
	1    3400 3800
	1    0    0    -1  
$EndComp
$Comp
L 000_PreferredParts:C_10uF_0805 C?
U 1 1 5D67CCD0
P 2950 3800
AR Path="/5D562501/5D67CCD0" Ref="C?"  Part="1" 
AR Path="/5D587C46/5D67CCD0" Ref="C?"  Part="1" 
AR Path="/5D591ABD/5D67CCD0" Ref="C402"  Part="1" 
F 0 "C402" H 3065 3846 50  0000 L CNN
F 1 "C_10uF_0805" H 2975 3700 50  0001 L CNN
F 2 "Capacitor_SMD:C_0805_2012Metric" H 2988 3650 50  0001 C CNN
F 3 "~" H 2950 3800 50  0001 C CNN
F 4 "0805" H 3100 3600 50  0000 C CNN "DisplayFootprint"
F 5 "10uF" H 3100 3700 50  0000 C CNN "DisplayValue"
F 6 "Murata Electronics" H 2950 3800 50  0001 C CNN "Manufacturer"
F 7 "GRM21BC8YA106ME11L" H 2950 3800 50  0001 C CNN "PartNumber"
	1    2950 3800
	1    0    0    -1  
$EndComp
$Comp
L 000_PreferredParts:C_10uF_0805 C?
U 1 1 5D67CCD1
P 2500 3800
AR Path="/5D562501/5D67CCD1" Ref="C?"  Part="1" 
AR Path="/5D587C46/5D67CCD1" Ref="C?"  Part="1" 
AR Path="/5D591ABD/5D67CCD1" Ref="C401"  Part="1" 
F 0 "C401" H 2615 3846 50  0000 L CNN
F 1 "C_10uF_0805" H 2525 3700 50  0001 L CNN
F 2 "Capacitor_SMD:C_0805_2012Metric" H 2538 3650 50  0001 C CNN
F 3 "~" H 2500 3800 50  0001 C CNN
F 4 "0805" H 2650 3600 50  0000 C CNN "DisplayFootprint"
F 5 "10uF" H 2650 3700 50  0000 C CNN "DisplayValue"
F 6 "Murata Electronics" H 2500 3800 50  0001 C CNN "Manufacturer"
F 7 "GRM21BC8YA106ME11L" H 2500 3800 50  0001 C CNN "PartNumber"
	1    2500 3800
	1    0    0    -1  
$EndComp
$Comp
L power:GND #PWR?
U 1 1 5D67CCD2
P 3400 4050
AR Path="/5D562501/5D67CCD2" Ref="#PWR?"  Part="1" 
AR Path="/5D587C46/5D67CCD2" Ref="#PWR?"  Part="1" 
AR Path="/5D591ABD/5D67CCD2" Ref="#PWR?"  Part="1" 
F 0 "#PWR?" H 3400 3800 50  0001 C CNN
F 1 "GND" H 3405 3877 50  0000 C CNN
F 2 "" H 3400 4050 50  0001 C CNN
F 3 "" H 3400 4050 50  0001 C CNN
	1    3400 4050
	1    0    0    -1  
$EndComp
$Comp
L power:GND #PWR?
U 1 1 5D67CCD3
P 2950 4050
AR Path="/5D562501/5D67CCD3" Ref="#PWR?"  Part="1" 
AR Path="/5D587C46/5D67CCD3" Ref="#PWR?"  Part="1" 
AR Path="/5D591ABD/5D67CCD3" Ref="#PWR?"  Part="1" 
F 0 "#PWR?" H 2950 3800 50  0001 C CNN
F 1 "GND" H 2955 3877 50  0000 C CNN
F 2 "" H 2950 4050 50  0001 C CNN
F 3 "" H 2950 4050 50  0001 C CNN
	1    2950 4050
	1    0    0    -1  
$EndComp
$Comp
L power:GND #PWR?
U 1 1 5D56CC7F
P 2500 4050
AR Path="/5D562501/5D56CC7F" Ref="#PWR?"  Part="1" 
AR Path="/5D587C46/5D56CC7F" Ref="#PWR?"  Part="1" 
AR Path="/5D591ABD/5D56CC7F" Ref="#PWR?"  Part="1" 
F 0 "#PWR?" H 2500 3800 50  0001 C CNN
F 1 "GND" H 2505 3877 50  0000 C CNN
F 2 "" H 2500 4050 50  0001 C CNN
F 3 "" H 2500 4050 50  0001 C CNN
	1    2500 4050
	1    0    0    -1  
$EndComp
Wire Wire Line
	2500 4050 2500 3950
Wire Wire Line
	2950 4050 2950 3950
Wire Wire Line
	3400 4050 3400 3950
Wire Wire Line
	4900 3450 4700 3450
Wire Wire Line
	3400 3450 3400 3650
Wire Wire Line
	3400 3450 2950 3450
Wire Wire Line
	2950 3450 2950 3650
Connection ~ 3400 3450
Wire Wire Line
	2950 3450 2500 3450
Wire Wire Line
	2500 3450 2500 3650
Connection ~ 2950 3450
Wire Wire Line
	4900 3350 4700 3350
Wire Wire Line
	4700 3350 4700 3450
Connection ~ 4700 3450
Wire Wire Line
	4700 3450 4350 3450
Wire Wire Line
	2500 3450 2150 3450
Connection ~ 2500 3450
Text HLabel 2150 3450 0    50   Input ~ 0
V_12
$Comp
L Device:L L?
U 1 1 5D56D68E
P 5500 2950
AR Path="/5D562501/5D56D68E" Ref="L?"  Part="1" 
AR Path="/5D587C46/5D56D68E" Ref="L?"  Part="1" 
AR Path="/5D591ABD/5D56D68E" Ref="L401"  Part="1" 
F 0 "L401" V 5690 2950 50  0000 C CNN
F 1 "1.5uH" V 5599 2950 50  0000 C CNN
F 2 "Inductor_SMD:L_Taiyo-Yuden_MD-4040" H 5500 2950 50  0001 C CNN
F 3 "~" H 5500 2950 50  0001 C CNN
F 4 "ABRACON" H 5500 2950 50  0001 C CNN "Manufacturer"
F 5 "ASPI-4030S-1R5N-T" H 5500 2950 50  0001 C CNN "PartNumber"
	1    5500 2950
	0    -1   -1   0   
$EndComp
Wire Wire Line
	5350 2950 5300 2950
Wire Wire Line
	5300 2950 5300 3100
Wire Wire Line
	5650 2950 5700 2950
Wire Wire Line
	5700 2950 5700 3100
$Comp
L 000_PreferredParts:C_10uF_0603 C?
U 1 1 5D56E1EA
P 7350 3650
AR Path="/5D562501/5D56E1EA" Ref="C?"  Part="1" 
AR Path="/5D587C46/5D56E1EA" Ref="C?"  Part="1" 
AR Path="/5D591ABD/5D56E1EA" Ref="C405"  Part="1" 
F 0 "C405" H 7465 3696 50  0000 L CNN
F 1 "C_10uF_0603" H 7375 3550 50  0001 L CNN
F 2 "Capacitor_SMD:C_0603_1608Metric" H 7388 3500 50  0001 C CNN
F 3 "~" H 7350 3650 50  0001 C CNN
F 4 "0603" H 7500 3450 50  0000 C CNN "DisplayFootprint"
F 5 "10uF" H 7500 3550 50  0000 C CNN "DisplayValue"
F 6 "Murata Electronics" H 7350 3650 50  0001 C CNN "Manufacturer"
F 7 "GRM188R6YA106MA73D" H 7350 3650 50  0001 C CNN "PartNumber"
	1    7350 3650
	1    0    0    -1  
$EndComp
$Comp
L Device:R R?
U 1 1 5D56E2A0
P 6900 3650
AR Path="/5D562501/5D56E2A0" Ref="R?"  Part="1" 
AR Path="/5D587C46/5D56E2A0" Ref="R?"  Part="1" 
AR Path="/5D591ABD/5D56E2A0" Ref="R402"  Part="1" 
F 0 "R402" H 6970 3696 50  0000 L CNN
F 1 "470k" H 6970 3605 50  0000 L CNN
F 2 "Resistor_SMD:R_0402_1005Metric" V 6830 3650 50  0001 C CNN
F 3 "~" H 6900 3650 50  0001 C CNN
F 4 "Stackpole Electronics Inc" H 6900 3650 50  0001 C CNN "Manufacturer"
F 5 "RMCF0402FT470K" H 6900 3650 50  0001 C CNN "PartNumber"
	1    6900 3650
	1    0    0    -1  
$EndComp
Wire Wire Line
	6100 3450 6900 3450
Wire Wire Line
	6900 3500 6900 3450
Connection ~ 6900 3450
$Comp
L Device:R R?
U 1 1 5D56E990
P 6900 4050
AR Path="/5D562501/5D56E990" Ref="R?"  Part="1" 
AR Path="/5D587C46/5D56E990" Ref="R?"  Part="1" 
AR Path="/5D591ABD/5D56E990" Ref="R403"  Part="1" 
F 0 "R403" H 6970 4096 50  0000 L CNN
F 1 "150k" H 6970 4005 50  0000 L CNN
F 2 "Resistor_SMD:R_0402_1005Metric" V 6830 4050 50  0001 C CNN
F 3 "~" H 6900 4050 50  0001 C CNN
F 4 "Stackpole Electronics Inc" H 6900 4050 50  0001 C CNN "Manufacturer"
F 5 "RMCF0201FT150K" H 6900 4050 50  0001 C CNN "PartNumber"
	1    6900 4050
	1    0    0    -1  
$EndComp
Wire Wire Line
	6900 3800 6900 3850
Wire Wire Line
	6100 3700 6650 3700
Connection ~ 6900 3850
Wire Wire Line
	6900 3850 6900 3900
Wire Wire Line
	6650 3850 6650 3700
Wire Wire Line
	6650 3850 6900 3850
$Comp
L power:GND #PWR?
U 1 1 5D56FB1A
P 6900 4300
AR Path="/5D562501/5D56FB1A" Ref="#PWR?"  Part="1" 
AR Path="/5D587C46/5D56FB1A" Ref="#PWR?"  Part="1" 
AR Path="/5D591ABD/5D56FB1A" Ref="#PWR?"  Part="1" 
F 0 "#PWR?" H 6900 4050 50  0001 C CNN
F 1 "GND" H 6905 4127 50  0000 C CNN
F 2 "" H 6900 4300 50  0001 C CNN
F 3 "" H 6900 4300 50  0001 C CNN
	1    6900 4300
	1    0    0    -1  
$EndComp
Wire Wire Line
	6900 4300 6900 4200
Wire Wire Line
	6100 3800 6500 3800
Wire Wire Line
	7350 3500 7350 3450
Wire Wire Line
	6900 3450 7350 3450
$Comp
L power:GND #PWR?
U 1 1 5D57210C
P 7350 3900
AR Path="/5D562501/5D57210C" Ref="#PWR?"  Part="1" 
AR Path="/5D587C46/5D57210C" Ref="#PWR?"  Part="1" 
AR Path="/5D591ABD/5D57210C" Ref="#PWR?"  Part="1" 
F 0 "#PWR?" H 7350 3650 50  0001 C CNN
F 1 "GND" H 7355 3727 50  0000 C CNN
F 2 "" H 7350 3900 50  0001 C CNN
F 3 "" H 7350 3900 50  0001 C CNN
	1    7350 3900
	1    0    0    -1  
$EndComp
Wire Wire Line
	7350 3900 7350 3800
Text HLabel 9750 3450 2    50   Output ~ 0
V_OUT
Text Label 4050 3700 0    50   ~ 0
V_AUX
Text Label 6300 3700 0    50   ~ 0
FB
Text Label 6300 3800 0    50   ~ 0
FB2
Text Label 5300 2950 0    50   ~ 0
L1
Text Label 5700 2950 0    50   ~ 0
L2
$Comp
L power:GND #PWR?
U 1 1 5D731D9F
P 7800 3900
AR Path="/5D562501/5D731D9F" Ref="#PWR?"  Part="1" 
AR Path="/5D587C46/5D731D9F" Ref="#PWR?"  Part="1" 
AR Path="/5D591ABD/5D731D9F" Ref="#PWR?"  Part="1" 
F 0 "#PWR?" H 7800 3650 50  0001 C CNN
F 1 "GND" H 7805 3727 50  0000 C CNN
F 2 "" H 7800 3900 50  0001 C CNN
F 3 "" H 7800 3900 50  0001 C CNN
	1    7800 3900
	1    0    0    -1  
$EndComp
Wire Wire Line
	7800 3900 7800 3800
Wire Wire Line
	7800 3500 7800 3450
Wire Wire Line
	7800 3450 7650 3450
$Comp
L power:GND #PWR?
U 1 1 5D731DA8
P 8600 3900
AR Path="/5D562501/5D731DA8" Ref="#PWR?"  Part="1" 
AR Path="/5D587C46/5D731DA8" Ref="#PWR?"  Part="1" 
AR Path="/5D591ABD/5D731DA8" Ref="#PWR?"  Part="1" 
F 0 "#PWR?" H 8600 3650 50  0001 C CNN
F 1 "GND" H 8605 3727 50  0000 C CNN
F 2 "" H 8600 3900 50  0001 C CNN
F 3 "" H 8600 3900 50  0001 C CNN
	1    8600 3900
	1    0    0    -1  
$EndComp
Wire Wire Line
	8600 3900 8600 3800
Wire Wire Line
	8600 3500 8600 3450
$Comp
L power:GND #PWR?
U 1 1 5D731DB0
P 9400 3900
AR Path="/5D562501/5D731DB0" Ref="#PWR?"  Part="1" 
AR Path="/5D587C46/5D731DB0" Ref="#PWR?"  Part="1" 
AR Path="/5D591ABD/5D731DB0" Ref="#PWR?"  Part="1" 
F 0 "#PWR?" H 9400 3650 50  0001 C CNN
F 1 "GND" H 9405 3727 50  0000 C CNN
F 2 "" H 9400 3900 50  0001 C CNN
F 3 "" H 9400 3900 50  0001 C CNN
	1    9400 3900
	1    0    0    -1  
$EndComp
Wire Wire Line
	9400 3900 9400 3800
Wire Wire Line
	9400 3500 9400 3450
Wire Wire Line
	7800 3450 8600 3450
Connection ~ 7800 3450
Connection ~ 8600 3450
Wire Wire Line
	8600 3450 9400 3450
Connection ~ 9400 3450
Wire Wire Line
	9400 3450 9750 3450
$Comp
L 000_PreferredParts:C_10uF_0805 C?
U 1 1 5D731DBE
P 7800 3650
AR Path="/5D562501/5D731DBE" Ref="C?"  Part="1" 
AR Path="/5D587C46/5D731DBE" Ref="C?"  Part="1" 
AR Path="/5D591ABD/5D731DBE" Ref="C406"  Part="1" 
F 0 "C406" H 7915 3696 50  0000 L CNN
F 1 "C_10uF_0805" H 7825 3550 50  0001 L CNN
F 2 "Capacitor_SMD:C_0805_2012Metric" H 7838 3500 50  0001 C CNN
F 3 "~" H 7800 3650 50  0001 C CNN
F 4 "0805" H 7950 3450 50  0000 C CNN "DisplayFootprint"
F 5 "10uF" H 7950 3550 50  0000 C CNN "DisplayValue"
F 6 "Murata Electronics" H 7800 3650 50  0001 C CNN "Manufacturer"
F 7 "GRM21BC8YA106ME11L" H 7800 3650 50  0001 C CNN "PartNumber"
	1    7800 3650
	1    0    0    -1  
$EndComp
$Comp
L 000_PreferredParts:C_10uF_0805 C?
U 1 1 5D731DC5
P 8600 3650
AR Path="/5D562501/5D731DC5" Ref="C?"  Part="1" 
AR Path="/5D587C46/5D731DC5" Ref="C?"  Part="1" 
AR Path="/5D591ABD/5D731DC5" Ref="C408"  Part="1" 
F 0 "C408" H 8715 3696 50  0000 L CNN
F 1 "C_10uF_0805" H 8625 3550 50  0001 L CNN
F 2 "Capacitor_SMD:C_0805_2012Metric" H 8638 3500 50  0001 C CNN
F 3 "~" H 8600 3650 50  0001 C CNN
F 4 "0805" H 8750 3450 50  0000 C CNN "DisplayFootprint"
F 5 "10uF" H 8750 3550 50  0000 C CNN "DisplayValue"
F 6 "Murata Electronics" H 8600 3650 50  0001 C CNN "Manufacturer"
F 7 "GRM21BC8YA106ME11L" H 8600 3650 50  0001 C CNN "PartNumber"
	1    8600 3650
	1    0    0    -1  
$EndComp
$Comp
L 000_PreferredParts:C_10uF_0805 C?
U 1 1 5D731DCC
P 9400 3650
AR Path="/5D562501/5D731DCC" Ref="C?"  Part="1" 
AR Path="/5D587C46/5D731DCC" Ref="C?"  Part="1" 
AR Path="/5D591ABD/5D731DCC" Ref="C410"  Part="1" 
F 0 "C410" H 9515 3696 50  0000 L CNN
F 1 "C_10uF_0805" H 9425 3550 50  0001 L CNN
F 2 "Capacitor_SMD:C_0805_2012Metric" H 9438 3500 50  0001 C CNN
F 3 "~" H 9400 3650 50  0001 C CNN
F 4 "0805" H 9550 3450 50  0000 C CNN "DisplayFootprint"
F 5 "10uF" H 9550 3550 50  0000 C CNN "DisplayValue"
F 6 "Murata Electronics" H 9400 3650 50  0001 C CNN "Manufacturer"
F 7 "GRM21BC8YA106ME11L" H 9400 3650 50  0001 C CNN "PartNumber"
	1    9400 3650
	1    0    0    -1  
$EndComp
$Comp
L power:GND #PWR?
U 1 1 5D731DD3
P 7800 4650
AR Path="/5D562501/5D731DD3" Ref="#PWR?"  Part="1" 
AR Path="/5D587C46/5D731DD3" Ref="#PWR?"  Part="1" 
AR Path="/5D591ABD/5D731DD3" Ref="#PWR?"  Part="1" 
F 0 "#PWR?" H 7800 4400 50  0001 C CNN
F 1 "GND" H 7805 4477 50  0000 C CNN
F 2 "" H 7800 4650 50  0001 C CNN
F 3 "" H 7800 4650 50  0001 C CNN
	1    7800 4650
	1    0    0    -1  
$EndComp
Wire Wire Line
	7800 4650 7800 4550
Wire Wire Line
	7800 4250 7800 4200
Wire Wire Line
	7800 4200 7650 4200
$Comp
L power:GND #PWR?
U 1 1 5D731DDC
P 8600 4650
AR Path="/5D562501/5D731DDC" Ref="#PWR?"  Part="1" 
AR Path="/5D587C46/5D731DDC" Ref="#PWR?"  Part="1" 
AR Path="/5D591ABD/5D731DDC" Ref="#PWR?"  Part="1" 
F 0 "#PWR?" H 8600 4400 50  0001 C CNN
F 1 "GND" H 8605 4477 50  0000 C CNN
F 2 "" H 8600 4650 50  0001 C CNN
F 3 "" H 8600 4650 50  0001 C CNN
	1    8600 4650
	1    0    0    -1  
$EndComp
Wire Wire Line
	8600 4650 8600 4550
Wire Wire Line
	8600 4250 8600 4200
$Comp
L power:GND #PWR?
U 1 1 5D731DE4
P 9400 4650
AR Path="/5D562501/5D731DE4" Ref="#PWR?"  Part="1" 
AR Path="/5D587C46/5D731DE4" Ref="#PWR?"  Part="1" 
AR Path="/5D591ABD/5D731DE4" Ref="#PWR?"  Part="1" 
F 0 "#PWR?" H 9400 4400 50  0001 C CNN
F 1 "GND" H 9405 4477 50  0000 C CNN
F 2 "" H 9400 4650 50  0001 C CNN
F 3 "" H 9400 4650 50  0001 C CNN
	1    9400 4650
	1    0    0    -1  
$EndComp
Wire Wire Line
	9400 4650 9400 4550
Wire Wire Line
	9400 4250 9400 4200
Wire Wire Line
	7800 4200 8600 4200
Connection ~ 7800 4200
Connection ~ 8600 4200
Wire Wire Line
	8600 4200 9400 4200
$Comp
L 000_PreferredParts:C_10uF_0805 C?
U 1 1 5D731DF0
P 7800 4400
AR Path="/5D562501/5D731DF0" Ref="C?"  Part="1" 
AR Path="/5D587C46/5D731DF0" Ref="C?"  Part="1" 
AR Path="/5D591ABD/5D731DF0" Ref="C407"  Part="1" 
F 0 "C407" H 7915 4446 50  0000 L CNN
F 1 "C_10uF_0805" H 7825 4300 50  0001 L CNN
F 2 "Capacitor_SMD:C_0805_2012Metric" H 7838 4250 50  0001 C CNN
F 3 "~" H 7800 4400 50  0001 C CNN
F 4 "0805" H 7950 4200 50  0000 C CNN "DisplayFootprint"
F 5 "10uF" H 7950 4300 50  0000 C CNN "DisplayValue"
F 6 "Murata Electronics" H 7800 4400 50  0001 C CNN "Manufacturer"
F 7 "GRM21BC8YA106ME11L" H 7800 4400 50  0001 C CNN "PartNumber"
	1    7800 4400
	1    0    0    -1  
$EndComp
$Comp
L 000_PreferredParts:C_10uF_0805 C?
U 1 1 5D731DF7
P 8600 4400
AR Path="/5D562501/5D731DF7" Ref="C?"  Part="1" 
AR Path="/5D587C46/5D731DF7" Ref="C?"  Part="1" 
AR Path="/5D591ABD/5D731DF7" Ref="C409"  Part="1" 
F 0 "C409" H 8715 4446 50  0000 L CNN
F 1 "C_10uF_0805" H 8625 4300 50  0001 L CNN
F 2 "Capacitor_SMD:C_0805_2012Metric" H 8638 4250 50  0001 C CNN
F 3 "~" H 8600 4400 50  0001 C CNN
F 4 "0805" H 8750 4200 50  0000 C CNN "DisplayFootprint"
F 5 "10uF" H 8750 4300 50  0000 C CNN "DisplayValue"
F 6 "Murata Electronics" H 8600 4400 50  0001 C CNN "Manufacturer"
F 7 "GRM21BC8YA106ME11L" H 8600 4400 50  0001 C CNN "PartNumber"
	1    8600 4400
	1    0    0    -1  
$EndComp
$Comp
L 000_PreferredParts:C_10uF_0805 C?
U 1 1 5D731DFE
P 9400 4400
AR Path="/5D562501/5D731DFE" Ref="C?"  Part="1" 
AR Path="/5D587C46/5D731DFE" Ref="C?"  Part="1" 
AR Path="/5D591ABD/5D731DFE" Ref="C411"  Part="1" 
F 0 "C411" H 9515 4446 50  0000 L CNN
F 1 "C_10uF_0805" H 9425 4300 50  0001 L CNN
F 2 "Capacitor_SMD:C_0805_2012Metric" H 9438 4250 50  0001 C CNN
F 3 "~" H 9400 4400 50  0001 C CNN
F 4 "0805" H 9550 4200 50  0000 C CNN "DisplayFootprint"
F 5 "10uF" H 9550 4300 50  0000 C CNN "DisplayValue"
F 6 "Murata Electronics" H 9400 4400 50  0001 C CNN "Manufacturer"
F 7 "GRM21BC8YA106ME11L" H 9400 4400 50  0001 C CNN "PartNumber"
	1    9400 4400
	1    0    0    -1  
$EndComp
Wire Wire Line
	7650 3450 7650 4200
Connection ~ 7650 3450
Wire Wire Line
	7650 3450 7350 3450
Connection ~ 7350 3450
$Comp
L power:GND #PWR?
U 1 1 5D86281A
P 4600 4300
AR Path="/5D562501/5D86281A" Ref="#PWR?"  Part="1" 
AR Path="/5D587C46/5D86281A" Ref="#PWR?"  Part="1" 
AR Path="/5D591ABD/5D86281A" Ref="#PWR?"  Part="1" 
F 0 "#PWR?" H 4600 4050 50  0001 C CNN
F 1 "GND" H 4605 4127 50  0000 C CNN
F 2 "" H 4600 4300 50  0001 C CNN
F 3 "" H 4600 4300 50  0001 C CNN
	1    4600 4300
	1    0    0    -1  
$EndComp
Wire Wire Line
	4600 4150 4600 4300
Wire Wire Line
	4600 3950 4900 3950
$Comp
L Device:R R?
U 1 1 5D864C5F
P 4350 3900
AR Path="/5D562501/5D864C5F" Ref="R?"  Part="1" 
AR Path="/5D587C46/5D864C5F" Ref="R?"  Part="1" 
AR Path="/5D591ABD/5D864C5F" Ref="R401"  Part="1" 
F 0 "R401" H 4420 3946 50  0000 L CNN
F 1 "10k" H 4420 3855 50  0000 L CNN
F 2 "Resistor_SMD:R_0402_1005Metric" V 4280 3900 50  0001 C CNN
F 3 "~" H 4350 3900 50  0001 C CNN
F 4 "Delta Electronics/Cyntec" H 4350 3900 50  0001 C CNN "Manufacturer"
F 5 "PFR05S-103-FNH" H 4350 3900 50  0001 C CNN "PartNumber"
	1    4350 3900
	1    0    0    -1  
$EndComp
Wire Wire Line
	4350 4050 4600 4050
Wire Wire Line
	4600 3950 4600 4050
Connection ~ 4600 4050
Wire Wire Line
	4600 4050 4900 4050
Wire Wire Line
	4350 3750 4350 3700
Wire Wire Line
	4350 3700 4350 3450
Connection ~ 4350 3450
Wire Wire Line
	4350 3450 3400 3450
Wire Wire Line
	3800 3700 4900 3700
Text Label 4700 3950 0    50   ~ 0
EN
$EndSCHEMATC
