EESchema Schematic File Version 4
EELAYER 30 0
EELAYER END
$Descr A4 11693 8268
encoding utf-8
Sheet 12 14
Title ""
Date ""
Rev ""
Comp ""
Comment1 ""
Comment2 ""
Comment3 ""
Comment4 ""
$EndDescr
$Comp
L power:GND #PWR?
U 1 1 5E85E590
P 5800 6000
AR Path="/5E85E590" Ref="#PWR?"  Part="1" 
AR Path="/5E655037/5E85E590" Ref="#PWR?"  Part="1" 
AR Path="/5E78F576/5E85E590" Ref="#PWR?"  Part="1" 
F 0 "#PWR?" H 5800 5750 50  0001 C CNN
F 1 "GND" H 5805 5827 50  0000 C CNN
F 2 "" H 5800 6000 50  0001 C CNN
F 3 "" H 5800 6000 50  0001 C CNN
	1    5800 6000
	1    0    0    -1  
$EndComp
Wire Wire Line
	5800 6000 5800 5900
$Comp
L power:GND #PWR?
U 1 1 5E85E597
P 5700 6000
AR Path="/5E85E597" Ref="#PWR?"  Part="1" 
AR Path="/5E655037/5E85E597" Ref="#PWR?"  Part="1" 
AR Path="/5E78F576/5E85E597" Ref="#PWR?"  Part="1" 
F 0 "#PWR?" H 5700 5750 50  0001 C CNN
F 1 "GND" H 5705 5827 50  0000 C CNN
F 2 "" H 5700 6000 50  0001 C CNN
F 3 "" H 5700 6000 50  0001 C CNN
	1    5700 6000
	1    0    0    -1  
$EndComp
Wire Wire Line
	5700 6000 5700 5900
$Comp
L power:GND #PWR?
U 1 1 5E85E59E
P 5600 6000
AR Path="/5E85E59E" Ref="#PWR?"  Part="1" 
AR Path="/5E655037/5E85E59E" Ref="#PWR?"  Part="1" 
AR Path="/5E78F576/5E85E59E" Ref="#PWR?"  Part="1" 
F 0 "#PWR?" H 5600 5750 50  0001 C CNN
F 1 "GND" H 5605 5827 50  0000 C CNN
F 2 "" H 5600 6000 50  0001 C CNN
F 3 "" H 5600 6000 50  0001 C CNN
	1    5600 6000
	1    0    0    -1  
$EndComp
Wire Wire Line
	5600 6000 5600 5900
$Comp
L power:GND #PWR?
U 1 1 5E85E5A5
P 5500 6000
AR Path="/5E85E5A5" Ref="#PWR?"  Part="1" 
AR Path="/5E655037/5E85E5A5" Ref="#PWR?"  Part="1" 
AR Path="/5E78F576/5E85E5A5" Ref="#PWR?"  Part="1" 
F 0 "#PWR?" H 5500 5750 50  0001 C CNN
F 1 "GND" H 5505 5827 50  0000 C CNN
F 2 "" H 5500 6000 50  0001 C CNN
F 3 "" H 5500 6000 50  0001 C CNN
	1    5500 6000
	1    0    0    -1  
$EndComp
Wire Wire Line
	5500 6000 5500 5900
$Comp
L power:GND #PWR?
U 1 1 5E85E5AC
P 5400 6000
AR Path="/5E85E5AC" Ref="#PWR?"  Part="1" 
AR Path="/5E655037/5E85E5AC" Ref="#PWR?"  Part="1" 
AR Path="/5E78F576/5E85E5AC" Ref="#PWR?"  Part="1" 
F 0 "#PWR?" H 5400 5750 50  0001 C CNN
F 1 "GND" H 5405 5827 50  0000 C CNN
F 2 "" H 5400 6000 50  0001 C CNN
F 3 "" H 5400 6000 50  0001 C CNN
	1    5400 6000
	1    0    0    -1  
$EndComp
Wire Wire Line
	5400 6000 5400 5900
$Comp
L power:GND #PWR?
U 1 1 5E85E5B3
P 5300 6000
AR Path="/5E85E5B3" Ref="#PWR?"  Part="1" 
AR Path="/5E655037/5E85E5B3" Ref="#PWR?"  Part="1" 
AR Path="/5E78F576/5E85E5B3" Ref="#PWR?"  Part="1" 
F 0 "#PWR?" H 5300 5750 50  0001 C CNN
F 1 "GND" H 5305 5827 50  0000 C CNN
F 2 "" H 5300 6000 50  0001 C CNN
F 3 "" H 5300 6000 50  0001 C CNN
	1    5300 6000
	1    0    0    -1  
$EndComp
Wire Wire Line
	5300 6000 5300 5900
$Comp
L power:GND #PWR?
U 1 1 5E85E5BA
P 5200 6000
AR Path="/5E85E5BA" Ref="#PWR?"  Part="1" 
AR Path="/5E655037/5E85E5BA" Ref="#PWR?"  Part="1" 
AR Path="/5E78F576/5E85E5BA" Ref="#PWR?"  Part="1" 
F 0 "#PWR?" H 5200 5750 50  0001 C CNN
F 1 "GND" H 5205 5827 50  0000 C CNN
F 2 "" H 5200 6000 50  0001 C CNN
F 3 "" H 5200 6000 50  0001 C CNN
	1    5200 6000
	1    0    0    -1  
$EndComp
Wire Wire Line
	5200 6000 5200 5900
$Comp
L power:GND #PWR?
U 1 1 5E85E5C1
P 5100 6000
AR Path="/5E85E5C1" Ref="#PWR?"  Part="1" 
AR Path="/5E655037/5E85E5C1" Ref="#PWR?"  Part="1" 
AR Path="/5E78F576/5E85E5C1" Ref="#PWR?"  Part="1" 
F 0 "#PWR?" H 5100 5750 50  0001 C CNN
F 1 "GND" H 5105 5827 50  0000 C CNN
F 2 "" H 5100 6000 50  0001 C CNN
F 3 "" H 5100 6000 50  0001 C CNN
	1    5100 6000
	1    0    0    -1  
$EndComp
Wire Wire Line
	5100 6000 5100 5900
$Comp
L power:GND #PWR?
U 1 1 5E85E5C8
P 5000 6000
AR Path="/5E85E5C8" Ref="#PWR?"  Part="1" 
AR Path="/5E655037/5E85E5C8" Ref="#PWR?"  Part="1" 
AR Path="/5E78F576/5E85E5C8" Ref="#PWR?"  Part="1" 
F 0 "#PWR?" H 5000 5750 50  0001 C CNN
F 1 "GND" H 5005 5827 50  0000 C CNN
F 2 "" H 5000 6000 50  0001 C CNN
F 3 "" H 5000 6000 50  0001 C CNN
	1    5000 6000
	1    0    0    -1  
$EndComp
Wire Wire Line
	5000 6000 5000 5900
$Comp
L power:GND #PWR?
U 1 1 5E85E5CF
P 4900 6000
AR Path="/5E85E5CF" Ref="#PWR?"  Part="1" 
AR Path="/5E655037/5E85E5CF" Ref="#PWR?"  Part="1" 
AR Path="/5E78F576/5E85E5CF" Ref="#PWR?"  Part="1" 
F 0 "#PWR?" H 4900 5750 50  0001 C CNN
F 1 "GND" H 4905 5827 50  0000 C CNN
F 2 "" H 4900 6000 50  0001 C CNN
F 3 "" H 4900 6000 50  0001 C CNN
	1    4900 6000
	1    0    0    -1  
$EndComp
Wire Wire Line
	4900 6000 4900 5900
$Comp
L power:GND #PWR?
U 1 1 5E85E5D6
P 4800 6000
AR Path="/5E85E5D6" Ref="#PWR?"  Part="1" 
AR Path="/5E655037/5E85E5D6" Ref="#PWR?"  Part="1" 
AR Path="/5E78F576/5E85E5D6" Ref="#PWR?"  Part="1" 
F 0 "#PWR?" H 4800 5750 50  0001 C CNN
F 1 "GND" H 4805 5827 50  0000 C CNN
F 2 "" H 4800 6000 50  0001 C CNN
F 3 "" H 4800 6000 50  0001 C CNN
	1    4800 6000
	1    0    0    -1  
$EndComp
Wire Wire Line
	4800 6000 4800 5900
$Comp
L power:GND #PWR?
U 1 1 5E85E5DD
P 4700 6000
AR Path="/5E85E5DD" Ref="#PWR?"  Part="1" 
AR Path="/5E655037/5E85E5DD" Ref="#PWR?"  Part="1" 
AR Path="/5E78F576/5E85E5DD" Ref="#PWR?"  Part="1" 
F 0 "#PWR?" H 4700 5750 50  0001 C CNN
F 1 "GND" H 4705 5827 50  0000 C CNN
F 2 "" H 4700 6000 50  0001 C CNN
F 3 "" H 4700 6000 50  0001 C CNN
	1    4700 6000
	1    0    0    -1  
$EndComp
Wire Wire Line
	4700 6000 4700 5900
$Comp
L power:GND #PWR?
U 1 1 5E85E5E4
P 4600 6000
AR Path="/5E85E5E4" Ref="#PWR?"  Part="1" 
AR Path="/5E655037/5E85E5E4" Ref="#PWR?"  Part="1" 
AR Path="/5E78F576/5E85E5E4" Ref="#PWR?"  Part="1" 
F 0 "#PWR?" H 4600 5750 50  0001 C CNN
F 1 "GND" H 4605 5827 50  0000 C CNN
F 2 "" H 4600 6000 50  0001 C CNN
F 3 "" H 4600 6000 50  0001 C CNN
	1    4600 6000
	1    0    0    -1  
$EndComp
Wire Wire Line
	4600 6000 4600 5900
$Comp
L power:GND #PWR?
U 1 1 5E85E5EB
P 4500 6000
AR Path="/5E85E5EB" Ref="#PWR?"  Part="1" 
AR Path="/5E655037/5E85E5EB" Ref="#PWR?"  Part="1" 
AR Path="/5E78F576/5E85E5EB" Ref="#PWR?"  Part="1" 
F 0 "#PWR?" H 4500 5750 50  0001 C CNN
F 1 "GND" H 4505 5827 50  0000 C CNN
F 2 "" H 4500 6000 50  0001 C CNN
F 3 "" H 4500 6000 50  0001 C CNN
	1    4500 6000
	1    0    0    -1  
$EndComp
Wire Wire Line
	4500 6000 4500 5900
$Comp
L power:GND #PWR?
U 1 1 5E85E5F2
P 4400 6000
AR Path="/5E85E5F2" Ref="#PWR?"  Part="1" 
AR Path="/5E655037/5E85E5F2" Ref="#PWR?"  Part="1" 
AR Path="/5E78F576/5E85E5F2" Ref="#PWR?"  Part="1" 
F 0 "#PWR?" H 4400 5750 50  0001 C CNN
F 1 "GND" H 4405 5827 50  0000 C CNN
F 2 "" H 4400 6000 50  0001 C CNN
F 3 "" H 4400 6000 50  0001 C CNN
	1    4400 6000
	1    0    0    -1  
$EndComp
Wire Wire Line
	4400 6000 4400 5900
$Comp
L power:GND #PWR?
U 1 1 5E85E5F9
P 4300 6000
AR Path="/5E85E5F9" Ref="#PWR?"  Part="1" 
AR Path="/5E655037/5E85E5F9" Ref="#PWR?"  Part="1" 
AR Path="/5E78F576/5E85E5F9" Ref="#PWR?"  Part="1" 
F 0 "#PWR?" H 4300 5750 50  0001 C CNN
F 1 "GND" H 4305 5827 50  0000 C CNN
F 2 "" H 4300 6000 50  0001 C CNN
F 3 "" H 4300 6000 50  0001 C CNN
	1    4300 6000
	1    0    0    -1  
$EndComp
Wire Wire Line
	4300 6000 4300 5900
$Comp
L POWDER_RF:PE43712 U?
U 1 1 5E85E600
P 5050 5350
AR Path="/5E85E600" Ref="U?"  Part="1" 
AR Path="/5E655037/5E85E600" Ref="U?"  Part="1" 
AR Path="/5E78F576/5E85E600" Ref="U1201"  Part="1" 
F 0 "U1201" H 5900 5850 50  0000 C CNN
F 1 "PE43712" H 5050 5350 50  0000 C CNN
F 2 "Package_DFN_QFN:QFN-32-1EP_5x5mm_P0.5mm_EP3.1x3.1mm" H 6200 4050 50  0001 C CNN
F 3 "" H 5900 5850 50  0001 C CNN
F 4 "3000-0000000187" H 5050 5350 50  0001 C CNN "PartSpecification"
	1    5050 5350
	-1   0    0    -1  
$EndComp
Text HLabel 6550 5350 2    50   Input ~ 0
RF_IN
Wire Wire Line
	6000 5350 6550 5350
Text HLabel 3550 5350 0    50   Output ~ 0
RF_OUT
Wire Wire Line
	3550 5350 4100 5350
Text Label 6000 1400 0    50   ~ 0
TX_att_VDD
Wire Wire Line
	5800 1400 6300 1400
Connection ~ 5800 1400
Wire Wire Line
	4800 1900 4800 1800
Wire Wire Line
	5300 1900 5300 1800
Wire Wire Line
	5300 1400 5800 1400
Wire Wire Line
	6300 1900 6300 1800
$Comp
L power:GND #PWR?
U 1 1 5E85E611
P 6300 1900
AR Path="/5E85E611" Ref="#PWR?"  Part="1" 
AR Path="/5E655037/5E85E611" Ref="#PWR?"  Part="1" 
AR Path="/5E78F576/5E85E611" Ref="#PWR?"  Part="1" 
F 0 "#PWR?" H 6300 1650 50  0001 C CNN
F 1 "GND" H 6305 1727 50  0000 C CNN
F 2 "" H 6300 1900 50  0001 C CNN
F 3 "" H 6300 1900 50  0001 C CNN
	1    6300 1900
	1    0    0    -1  
$EndComp
Wire Wire Line
	4800 1400 5300 1400
Connection ~ 4800 1400
Wire Wire Line
	4800 1500 4800 1400
Connection ~ 5300 1400
Wire Wire Line
	5300 1500 5300 1400
Wire Wire Line
	6300 1500 6300 1400
$Comp
L 000_PreferredParts:C_100nF C?
U 1 1 5E85E61E
P 6300 1650
AR Path="/5E85E61E" Ref="C?"  Part="1" 
AR Path="/5E655037/5E85E61E" Ref="C?"  Part="1" 
AR Path="/5E78F576/5E85E61E" Ref="C1203"  Part="1" 
F 0 "C1203" H 6325 1750 50  0000 L CNN
F 1 "C_100nF" H 6325 1550 50  0001 L CNN
F 2 "Capacitor_SMD:C_0402_1005Metric" H 6338 1500 50  0001 C CNN
F 3 "~" H 6300 1650 50  0001 C CNN
F 4 "100nF" H 6450 1550 50  0000 C CNN "DisplayValue"
F 5 "3000-0000000125" H 0   0   50  0001 C CNN "PartSpecification"
	1    6300 1650
	1    0    0    -1  
$EndComp
$Comp
L 000_PreferredParts:C_1nF C?
U 1 1 5E85E624
P 5300 1650
AR Path="/5E85E624" Ref="C?"  Part="1" 
AR Path="/5E655037/5E85E624" Ref="C?"  Part="1" 
AR Path="/5E78F576/5E85E624" Ref="C1202"  Part="1" 
F 0 "C1202" H 5325 1750 50  0000 L CNN
F 1 "C_1nF" H 5325 1550 50  0000 L CNN
F 2 "Capacitor_SMD:C_0402_1005Metric" H 5338 1500 50  0001 C CNN
F 3 "~" H 5300 1650 50  0001 C CNN
F 4 "3000-0000000128" H 0   0   50  0001 C CNN "PartSpecification"
	1    5300 1650
	1    0    0    -1  
$EndComp
$Comp
L 000_PreferredParts:C_10pF C?
U 1 1 5E85E62A
P 4800 1650
AR Path="/5E85E62A" Ref="C?"  Part="1" 
AR Path="/5E655037/5E85E62A" Ref="C?"  Part="1" 
AR Path="/5E78F576/5E85E62A" Ref="C1201"  Part="1" 
F 0 "C1201" H 4825 1750 50  0000 L CNN
F 1 "C_10pF" H 4825 1550 50  0000 L CNN
F 2 "Capacitor_SMD:C_0402_1005Metric" H 4838 1500 50  0001 C CNN
F 3 "~" H 4800 1650 50  0001 C CNN
F 4 "3000-0000000582" H 0   0   50  0001 C CNN "PartSpecification"
	1    4800 1650
	1    0    0    -1  
$EndComp
Wire Wire Line
	4600 1400 4800 1400
Wire Wire Line
	4300 1400 4100 1400
$Comp
L Device:L L?
U 1 1 5E85E634
P 4450 1400
AR Path="/5E85E634" Ref="L?"  Part="1" 
AR Path="/5D96ADB0/5E85E634" Ref="L?"  Part="1" 
AR Path="/5E655037/5E85E634" Ref="L?"  Part="1" 
AR Path="/5E78F576/5E85E634" Ref="L1201"  Part="1" 
F 0 "L1201" V 4640 1400 50  0000 C CNN
F 1 "BEAD" V 4549 1400 50  0000 C CNN
F 2 "Inductor_SMD:L_0603_1608Metric" H 4450 1400 50  0001 C CNN
F 3 "~" H 4450 1400 50  0001 C CNN
F 4 "BLM18EG221SZ1" V 4450 1400 50  0001 C CNN "PartNumber"
F 5 "Murata Electronics" H 4450 1400 50  0001 C CNN "Manufacturer"
F 6 "3000-0000000091" H 4450 1400 50  0001 C CNN "PartSpecification"
	1    4450 1400
	0    -1   -1   0   
$EndComp
Text Label 4600 4700 1    50   ~ 0
TX_ATT_A1
Text Label 4500 4700 1    50   ~ 0
TX_ATT_A2
Text Label 4400 4700 1    50   ~ 0
TX_ATT_A0
Text Label 4300 4700 1    50   ~ 0
TX_ATT_S_P
Text Label 5600 4700 1    50   ~ 0
TX_ATT_D0
Text Label 5500 4700 1    50   ~ 0
TX_ATT_D1
Text Label 5400 4700 1    50   ~ 0
TX_ATT_D2
Text Label 5300 4700 1    50   ~ 0
TX_ATT_D3
Text Label 5200 4700 1    50   ~ 0
TX_ATT_D4
Text Label 5100 4700 1    50   ~ 0
TX_ATT_D5
Text Label 5000 4700 1    50   ~ 0
TX_ATT_D6
$Comp
L Connector:TestPoint TP?
U 1 1 5E85E645
P 5600 2600
AR Path="/5E85E645" Ref="TP?"  Part="1" 
AR Path="/5E655037/5E85E645" Ref="TP?"  Part="1" 
AR Path="/5E78F576/5E85E645" Ref="TP1208"  Part="1" 
F 0 "TP1208" H 5658 2718 50  0000 L CNN
F 1 "TestPoint" H 5658 2627 50  0001 L CNN
F 2 "TestPoint:TestPoint_Pad_D1.0mm" H 5800 2600 50  0001 C CNN
F 3 "~" H 5800 2600 50  0001 C CNN
	1    5600 2600
	-1   0    0    -1  
$EndComp
$Comp
L Connector:TestPoint TP?
U 1 1 5E85E64B
P 5500 2800
AR Path="/5E85E64B" Ref="TP?"  Part="1" 
AR Path="/5E655037/5E85E64B" Ref="TP?"  Part="1" 
AR Path="/5E78F576/5E85E64B" Ref="TP1207"  Part="1" 
F 0 "TP1207" H 5558 2918 50  0000 L CNN
F 1 "TestPoint" H 5558 2827 50  0001 L CNN
F 2 "TestPoint:TestPoint_Pad_D1.0mm" H 5700 2800 50  0001 C CNN
F 3 "~" H 5700 2800 50  0001 C CNN
	1    5500 2800
	-1   0    0    -1  
$EndComp
$Comp
L Connector:TestPoint TP?
U 1 1 5E85E651
P 5400 3400
AR Path="/5E85E651" Ref="TP?"  Part="1" 
AR Path="/5E655037/5E85E651" Ref="TP?"  Part="1" 
AR Path="/5E78F576/5E85E651" Ref="TP1206"  Part="1" 
F 0 "TP1206" H 5458 3518 50  0000 L CNN
F 1 "TestPoint" H 5458 3427 50  0001 L CNN
F 2 "TestPoint:TestPoint_Pad_D1.0mm" H 5600 3400 50  0001 C CNN
F 3 "~" H 5600 3400 50  0001 C CNN
	1    5400 3400
	-1   0    0    -1  
$EndComp
$Comp
L Connector:TestPoint TP?
U 1 1 5E85E657
P 5300 3250
AR Path="/5E85E657" Ref="TP?"  Part="1" 
AR Path="/5E655037/5E85E657" Ref="TP?"  Part="1" 
AR Path="/5E78F576/5E85E657" Ref="TP1205"  Part="1" 
F 0 "TP1205" H 5358 3368 50  0000 L CNN
F 1 "TestPoint" H 5358 3277 50  0001 L CNN
F 2 "TestPoint:TestPoint_Pad_D1.0mm" H 5500 3250 50  0001 C CNN
F 3 "~" H 5500 3250 50  0001 C CNN
	1    5300 3250
	-1   0    0    -1  
$EndComp
$Comp
L Connector:TestPoint TP?
U 1 1 5E85E65D
P 5200 3100
AR Path="/5E85E65D" Ref="TP?"  Part="1" 
AR Path="/5E655037/5E85E65D" Ref="TP?"  Part="1" 
AR Path="/5E78F576/5E85E65D" Ref="TP1204"  Part="1" 
F 0 "TP1204" H 5258 3218 50  0000 L CNN
F 1 "TestPoint" H 5258 3127 50  0001 L CNN
F 2 "TestPoint:TestPoint_Pad_D1.0mm" H 5400 3100 50  0001 C CNN
F 3 "~" H 5400 3100 50  0001 C CNN
	1    5200 3100
	-1   0    0    -1  
$EndComp
$Comp
L Connector:TestPoint TP?
U 1 1 5E85E663
P 5100 2950
AR Path="/5E85E663" Ref="TP?"  Part="1" 
AR Path="/5E655037/5E85E663" Ref="TP?"  Part="1" 
AR Path="/5E78F576/5E85E663" Ref="TP1203"  Part="1" 
F 0 "TP1203" H 5158 3068 50  0000 L CNN
F 1 "TestPoint" H 5158 2977 50  0001 L CNN
F 2 "TestPoint:TestPoint_Pad_D1.0mm" H 5300 2950 50  0001 C CNN
F 3 "~" H 5300 2950 50  0001 C CNN
	1    5100 2950
	-1   0    0    -1  
$EndComp
$Comp
L Connector:TestPoint TP?
U 1 1 5E85E669
P 5000 2800
AR Path="/5E85E669" Ref="TP?"  Part="1" 
AR Path="/5E655037/5E85E669" Ref="TP?"  Part="1" 
AR Path="/5E78F576/5E85E669" Ref="TP1202"  Part="1" 
F 0 "TP1202" H 5058 2918 50  0000 L CNN
F 1 "TestPoint" H 5058 2827 50  0001 L CNN
F 2 "TestPoint:TestPoint_Pad_D1.0mm" H 5200 2800 50  0001 C CNN
F 3 "~" H 5200 2800 50  0001 C CNN
	1    5000 2800
	-1   0    0    -1  
$EndComp
Wire Wire Line
	5600 4800 5600 2750
Wire Wire Line
	5500 4800 5500 3000
Wire Wire Line
	5400 4800 5400 3400
Wire Wire Line
	5300 4800 5300 3500
Wire Wire Line
	5200 4800 5200 3750
Wire Wire Line
	5100 4800 5100 4000
Wire Wire Line
	5000 4800 5000 4250
Text Label 4900 3100 1    50   ~ 0
ATT_SI
Text Label 4800 3100 1    50   ~ 0
ATT_CLK
Text Label 4700 3100 1    50   ~ 0
ATT_LE
$Comp
L power:GND #PWR?
U 1 1 5E85E679
P 3400 2950
AR Path="/5E85E679" Ref="#PWR?"  Part="1" 
AR Path="/5E655037/5E85E679" Ref="#PWR?"  Part="1" 
AR Path="/5E78F576/5E85E679" Ref="#PWR?"  Part="1" 
F 0 "#PWR?" H 3400 2700 50  0001 C CNN
F 1 "GND" H 3405 2777 50  0000 C CNN
F 2 "" H 3400 2950 50  0001 C CNN
F 3 "" H 3400 2950 50  0001 C CNN
	1    3400 2950
	1    0    0    -1  
$EndComp
$Comp
L Device:R R?
U 1 1 5E85E681
P 4000 2550
AR Path="/5D69D382/5E85E681" Ref="R?"  Part="1" 
AR Path="/5E85E681" Ref="R?"  Part="1" 
AR Path="/5E655037/5E85E681" Ref="R?"  Part="1" 
AR Path="/5E78F576/5E85E681" Ref="R1201"  Part="1" 
F 0 "R1201" H 4070 2596 50  0000 L CNN
F 1 "10k" H 4070 2505 50  0000 L CNN
F 2 "Resistor_SMD:R_0402_1005Metric" V 3930 2550 50  0001 C CNN
F 3 "~" H 4000 2550 50  0001 C CNN
F 4 "Delta Electronics/Cyntec" H 4000 2550 50  0001 C CNN "Manufacturer"
F 5 "PFR05S-103-FNH" H 4000 2550 50  0001 C CNN "PartNumber"
F 6 "3000-0000000131" H 4000 2550 50  0001 C CNN "PartSpecification"
	1    4000 2550
	0    1    1    0   
$EndComp
$Comp
L Device:R R?
U 1 1 5E85E689
P 4000 2850
AR Path="/5D69D382/5E85E689" Ref="R?"  Part="1" 
AR Path="/5E85E689" Ref="R?"  Part="1" 
AR Path="/5E655037/5E85E689" Ref="R?"  Part="1" 
AR Path="/5E78F576/5E85E689" Ref="R1202"  Part="1" 
F 0 "R1202" H 4070 2896 50  0000 L CNN
F 1 "10k" H 4070 2805 50  0000 L CNN
F 2 "Resistor_SMD:R_0402_1005Metric" V 3930 2850 50  0001 C CNN
F 3 "~" H 4000 2850 50  0001 C CNN
F 4 "Delta Electronics/Cyntec" H 4000 2850 50  0001 C CNN "Manufacturer"
F 5 "PFR05S-103-FNH" H 4000 2850 50  0001 C CNN "PartNumber"
F 6 "3000-0000000131" H 4000 2850 50  0001 C CNN "PartSpecification"
	1    4000 2850
	0    1    1    0   
$EndComp
$Comp
L Device:R R?
U 1 1 5E85E691
P 4000 3350
AR Path="/5D69D382/5E85E691" Ref="R?"  Part="1" 
AR Path="/5E85E691" Ref="R?"  Part="1" 
AR Path="/5E655037/5E85E691" Ref="R?"  Part="1" 
AR Path="/5E78F576/5E85E691" Ref="R1203"  Part="1" 
F 0 "R1203" H 4070 3396 50  0000 L CNN
F 1 "10k" H 4070 3305 50  0000 L CNN
F 2 "Resistor_SMD:R_0402_1005Metric" V 3930 3350 50  0001 C CNN
F 3 "~" H 4000 3350 50  0001 C CNN
F 4 "Delta Electronics/Cyntec" H 4000 3350 50  0001 C CNN "Manufacturer"
F 5 "PFR05S-103-FNH" H 4000 3350 50  0001 C CNN "PartNumber"
F 6 "3000-0000000131" H 4000 3350 50  0001 C CNN "PartSpecification"
	1    4000 3350
	0    1    1    0   
$EndComp
Wire Wire Line
	4050 4750 4300 4750
$Comp
L Connector:TestPoint TP?
U 1 1 5E85E698
P 4050 4750
AR Path="/5E85E698" Ref="TP?"  Part="1" 
AR Path="/5E655037/5E85E698" Ref="TP?"  Part="1" 
AR Path="/5E78F576/5E85E698" Ref="TP1201"  Part="1" 
F 0 "TP1201" H 4108 4868 50  0000 L CNN
F 1 "TestPoint" H 4108 4777 50  0000 L CNN
F 2 "TestPoint:TestPoint_Pad_D1.0mm" H 4250 4750 50  0001 C CNN
F 3 "~" H 4250 4750 50  0001 C CNN
	1    4050 4750
	-1   0    0    -1  
$EndComp
$Comp
L power:+3.3V #PWR?
U 1 1 5E85E69E
P 3600 3250
AR Path="/5E85E69E" Ref="#PWR?"  Part="1" 
AR Path="/5E655037/5E85E69E" Ref="#PWR?"  Part="1" 
AR Path="/5E78F576/5E85E69E" Ref="#PWR?"  Part="1" 
F 0 "#PWR?" H 3600 3100 50  0001 C CNN
F 1 "+3.3V" H 3615 3423 50  0000 C CNN
F 2 "" H 3600 3250 50  0001 C CNN
F 3 "" H 3600 3250 50  0001 C CNN
	1    3600 3250
	1    0    0    -1  
$EndComp
$Comp
L Device:R R?
U 1 1 5E85E6A6
P 4000 4200
AR Path="/5D69D382/5E85E6A6" Ref="R?"  Part="1" 
AR Path="/5E85E6A6" Ref="R?"  Part="1" 
AR Path="/5E655037/5E85E6A6" Ref="R?"  Part="1" 
AR Path="/5E78F576/5E85E6A6" Ref="R1204"  Part="1" 
F 0 "R1204" H 4070 4246 50  0000 L CNN
F 1 "10k" H 4070 4155 50  0000 L CNN
F 2 "Resistor_SMD:R_0402_1005Metric" V 3930 4200 50  0001 C CNN
F 3 "~" H 4000 4200 50  0001 C CNN
F 4 "Delta Electronics/Cyntec" H 4000 4200 50  0001 C CNN "Manufacturer"
F 5 "PFR05S-103-FNH" H 4000 4200 50  0001 C CNN "PartNumber"
F 6 "3000-0000000131" H 4000 4200 50  0001 C CNN "PartSpecification"
	1    4000 4200
	0    1    1    0   
$EndComp
$Comp
L power:GND #PWR?
U 1 1 5E85E6AC
P 4800 1900
AR Path="/5E85E6AC" Ref="#PWR?"  Part="1" 
AR Path="/5E655037/5E85E6AC" Ref="#PWR?"  Part="1" 
AR Path="/5E78F576/5E85E6AC" Ref="#PWR?"  Part="1" 
F 0 "#PWR?" H 4800 1650 50  0001 C CNN
F 1 "GND" H 4805 1727 50  0000 C CNN
F 2 "" H 4800 1900 50  0001 C CNN
F 3 "" H 4800 1900 50  0001 C CNN
	1    4800 1900
	1    0    0    -1  
$EndComp
$Comp
L power:GND #PWR?
U 1 1 5E85E6B2
P 5300 1900
AR Path="/5E85E6B2" Ref="#PWR?"  Part="1" 
AR Path="/5E655037/5E85E6B2" Ref="#PWR?"  Part="1" 
AR Path="/5E78F576/5E85E6B2" Ref="#PWR?"  Part="1" 
F 0 "#PWR?" H 5300 1650 50  0001 C CNN
F 1 "GND" H 5305 1727 50  0000 C CNN
F 2 "" H 5300 1900 50  0001 C CNN
F 3 "" H 5300 1900 50  0001 C CNN
	1    5300 1900
	1    0    0    -1  
$EndComp
Wire Wire Line
	5800 1400 5800 4800
Text HLabel 4100 1400 0    50   Input ~ 0
VDD
Wire Wire Line
	4150 4200 4300 4200
Wire Wire Line
	4300 4200 4300 4750
Wire Wire Line
	3600 3250 3600 3350
Wire Wire Line
	3600 4200 3850 4200
Wire Wire Line
	3850 3350 3600 3350
Connection ~ 3600 3350
Wire Wire Line
	3600 3350 3600 4200
Wire Wire Line
	4400 3350 4400 4800
Wire Wire Line
	4150 3350 4400 3350
Wire Wire Line
	3400 2950 3400 2850
Wire Wire Line
	3400 2850 3850 2850
Wire Wire Line
	3850 2550 3400 2550
Wire Wire Line
	3400 2550 3400 2850
Connection ~ 3400 2850
Wire Wire Line
	4500 2850 4150 2850
Wire Wire Line
	4500 2850 4500 4800
Wire Wire Line
	4150 2550 4600 2550
Wire Wire Line
	4600 2550 4600 4800
Text HLabel 4600 2450 0    50   Input ~ 0
LE
Text HLabel 4600 2350 0    50   Input ~ 0
CLK
Text HLabel 4600 2250 0    50   Input ~ 0
SI
Wire Wire Line
	4700 2450 4600 2450
Wire Wire Line
	4800 2350 4600 2350
Wire Wire Line
	4900 2250 4600 2250
Wire Wire Line
	4700 2450 4700 4800
Wire Wire Line
	4800 2350 4800 4800
Wire Wire Line
	4900 2250 4900 4800
Connection ~ 4300 4750
Wire Wire Line
	4300 4750 4300 4800
$Comp
L Device:R R?
U 1 1 5E85E6D9
P 6100 4250
AR Path="/5D69D382/5E85E6D9" Ref="R?"  Part="1" 
AR Path="/5E85E6D9" Ref="R?"  Part="1" 
AR Path="/5E655037/5E85E6D9" Ref="R?"  Part="1" 
AR Path="/5E78F576/5E85E6D9" Ref="R1208"  Part="1" 
F 0 "R1208" H 6170 4296 50  0000 L CNN
F 1 "10k" H 6170 4205 50  0000 L CNN
F 2 "Resistor_SMD:R_0402_1005Metric" V 6030 4250 50  0001 C CNN
F 3 "~" H 6100 4250 50  0001 C CNN
F 4 "Delta Electronics/Cyntec" H 6100 4250 50  0001 C CNN "Manufacturer"
F 5 "PFR05S-103-FNH" H 6100 4250 50  0001 C CNN "PartNumber"
F 6 "3000-0000000131" H 6100 4250 50  0001 C CNN "PartSpecification"
	1    6100 4250
	0    1    1    0   
$EndComp
$Comp
L Device:R R?
U 1 1 5E85E6E1
P 6350 4000
AR Path="/5D69D382/5E85E6E1" Ref="R?"  Part="1" 
AR Path="/5E85E6E1" Ref="R?"  Part="1" 
AR Path="/5E655037/5E85E6E1" Ref="R?"  Part="1" 
AR Path="/5E78F576/5E85E6E1" Ref="R1211"  Part="1" 
F 0 "R1211" H 6420 4046 50  0000 L CNN
F 1 "10k" H 6420 3955 50  0000 L CNN
F 2 "Resistor_SMD:R_0402_1005Metric" V 6280 4000 50  0001 C CNN
F 3 "~" H 6350 4000 50  0001 C CNN
F 4 "Delta Electronics/Cyntec" H 6350 4000 50  0001 C CNN "Manufacturer"
F 5 "PFR05S-103-FNH" H 6350 4000 50  0001 C CNN "PartNumber"
F 6 "3000-0000000131" H 6350 4000 50  0001 C CNN "PartSpecification"
	1    6350 4000
	0    1    1    0   
$EndComp
Wire Wire Line
	5950 4250 5000 4250
Connection ~ 5000 4250
Wire Wire Line
	5000 4250 5000 2800
Wire Wire Line
	6200 4000 5100 4000
Connection ~ 5100 4000
Wire Wire Line
	5100 4000 5100 2950
$Comp
L Device:R R?
U 1 1 5E85E6EF
P 6100 3750
AR Path="/5D69D382/5E85E6EF" Ref="R?"  Part="1" 
AR Path="/5E85E6EF" Ref="R?"  Part="1" 
AR Path="/5E655037/5E85E6EF" Ref="R?"  Part="1" 
AR Path="/5E78F576/5E85E6EF" Ref="R1207"  Part="1" 
F 0 "R1207" H 6170 3796 50  0000 L CNN
F 1 "10k" H 6170 3705 50  0000 L CNN
F 2 "Resistor_SMD:R_0402_1005Metric" V 6030 3750 50  0001 C CNN
F 3 "~" H 6100 3750 50  0001 C CNN
F 4 "Delta Electronics/Cyntec" H 6100 3750 50  0001 C CNN "Manufacturer"
F 5 "PFR05S-103-FNH" H 6100 3750 50  0001 C CNN "PartNumber"
F 6 "3000-0000000131" H 6100 3750 50  0001 C CNN "PartSpecification"
	1    6100 3750
	0    1    1    0   
$EndComp
$Comp
L Device:R R?
U 1 1 5E85E6F7
P 6350 3500
AR Path="/5D69D382/5E85E6F7" Ref="R?"  Part="1" 
AR Path="/5E85E6F7" Ref="R?"  Part="1" 
AR Path="/5E655037/5E85E6F7" Ref="R?"  Part="1" 
AR Path="/5E78F576/5E85E6F7" Ref="R1210"  Part="1" 
F 0 "R1210" H 6420 3546 50  0000 L CNN
F 1 "10k" H 6420 3455 50  0000 L CNN
F 2 "Resistor_SMD:R_0402_1005Metric" V 6280 3500 50  0001 C CNN
F 3 "~" H 6350 3500 50  0001 C CNN
F 4 "Delta Electronics/Cyntec" H 6350 3500 50  0001 C CNN "Manufacturer"
F 5 "PFR05S-103-FNH" H 6350 3500 50  0001 C CNN "PartNumber"
F 6 "3000-0000000131" H 6350 3500 50  0001 C CNN "PartSpecification"
	1    6350 3500
	0    1    1    0   
$EndComp
Wire Wire Line
	5950 3750 5200 3750
Connection ~ 5200 3750
Wire Wire Line
	5200 3750 5200 3100
Wire Wire Line
	6200 3500 5300 3500
Connection ~ 5300 3500
Wire Wire Line
	5300 3500 5300 3250
Wire Wire Line
	6900 4250 6250 4250
Wire Wire Line
	6500 4000 6900 4000
Wire Wire Line
	6900 4000 6900 4250
Wire Wire Line
	6250 3750 6900 3750
Wire Wire Line
	6900 3750 6900 4000
Connection ~ 6900 4000
Wire Wire Line
	6500 3500 6900 3500
Wire Wire Line
	6900 3500 6900 3750
Connection ~ 6900 3750
$Comp
L Device:R R?
U 1 1 5E85E70E
P 6100 3250
AR Path="/5D69D382/5E85E70E" Ref="R?"  Part="1" 
AR Path="/5E85E70E" Ref="R?"  Part="1" 
AR Path="/5E655037/5E85E70E" Ref="R?"  Part="1" 
AR Path="/5E78F576/5E85E70E" Ref="R1206"  Part="1" 
F 0 "R1206" H 6170 3296 50  0000 L CNN
F 1 "10k" H 6170 3205 50  0000 L CNN
F 2 "Resistor_SMD:R_0402_1005Metric" V 6030 3250 50  0001 C CNN
F 3 "~" H 6100 3250 50  0001 C CNN
F 4 "Delta Electronics/Cyntec" H 6100 3250 50  0001 C CNN "Manufacturer"
F 5 "PFR05S-103-FNH" H 6100 3250 50  0001 C CNN "PartNumber"
F 6 "3000-0000000131" H 6100 3250 50  0001 C CNN "PartSpecification"
	1    6100 3250
	0    1    1    0   
$EndComp
Wire Wire Line
	5950 3250 5950 3400
Wire Wire Line
	5950 3400 5400 3400
Connection ~ 5400 3400
$Comp
L Device:R R?
U 1 1 5E85E719
P 6350 3000
AR Path="/5D69D382/5E85E719" Ref="R?"  Part="1" 
AR Path="/5E85E719" Ref="R?"  Part="1" 
AR Path="/5E655037/5E85E719" Ref="R?"  Part="1" 
AR Path="/5E78F576/5E85E719" Ref="R1209"  Part="1" 
F 0 "R1209" H 6420 3046 50  0000 L CNN
F 1 "10k" H 6420 2955 50  0000 L CNN
F 2 "Resistor_SMD:R_0402_1005Metric" V 6280 3000 50  0001 C CNN
F 3 "~" H 6350 3000 50  0001 C CNN
F 4 "Delta Electronics/Cyntec" H 6350 3000 50  0001 C CNN "Manufacturer"
F 5 "PFR05S-103-FNH" H 6350 3000 50  0001 C CNN "PartNumber"
F 6 "3000-0000000131" H 6350 3000 50  0001 C CNN "PartSpecification"
	1    6350 3000
	0    1    1    0   
$EndComp
$Comp
L Device:R R?
U 1 1 5E85E721
P 6100 2750
AR Path="/5D69D382/5E85E721" Ref="R?"  Part="1" 
AR Path="/5E85E721" Ref="R?"  Part="1" 
AR Path="/5E655037/5E85E721" Ref="R?"  Part="1" 
AR Path="/5E78F576/5E85E721" Ref="R1205"  Part="1" 
F 0 "R1205" H 6170 2796 50  0000 L CNN
F 1 "10k" H 6170 2705 50  0000 L CNN
F 2 "Resistor_SMD:R_0402_1005Metric" V 6030 2750 50  0001 C CNN
F 3 "~" H 6100 2750 50  0001 C CNN
F 4 "Delta Electronics/Cyntec" H 6100 2750 50  0001 C CNN "Manufacturer"
F 5 "PFR05S-103-FNH" H 6100 2750 50  0001 C CNN "PartNumber"
F 6 "3000-0000000131" H 6100 2750 50  0001 C CNN "PartSpecification"
	1    6100 2750
	0    1    1    0   
$EndComp
Wire Wire Line
	6200 3000 5500 3000
Connection ~ 5500 3000
Wire Wire Line
	5500 3000 5500 2800
Wire Wire Line
	5950 2750 5600 2750
Connection ~ 5600 2750
Wire Wire Line
	5600 2750 5600 2600
Wire Wire Line
	6250 3250 6900 3250
Wire Wire Line
	6900 3250 6900 3500
Connection ~ 6900 3500
Wire Wire Line
	6500 3000 6900 3000
Wire Wire Line
	6900 3000 6900 3250
Connection ~ 6900 3250
Wire Wire Line
	6250 2750 6900 2750
Wire Wire Line
	6900 2750 6900 3000
Connection ~ 6900 3000
$Comp
L power:+3.3V #PWR?
U 1 1 5E85E736
P 6900 2650
AR Path="/5E85E736" Ref="#PWR?"  Part="1" 
AR Path="/5E655037/5E85E736" Ref="#PWR?"  Part="1" 
AR Path="/5E78F576/5E85E736" Ref="#PWR?"  Part="1" 
F 0 "#PWR?" H 6900 2500 50  0001 C CNN
F 1 "+3.3V" H 6915 2823 50  0000 C CNN
F 2 "" H 6900 2650 50  0001 C CNN
F 3 "" H 6900 2650 50  0001 C CNN
	1    6900 2650
	1    0    0    -1  
$EndComp
Wire Wire Line
	6900 2650 6900 2750
Connection ~ 6900 2750
$EndSCHEMATC
