EESchema Schematic File Version 4
EELAYER 30 0
EELAYER END
$Descr A4 11693 8268
encoding utf-8
Sheet 1 1
Title ""
Date ""
Rev ""
Comp ""
Comment1 ""
Comment2 ""
Comment3 ""
Comment4 ""
$EndDescr
$Comp
L Connector:Conn_Coaxial J1
U 1 1 5B583F23
P 2350 2350
F 0 "J1" H 2280 2588 50  0000 C CNN
F 1 "Conn_Coaxial" H 2280 2497 50  0000 C CNN
F 2 "rf:SMA_endlaunch_SD-73251-115" H 2350 2350 50  0001 C CNN
F 3 " ~" H 2350 2350 50  0001 C CNN
	1    2350 2350
	-1   0    0    -1  
$EndComp
$Comp
L rf:SKY13489-001 U1
U 1 1 5B584096
P 4700 2400
F 0 "U1" H 5191 2446 50  0000 L CNN
F 1 "SKY13489-001" H 5191 2355 50  0000 L CNN
F 2 "rf:BGA-6_3x2_1.5x1.0mm" H 5500 1800 50  0001 C CNN
F 3 "" H 5500 1800 50  0001 C CNN
	1    4700 2400
	1    0    0    -1  
$EndComp
Wire Wire Line
	2550 2350 4250 2350
$Comp
L Connector:Conn_Coaxial J2
U 1 1 5B584168
P 2850 2450
F 0 "J2" H 2780 2688 50  0000 C CNN
F 1 "Conn_Coaxial" H 2780 2597 50  0000 C CNN
F 2 "rf:SMA_endlaunch_SD-73251-115" H 2850 2450 50  0001 C CNN
F 3 " ~" H 2850 2450 50  0001 C CNN
	1    2850 2450
	-1   0    0    -1  
$EndComp
Wire Wire Line
	3050 2450 4250 2450
$Comp
L power:GND #PWR?
U 1 1 5B5841FE
P 4950 3050
F 0 "#PWR?" H 4950 2800 50  0001 C CNN
F 1 "GND" H 4955 2877 50  0000 C CNN
F 2 "" H 4950 3050 50  0001 C CNN
F 3 "" H 4950 3050 50  0001 C CNN
	1    4950 3050
	1    0    0    -1  
$EndComp
$Comp
L power:GND #PWR?
U 1 1 5B584216
P 2850 3050
F 0 "#PWR?" H 2850 2800 50  0001 C CNN
F 1 "GND" H 2855 2877 50  0000 C CNN
F 2 "" H 2850 3050 50  0001 C CNN
F 3 "" H 2850 3050 50  0001 C CNN
	1    2850 3050
	1    0    0    -1  
$EndComp
Wire Wire Line
	2850 3050 2850 2650
Wire Wire Line
	4950 3050 4950 2800
$Comp
L power:GND #PWR?
U 1 1 5B58423A
P 2350 3050
F 0 "#PWR?" H 2350 2800 50  0001 C CNN
F 1 "GND" H 2355 2877 50  0000 C CNN
F 2 "" H 2350 3050 50  0001 C CNN
F 3 "" H 2350 3050 50  0001 C CNN
	1    2350 3050
	1    0    0    -1  
$EndComp
Wire Wire Line
	2350 3050 2350 2550
$Comp
L power:VDD #PWR?
U 1 1 5B5842B4
P 4700 1300
F 0 "#PWR?" H 4700 1150 50  0001 C CNN
F 1 "VDD" H 4717 1473 50  0000 C CNN
F 2 "" H 4700 1300 50  0001 C CNN
F 3 "" H 4700 1300 50  0001 C CNN
	1    4700 1300
	1    0    0    -1  
$EndComp
$Comp
L Connector:Conn_Coaxial J4
U 1 1 5B5842EF
P 6100 2400
F 0 "J4" H 6199 2376 50  0000 L CNN
F 1 "Conn_Coaxial" H 6199 2285 50  0000 L CNN
F 2 "rf:SMA_endlaunch_SD-73251-115" H 6100 2400 50  0001 C CNN
F 3 " ~" H 6100 2400 50  0001 C CNN
	1    6100 2400
	1    0    0    -1  
$EndComp
$Comp
L power:GND #PWR?
U 1 1 5B58439A
P 6100 3050
F 0 "#PWR?" H 6100 2800 50  0001 C CNN
F 1 "GND" H 6105 2877 50  0000 C CNN
F 2 "" H 6100 3050 50  0001 C CNN
F 3 "" H 6100 3050 50  0001 C CNN
	1    6100 3050
	1    0    0    -1  
$EndComp
Wire Wire Line
	6100 3050 6100 2600
Wire Wire Line
	5900 2400 5150 2400
Wire Wire Line
	4700 2800 4700 3000
Text Label 3800 3000 0    50   ~ 0
VCTL
$Comp
L Connector:Conn_01x03_Male J3
U 1 1 5B5844F9
P 3450 3000
F 0 "J3" H 3556 3278 50  0000 C CNN
F 1 "Conn_01x03_Male" H 3556 3187 50  0000 C CNN
F 2 "Connector_PinHeader_2.54mm:PinHeader_1x03_P2.54mm_Vertical" H 3450 3000 50  0001 C CNN
F 3 "~" H 3450 3000 50  0001 C CNN
	1    3450 3000
	1    0    0    -1  
$EndComp
$Comp
L power:VDD #PWR?
U 1 1 5B58459E
P 4000 2700
F 0 "#PWR?" H 4000 2550 50  0001 C CNN
F 1 "VDD" H 4017 2873 50  0000 C CNN
F 2 "" H 4000 2700 50  0001 C CNN
F 3 "" H 4000 2700 50  0001 C CNN
	1    4000 2700
	1    0    0    -1  
$EndComp
$Comp
L power:GND #PWR?
U 1 1 5B5845B3
P 4000 3250
F 0 "#PWR?" H 4000 3000 50  0001 C CNN
F 1 "GND" H 4005 3077 50  0000 C CNN
F 2 "" H 4000 3250 50  0001 C CNN
F 3 "" H 4000 3250 50  0001 C CNN
	1    4000 3250
	1    0    0    -1  
$EndComp
Wire Wire Line
	4000 3250 4000 3100
Wire Wire Line
	4000 3100 3650 3100
Wire Wire Line
	3650 2900 4000 2900
Wire Wire Line
	4000 2900 4000 2700
$Comp
L Device:R R1
U 1 1 5B578313
P 4350 3000
F 0 "R1" V 4143 3000 50  0000 C CNN
F 1 "100" V 4234 3000 50  0000 C CNN
F 2 "Resistor_SMD:R_0603_1608Metric" V 4280 3000 50  0001 C CNN
F 3 "~" H 4350 3000 50  0001 C CNN
	1    4350 3000
	0    1    1    0   
$EndComp
Wire Wire Line
	4700 3000 4500 3000
Wire Wire Line
	4200 3000 3650 3000
$Comp
L Device:R R2
U 1 1 5B578581
P 4700 1550
F 0 "R2" H 4630 1504 50  0000 R CNN
F 1 "10" H 4630 1595 50  0000 R CNN
F 2 "Resistor_SMD:R_0603_1608Metric" V 4630 1550 50  0001 C CNN
F 3 "~" H 4700 1550 50  0001 C CNN
	1    4700 1550
	-1   0    0    1   
$EndComp
$Comp
L Device:C C1
U 1 1 5B578623
P 5400 1950
F 0 "C1" H 5515 1996 50  0000 L CNN
F 1 "1u" H 5515 1905 50  0000 L CNN
F 2 "Capacitor_SMD:C_0402_1005Metric" H 5438 1800 50  0001 C CNN
F 3 "~" H 5400 1950 50  0001 C CNN
	1    5400 1950
	1    0    0    -1  
$EndComp
$Comp
L Device:C C2
U 1 1 5B578697
P 5850 1950
F 0 "C2" H 5965 1996 50  0000 L CNN
F 1 "1n" H 5965 1905 50  0000 L CNN
F 2 "Capacitor_SMD:C_0402_1005Metric" H 5888 1800 50  0001 C CNN
F 3 "~" H 5850 1950 50  0001 C CNN
	1    5850 1950
	1    0    0    -1  
$EndComp
Wire Wire Line
	4700 1400 4700 1300
Wire Wire Line
	4700 1700 4700 1750
$Comp
L power:GND #PWR?
U 1 1 5B57891D
P 5400 2200
F 0 "#PWR?" H 5400 1950 50  0001 C CNN
F 1 "GND" H 5405 2027 50  0000 C CNN
F 2 "" H 5400 2200 50  0001 C CNN
F 3 "" H 5400 2200 50  0001 C CNN
	1    5400 2200
	1    0    0    -1  
$EndComp
$Comp
L power:GND #PWR?
U 1 1 5B57893A
P 5850 2200
F 0 "#PWR?" H 5850 1950 50  0001 C CNN
F 1 "GND" H 5855 2027 50  0000 C CNN
F 2 "" H 5850 2200 50  0001 C CNN
F 3 "" H 5850 2200 50  0001 C CNN
	1    5850 2200
	1    0    0    -1  
$EndComp
Wire Wire Line
	5850 2200 5850 2100
Wire Wire Line
	5400 2200 5400 2100
Wire Wire Line
	5850 1800 5850 1750
Wire Wire Line
	5850 1750 5400 1750
Wire Wire Line
	5400 1750 5400 1800
Wire Wire Line
	5400 1750 4700 1750
Connection ~ 5400 1750
Connection ~ 4700 1750
Wire Wire Line
	4700 1750 4700 2000
Text Label 3550 2350 0    50   ~ 0
RF1
Text Label 3550 2450 0    50   ~ 0
RF2
Text Label 5550 2400 0    50   ~ 0
RFC
Text Label 4600 3000 0    50   ~ 0
VCTL_1
Text Label 4950 1750 0    50   ~ 0
VDD_1
$Comp
L Connector:Conn_Coaxial J5
U 1 1 5B5791A4
P 2100 4400
F 0 "J5" H 2030 4638 50  0000 C CNN
F 1 "Conn_Coaxial" H 2030 4547 50  0000 C CNN
F 2 "rf:oshpark4_cbcpw_50" H 2100 4400 50  0001 C CNN
F 3 " ~" H 2100 4400 50  0001 C CNN
	1    2100 4400
	-1   0    0    -1  
$EndComp
Wire Wire Line
	2300 4400 4000 4400
$Comp
L Connector:Conn_Coaxial J6
U 1 1 5B5791B1
P 2600 4500
F 0 "J6" H 2530 4738 50  0000 C CNN
F 1 "Conn_Coaxial" H 2530 4647 50  0000 C CNN
F 2 "rf:oshpark4_cbcpw_50" H 2600 4500 50  0001 C CNN
F 3 " ~" H 2600 4500 50  0001 C CNN
	1    2600 4500
	-1   0    0    -1  
$EndComp
Wire Wire Line
	2800 4500 4000 4500
$Comp
L power:GND #PWR?
U 1 1 5B5791BE
P 2600 5100
F 0 "#PWR?" H 2600 4850 50  0001 C CNN
F 1 "GND" H 2605 4927 50  0000 C CNN
F 2 "" H 2600 5100 50  0001 C CNN
F 3 "" H 2600 5100 50  0001 C CNN
	1    2600 5100
	1    0    0    -1  
$EndComp
Wire Wire Line
	2600 5100 2600 4700
$Comp
L power:GND #PWR?
U 1 1 5B5791C6
P 2100 5100
F 0 "#PWR?" H 2100 4850 50  0001 C CNN
F 1 "GND" H 2105 4927 50  0000 C CNN
F 2 "" H 2100 5100 50  0001 C CNN
F 3 "" H 2100 5100 50  0001 C CNN
	1    2100 5100
	1    0    0    -1  
$EndComp
Wire Wire Line
	2100 5100 2100 4600
$Comp
L Connector:Conn_Coaxial J7
U 1 1 5B5791CD
P 5850 4450
F 0 "J7" H 5949 4426 50  0000 L CNN
F 1 "Conn_Coaxial" H 5949 4335 50  0000 L CNN
F 2 "rf:oshpark4_cbcpw_50" H 5850 4450 50  0001 C CNN
F 3 " ~" H 5850 4450 50  0001 C CNN
	1    5850 4450
	1    0    0    -1  
$EndComp
$Comp
L power:GND #PWR?
U 1 1 5B5791D3
P 5850 5100
F 0 "#PWR?" H 5850 4850 50  0001 C CNN
F 1 "GND" H 5855 4927 50  0000 C CNN
F 2 "" H 5850 5100 50  0001 C CNN
F 3 "" H 5850 5100 50  0001 C CNN
	1    5850 5100
	1    0    0    -1  
$EndComp
Wire Wire Line
	5850 5100 5850 4650
Wire Wire Line
	5650 4450 4900 4450
Text Label 3300 4400 0    50   ~ 0
RF1
Text Label 3300 4500 0    50   ~ 0
RF2
Text Label 5300 4450 0    50   ~ 0
RFC
$EndSCHEMATC
