EESchema Schematic File Version 4
EELAYER 30 0
EELAYER END
$Descr A4 11693 8268
encoding utf-8
Sheet 11 39
Title ""
Date ""
Rev ""
Comp ""
Comment1 ""
Comment2 ""
Comment3 ""
Comment4 ""
$EndDescr
$Comp
L POWDER_RF:SKYA21003 U1102
U 1 1 60AF3632
P 2400 3550
AR Path="/60ADA657/60AF3632" Ref="U1102"  Part="1" 
AR Path="/60C1ED24/60AF3632" Ref="U1202"  Part="1" 
F 0 "U1202" H 2750 4050 50  0000 C CNN
F 1 "SKYA21003" H 2050 4050 50  0000 C CNN
F 2 "POWDER_RF:SKYA21003" H 2400 3550 50  0001 C CNN
F 3 "" H 2400 3550 50  0001 C CNN
F 4 "3000-0000001307" H 2400 3550 50  0001 C CNN "PartSpecification"
	1    2400 3550
	1    0    0    -1  
$EndComp
$Comp
L POWDER_RF:SKYA21003 U1103
U 1 1 60AF3C9E
P 8600 3550
AR Path="/60ADA657/60AF3C9E" Ref="U1103"  Part="1" 
AR Path="/60C1ED24/60AF3C9E" Ref="U1203"  Part="1" 
F 0 "U1203" H 8300 4050 50  0000 C CNN
F 1 "SKYA21003" H 8900 4050 50  0000 C CNN
F 2 "POWDER_RF:SKYA21003" H 8600 3550 50  0001 C CNN
F 3 "" H 8600 3550 50  0001 C CNN
F 4 "3000-0000001307" H 8600 3550 50  0001 C CNN "PartSpecification"
	1    8600 3550
	-1   0    0    -1  
$EndComp
$Comp
L power:GND #PWR?
U 1 1 60AF5F49
P 2150 4200
AR Path="/60ADA657/60AF5F49" Ref="#PWR?"  Part="1" 
AR Path="/60C1ED24/60AF5F49" Ref="#PWR?"  Part="1" 
F 0 "#PWR?" H 2150 3950 50  0001 C CNN
F 1 "GND" H 2155 4027 50  0000 C CNN
F 2 "" H 2150 4200 50  0001 C CNN
F 3 "" H 2150 4200 50  0001 C CNN
	1    2150 4200
	1    0    0    -1  
$EndComp
Wire Wire Line
	2150 4200 2150 4100
$Comp
L POWDER_RF:DEA252593BT-2074A3 FL1101
U 1 1 60AF67A4
P 5300 2700
AR Path="/60ADA657/60AF67A4" Ref="FL1101"  Part="1" 
AR Path="/60C1ED24/60AF67A4" Ref="FL1201"  Part="1" 
F 0 "FL1201" H 5300 3065 50  0000 C CNN
F 1 "DEA252593BT-2074A3" H 5300 2974 50  0000 C CNN
F 2 "POWDER_RF:DEA252593BT-2074A3" H 5300 3050 50  0001 C CNN
F 3 "" H 5300 2700 50  0001 C CNN
F 4 "3000-0000001377" H 5300 2700 50  0001 C CNN "PartSpecification"
	1    5300 2700
	1    0    0    -1  
$EndComp
Text Notes 5250 2100 0    50   ~ 0
b41
$Comp
L POWDER_RF:DEA202450BT-1275A1 U1104
U 1 1 60AF79DA
P 5300 4350
AR Path="/60ADA657/60AF79DA" Ref="U1104"  Part="1" 
AR Path="/60C1ED24/60AF79DA" Ref="U1204"  Part="1" 
F 0 "U1204" H 5300 4665 50  0000 C CNN
F 1 "DEA202450BT-1275A1" H 5300 4574 50  0000 C CNN
F 2 "POWDER_RF:DEA202450BT-1275A1" H 5300 4650 50  0001 C CNN
F 3 "" H 5300 4350 50  0001 C CNN
F 4 "3000-0000001378" H 5300 4350 50  0001 C CNN "PartSpecification"
	1    5300 4350
	1    0    0    -1  
$EndComp
$Comp
L power:GND #PWR?
U 1 1 60AF881D
P 2250 4200
AR Path="/60ADA657/60AF881D" Ref="#PWR?"  Part="1" 
AR Path="/60C1ED24/60AF881D" Ref="#PWR?"  Part="1" 
F 0 "#PWR?" H 2250 3950 50  0001 C CNN
F 1 "GND" H 2255 4027 50  0000 C CNN
F 2 "" H 2250 4200 50  0001 C CNN
F 3 "" H 2250 4200 50  0001 C CNN
	1    2250 4200
	1    0    0    -1  
$EndComp
Wire Wire Line
	2250 4200 2250 4100
$Comp
L power:GND #PWR?
U 1 1 60AF89D8
P 2350 4200
AR Path="/60ADA657/60AF89D8" Ref="#PWR?"  Part="1" 
AR Path="/60C1ED24/60AF89D8" Ref="#PWR?"  Part="1" 
F 0 "#PWR?" H 2350 3950 50  0001 C CNN
F 1 "GND" H 2355 4027 50  0000 C CNN
F 2 "" H 2350 4200 50  0001 C CNN
F 3 "" H 2350 4200 50  0001 C CNN
	1    2350 4200
	1    0    0    -1  
$EndComp
Wire Wire Line
	2350 4200 2350 4100
$Comp
L power:GND #PWR?
U 1 1 60AF8BF1
P 2450 4200
AR Path="/60ADA657/60AF8BF1" Ref="#PWR?"  Part="1" 
AR Path="/60C1ED24/60AF8BF1" Ref="#PWR?"  Part="1" 
F 0 "#PWR?" H 2450 3950 50  0001 C CNN
F 1 "GND" H 2455 4027 50  0000 C CNN
F 2 "" H 2450 4200 50  0001 C CNN
F 3 "" H 2450 4200 50  0001 C CNN
	1    2450 4200
	1    0    0    -1  
$EndComp
Wire Wire Line
	2450 4200 2450 4100
$Comp
L power:GND #PWR?
U 1 1 60AF8D81
P 2550 4200
AR Path="/60ADA657/60AF8D81" Ref="#PWR?"  Part="1" 
AR Path="/60C1ED24/60AF8D81" Ref="#PWR?"  Part="1" 
F 0 "#PWR?" H 2550 3950 50  0001 C CNN
F 1 "GND" H 2555 4027 50  0000 C CNN
F 2 "" H 2550 4200 50  0001 C CNN
F 3 "" H 2550 4200 50  0001 C CNN
	1    2550 4200
	1    0    0    -1  
$EndComp
Wire Wire Line
	2550 4200 2550 4100
$Comp
L power:GND #PWR?
U 1 1 60AF8F75
P 2650 4200
AR Path="/60ADA657/60AF8F75" Ref="#PWR?"  Part="1" 
AR Path="/60C1ED24/60AF8F75" Ref="#PWR?"  Part="1" 
F 0 "#PWR?" H 2650 3950 50  0001 C CNN
F 1 "GND" H 2655 4027 50  0000 C CNN
F 2 "" H 2650 4200 50  0001 C CNN
F 3 "" H 2650 4200 50  0001 C CNN
	1    2650 4200
	1    0    0    -1  
$EndComp
Wire Wire Line
	2650 4200 2650 4100
$Comp
L power:GND #PWR?
U 1 1 60AF9206
P 5250 3100
AR Path="/60ADA657/60AF9206" Ref="#PWR?"  Part="1" 
AR Path="/60C1ED24/60AF9206" Ref="#PWR?"  Part="1" 
F 0 "#PWR?" H 5250 2850 50  0001 C CNN
F 1 "GND" H 5255 2927 50  0000 C CNN
F 2 "" H 5250 3100 50  0001 C CNN
F 3 "" H 5250 3100 50  0001 C CNN
	1    5250 3100
	1    0    0    -1  
$EndComp
Wire Wire Line
	5250 3100 5250 3000
$Comp
L power:GND #PWR?
U 1 1 60AF93E1
P 5350 3100
AR Path="/60ADA657/60AF93E1" Ref="#PWR?"  Part="1" 
AR Path="/60C1ED24/60AF93E1" Ref="#PWR?"  Part="1" 
F 0 "#PWR?" H 5350 2850 50  0001 C CNN
F 1 "GND" H 5355 2927 50  0000 C CNN
F 2 "" H 5350 3100 50  0001 C CNN
F 3 "" H 5350 3100 50  0001 C CNN
	1    5350 3100
	1    0    0    -1  
$EndComp
Wire Wire Line
	5350 3100 5350 3000
$Comp
L power:GND #PWR?
U 1 1 60AF9737
P 5250 4700
AR Path="/60ADA657/60AF9737" Ref="#PWR?"  Part="1" 
AR Path="/60C1ED24/60AF9737" Ref="#PWR?"  Part="1" 
F 0 "#PWR?" H 5250 4450 50  0001 C CNN
F 1 "GND" H 5255 4527 50  0000 C CNN
F 2 "" H 5250 4700 50  0001 C CNN
F 3 "" H 5250 4700 50  0001 C CNN
	1    5250 4700
	1    0    0    -1  
$EndComp
Wire Wire Line
	5250 4700 5250 4600
$Comp
L power:GND #PWR?
U 1 1 60AF9962
P 5350 4700
AR Path="/60ADA657/60AF9962" Ref="#PWR?"  Part="1" 
AR Path="/60C1ED24/60AF9962" Ref="#PWR?"  Part="1" 
F 0 "#PWR?" H 5350 4450 50  0001 C CNN
F 1 "GND" H 5355 4527 50  0000 C CNN
F 2 "" H 5350 4700 50  0001 C CNN
F 3 "" H 5350 4700 50  0001 C CNN
	1    5350 4700
	1    0    0    -1  
$EndComp
Wire Wire Line
	5350 4700 5350 4600
$Comp
L power:GND #PWR?
U 1 1 60AF9D0E
P 8350 4200
AR Path="/60ADA657/60AF9D0E" Ref="#PWR?"  Part="1" 
AR Path="/60C1ED24/60AF9D0E" Ref="#PWR?"  Part="1" 
F 0 "#PWR?" H 8350 3950 50  0001 C CNN
F 1 "GND" H 8355 4027 50  0000 C CNN
F 2 "" H 8350 4200 50  0001 C CNN
F 3 "" H 8350 4200 50  0001 C CNN
	1    8350 4200
	1    0    0    -1  
$EndComp
Wire Wire Line
	8350 4200 8350 4100
$Comp
L power:GND #PWR?
U 1 1 60AF9FB6
P 8450 4200
AR Path="/60ADA657/60AF9FB6" Ref="#PWR?"  Part="1" 
AR Path="/60C1ED24/60AF9FB6" Ref="#PWR?"  Part="1" 
F 0 "#PWR?" H 8450 3950 50  0001 C CNN
F 1 "GND" H 8455 4027 50  0000 C CNN
F 2 "" H 8450 4200 50  0001 C CNN
F 3 "" H 8450 4200 50  0001 C CNN
	1    8450 4200
	1    0    0    -1  
$EndComp
Wire Wire Line
	8450 4200 8450 4100
$Comp
L power:GND #PWR?
U 1 1 60AFA2C5
P 8550 4200
AR Path="/60ADA657/60AFA2C5" Ref="#PWR?"  Part="1" 
AR Path="/60C1ED24/60AFA2C5" Ref="#PWR?"  Part="1" 
F 0 "#PWR?" H 8550 3950 50  0001 C CNN
F 1 "GND" H 8555 4027 50  0000 C CNN
F 2 "" H 8550 4200 50  0001 C CNN
F 3 "" H 8550 4200 50  0001 C CNN
	1    8550 4200
	1    0    0    -1  
$EndComp
Wire Wire Line
	8550 4200 8550 4100
$Comp
L power:GND #PWR?
U 1 1 60AFA63E
P 8650 4200
AR Path="/60ADA657/60AFA63E" Ref="#PWR?"  Part="1" 
AR Path="/60C1ED24/60AFA63E" Ref="#PWR?"  Part="1" 
F 0 "#PWR?" H 8650 3950 50  0001 C CNN
F 1 "GND" H 8655 4027 50  0000 C CNN
F 2 "" H 8650 4200 50  0001 C CNN
F 3 "" H 8650 4200 50  0001 C CNN
	1    8650 4200
	1    0    0    -1  
$EndComp
Wire Wire Line
	8650 4200 8650 4100
$Comp
L power:GND #PWR?
U 1 1 60AFA9B8
P 8750 4200
AR Path="/60ADA657/60AFA9B8" Ref="#PWR?"  Part="1" 
AR Path="/60C1ED24/60AFA9B8" Ref="#PWR?"  Part="1" 
F 0 "#PWR?" H 8750 3950 50  0001 C CNN
F 1 "GND" H 8755 4027 50  0000 C CNN
F 2 "" H 8750 4200 50  0001 C CNN
F 3 "" H 8750 4200 50  0001 C CNN
	1    8750 4200
	1    0    0    -1  
$EndComp
Wire Wire Line
	8750 4200 8750 4100
$Comp
L power:GND #PWR?
U 1 1 60AFAD5A
P 8850 4200
AR Path="/60ADA657/60AFAD5A" Ref="#PWR?"  Part="1" 
AR Path="/60C1ED24/60AFAD5A" Ref="#PWR?"  Part="1" 
F 0 "#PWR?" H 8850 3950 50  0001 C CNN
F 1 "GND" H 8855 4027 50  0000 C CNN
F 2 "" H 8850 4200 50  0001 C CNN
F 3 "" H 8850 4200 50  0001 C CNN
	1    8850 4200
	1    0    0    -1  
$EndComp
Wire Wire Line
	8850 4200 8850 4100
Wire Wire Line
	8100 3500 7500 3500
Wire Wire Line
	7500 3500 7500 2700
Wire Wire Line
	7500 2700 5700 2700
Wire Wire Line
	8100 3400 7600 3400
Wire Wire Line
	7600 3400 7600 4350
Wire Wire Line
	7600 4350 5700 4350
Wire Wire Line
	4900 4350 4000 4350
Wire Wire Line
	4000 4350 4000 3500
Wire Wire Line
	4000 3500 2900 3500
Wire Wire Line
	2900 3400 4000 3400
Wire Wire Line
	4000 3400 4000 2700
Wire Wire Line
	4000 2700 4900 2700
Wire Wire Line
	1900 3600 1500 3600
Wire Wire Line
	1900 3700 1500 3700
Wire Wire Line
	1900 3400 1500 3400
Wire Wire Line
	9100 3400 9500 3400
Wire Wire Line
	9500 3600 9100 3600
Wire Wire Line
	9500 3700 9100 3700
Text HLabel 1500 3400 0    50   Input ~ 0
RF_IN
Text HLabel 9500 3400 2    50   Output ~ 0
RF_OUT
Text HLabel 1500 3600 0    50   Input ~ 0
CTRL_1
Text HLabel 1500 3700 0    50   Input ~ 0
ENABLE
Text HLabel 9500 3700 2    50   Input ~ 0
ENABLE
Text HLabel 9500 3600 2    50   Input ~ 0
CTRL_2
$Comp
L POWDER_PowerGlobals:+4.8V #PWR?
U 1 1 6057B011
P 3500 2500
AR Path="/60ADA657/6057B011" Ref="#PWR?"  Part="1" 
AR Path="/60C1ED24/6057B011" Ref="#PWR?"  Part="1" 
F 0 "#PWR?" H 3500 2350 50  0001 C CNN
F 1 "+4.8V" H 3515 2673 50  0000 C CNN
F 2 "" H 3500 2500 50  0001 C CNN
F 3 "" H 3500 2500 50  0001 C CNN
	1    3500 2500
	1    0    0    -1  
$EndComp
$Comp
L POWDER_PowerGlobals:+4.8V #PWR?
U 1 1 6057B017
P 3000 2500
AR Path="/6057B017" Ref="#PWR?"  Part="1" 
AR Path="/60ADA657/6057B017" Ref="#PWR?"  Part="1" 
AR Path="/60C1ED24/6057B017" Ref="#PWR?"  Part="1" 
F 0 "#PWR?" H 3000 2350 50  0001 C CNN
F 1 "+4.8V" H 3015 2673 50  0000 C CNN
F 2 "" H 3000 2500 50  0001 C CNN
F 3 "" H 3000 2500 50  0001 C CNN
	1    3000 2500
	1    0    0    -1  
$EndComp
$Comp
L 000_PreferredParts:C_10pF C1108
U 1 1 6057B01E
P 3500 2750
AR Path="/60ADA657/6057B01E" Ref="C1108"  Part="1" 
AR Path="/60C1ED24/6057B01E" Ref="C1230"  Part="1" 
F 0 "C1230" H 3615 2796 50  0000 L CNN
F 1 "C_10pF" H 3615 2705 50  0000 L CNN
F 2 "Capacitor_SMD:C_0402_1005Metric" H 3538 2600 50  0001 C CNN
F 3 "~" H 3500 2750 50  0001 C CNN
F 4 "3000-0000000582" H 3500 2750 50  0001 C CNN "PartSpecification"
	1    3500 2750
	1    0    0    -1  
$EndComp
$Comp
L 000_PreferredParts:C_1nF C1107
U 1 1 6057B025
P 3000 2750
AR Path="/60ADA657/6057B025" Ref="C1107"  Part="1" 
AR Path="/60C1ED24/6057B025" Ref="C1229"  Part="1" 
F 0 "C1229" H 3115 2796 50  0000 L CNN
F 1 "C_1nF" H 3115 2705 50  0000 L CNN
F 2 "Capacitor_SMD:C_0402_1005Metric" H 3038 2600 50  0001 C CNN
F 3 "~" H 3000 2750 50  0001 C CNN
F 4 "3000-0000000128" H 3000 2750 50  0001 C CNN "PartSpecification"
	1    3000 2750
	1    0    0    -1  
$EndComp
$Comp
L power:GND #PWR?
U 1 1 6057B02B
P 3500 3000
AR Path="/60ADA657/6057B02B" Ref="#PWR?"  Part="1" 
AR Path="/60C1ED24/6057B02B" Ref="#PWR?"  Part="1" 
F 0 "#PWR?" H 3500 2750 50  0001 C CNN
F 1 "GND" H 3505 2827 50  0000 C CNN
F 2 "" H 3500 3000 50  0001 C CNN
F 3 "" H 3500 3000 50  0001 C CNN
	1    3500 3000
	1    0    0    -1  
$EndComp
$Comp
L power:GND #PWR?
U 1 1 6057B031
P 3000 3000
AR Path="/60ADA657/6057B031" Ref="#PWR?"  Part="1" 
AR Path="/60C1ED24/6057B031" Ref="#PWR?"  Part="1" 
F 0 "#PWR?" H 3000 2750 50  0001 C CNN
F 1 "GND" H 3005 2827 50  0000 C CNN
F 2 "" H 3000 3000 50  0001 C CNN
F 3 "" H 3000 3000 50  0001 C CNN
	1    3000 3000
	1    0    0    -1  
$EndComp
Wire Wire Line
	3000 3000 3000 2900
Wire Wire Line
	3500 2900 3500 3000
Wire Wire Line
	3500 2600 3500 2500
Wire Wire Line
	3000 2500 3000 2600
$Comp
L POWDER_PowerGlobals:+4.8V #PWR?
U 1 1 6057D1F9
P 2400 2900
AR Path="/6057D1F9" Ref="#PWR?"  Part="1" 
AR Path="/60ADA657/6057D1F9" Ref="#PWR?"  Part="1" 
AR Path="/60C1ED24/6057D1F9" Ref="#PWR?"  Part="1" 
F 0 "#PWR?" H 2400 2750 50  0001 C CNN
F 1 "+4.8V" H 2415 3073 50  0000 C CNN
F 2 "" H 2400 2900 50  0001 C CNN
F 3 "" H 2400 2900 50  0001 C CNN
	1    2400 2900
	1    0    0    -1  
$EndComp
Wire Wire Line
	2400 2900 2400 3000
$Comp
L POWDER_PowerGlobals:+4.8V #PWR?
U 1 1 605830B1
P 10000 2000
AR Path="/60ADA657/605830B1" Ref="#PWR?"  Part="1" 
AR Path="/60C1ED24/605830B1" Ref="#PWR?"  Part="1" 
F 0 "#PWR?" H 10000 1850 50  0001 C CNN
F 1 "+4.8V" H 10015 2173 50  0000 C CNN
F 2 "" H 10000 2000 50  0001 C CNN
F 3 "" H 10000 2000 50  0001 C CNN
	1    10000 2000
	1    0    0    -1  
$EndComp
$Comp
L POWDER_PowerGlobals:+4.8V #PWR?
U 1 1 605830B7
P 9500 2000
AR Path="/605830B7" Ref="#PWR?"  Part="1" 
AR Path="/60ADA657/605830B7" Ref="#PWR?"  Part="1" 
AR Path="/60C1ED24/605830B7" Ref="#PWR?"  Part="1" 
F 0 "#PWR?" H 9500 1850 50  0001 C CNN
F 1 "+4.8V" H 9515 2173 50  0000 C CNN
F 2 "" H 9500 2000 50  0001 C CNN
F 3 "" H 9500 2000 50  0001 C CNN
	1    9500 2000
	1    0    0    -1  
$EndComp
$Comp
L 000_PreferredParts:C_10pF C1106
U 1 1 605830BE
P 10000 2250
AR Path="/60ADA657/605830BE" Ref="C1106"  Part="1" 
AR Path="/60C1ED24/605830BE" Ref="C1228"  Part="1" 
F 0 "C1228" H 10115 2296 50  0000 L CNN
F 1 "C_10pF" H 10115 2205 50  0000 L CNN
F 2 "Capacitor_SMD:C_0402_1005Metric" H 10038 2100 50  0001 C CNN
F 3 "~" H 10000 2250 50  0001 C CNN
F 4 "3000-0000000582" H 10000 2250 50  0001 C CNN "PartSpecification"
	1    10000 2250
	1    0    0    -1  
$EndComp
$Comp
L 000_PreferredParts:C_1nF C1105
U 1 1 605830C5
P 9500 2250
AR Path="/60ADA657/605830C5" Ref="C1105"  Part="1" 
AR Path="/60C1ED24/605830C5" Ref="C1227"  Part="1" 
F 0 "C1227" H 9615 2296 50  0000 L CNN
F 1 "C_1nF" H 9615 2205 50  0000 L CNN
F 2 "Capacitor_SMD:C_0402_1005Metric" H 9538 2100 50  0001 C CNN
F 3 "~" H 9500 2250 50  0001 C CNN
F 4 "3000-0000000128" H 9500 2250 50  0001 C CNN "PartSpecification"
	1    9500 2250
	1    0    0    -1  
$EndComp
$Comp
L power:GND #PWR?
U 1 1 605830CB
P 10000 2500
AR Path="/60ADA657/605830CB" Ref="#PWR?"  Part="1" 
AR Path="/60C1ED24/605830CB" Ref="#PWR?"  Part="1" 
F 0 "#PWR?" H 10000 2250 50  0001 C CNN
F 1 "GND" H 10005 2327 50  0000 C CNN
F 2 "" H 10000 2500 50  0001 C CNN
F 3 "" H 10000 2500 50  0001 C CNN
	1    10000 2500
	1    0    0    -1  
$EndComp
$Comp
L power:GND #PWR?
U 1 1 605830D1
P 9500 2500
AR Path="/60ADA657/605830D1" Ref="#PWR?"  Part="1" 
AR Path="/60C1ED24/605830D1" Ref="#PWR?"  Part="1" 
F 0 "#PWR?" H 9500 2250 50  0001 C CNN
F 1 "GND" H 9505 2327 50  0000 C CNN
F 2 "" H 9500 2500 50  0001 C CNN
F 3 "" H 9500 2500 50  0001 C CNN
	1    9500 2500
	1    0    0    -1  
$EndComp
Wire Wire Line
	9500 2500 9500 2400
Wire Wire Line
	10000 2400 10000 2500
Wire Wire Line
	10000 2100 10000 2000
Wire Wire Line
	9500 2000 9500 2100
$Comp
L POWDER_PowerGlobals:+4.8V #PWR?
U 1 1 60583E41
P 8600 2900
AR Path="/60583E41" Ref="#PWR?"  Part="1" 
AR Path="/60ADA657/60583E41" Ref="#PWR?"  Part="1" 
AR Path="/60C1ED24/60583E41" Ref="#PWR?"  Part="1" 
F 0 "#PWR?" H 8600 2750 50  0001 C CNN
F 1 "+4.8V" H 8615 3073 50  0000 C CNN
F 2 "" H 8600 2900 50  0001 C CNN
F 3 "" H 8600 2900 50  0001 C CNN
	1    8600 2900
	1    0    0    -1  
$EndComp
Wire Wire Line
	8600 2900 8600 3000
Text Label 6500 2700 0    50   ~ 0
b41_out
Text Label 6500 4350 0    50   ~ 0
ism_2_4_out
Text Label 4200 4350 0    50   ~ 0
ism_2_4_in
Text Label 4200 2700 0    50   ~ 0
b41_in
$EndSCHEMATC
