EESchema Schematic File Version 4
EELAYER 30 0
EELAYER END
$Descr A4 11693 8268
encoding utf-8
Sheet 3 27
Title ""
Date ""
Rev ""
Comp ""
Comment1 ""
Comment2 ""
Comment3 ""
Comment4 ""
$EndDescr
Text HLabel 1500 2600 0    50   Input ~ 0
v_in
Text HLabel 7800 2750 2    50   Output ~ 0
p1
Text HLabel 7800 2850 2    50   Output ~ 0
p2
Text HLabel 7800 2950 2    50   Output ~ 0
p3
Text HLabel 7800 3050 2    50   Output ~ 0
p4
Text HLabel 7800 3150 2    50   Output ~ 0
p5
Text HLabel 1500 2950 0    50   Input ~ 0
en
$Comp
L POWDER_Power:TPS7A1633-Q1 U301
U 1 1 5E47E7F9
P 2300 2900
F 0 "U301" H 2500 2450 50  0000 C CNN
F 1 "TPS7A1633-Q1" H 2300 3350 50  0000 C CNN
F 2 "POWDER_Power:DGN0008C" H 2700 3450 50  0001 C CNN
F 3 "" H 2700 3450 50  0001 C CNN
F 4 "3000-0000000505" H 2300 2900 50  0001 C CNN "PartSpecification"
	1    2300 2900
	1    0    0    -1  
$EndComp
Wire Wire Line
	1500 2950 1900 2950
Wire Wire Line
	1500 2600 1900 2600
$Comp
L 000_PreferredParts:C_100nF C301
U 1 1 5E480AC3
P 1700 3250
F 0 "C301" H 1725 3350 50  0000 L CNN
F 1 "C_100nF" H 1725 3150 50  0001 L CNN
F 2 "Capacitor_SMD:C_0402_1005Metric" H 1738 3100 50  0001 C CNN
F 3 "~" H 1700 3250 50  0001 C CNN
F 4 "100nF" H 1850 3150 50  0000 C CNN "DisplayValue"
F 5 "3000-0000000125" H 1700 3250 50  0001 C CNN "PartSpecification"
	1    1700 3250
	1    0    0    -1  
$EndComp
Wire Wire Line
	1700 3100 1700 3050
Wire Wire Line
	1700 3050 1900 3050
$Comp
L power:GND #PWR?
U 1 1 5E481217
P 1700 3500
F 0 "#PWR?" H 1700 3250 50  0001 C CNN
F 1 "GND" H 1700 3350 50  0000 C CNN
F 2 "" H 1700 3500 50  0001 C CNN
F 3 "" H 1700 3500 50  0001 C CNN
	1    1700 3500
	1    0    0    -1  
$EndComp
Wire Wire Line
	1700 3500 1700 3400
$Comp
L power:GND #PWR?
U 1 1 5E481DB8
P 2250 3500
F 0 "#PWR?" H 2250 3250 50  0001 C CNN
F 1 "GND" H 2250 3350 50  0000 C CNN
F 2 "" H 2250 3500 50  0001 C CNN
F 3 "" H 2250 3500 50  0001 C CNN
	1    2250 3500
	1    0    0    -1  
$EndComp
$Comp
L power:GND #PWR?
U 1 1 5E481EC5
P 2350 3500
F 0 "#PWR?" H 2350 3250 50  0001 C CNN
F 1 "GND" H 2350 3350 50  0000 C CNN
F 2 "" H 2350 3500 50  0001 C CNN
F 3 "" H 2350 3500 50  0001 C CNN
	1    2350 3500
	1    0    0    -1  
$EndComp
Wire Wire Line
	2350 3500 2350 3400
Wire Wire Line
	2250 3400 2250 3500
$Comp
L POWDER_Misc:CB3LV-3I-3M579545 U302
U 1 1 5E484498
P 3750 2750
F 0 "U302" H 3900 3050 50  0000 C CNN
F 1 "SG-210STF 3.0000ML" H 4200 2450 50  0000 C CNN
F 2 "Crystal:Crystal_SMD_2520-4Pin_2.5x2.0mm" H 3750 3100 50  0001 C CNN
F 3 "" H 3750 3100 50  0001 C CNN
F 4 "3000-0000000507" H 3750 2750 50  0001 C CNN "PartSpecification"
	1    3750 2750
	1    0    0    -1  
$EndComp
Wire Wire Line
	3750 2400 3650 2400
Wire Wire Line
	3000 2400 3000 2600
Wire Wire Line
	3000 2600 2650 2600
Wire Wire Line
	3400 2750 3000 2750
Wire Wire Line
	3000 2750 3000 2600
Connection ~ 3000 2600
$Comp
L power:GND #PWR?
U 1 1 5E484CA4
P 3750 3500
F 0 "#PWR?" H 3750 3250 50  0001 C CNN
F 1 "GND" H 3750 3350 50  0000 C CNN
F 2 "" H 3750 3500 50  0001 C CNN
F 3 "" H 3750 3500 50  0001 C CNN
	1    3750 3500
	1    0    0    -1  
$EndComp
Wire Wire Line
	3750 3500 3750 3100
Text HLabel 3000 3050 2    50   Output ~ 0
pg
Wire Wire Line
	3000 3050 2650 3050
$Comp
L 4xxx:4017 U303
U 1 1 5E49BAE9
P 7100 3250
F 0 "U303" H 6800 3900 50  0000 C CNN
F 1 "4017" H 6800 2500 50  0000 C CNN
F 2 "Package_SO:TSSOP-16_4.4x5mm_P0.65mm" H 7100 3250 50  0001 C CNN
F 3 "http://www.intersil.com/content/dam/Intersil/documents/cd40/cd4017bms-22bms.pdf" H 7100 3250 50  0001 C CNN
F 4 "CD74HC4017-Q1" H 7100 3250 50  0001 C CNN "PartNumber"
F 5 "3000-0000000509" H 7100 3250 50  0001 C CNN "PartSpecification"
	1    7100 3250
	1    0    0    -1  
$EndComp
$Comp
L power:GND #PWR?
U 1 1 5E49C674
P 6300 3200
F 0 "#PWR?" H 6300 2950 50  0001 C CNN
F 1 "GND" H 6300 3050 50  0000 C CNN
F 2 "" H 6300 3200 50  0001 C CNN
F 3 "" H 6300 3200 50  0001 C CNN
	1    6300 3200
	1    0    0    -1  
$EndComp
Wire Wire Line
	7600 3250 7800 3250
Wire Wire Line
	7800 4450 6500 4450
Wire Wire Line
	4100 2750 6600 2750
$Comp
L Device:R R301
U 1 1 5E4A0548
P 6300 3000
F 0 "R301" V 6380 3000 50  0000 C CNN
F 1 "1k" V 6300 3000 50  0000 C CNN
F 2 "Resistor_SMD:R_0402_1005Metric" V 6230 3000 50  0001 C CNN
F 3 "~" H 6300 3000 50  0001 C CNN
F 4 "3000-0000000156" H 6300 3000 50  0001 C CNN "PartSpecification"
	1    6300 3000
	1    0    0    -1  
$EndComp
Wire Wire Line
	6300 3150 6300 3200
Wire Wire Line
	6500 3050 6600 3050
Wire Wire Line
	6500 3050 6500 4450
Wire Wire Line
	6300 2850 6600 2850
Wire Wire Line
	3650 2400 3650 2250
Wire Wire Line
	3650 2250 5200 2250
Wire Wire Line
	7100 2250 7100 2450
Connection ~ 3650 2400
Wire Wire Line
	3650 2400 3250 2400
Wire Wire Line
	7600 3150 7800 3150
Wire Wire Line
	7800 3050 7600 3050
Wire Wire Line
	7600 2950 7800 2950
Wire Wire Line
	7800 2850 7600 2850
Wire Wire Line
	7600 2750 7800 2750
$Comp
L power:GND #PWR?
U 1 1 5E4A5D2A
P 7100 4250
F 0 "#PWR?" H 7100 4000 50  0001 C CNN
F 1 "GND" H 7100 4100 50  0000 C CNN
F 2 "" H 7100 4250 50  0001 C CNN
F 3 "" H 7100 4250 50  0001 C CNN
	1    7100 4250
	1    0    0    -1  
$EndComp
Wire Wire Line
	7100 4250 7100 4150
NoConn ~ 7600 3450
NoConn ~ 7600 3550
NoConn ~ 7600 3650
NoConn ~ 7600 3850
$Comp
L 000_PreferredParts:C_0_1uF C304
U 1 1 5E5ECF0B
P 5500 3250
F 0 "C304" H 5525 3350 50  0000 L CNN
F 1 "C_0_1uF" H 5525 3150 50  0001 L CNN
F 2 "Capacitor_SMD:C_0402_1005Metric" H 5538 3100 50  0001 C CNN
F 3 "~" H 5500 3250 50  0001 C CNN
F 4 "0.1uF" H 5650 3150 50  0000 C CNN "DisplayValue"
F 5 "3000-0000000125" H 5500 3250 50  0001 C CNN "PartSpecification"
F 6 "100V" H 5500 3250 50  0001 C CNN "Voltage"
	1    5500 3250
	1    0    0    -1  
$EndComp
Wire Wire Line
	5500 3100 5500 2250
Connection ~ 5500 2250
Wire Wire Line
	5500 2250 7100 2250
$Comp
L power:GND #PWR?
U 1 1 5E5ED9BD
P 5500 3500
F 0 "#PWR?" H 5500 3250 50  0001 C CNN
F 1 "GND" H 5500 3350 50  0000 C CNN
F 2 "" H 5500 3500 50  0001 C CNN
F 3 "" H 5500 3500 50  0001 C CNN
	1    5500 3500
	1    0    0    -1  
$EndComp
Wire Wire Line
	5500 3500 5500 3400
$Comp
L 000_PreferredParts:C_10nF C302
U 1 1 5E5EE4E6
P 3250 3250
F 0 "C302" H 3275 3350 50  0000 L CNN
F 1 "C_10nF" H 3275 3150 50  0001 L CNN
F 2 "Capacitor_SMD:C_0402_1005Metric" H 3288 3100 50  0001 C CNN
F 3 "~" H 3250 3250 50  0001 C CNN
F 4 "10nF" H 3400 3150 50  0000 C CNN "DisplayValue"
F 5 "3000-0000000203" H 3250 3250 50  0001 C CNN "PartSpecification"
F 6 "50V" H 3250 3250 50  0001 C CNN "Voltage"
	1    3250 3250
	1    0    0    -1  
$EndComp
Wire Wire Line
	3250 3100 3250 2400
Connection ~ 3250 2400
Wire Wire Line
	3250 2400 3000 2400
$Comp
L power:GND #PWR?
U 1 1 5E5EF101
P 3250 3500
F 0 "#PWR?" H 3250 3250 50  0001 C CNN
F 1 "GND" H 3250 3350 50  0000 C CNN
F 2 "" H 3250 3500 50  0001 C CNN
F 3 "" H 3250 3500 50  0001 C CNN
	1    3250 3500
	1    0    0    -1  
$EndComp
Wire Wire Line
	3250 3500 3250 3400
$Comp
L 000_PreferredParts:C_1nF C303
U 1 1 5E5F15CF
P 5200 3250
F 0 "C303" H 5225 3350 50  0000 L CNN
F 1 "C_1nF" H 5225 3150 50  0000 L CNN
F 2 "Capacitor_SMD:C_0402_1005Metric" H 5238 3100 50  0001 C CNN
F 3 "~" H 5200 3250 50  0001 C CNN
F 4 "3000-0000000128" H 5200 3250 50  0001 C CNN "PartSpecification"
	1    5200 3250
	1    0    0    -1  
$EndComp
$Comp
L power:GND #PWR?
U 1 1 5E5F20BC
P 5200 3500
F 0 "#PWR?" H 5200 3250 50  0001 C CNN
F 1 "GND" H 5200 3350 50  0000 C CNN
F 2 "" H 5200 3500 50  0001 C CNN
F 3 "" H 5200 3500 50  0001 C CNN
	1    5200 3500
	1    0    0    -1  
$EndComp
Wire Wire Line
	5200 3500 5200 3400
Wire Wire Line
	5200 3100 5200 2250
Connection ~ 5200 2250
Wire Wire Line
	5200 2250 5500 2250
Text Label 3100 2400 0    50   ~ 0
v_3_3_osc
Text Label 4700 2750 0    50   ~ 0
clk
Text Label 1700 3050 0    50   ~ 0
delay
Text Label 6350 2850 0    50   ~ 0
cken_b
Text Label 6500 3800 1    50   ~ 0
reset
Wire Wire Line
	7100 2250 7500 2250
Connection ~ 7100 2250
Text HLabel 7500 2250 2    50   Output ~ 0
v_3_3_pre
Wire Wire Line
	7800 3250 7800 4450
NoConn ~ 7600 3350
$EndSCHEMATC
