EESchema Schematic File Version 4
EELAYER 30 0
EELAYER END
$Descr A4 11693 8268
encoding utf-8
Sheet 6 13
Title ""
Date ""
Rev ""
Comp ""
Comment1 ""
Comment2 ""
Comment3 ""
Comment4 ""
$EndDescr
$Comp
L Interface:LTC6957xDD-3 U2
U 1 1 62B2EC9A
P 6100 2450
F 0 "U2" H 6544 2496 50  0000 L CNN
F 1 "LTC6957xDD-4" H 6544 2405 50  0000 L CNN
F 2 "Package_DFN_QFN:DFN-12-1EP_3x3mm_P0.45mm_EP1.66x2.38mm" H 6100 1800 50  0001 C CNN
F 3 "https://www.analog.com/media/en/technical-documentation/data-sheets/6957fb.pdf" H 6100 2450 50  0001 C CNN
F 4 "3000-0000001316" H 6100 2450 50  0001 C CNN "PartSpecification"
	1    6100 2450
	1    0    0    -1  
$EndComp
$Comp
L power:+3.3V #PWR?
U 1 1 62B330BE
P 6100 1750
F 0 "#PWR?" H 6100 1600 50  0001 C CNN
F 1 "+3.3V" H 6115 1923 50  0000 C CNN
F 2 "" H 6100 1750 50  0001 C CNN
F 3 "" H 6100 1750 50  0001 C CNN
	1    6100 1750
	1    0    0    -1  
$EndComp
Wire Wire Line
	6100 1750 6100 1800
Wire Wire Line
	6100 1800 6200 1800
Wire Wire Line
	6200 1800 6200 1850
Connection ~ 6100 1800
Wire Wire Line
	6100 1800 6100 1850
$Comp
L power:GND #PWR?
U 1 1 62B3590F
P 6100 3150
AR Path="/5F8E5420/5F971A6D/62B3590F" Ref="#PWR?"  Part="1" 
AR Path="/5F8E5420/5F9AA234/62B3590F" Ref="#PWR?"  Part="1" 
AR Path="/605746B5/5F8E5420/5F9AA234/62B3590F" Ref="#PWR?"  Part="1" 
AR Path="/614F83C4/62B3590F" Ref="#PWR?"  Part="1" 
F 0 "#PWR?" H 6100 2900 50  0001 C CNN
F 1 "GND" H 6100 3000 50  0000 C CNN
F 2 "" H 6100 3150 50  0001 C CNN
F 3 "" H 6100 3150 50  0001 C CNN
	1    6100 3150
	1    0    0    -1  
$EndComp
$Comp
L power:GND #PWR?
U 1 1 62B35B2E
P 6200 3150
AR Path="/5F8E5420/5F971A6D/62B35B2E" Ref="#PWR?"  Part="1" 
AR Path="/5F8E5420/5F9AA234/62B35B2E" Ref="#PWR?"  Part="1" 
AR Path="/605746B5/5F8E5420/5F9AA234/62B35B2E" Ref="#PWR?"  Part="1" 
AR Path="/614F83C4/62B35B2E" Ref="#PWR?"  Part="1" 
F 0 "#PWR?" H 6200 2900 50  0001 C CNN
F 1 "GND" H 6200 3000 50  0000 C CNN
F 2 "" H 6200 3150 50  0001 C CNN
F 3 "" H 6200 3150 50  0001 C CNN
	1    6200 3150
	1    0    0    -1  
$EndComp
Wire Wire Line
	6200 3150 6200 3050
Wire Wire Line
	6100 3050 6100 3150
$Comp
L Connector:Conn_Coaxial J8
U 1 1 62B4B083
P 4300 2050
F 0 "J8" H 4228 2288 50  0000 C CNN
F 1 "Conn_Coaxial" H 4228 2197 50  0000 C CNN
F 2 "POWDER_RF:SMP_RA_MSLD-PCS17T" H 4300 2050 50  0001 C CNN
F 3 " ~" H 4300 2050 50  0001 C CNN
F 4 "3000-0000000485" H 4300 2050 50  0001 C CNN "PartSpecification"
	1    4300 2050
	-1   0    0    -1  
$EndComp
$Comp
L power:GND #PWR?
U 1 1 62B4B92E
P 4300 2350
AR Path="/5F8E5420/5F971A6D/62B4B92E" Ref="#PWR?"  Part="1" 
AR Path="/5F8E5420/5F9AA234/62B4B92E" Ref="#PWR?"  Part="1" 
AR Path="/605746B5/5F8E5420/5F9AA234/62B4B92E" Ref="#PWR?"  Part="1" 
AR Path="/614F83C4/62B4B92E" Ref="#PWR?"  Part="1" 
F 0 "#PWR?" H 4300 2100 50  0001 C CNN
F 1 "GND" H 4300 2200 50  0000 C CNN
F 2 "" H 4300 2350 50  0001 C CNN
F 3 "" H 4300 2350 50  0001 C CNN
	1    4300 2350
	1    0    0    -1  
$EndComp
Wire Wire Line
	4300 2350 4300 2250
$Comp
L Device:R R16
U 1 1 62B4DBBC
P 4600 2300
F 0 "R16" H 4670 2346 50  0000 L CNN
F 1 "49.9" H 4670 2255 50  0000 L CNN
F 2 "Resistor_SMD:R_0805_2012Metric" V 4530 2300 50  0001 C CNN
F 3 "~" H 4600 2300 50  0001 C CNN
F 4 "At least 0.4W" H 4600 2300 50  0001 C CNN "Power"
F 5 "CRCW080549R9FKEAHP" H 4600 2300 50  0001 C CNN "PartNumber"
F 6 "3000-0000001304" H 4600 2300 50  0001 C CNN "PartSpecification"
	1    4600 2300
	1    0    0    -1  
$EndComp
$Comp
L 000_PreferredParts:C_10nF C16
U 1 1 62B505CD
P 5100 2400
F 0 "C16" H 5215 2446 50  0000 L CNN
F 1 "C_10nF" H 5125 2300 50  0001 L CNN
F 2 "Capacitor_SMD:C_0402_1005Metric" H 5138 2250 50  0001 C CNN
F 3 "~" H 5100 2400 50  0001 C CNN
F 4 "10nF" H 5215 2355 50  0000 L CNN "DisplayValue"
F 5 "3000-0000000203" H 5100 2400 50  0001 C CNN "PartSpecification"
F 6 "50V" H 5100 2400 50  0001 C CNN "Voltage"
	1    5100 2400
	1    0    0    -1  
$EndComp
$Comp
L power:GND #PWR?
U 1 1 62B510E3
P 5100 2650
AR Path="/5F8E5420/5F971A6D/62B510E3" Ref="#PWR?"  Part="1" 
AR Path="/5F8E5420/5F9AA234/62B510E3" Ref="#PWR?"  Part="1" 
AR Path="/605746B5/5F8E5420/5F9AA234/62B510E3" Ref="#PWR?"  Part="1" 
AR Path="/614F83C4/62B510E3" Ref="#PWR?"  Part="1" 
F 0 "#PWR?" H 5100 2400 50  0001 C CNN
F 1 "GND" H 5100 2500 50  0000 C CNN
F 2 "" H 5100 2650 50  0001 C CNN
F 3 "" H 5100 2650 50  0001 C CNN
	1    5100 2650
	1    0    0    -1  
$EndComp
Wire Wire Line
	5100 2650 5100 2550
Wire Wire Line
	5100 2250 5100 2150
Wire Wire Line
	5100 2150 5700 2150
$Comp
L 000_PreferredParts:C_10nF C15
U 1 1 62B5453C
P 4950 2050
F 0 "C15" V 5202 2050 50  0000 C CNN
F 1 "C_10nF" H 4975 1950 50  0001 L CNN
F 2 "Capacitor_SMD:C_0402_1005Metric" H 4988 1900 50  0001 C CNN
F 3 "~" H 4950 2050 50  0001 C CNN
F 4 "10nF" V 5111 2050 50  0000 C CNN "DisplayValue"
F 5 "3000-0000000203" H 4950 2050 50  0001 C CNN "PartSpecification"
F 6 "50V" H 4950 2050 50  0001 C CNN "Voltage"
	1    4950 2050
	0    -1   -1   0   
$EndComp
Wire Wire Line
	5100 2050 5700 2050
Wire Wire Line
	4800 2050 4600 2050
Wire Wire Line
	4600 2050 4600 2150
Connection ~ 4600 2050
Wire Wire Line
	4600 2050 4500 2050
$Comp
L power:GND #PWR?
U 1 1 62B59C05
P 4600 2550
AR Path="/5F8E5420/5F971A6D/62B59C05" Ref="#PWR?"  Part="1" 
AR Path="/5F8E5420/5F9AA234/62B59C05" Ref="#PWR?"  Part="1" 
AR Path="/605746B5/5F8E5420/5F9AA234/62B59C05" Ref="#PWR?"  Part="1" 
AR Path="/614F83C4/62B59C05" Ref="#PWR?"  Part="1" 
F 0 "#PWR?" H 4600 2300 50  0001 C CNN
F 1 "GND" H 4600 2400 50  0000 C CNN
F 2 "" H 4600 2550 50  0001 C CNN
F 3 "" H 4600 2550 50  0001 C CNN
	1    4600 2550
	1    0    0    -1  
$EndComp
Wire Wire Line
	4600 2550 4600 2450
Text Label 4750 2050 1    50   ~ 0
REF_10_MHZ
Text Label 5250 2150 0    50   ~ 0
REF_IN_M
Text Label 5250 2050 0    50   ~ 0
REF_IN_P
$Comp
L 000_PreferredParts:C_0_1uF C?
U 1 1 62B9C85C
P 6700 1700
AR Path="/5F8E5420/5F971A6D/62B9C85C" Ref="C?"  Part="1" 
AR Path="/5F8E5420/5F9AA234/62B9C85C" Ref="C?"  Part="1" 
AR Path="/605746B5/5F8E5420/5F9AA234/62B9C85C" Ref="C?"  Part="1" 
AR Path="/614F83C4/62B9C85C" Ref="C17"  Part="1" 
F 0 "C17" H 6725 1800 50  0000 L CNN
F 1 "C_0_1uF" H 6725 1600 50  0001 L CNN
F 2 "Capacitor_SMD:C_0402_1005Metric" H 6738 1550 50  0001 C CNN
F 3 "~" H 6700 1700 50  0001 C CNN
F 4 "0.1uF" H 6850 1600 50  0000 C CNN "DisplayValue"
F 5 "3000-0000000125" H 6700 1700 50  0001 C CNN "PartSpecification"
F 6 "100V" H 6700 1700 50  0001 C CNN "Voltage"
	1    6700 1700
	1    0    0    -1  
$EndComp
$Comp
L 000_PreferredParts:C_1nF C?
U 1 1 62B9D299
P 7200 1700
AR Path="/5F8E5420/5F971A6D/62B9D299" Ref="C?"  Part="1" 
AR Path="/5F8E5420/5F9AA234/62B9D299" Ref="C?"  Part="1" 
AR Path="/605746B5/5F8E5420/5F9AA234/62B9D299" Ref="C?"  Part="1" 
AR Path="/614F83C4/62B9D299" Ref="C18"  Part="1" 
F 0 "C18" H 7225 1800 50  0000 L CNN
F 1 "C_1nF" H 7225 1600 50  0000 L CNN
F 2 "Capacitor_SMD:C_0402_1005Metric" H 7238 1550 50  0001 C CNN
F 3 "~" H 7200 1700 50  0001 C CNN
F 4 "3000-0000000128" H 7200 1700 50  0001 C CNN "PartSpecification"
	1    7200 1700
	1    0    0    -1  
$EndComp
$Comp
L power:+3.3V #PWR?
U 1 1 62B9D85C
P 6700 1450
F 0 "#PWR?" H 6700 1300 50  0001 C CNN
F 1 "+3.3V" H 6715 1623 50  0000 C CNN
F 2 "" H 6700 1450 50  0001 C CNN
F 3 "" H 6700 1450 50  0001 C CNN
	1    6700 1450
	1    0    0    -1  
$EndComp
$Comp
L power:+3.3V #PWR?
U 1 1 62B9DBC5
P 7200 1450
F 0 "#PWR?" H 7200 1300 50  0001 C CNN
F 1 "+3.3V" H 7215 1623 50  0000 C CNN
F 2 "" H 7200 1450 50  0001 C CNN
F 3 "" H 7200 1450 50  0001 C CNN
	1    7200 1450
	1    0    0    -1  
$EndComp
$Comp
L power:GND #PWR?
U 1 1 62B9DEAE
P 7200 1950
AR Path="/5F8E5420/5F971A6D/62B9DEAE" Ref="#PWR?"  Part="1" 
AR Path="/5F8E5420/5F9AA234/62B9DEAE" Ref="#PWR?"  Part="1" 
AR Path="/605746B5/5F8E5420/5F9AA234/62B9DEAE" Ref="#PWR?"  Part="1" 
AR Path="/614F83C4/62B9DEAE" Ref="#PWR?"  Part="1" 
F 0 "#PWR?" H 7200 1700 50  0001 C CNN
F 1 "GND" H 7200 1800 50  0000 C CNN
F 2 "" H 7200 1950 50  0001 C CNN
F 3 "" H 7200 1950 50  0001 C CNN
	1    7200 1950
	1    0    0    -1  
$EndComp
$Comp
L power:GND #PWR?
U 1 1 62B9E0DD
P 6700 1950
AR Path="/5F8E5420/5F971A6D/62B9E0DD" Ref="#PWR?"  Part="1" 
AR Path="/5F8E5420/5F9AA234/62B9E0DD" Ref="#PWR?"  Part="1" 
AR Path="/605746B5/5F8E5420/5F9AA234/62B9E0DD" Ref="#PWR?"  Part="1" 
AR Path="/614F83C4/62B9E0DD" Ref="#PWR?"  Part="1" 
F 0 "#PWR?" H 6700 1700 50  0001 C CNN
F 1 "GND" H 6700 1800 50  0000 C CNN
F 2 "" H 6700 1950 50  0001 C CNN
F 3 "" H 6700 1950 50  0001 C CNN
	1    6700 1950
	1    0    0    -1  
$EndComp
Wire Wire Line
	6700 1950 6700 1850
Wire Wire Line
	7200 1850 7200 1950
Wire Wire Line
	7200 1550 7200 1450
Wire Wire Line
	6700 1450 6700 1550
$Comp
L Connector:Conn_Coaxial J?
U 1 1 6151015B
P 4750 4100
AR Path="/6151015B" Ref="J?"  Part="1" 
AR Path="/614F83C4/6151015B" Ref="J9"  Part="1" 
F 0 "J9" H 4850 4075 50  0000 L CNN
F 1 "Conn_Coaxial" H 4850 3984 50  0000 L CNN
F 2 "POWDER_RF:SMP_RA_MSLD-PCS17T" H 4750 4100 50  0001 C CNN
F 3 " ~" H 4750 4100 50  0001 C CNN
	1    4750 4100
	-1   0    0    -1  
$EndComp
Wire Wire Line
	4750 4300 4750 4400
$Comp
L power:GND #PWR?
U 1 1 61510162
P 4750 4400
AR Path="/61510162" Ref="#PWR?"  Part="1" 
AR Path="/614F83C4/61510162" Ref="#PWR?"  Part="1" 
F 0 "#PWR?" H 4750 4150 50  0001 C CNN
F 1 "GND" H 4755 4227 50  0000 C CNN
F 2 "" H 4750 4400 50  0001 C CNN
F 3 "" H 4750 4400 50  0001 C CNN
	1    4750 4400
	1    0    0    -1  
$EndComp
Wire Wire Line
	5400 4900 5400 5000
$Comp
L power:GND #PWR?
U 1 1 61510176
P 5400 5000
AR Path="/61510176" Ref="#PWR?"  Part="1" 
AR Path="/614F83C4/61510176" Ref="#PWR?"  Part="1" 
F 0 "#PWR?" H 5400 4750 50  0001 C CNN
F 1 "GND" H 5405 4827 50  0000 C CNN
F 2 "" H 5400 5000 50  0001 C CNN
F 3 "" H 5400 5000 50  0001 C CNN
	1    5400 5000
	1    0    0    -1  
$EndComp
Wire Wire Line
	5800 4550 5400 4550
Wire Wire Line
	5400 4100 5400 4200
Text Label 4950 4100 0    50   ~ 0
PPS_IN
Wire Wire Line
	5400 4100 4950 4100
Text HLabel 5800 4550 2    50   Output ~ 0
PPS
Wire Wire Line
	6500 2350 7500 2350
Text HLabel 7500 2350 2    50   Output ~ 0
10MHz_p
Wire Wire Line
	5400 4500 5400 4550
$Comp
L Device:R R?
U 1 1 61510168
P 5400 4350
AR Path="/61510168" Ref="R?"  Part="1" 
AR Path="/614F83C4/61510168" Ref="R17"  Part="1" 
F 0 "R17" H 5450 4350 50  0000 L CNN
F 1 "1k" V 5400 4350 50  0000 C CNN
F 2 "Resistor_SMD:R_0402_1005Metric" V 5330 4350 50  0001 C CNN
F 3 "~" H 5400 4350 50  0001 C CNN
	1    5400 4350
	1    0    0    -1  
$EndComp
$Comp
L Device:R R?
U 1 1 6152D5C5
P 5400 4750
AR Path="/6152D5C5" Ref="R?"  Part="1" 
AR Path="/614F83C4/6152D5C5" Ref="R18"  Part="1" 
F 0 "R18" H 5450 4750 50  0000 L CNN
F 1 "2k" V 5400 4750 50  0000 C CNN
F 2 "Resistor_SMD:R_0402_1005Metric" V 5330 4750 50  0001 C CNN
F 3 "~" H 5400 4750 50  0001 C CNN
	1    5400 4750
	1    0    0    -1  
$EndComp
Connection ~ 5400 4550
Wire Wire Line
	5400 4550 5400 4600
Wire Wire Line
	6500 2550 7500 2550
Text HLabel 7500 2550 2    50   Output ~ 0
10MHz_n
$Comp
L Device:R R14
U 1 1 61533B82
P 3300 2150
F 0 "R14" H 3370 2196 50  0000 L CNN
F 1 "DNP" H 3370 2105 50  0000 L CNN
F 2 "Resistor_SMD:R_0402_1005Metric" V 3230 2150 50  0001 C CNN
F 3 "~" H 3300 2150 50  0001 C CNN
	1    3300 2150
	1    0    0    -1  
$EndComp
$Comp
L Device:R R15
U 1 1 61534D60
P 3300 2650
F 0 "R15" H 3370 2696 50  0000 L CNN
F 1 "10k" H 3370 2605 50  0000 L CNN
F 2 "Resistor_SMD:R_0402_1005Metric" V 3230 2650 50  0001 C CNN
F 3 "~" H 3300 2650 50  0001 C CNN
	1    3300 2650
	1    0    0    -1  
$EndComp
Wire Wire Line
	3300 2800 3300 2900
$Comp
L power:GND #PWR?
U 1 1 61536D6D
P 3300 2900
F 0 "#PWR?" H 3300 2650 50  0001 C CNN
F 1 "GND" H 3305 2727 50  0000 C CNN
F 2 "" H 3300 2900 50  0001 C CNN
F 3 "" H 3300 2900 50  0001 C CNN
	1    3300 2900
	1    0    0    -1  
$EndComp
Wire Wire Line
	3300 1900 3300 2000
$Comp
L power:+3V3 #PWR?
U 1 1 61537297
P 3300 1900
F 0 "#PWR?" H 3300 1750 50  0001 C CNN
F 1 "+3V3" H 3315 2073 50  0000 C CNN
F 2 "" H 3300 1900 50  0001 C CNN
F 3 "" H 3300 1900 50  0001 C CNN
	1    3300 1900
	1    0    0    -1  
$EndComp
Wire Wire Line
	3300 2300 3300 2400
Wire Wire Line
	3300 2400 3400 2400
Connection ~ 3300 2400
Wire Wire Line
	3300 2400 3300 2500
Text Label 3400 2400 0    50   ~ 0
SD2
$Comp
L Device:R R12
U 1 1 6154622D
P 2900 2150
F 0 "R12" H 2970 2196 50  0000 L CNN
F 1 "DNP" H 2970 2105 50  0000 L CNN
F 2 "Resistor_SMD:R_0402_1005Metric" V 2830 2150 50  0001 C CNN
F 3 "~" H 2900 2150 50  0001 C CNN
	1    2900 2150
	1    0    0    -1  
$EndComp
$Comp
L Device:R R13
U 1 1 61546233
P 2900 2650
F 0 "R13" H 2970 2696 50  0000 L CNN
F 1 "10k" H 2970 2605 50  0000 L CNN
F 2 "Resistor_SMD:R_0402_1005Metric" V 2830 2650 50  0001 C CNN
F 3 "~" H 2900 2650 50  0001 C CNN
	1    2900 2650
	1    0    0    -1  
$EndComp
Wire Wire Line
	2900 2800 2900 2900
$Comp
L power:GND #PWR?
U 1 1 6154623A
P 2900 2900
F 0 "#PWR?" H 2900 2650 50  0001 C CNN
F 1 "GND" H 2905 2727 50  0000 C CNN
F 2 "" H 2900 2900 50  0001 C CNN
F 3 "" H 2900 2900 50  0001 C CNN
	1    2900 2900
	1    0    0    -1  
$EndComp
Wire Wire Line
	2900 1900 2900 2000
$Comp
L power:+3V3 #PWR?
U 1 1 61546241
P 2900 1900
F 0 "#PWR?" H 2900 1750 50  0001 C CNN
F 1 "+3V3" H 2915 2073 50  0000 C CNN
F 2 "" H 2900 1900 50  0001 C CNN
F 3 "" H 2900 1900 50  0001 C CNN
	1    2900 1900
	1    0    0    -1  
$EndComp
Wire Wire Line
	2900 2300 2900 2400
Wire Wire Line
	2900 2400 3000 2400
Connection ~ 2900 2400
Wire Wire Line
	2900 2400 2900 2500
Text Label 3000 2400 0    50   ~ 0
SD1
Wire Wire Line
	5650 2750 5700 2750
Wire Wire Line
	5700 2850 5650 2850
Text Label 5650 2750 2    50   ~ 0
SD1
Text Label 5650 2850 2    50   ~ 0
SD2
$Comp
L Device:R R68
U 1 1 6182AF26
P 3300 3700
F 0 "R68" H 3370 3746 50  0000 L CNN
F 1 "DNP" H 3370 3655 50  0000 L CNN
F 2 "Resistor_SMD:R_0402_1005Metric" V 3230 3700 50  0001 C CNN
F 3 "~" H 3300 3700 50  0001 C CNN
	1    3300 3700
	1    0    0    -1  
$EndComp
$Comp
L Device:R R69
U 1 1 6182AF2C
P 3300 4200
F 0 "R69" H 3370 4246 50  0000 L CNN
F 1 "10k" H 3370 4155 50  0000 L CNN
F 2 "Resistor_SMD:R_0402_1005Metric" V 3230 4200 50  0001 C CNN
F 3 "~" H 3300 4200 50  0001 C CNN
	1    3300 4200
	1    0    0    -1  
$EndComp
Wire Wire Line
	3300 4350 3300 4450
$Comp
L power:GND #PWR?
U 1 1 6182AF33
P 3300 4450
F 0 "#PWR?" H 3300 4200 50  0001 C CNN
F 1 "GND" H 3305 4277 50  0000 C CNN
F 2 "" H 3300 4450 50  0001 C CNN
F 3 "" H 3300 4450 50  0001 C CNN
	1    3300 4450
	1    0    0    -1  
$EndComp
Wire Wire Line
	3300 3450 3300 3550
$Comp
L power:+3V3 #PWR?
U 1 1 6182AF3A
P 3300 3450
F 0 "#PWR?" H 3300 3300 50  0001 C CNN
F 1 "+3V3" H 3315 3623 50  0000 C CNN
F 2 "" H 3300 3450 50  0001 C CNN
F 3 "" H 3300 3450 50  0001 C CNN
	1    3300 3450
	1    0    0    -1  
$EndComp
Wire Wire Line
	3300 3850 3300 3950
Wire Wire Line
	3300 3950 3400 3950
Connection ~ 3300 3950
Wire Wire Line
	3300 3950 3300 4050
Text Label 3400 3950 0    50   ~ 0
FILTB
$Comp
L Device:R R66
U 1 1 6182AF45
P 2900 3700
F 0 "R66" H 2970 3746 50  0000 L CNN
F 1 "DNP" H 2970 3655 50  0000 L CNN
F 2 "Resistor_SMD:R_0402_1005Metric" V 2830 3700 50  0001 C CNN
F 3 "~" H 2900 3700 50  0001 C CNN
	1    2900 3700
	1    0    0    -1  
$EndComp
$Comp
L Device:R R67
U 1 1 6182AF4B
P 2900 4200
F 0 "R67" H 2970 4246 50  0000 L CNN
F 1 "10k" H 2970 4155 50  0000 L CNN
F 2 "Resistor_SMD:R_0402_1005Metric" V 2830 4200 50  0001 C CNN
F 3 "~" H 2900 4200 50  0001 C CNN
	1    2900 4200
	1    0    0    -1  
$EndComp
Wire Wire Line
	2900 4350 2900 4450
$Comp
L power:GND #PWR?
U 1 1 6182AF52
P 2900 4450
F 0 "#PWR?" H 2900 4200 50  0001 C CNN
F 1 "GND" H 2905 4277 50  0000 C CNN
F 2 "" H 2900 4450 50  0001 C CNN
F 3 "" H 2900 4450 50  0001 C CNN
	1    2900 4450
	1    0    0    -1  
$EndComp
Wire Wire Line
	2900 3450 2900 3550
$Comp
L power:+3V3 #PWR?
U 1 1 6182AF59
P 2900 3450
F 0 "#PWR?" H 2900 3300 50  0001 C CNN
F 1 "+3V3" H 2915 3623 50  0000 C CNN
F 2 "" H 2900 3450 50  0001 C CNN
F 3 "" H 2900 3450 50  0001 C CNN
	1    2900 3450
	1    0    0    -1  
$EndComp
Wire Wire Line
	2900 3850 2900 3950
Wire Wire Line
	2900 3950 3000 3950
Connection ~ 2900 3950
Wire Wire Line
	2900 3950 2900 4050
Text Label 3000 3950 0    50   ~ 0
FILTA
Wire Wire Line
	5700 2450 5650 2450
Text Label 5650 2450 2    50   ~ 0
FILTA
Wire Wire Line
	5650 2550 5700 2550
Text Label 5650 2550 2    50   ~ 0
FILTB
$EndSCHEMATC
