EESchema Schematic File Version 4
EELAYER 30 0
EELAYER END
$Descr A4 11693 8268
encoding utf-8
Sheet 25 39
Title ""
Date ""
Rev ""
Comp ""
Comment1 ""
Comment2 ""
Comment3 ""
Comment4 ""
$EndDescr
$Comp
L 000_PreferredParts:C_1nF C2502
U 1 1 5FB8EDC6
P 5000 2000
F 0 "C2502" H 5025 2100 50  0000 L CNN
F 1 "C_1nF" H 5025 1900 50  0000 L CNN
F 2 "Capacitor_SMD:C_0402_1005Metric" H 5038 1850 50  0001 C CNN
F 3 "~" H 5000 2000 50  0001 C CNN
F 4 "3000-0000000128" H 5000 2000 50  0001 C CNN "PartSpecification"
	1    5000 2000
	1    0    0    -1  
$EndComp
$Comp
L 000_PreferredParts:C_1nF C2501
U 1 1 5FB8FC3C
P 4400 2000
F 0 "C2501" H 4425 2100 50  0000 L CNN
F 1 "C_1nF" H 4425 1900 50  0000 L CNN
F 2 "Capacitor_SMD:C_0402_1005Metric" H 4438 1850 50  0001 C CNN
F 3 "~" H 4400 2000 50  0001 C CNN
F 4 "3000-0000000128" H 4400 2000 50  0001 C CNN "PartSpecification"
	1    4400 2000
	1    0    0    -1  
$EndComp
$Comp
L 000_PreferredParts:C_0_1uF C2503
U 1 1 5FB90505
P 5350 2000
F 0 "C2503" H 5375 2100 50  0000 L CNN
F 1 "C_0_1uF" H 5375 1900 50  0001 L CNN
F 2 "Capacitor_SMD:C_0402_1005Metric" H 5388 1850 50  0001 C CNN
F 3 "~" H 5350 2000 50  0001 C CNN
F 4 "0.1uF" H 5500 1900 50  0000 C CNN "DisplayValue"
F 5 "3000-0000000125" H 5350 2000 50  0001 C CNN "PartSpecification"
F 6 "100V" H 5350 2000 50  0001 C CNN "Voltage"
	1    5350 2000
	1    0    0    -1  
$EndComp
$Comp
L power:GND #PWR?
U 1 1 5FB91DF6
P 5700 2200
F 0 "#PWR?" H 5700 1950 50  0001 C CNN
F 1 "GND" H 5700 2050 50  0000 C CNN
F 2 "" H 5700 2200 50  0001 C CNN
F 3 "" H 5700 2200 50  0001 C CNN
	1    5700 2200
	1    0    0    -1  
$EndComp
Wire Wire Line
	5000 2150 5000 2200
Wire Wire Line
	5000 2200 5350 2200
Wire Wire Line
	5350 2200 5350 2150
Connection ~ 5350 2200
Wire Wire Line
	5350 2200 5700 2200
Wire Wire Line
	4800 2350 4800 1750
Wire Wire Line
	4800 1750 5000 1750
Wire Wire Line
	5350 1850 5350 1750
Wire Wire Line
	5000 1850 5000 1750
Connection ~ 5000 1750
Wire Wire Line
	5000 1750 5350 1750
$Comp
L power:GND #PWR?
U 1 1 5FB937F6
P 4400 2200
F 0 "#PWR?" H 4400 1950 50  0001 C CNN
F 1 "GND" H 4400 2050 50  0000 C CNN
F 2 "" H 4400 2200 50  0001 C CNN
F 3 "" H 4400 2200 50  0001 C CNN
	1    4400 2200
	1    0    0    -1  
$EndComp
Wire Wire Line
	4400 2200 4400 2150
Wire Wire Line
	4400 1850 4400 1750
Wire Wire Line
	4400 1750 4700 1750
Wire Wire Line
	4700 1750 4700 2350
Wire Wire Line
	4700 1750 4700 1650
Wire Wire Line
	4700 1650 4750 1650
Wire Wire Line
	4800 1650 4800 1750
Connection ~ 4700 1750
Connection ~ 4800 1750
Text HLabel 3000 2800 0    50   Output ~ 0
RF_REG_EN
Text HLabel 3000 2900 0    50   Output ~ 0
RF_REG_PS_SYNC
Text HLabel 3000 3000 0    50   Input ~ 0
RF_REG_DCDC_PG
Text HLabel 3000 3100 0    50   Input ~ 0
RF_REG_LDO_4_8_PG
Text HLabel 3000 3200 0    50   Input ~ 0
RF_REG_LDO_3_3VRF_PG
Text HLabel 6500 3300 2    50   Output ~ 0
ATT_SI
Text HLabel 6500 3400 2    50   Output ~ 0
ATT_CLK
Text HLabel 6500 3500 2    50   Output ~ 0
ATT_LE
$Comp
L power:+2V5 #PWR?
U 1 1 60E0DEBB
P 4750 1500
F 0 "#PWR?" H 4750 1350 50  0001 C CNN
F 1 "+2V5" H 4765 1673 50  0000 C CNN
F 2 "" H 4750 1500 50  0001 C CNN
F 3 "" H 4750 1500 50  0001 C CNN
	1    4750 1500
	1    0    0    -1  
$EndComp
Wire Wire Line
	4750 1500 4750 1650
Connection ~ 4750 1650
Wire Wire Line
	4750 1650 4800 1650
Wire Wire Line
	6150 3300 6500 3300
Wire Wire Line
	6150 3400 6500 3400
Wire Wire Line
	6150 3500 6500 3500
Wire Wire Line
	3000 2800 3350 2800
Wire Wire Line
	3000 2900 3350 2900
Wire Wire Line
	3000 3000 3350 3000
Wire Wire Line
	3000 3100 3350 3100
Wire Wire Line
	3000 3200 3350 3200
NoConn ~ 3350 3300
NoConn ~ 6150 2900
Text HLabel 3000 3400 0    50   Output ~ 0
FAN_PWM
Text HLabel 3000 3500 0    50   Input ~ 0
FAN_TACH
$Comp
L POWDER_Digital:10M50DAF256 U2201
U 2 1 5F98722E
P 4750 3150
F 0 "U2201" H 4750 3300 50  0000 C CNN
F 1 "‎10M08DAF256C8G" H 4750 3150 50  0000 C CNN
F 2 "Package_BGA:BGA-256_17.0x17.0mm_Layout16x16_P1.0mm_Ball0.5mm_Pad0.4mm_NSMD" H 4750 3150 50  0001 C CNN
F 3 "" H 4750 3150 50  0001 C CNN
F 4 "3000-0000001300" H 4750 3150 50  0001 C CNN "PartSpecification"
	2    4750 3150
	1    0    0    -1  
$EndComp
Wire Wire Line
	3350 3500 3000 3500
Wire Wire Line
	3000 3400 3350 3400
Text HLabel 6500 3000 2    50   Output ~ 0
SYNC_1
Text HLabel 6500 3100 2    50   Output ~ 0
SYNC_2
Text HLabel 6500 3200 2    50   Output ~ 0
SYNC_3
Text HLabel 6500 2800 2    50   Output ~ 0
SYNC_0
Wire Wire Line
	6150 2800 6500 2800
Wire Wire Line
	6500 3000 6150 3000
Wire Wire Line
	6150 3100 6500 3100
Wire Wire Line
	6500 3200 6150 3200
$EndSCHEMATC
