EESchema Schematic File Version 4
EELAYER 30 0
EELAYER END
$Descr A4 11693 8268
encoding utf-8
Sheet 14 39
Title ""
Date ""
Rev ""
Comp ""
Comment1 ""
Comment2 ""
Comment3 ""
Comment4 ""
$EndDescr
$Comp
L Device:R R?
U 1 1 60779AE0
P 6750 2500
AR Path="/60779AE0" Ref="R?"  Part="1" 
AR Path="/60767402/60779AE0" Ref="R1401"  Part="1" 
F 0 "R1401" H 6820 2546 50  0000 L CNN
F 1 "400" H 6820 2455 50  0000 L CNN
F 2 "Resistor_SMD:R_0402_1005Metric" V 6680 2500 50  0001 C CNN
F 3 "~" H 6750 2500 50  0001 C CNN
F 4 "Stackpole Electronics Inc" H 6750 2500 50  0001 C CNN "Manufacturer"
F 5 "RMCF0402FT402R" H 6750 2500 50  0001 C CNN "PartNumber"
F 6 "3000-0000000159" H 6750 2500 50  0001 C CNN "PartSpecification"
	1    6750 2500
	0    1    1    0   
$EndComp
$Comp
L Device:R R?
U 1 1 60779AE9
P 7250 3500
AR Path="/60779AE9" Ref="R?"  Part="1" 
AR Path="/60767402/60779AE9" Ref="R1404"  Part="1" 
F 0 "R1404" H 7320 3546 50  0000 L CNN
F 1 "400" H 7320 3455 50  0000 L CNN
F 2 "Resistor_SMD:R_0402_1005Metric" V 7180 3500 50  0001 C CNN
F 3 "~" H 7250 3500 50  0001 C CNN
F 4 "Stackpole Electronics Inc" H 7250 3500 50  0001 C CNN "Manufacturer"
F 5 "RMCF0402FT402R" H 7250 3500 50  0001 C CNN "PartNumber"
F 6 "3000-0000000159" H 7250 3500 50  0001 C CNN "PartSpecification"
	1    7250 3500
	0    1    1    0   
$EndComp
$Comp
L Device:R R?
U 1 1 60779AF2
P 6950 4500
AR Path="/60779AF2" Ref="R?"  Part="1" 
AR Path="/60767402/60779AF2" Ref="R1406"  Part="1" 
F 0 "R1406" H 7020 4546 50  0000 L CNN
F 1 "400" H 7020 4455 50  0000 L CNN
F 2 "Resistor_SMD:R_0402_1005Metric" V 6880 4500 50  0001 C CNN
F 3 "~" H 6950 4500 50  0001 C CNN
F 4 "Stackpole Electronics Inc" H 6950 4500 50  0001 C CNN "Manufacturer"
F 5 "RMCF0402FT402R" H 6950 4500 50  0001 C CNN "PartNumber"
F 6 "3000-0000000159" H 6950 4500 50  0001 C CNN "PartSpecification"
	1    6950 4500
	0    1    1    0   
$EndComp
Wire Wire Line
	5000 5500 6300 5500
$Comp
L Device:R R?
U 1 1 60779AFE
P 7650 3500
AR Path="/60779AFE" Ref="R?"  Part="1" 
AR Path="/60767402/60779AFE" Ref="R1405"  Part="1" 
F 0 "R1405" H 7720 3546 50  0000 L CNN
F 1 "400" H 7720 3455 50  0000 L CNN
F 2 "Resistor_SMD:R_0402_1005Metric" V 7580 3500 50  0001 C CNN
F 3 "~" H 7650 3500 50  0001 C CNN
F 4 "Stackpole Electronics Inc" H 7650 3500 50  0001 C CNN "Manufacturer"
F 5 "RMCF0402FT402R" H 7650 3500 50  0001 C CNN "PartNumber"
F 6 "3000-0000000159" H 7650 3500 50  0001 C CNN "PartSpecification"
	1    7650 3500
	0    1    1    0   
$EndComp
$Comp
L Device:R R?
U 1 1 60779B07
P 7350 4500
AR Path="/60779B07" Ref="R?"  Part="1" 
AR Path="/60767402/60779B07" Ref="R1407"  Part="1" 
F 0 "R1407" H 7420 4546 50  0000 L CNN
F 1 "400" H 7420 4455 50  0000 L CNN
F 2 "Resistor_SMD:R_0402_1005Metric" V 7280 4500 50  0001 C CNN
F 3 "~" H 7350 4500 50  0001 C CNN
F 4 "Stackpole Electronics Inc" H 7350 4500 50  0001 C CNN "Manufacturer"
F 5 "RMCF0402FT402R" H 7350 4500 50  0001 C CNN "PartNumber"
F 6 "3000-0000000159" H 7350 4500 50  0001 C CNN "PartSpecification"
	1    7350 4500
	0    1    1    0   
$EndComp
$Comp
L Device:R R?
U 1 1 60779B10
P 7750 4500
AR Path="/60779B10" Ref="R?"  Part="1" 
AR Path="/60767402/60779B10" Ref="R1408"  Part="1" 
F 0 "R1408" H 7820 4546 50  0000 L CNN
F 1 "400" H 7820 4455 50  0000 L CNN
F 2 "Resistor_SMD:R_0402_1005Metric" V 7680 4500 50  0001 C CNN
F 3 "~" H 7750 4500 50  0001 C CNN
F 4 "Stackpole Electronics Inc" H 7750 4500 50  0001 C CNN "Manufacturer"
F 5 "RMCF0402FT402R" H 7750 4500 50  0001 C CNN "PartNumber"
F 6 "3000-0000000159" H 7750 4500 50  0001 C CNN "PartSpecification"
	1    7750 4500
	0    1    1    0   
$EndComp
$Comp
L Device:R R?
U 1 1 60779B19
P 8150 4500
AR Path="/60779B19" Ref="R?"  Part="1" 
AR Path="/60767402/60779B19" Ref="R1409"  Part="1" 
F 0 "R1409" H 8220 4546 50  0000 L CNN
F 1 "400" H 8220 4455 50  0000 L CNN
F 2 "Resistor_SMD:R_0402_1005Metric" V 8080 4500 50  0001 C CNN
F 3 "~" H 8150 4500 50  0001 C CNN
F 4 "Stackpole Electronics Inc" H 8150 4500 50  0001 C CNN "Manufacturer"
F 5 "RMCF0402FT402R" H 8150 4500 50  0001 C CNN "PartNumber"
F 6 "3000-0000000159" H 8150 4500 50  0001 C CNN "PartSpecification"
	1    8150 4500
	0    1    1    0   
$EndComp
$Comp
L Device:R R?
U 1 1 60779B22
P 9250 5500
AR Path="/60779B22" Ref="R?"  Part="1" 
AR Path="/60767402/60779B22" Ref="R1417"  Part="1" 
F 0 "R1417" H 9320 5546 50  0000 L CNN
F 1 "400" H 9320 5455 50  0000 L CNN
F 2 "Resistor_SMD:R_0402_1005Metric" V 9180 5500 50  0001 C CNN
F 3 "~" H 9250 5500 50  0001 C CNN
F 4 "Stackpole Electronics Inc" H 9250 5500 50  0001 C CNN "Manufacturer"
F 5 "RMCF0402FT402R" H 9250 5500 50  0001 C CNN "PartNumber"
F 6 "3000-0000000159" H 9250 5500 50  0001 C CNN "PartSpecification"
	1    9250 5500
	0    1    1    0   
$EndComp
Wire Wire Line
	6600 5500 6700 5500
Wire Wire Line
	7000 5500 7100 5500
Wire Wire Line
	9500 5500 9500 2500
Wire Wire Line
	6900 2500 8000 2500
Wire Wire Line
	7800 3500 8000 3500
Wire Wire Line
	8000 3500 8000 2500
Connection ~ 8000 2500
Wire Wire Line
	8000 2500 8500 2500
Wire Wire Line
	7100 4500 7200 4500
Wire Wire Line
	7500 3500 7400 3500
Wire Wire Line
	7500 5500 7400 5500
Wire Wire Line
	7800 5500 7900 5500
Wire Wire Line
	8200 5500 8300 5500
Wire Wire Line
	7600 4500 7500 4500
Wire Wire Line
	7900 4500 8000 4500
Wire Wire Line
	8300 4500 8500 4500
Wire Wire Line
	8500 4500 8500 2500
Connection ~ 8500 2500
Wire Wire Line
	8500 2500 9500 2500
Wire Wire Line
	8700 5500 8600 5500
$Comp
L Device:R R?
U 1 1 60779B41
P 8850 5500
AR Path="/60779B41" Ref="R?"  Part="1" 
AR Path="/60767402/60779B41" Ref="R1416"  Part="1" 
F 0 "R1416" H 8920 5546 50  0000 L CNN
F 1 "400" H 8920 5455 50  0000 L CNN
F 2 "Resistor_SMD:R_0402_1005Metric" V 8780 5500 50  0001 C CNN
F 3 "~" H 8850 5500 50  0001 C CNN
F 4 "Stackpole Electronics Inc" H 8850 5500 50  0001 C CNN "Manufacturer"
F 5 "RMCF0402FT402R" H 8850 5500 50  0001 C CNN "PartNumber"
F 6 "3000-0000000159" H 8850 5500 50  0001 C CNN "PartSpecification"
	1    8850 5500
	0    1    1    0   
$EndComp
$Comp
L Device:R R?
U 1 1 60779B4A
P 8450 5500
AR Path="/60779B4A" Ref="R?"  Part="1" 
AR Path="/60767402/60779B4A" Ref="R1415"  Part="1" 
F 0 "R1415" H 8520 5546 50  0000 L CNN
F 1 "400" H 8520 5455 50  0000 L CNN
F 2 "Resistor_SMD:R_0402_1005Metric" V 8380 5500 50  0001 C CNN
F 3 "~" H 8450 5500 50  0001 C CNN
F 4 "Stackpole Electronics Inc" H 8450 5500 50  0001 C CNN "Manufacturer"
F 5 "RMCF0402FT402R" H 8450 5500 50  0001 C CNN "PartNumber"
F 6 "3000-0000000159" H 8450 5500 50  0001 C CNN "PartSpecification"
	1    8450 5500
	0    1    1    0   
$EndComp
$Comp
L Device:R R?
U 1 1 60779B53
P 8050 5500
AR Path="/60779B53" Ref="R?"  Part="1" 
AR Path="/60767402/60779B53" Ref="R1414"  Part="1" 
F 0 "R1414" H 8120 5546 50  0000 L CNN
F 1 "400" H 8120 5455 50  0000 L CNN
F 2 "Resistor_SMD:R_0402_1005Metric" V 7980 5500 50  0001 C CNN
F 3 "~" H 8050 5500 50  0001 C CNN
F 4 "Stackpole Electronics Inc" H 8050 5500 50  0001 C CNN "Manufacturer"
F 5 "RMCF0402FT402R" H 8050 5500 50  0001 C CNN "PartNumber"
F 6 "3000-0000000159" H 8050 5500 50  0001 C CNN "PartSpecification"
	1    8050 5500
	0    1    1    0   
$EndComp
$Comp
L Device:R R?
U 1 1 60779B5C
P 7650 5500
AR Path="/60779B5C" Ref="R?"  Part="1" 
AR Path="/60767402/60779B5C" Ref="R1413"  Part="1" 
F 0 "R1413" H 7720 5546 50  0000 L CNN
F 1 "400" H 7720 5455 50  0000 L CNN
F 2 "Resistor_SMD:R_0402_1005Metric" V 7580 5500 50  0001 C CNN
F 3 "~" H 7650 5500 50  0001 C CNN
F 4 "Stackpole Electronics Inc" H 7650 5500 50  0001 C CNN "Manufacturer"
F 5 "RMCF0402FT402R" H 7650 5500 50  0001 C CNN "PartNumber"
F 6 "3000-0000000159" H 7650 5500 50  0001 C CNN "PartSpecification"
	1    7650 5500
	0    1    1    0   
$EndComp
$Comp
L Device:R R?
U 1 1 60779B65
P 7250 5500
AR Path="/60779B65" Ref="R?"  Part="1" 
AR Path="/60767402/60779B65" Ref="R1412"  Part="1" 
F 0 "R1412" H 7320 5546 50  0000 L CNN
F 1 "400" H 7320 5455 50  0000 L CNN
F 2 "Resistor_SMD:R_0402_1005Metric" V 7180 5500 50  0001 C CNN
F 3 "~" H 7250 5500 50  0001 C CNN
F 4 "Stackpole Electronics Inc" H 7250 5500 50  0001 C CNN "Manufacturer"
F 5 "RMCF0402FT402R" H 7250 5500 50  0001 C CNN "PartNumber"
F 6 "3000-0000000159" H 7250 5500 50  0001 C CNN "PartSpecification"
	1    7250 5500
	0    1    1    0   
$EndComp
$Comp
L Device:R R?
U 1 1 60779B6E
P 6850 5500
AR Path="/60779B6E" Ref="R?"  Part="1" 
AR Path="/60767402/60779B6E" Ref="R1411"  Part="1" 
F 0 "R1411" H 6920 5546 50  0000 L CNN
F 1 "400" H 6920 5455 50  0000 L CNN
F 2 "Resistor_SMD:R_0402_1005Metric" V 6780 5500 50  0001 C CNN
F 3 "~" H 6850 5500 50  0001 C CNN
F 4 "Stackpole Electronics Inc" H 6850 5500 50  0001 C CNN "Manufacturer"
F 5 "RMCF0402FT402R" H 6850 5500 50  0001 C CNN "PartNumber"
F 6 "3000-0000000159" H 6850 5500 50  0001 C CNN "PartSpecification"
	1    6850 5500
	0    1    1    0   
$EndComp
$Comp
L Device:R R?
U 1 1 60779B77
P 6450 5500
AR Path="/60779B77" Ref="R?"  Part="1" 
AR Path="/60767402/60779B77" Ref="R1410"  Part="1" 
F 0 "R1410" H 6520 5546 50  0000 L CNN
F 1 "400" H 6520 5455 50  0000 L CNN
F 2 "Resistor_SMD:R_0402_1005Metric" V 6380 5500 50  0001 C CNN
F 3 "~" H 6450 5500 50  0001 C CNN
F 4 "Stackpole Electronics Inc" H 6450 5500 50  0001 C CNN "Manufacturer"
F 5 "RMCF0402FT402R" H 6450 5500 50  0001 C CNN "PartNumber"
F 6 "3000-0000000159" H 6450 5500 50  0001 C CNN "PartSpecification"
	1    6450 5500
	0    1    1    0   
$EndComp
Text Label 5050 2500 0    50   ~ 0
lna_b3
Text Label 5050 3500 0    50   ~ 0
lna_b2
Text Label 5050 4500 0    50   ~ 0
lna_b1
Text Label 5050 5500 0    50   ~ 0
lna_b0
Text Label 7450 3500 1    50   ~ 0
lna_b2_1
Text Label 7150 4500 1    50   ~ 0
lba_b1_1
Text Label 7550 4500 1    50   ~ 0
lba_b1_2
Text Label 7950 4500 1    50   ~ 0
lba_b1_3
Text Label 6650 5500 3    50   ~ 0
lba_b0_1
Text Label 7050 5500 3    50   ~ 0
lba_b0_2
Text Label 7450 5500 3    50   ~ 0
lba_b0_3
Text Label 7850 5500 3    50   ~ 0
lba_b0_4
Text Label 8250 5500 3    50   ~ 0
lba_b0_5
Text Label 8650 5500 3    50   ~ 0
lba_b0_6
Text Label 9050 5500 3    50   ~ 0
lba_b0_7
Wire Wire Line
	5000 2500 6600 2500
Wire Wire Line
	5000 3500 7100 3500
Wire Wire Line
	5000 4500 6800 4500
$Comp
L POWDER_Misc:TLP2366 U1403
U 1 1 6078C542
P 4400 2500
F 0 "U1403" H 4400 2915 50  0000 C CNN
F 1 "TLP2366" H 4400 2824 50  0000 C CNN
F 2 "Package_SO:SO-5_4.4x3.6mm_P1.27mm" H 4400 2500 50  0001 C CNN
F 3 "" H 4400 2500 50  0001 C CNN
F 4 "3000-0000001312" H 4400 2500 50  0001 C CNN "PartSpecification"
	1    4400 2500
	1    0    0    -1  
$EndComp
Wire Wire Line
	9500 5500 9400 5500
$Comp
L POWDER_Misc:TLP2366 U1404
U 1 1 6079B17D
P 4400 3500
F 0 "U1404" H 4400 3915 50  0000 C CNN
F 1 "TLP2366" H 4400 3824 50  0000 C CNN
F 2 "Package_SO:SO-5_4.4x3.6mm_P1.27mm" H 4400 3500 50  0001 C CNN
F 3 "" H 4400 3500 50  0001 C CNN
F 4 "3000-0000001312" H 4400 3500 50  0001 C CNN "PartSpecification"
	1    4400 3500
	1    0    0    -1  
$EndComp
$Comp
L POWDER_Misc:TLP2366 U1405
U 1 1 607AC793
P 4400 4500
F 0 "U1405" H 4400 4915 50  0000 C CNN
F 1 "TLP2366" H 4400 4824 50  0000 C CNN
F 2 "Package_SO:SO-5_4.4x3.6mm_P1.27mm" H 4400 4500 50  0001 C CNN
F 3 "" H 4400 4500 50  0001 C CNN
F 4 "3000-0000001312" H 4400 4500 50  0001 C CNN "PartSpecification"
	1    4400 4500
	1    0    0    -1  
$EndComp
$Comp
L POWDER_Misc:TLP2366 U1406
U 1 1 607ACD19
P 4400 5500
F 0 "U1406" H 4400 5915 50  0000 C CNN
F 1 "TLP2366" H 4400 5824 50  0000 C CNN
F 2 "Package_SO:SO-5_4.4x3.6mm_P1.27mm" H 4400 5500 50  0001 C CNN
F 3 "" H 4400 5500 50  0001 C CNN
F 4 "3000-0000001312" H 4400 5500 50  0001 C CNN "PartSpecification"
	1    4400 5500
	1    0    0    -1  
$EndComp
$Comp
L power:GND #PWR?
U 1 1 607ADACD
P 5100 5750
F 0 "#PWR?" H 5100 5500 50  0001 C CNN
F 1 "GND" H 5105 5577 50  0000 C CNN
F 2 "" H 5100 5750 50  0001 C CNN
F 3 "" H 5100 5750 50  0001 C CNN
	1    5100 5750
	1    0    0    -1  
$EndComp
Wire Wire Line
	5100 5750 5100 5650
Wire Wire Line
	5100 5650 5000 5650
$Comp
L power:GND #PWR?
U 1 1 607B0B32
P 5100 4750
F 0 "#PWR?" H 5100 4500 50  0001 C CNN
F 1 "GND" H 5105 4577 50  0000 C CNN
F 2 "" H 5100 4750 50  0001 C CNN
F 3 "" H 5100 4750 50  0001 C CNN
	1    5100 4750
	1    0    0    -1  
$EndComp
Wire Wire Line
	5100 4750 5100 4650
Wire Wire Line
	5100 4650 5000 4650
$Comp
L power:GND #PWR?
U 1 1 607B144E
P 5100 3750
F 0 "#PWR?" H 5100 3500 50  0001 C CNN
F 1 "GND" H 5105 3577 50  0000 C CNN
F 2 "" H 5100 3750 50  0001 C CNN
F 3 "" H 5100 3750 50  0001 C CNN
	1    5100 3750
	1    0    0    -1  
$EndComp
Wire Wire Line
	5100 3750 5100 3650
Wire Wire Line
	5100 3650 5000 3650
$Comp
L power:GND #PWR?
U 1 1 607B3CD1
P 5100 2750
F 0 "#PWR?" H 5100 2500 50  0001 C CNN
F 1 "GND" H 5105 2577 50  0000 C CNN
F 2 "" H 5100 2750 50  0001 C CNN
F 3 "" H 5100 2750 50  0001 C CNN
	1    5100 2750
	1    0    0    -1  
$EndComp
Wire Wire Line
	5100 2750 5100 2650
Wire Wire Line
	5100 2650 5000 2650
$Comp
L power:GND #PWR?
U 1 1 607B5E6D
P 3700 2750
F 0 "#PWR?" H 3700 2500 50  0001 C CNN
F 1 "GND" H 3705 2577 50  0000 C CNN
F 2 "" H 3700 2750 50  0001 C CNN
F 3 "" H 3700 2750 50  0001 C CNN
	1    3700 2750
	1    0    0    -1  
$EndComp
Wire Wire Line
	3700 2750 3700 2650
Wire Wire Line
	3700 2650 3800 2650
$Comp
L power:GND #PWR?
U 1 1 607B91A4
P 3700 3750
F 0 "#PWR?" H 3700 3500 50  0001 C CNN
F 1 "GND" H 3705 3577 50  0000 C CNN
F 2 "" H 3700 3750 50  0001 C CNN
F 3 "" H 3700 3750 50  0001 C CNN
	1    3700 3750
	1    0    0    -1  
$EndComp
Wire Wire Line
	3700 3750 3700 3650
Wire Wire Line
	3700 3650 3800 3650
$Comp
L power:GND #PWR?
U 1 1 607B9E87
P 3700 4750
F 0 "#PWR?" H 3700 4500 50  0001 C CNN
F 1 "GND" H 3705 4577 50  0000 C CNN
F 2 "" H 3700 4750 50  0001 C CNN
F 3 "" H 3700 4750 50  0001 C CNN
	1    3700 4750
	1    0    0    -1  
$EndComp
Wire Wire Line
	3700 4750 3700 4650
Wire Wire Line
	3700 4650 3800 4650
$Comp
L power:GND #PWR?
U 1 1 607BCB14
P 3700 5750
F 0 "#PWR?" H 3700 5500 50  0001 C CNN
F 1 "GND" H 3705 5577 50  0000 C CNN
F 2 "" H 3700 5750 50  0001 C CNN
F 3 "" H 3700 5750 50  0001 C CNN
	1    3700 5750
	1    0    0    -1  
$EndComp
Wire Wire Line
	3700 5750 3700 5650
Wire Wire Line
	3700 5650 3800 5650
Wire Bus Line
	2500 2000 1500 2000
Entry Wire Line
	2500 5250 2600 5350
Entry Wire Line
	2500 4250 2600 4350
Entry Wire Line
	2500 3250 2600 3350
Entry Wire Line
	2500 2250 2600 2350
Text HLabel 1500 2000 0    50   Input ~ 0
LNA_BIAS_IN[0..3]
Text Label 2700 5350 1    50   ~ 0
LNA_BIAS_IN0
Text Label 2700 4350 1    50   ~ 0
LNA_BIAS_IN1
Text Label 2700 3350 1    50   ~ 0
LNA_BIAS_IN2
Text Label 2700 2350 1    50   ~ 0
LNA_BIAS_IN3
Text HLabel 10000 2500 2    50   Output ~ 0
LNA_BIAS_OUT
Connection ~ 9500 2500
$Comp
L Device:R R?
U 1 1 60754487
P 9750 2800
AR Path="/60754487" Ref="R?"  Part="1" 
AR Path="/60767402/60754487" Ref="R1402"  Part="1" 
F 0 "R1402" V 9830 2800 50  0000 C CNN
F 1 "100k" V 9750 2800 50  0000 C CNN
F 2 "Resistor_SMD:R_0402_1005Metric" V 9680 2800 50  0001 C CNN
F 3 "~" H 9750 2800 50  0001 C CNN
F 4 "3000-0000000131" V 9750 2800 50  0001 C CNN "PartSpecification"
	1    9750 2800
	1    0    0    -1  
$EndComp
$Comp
L Device:R R?
U 1 1 6075448E
P 9750 3200
AR Path="/6075448E" Ref="R?"  Part="1" 
AR Path="/60767402/6075448E" Ref="R1403"  Part="1" 
F 0 "R1403" V 9830 3200 50  0000 C CNN
F 1 "48.7k" V 9750 3200 50  0000 C CNN
F 2 "Resistor_SMD:R_0402_1005Metric" V 9680 3200 50  0001 C CNN
F 3 "~" H 9750 3200 50  0001 C CNN
F 4 "3000-0000000133" V 9750 3200 50  0001 C CNN "PartSpecification"
	1    9750 3200
	1    0    0    -1  
$EndComp
Wire Wire Line
	9750 3350 9750 3500
Wire Wire Line
	9750 3050 9750 3000
Wire Wire Line
	9750 2500 9750 2650
Wire Wire Line
	9750 3000 10000 3000
Connection ~ 9750 3000
Wire Wire Line
	9750 3000 9750 2950
$Comp
L power:GND #PWR?
U 1 1 6075449B
P 9750 3500
AR Path="/6075449B" Ref="#PWR?"  Part="1" 
AR Path="/60767402/6075449B" Ref="#PWR?"  Part="1" 
F 0 "#PWR?" H 9750 3250 50  0001 C CNN
F 1 "GND" H 9755 3327 50  0000 C CNN
F 2 "" H 9750 3500 50  0001 C CNN
F 3 "" H 9750 3500 50  0001 C CNN
	1    9750 3500
	1    0    0    -1  
$EndComp
Wire Wire Line
	9500 2500 9750 2500
Connection ~ 9750 2500
Wire Wire Line
	9750 2500 10000 2500
Text HLabel 10000 3000 2    50   Output ~ 0
VSENSE_OUT
$Comp
L Device:L L?
U 1 1 60E54F28
P 5500 1250
AR Path="/60E54F28" Ref="L?"  Part="1" 
AR Path="/5D96ADB0/60E54F28" Ref="L?"  Part="1" 
AR Path="/5E655037/60E54F28" Ref="L?"  Part="1" 
AR Path="/5E78F576/60E54F28" Ref="L?"  Part="1" 
AR Path="/60767402/60E54F28" Ref="L1401"  Part="1" 
F 0 "L1401" V 5690 1250 50  0000 C CNN
F 1 "BEAD" V 5599 1250 50  0000 C CNN
F 2 "Inductor_SMD:L_0603_1608Metric" H 5500 1250 50  0001 C CNN
F 3 "~" H 5500 1250 50  0001 C CNN
F 4 "BLM18EG221SZ1" V 5500 1250 50  0001 C CNN "PartNumber"
F 5 "Murata Electronics" H 5500 1250 50  0001 C CNN "Manufacturer"
F 6 "3000-0000000091" H 5500 1250 50  0001 C CNN "PartSpecification"
	1    5500 1250
	1    0    0    -1  
$EndComp
$Comp
L POWDER_PowerGlobals:+3.3VRF #PWR?
U 1 1 60E56128
P 5500 1000
F 0 "#PWR?" H 5500 850 50  0001 C CNN
F 1 "+3.3VRF" H 5515 1173 50  0000 C CNN
F 2 "" H 5500 1000 50  0001 C CNN
F 3 "" H 5500 1000 50  0001 C CNN
	1    5500 1000
	1    0    0    -1  
$EndComp
$Comp
L 000_PreferredParts:C_1uF C1417
U 1 1 60E56A65
P 6000 1750
F 0 "C1417" H 6115 1796 50  0000 L CNN
F 1 "C_1uF" H 6115 1705 50  0000 L CNN
F 2 "Capacitor_SMD:C_0603_1608Metric" H 6038 1600 50  0001 C CNN
F 3 "~" H 6000 1750 50  0001 C CNN
F 4 "3000-0000000136" H 6000 1750 50  0001 C CNN "PartSpecification"
	1    6000 1750
	1    0    0    -1  
$EndComp
$Comp
L 000_PreferredParts:C_0_1uF C1418
U 1 1 60E57250
P 6500 1750
F 0 "C1418" H 6615 1796 50  0000 L CNN
F 1 "C_0_1uF" H 6525 1650 50  0001 L CNN
F 2 "Capacitor_SMD:C_0402_1005Metric" H 6538 1600 50  0001 C CNN
F 3 "~" H 6500 1750 50  0001 C CNN
F 4 "0.1uF" H 6615 1705 50  0000 L CNN "DisplayValue"
F 5 "3000-0000000125" H 6500 1750 50  0001 C CNN "PartSpecification"
F 6 "100V" H 6500 1750 50  0001 C CNN "Voltage"
	1    6500 1750
	1    0    0    -1  
$EndComp
$Comp
L power:GND #PWR?
U 1 1 60E57A50
P 6000 2000
F 0 "#PWR?" H 6000 1750 50  0001 C CNN
F 1 "GND" H 6005 1827 50  0000 C CNN
F 2 "" H 6000 2000 50  0001 C CNN
F 3 "" H 6000 2000 50  0001 C CNN
	1    6000 2000
	1    0    0    -1  
$EndComp
$Comp
L power:GND #PWR?
U 1 1 60E58037
P 6500 2000
F 0 "#PWR?" H 6500 1750 50  0001 C CNN
F 1 "GND" H 6505 1827 50  0000 C CNN
F 2 "" H 6500 2000 50  0001 C CNN
F 3 "" H 6500 2000 50  0001 C CNN
	1    6500 2000
	1    0    0    -1  
$EndComp
Wire Wire Line
	5500 1100 5500 1000
Wire Wire Line
	5500 1400 5500 1500
Wire Wire Line
	5500 1500 6000 1500
Wire Wire Line
	6500 1500 6500 1600
Wire Wire Line
	6000 1600 6000 1500
Connection ~ 6000 1500
Wire Wire Line
	6000 1500 6500 1500
Wire Wire Line
	6000 1900 6000 2000
Wire Wire Line
	6500 2000 6500 1900
$Comp
L 000_PreferredParts:C_1nF C1419
U 1 1 60E6107E
P 5850 2750
F 0 "C1419" H 5965 2796 50  0000 L CNN
F 1 "C_1nF" H 5965 2705 50  0000 L CNN
F 2 "Capacitor_SMD:C_0402_1005Metric" H 5888 2600 50  0001 C CNN
F 3 "~" H 5850 2750 50  0001 C CNN
F 4 "3000-0000000128" H 5850 2750 50  0001 C CNN "PartSpecification"
	1    5850 2750
	1    0    0    -1  
$EndComp
$Comp
L 000_PreferredParts:C_10pF C1420
U 1 1 60E62541
P 5350 2750
F 0 "C1420" H 5465 2796 50  0000 L CNN
F 1 "C_10pF" H 5465 2705 50  0000 L CNN
F 2 "Capacitor_SMD:C_0402_1005Metric" H 5388 2600 50  0001 C CNN
F 3 "~" H 5350 2750 50  0001 C CNN
F 4 "3000-0000000582" H 5350 2750 50  0001 C CNN "PartSpecification"
	1    5350 2750
	1    0    0    -1  
$EndComp
Wire Wire Line
	5350 2600 5350 2350
Wire Wire Line
	5000 2350 5350 2350
$Comp
L power:GND #PWR?
U 1 1 60E6D69B
P 5350 3000
F 0 "#PWR?" H 5350 2750 50  0001 C CNN
F 1 "GND" H 5355 2827 50  0000 C CNN
F 2 "" H 5350 3000 50  0001 C CNN
F 3 "" H 5350 3000 50  0001 C CNN
	1    5350 3000
	1    0    0    -1  
$EndComp
$Comp
L power:GND #PWR?
U 1 1 60E6DAD0
P 5850 3000
F 0 "#PWR?" H 5850 2750 50  0001 C CNN
F 1 "GND" H 5855 2827 50  0000 C CNN
F 2 "" H 5850 3000 50  0001 C CNN
F 3 "" H 5850 3000 50  0001 C CNN
	1    5850 3000
	1    0    0    -1  
$EndComp
Wire Wire Line
	5850 3000 5850 2900
Wire Wire Line
	5500 1500 5500 2350
Wire Wire Line
	5500 2350 5700 2350
Wire Wire Line
	5850 2350 5850 2600
Connection ~ 5500 1500
Wire Wire Line
	5500 2350 5350 2350
Connection ~ 5500 2350
Connection ~ 5350 2350
Wire Wire Line
	5350 2900 5350 3000
$Comp
L 000_PreferredParts:C_1nF C1421
U 1 1 60E76800
P 5850 3750
F 0 "C1421" H 5965 3796 50  0000 L CNN
F 1 "C_1nF" H 5965 3705 50  0000 L CNN
F 2 "Capacitor_SMD:C_0402_1005Metric" H 5888 3600 50  0001 C CNN
F 3 "~" H 5850 3750 50  0001 C CNN
F 4 "3000-0000000128" H 5850 3750 50  0001 C CNN "PartSpecification"
	1    5850 3750
	1    0    0    -1  
$EndComp
$Comp
L 000_PreferredParts:C_10pF C1422
U 1 1 60E76807
P 5350 3750
F 0 "C1422" H 5465 3796 50  0000 L CNN
F 1 "C_10pF" H 5465 3705 50  0000 L CNN
F 2 "Capacitor_SMD:C_0402_1005Metric" H 5388 3600 50  0001 C CNN
F 3 "~" H 5350 3750 50  0001 C CNN
F 4 "3000-0000000582" H 5350 3750 50  0001 C CNN "PartSpecification"
	1    5350 3750
	1    0    0    -1  
$EndComp
Wire Wire Line
	5350 3600 5350 3350
$Comp
L power:GND #PWR?
U 1 1 60E7680E
P 5350 4000
F 0 "#PWR?" H 5350 3750 50  0001 C CNN
F 1 "GND" H 5355 3827 50  0000 C CNN
F 2 "" H 5350 4000 50  0001 C CNN
F 3 "" H 5350 4000 50  0001 C CNN
	1    5350 4000
	1    0    0    -1  
$EndComp
$Comp
L power:GND #PWR?
U 1 1 60E76814
P 5850 4000
F 0 "#PWR?" H 5850 3750 50  0001 C CNN
F 1 "GND" H 5855 3827 50  0000 C CNN
F 2 "" H 5850 4000 50  0001 C CNN
F 3 "" H 5850 4000 50  0001 C CNN
	1    5850 4000
	1    0    0    -1  
$EndComp
Wire Wire Line
	5850 4000 5850 3900
Wire Wire Line
	5850 3350 5850 3600
Wire Wire Line
	5350 3900 5350 4000
$Comp
L 000_PreferredParts:C_1nF C1423
U 1 1 60E79879
P 5850 4750
F 0 "C1423" H 5965 4796 50  0000 L CNN
F 1 "C_1nF" H 5965 4705 50  0000 L CNN
F 2 "Capacitor_SMD:C_0402_1005Metric" H 5888 4600 50  0001 C CNN
F 3 "~" H 5850 4750 50  0001 C CNN
F 4 "3000-0000000128" H 5850 4750 50  0001 C CNN "PartSpecification"
	1    5850 4750
	1    0    0    -1  
$EndComp
$Comp
L 000_PreferredParts:C_10pF C1424
U 1 1 60E79880
P 5350 4750
F 0 "C1424" H 5465 4796 50  0000 L CNN
F 1 "C_10pF" H 5465 4705 50  0000 L CNN
F 2 "Capacitor_SMD:C_0402_1005Metric" H 5388 4600 50  0001 C CNN
F 3 "~" H 5350 4750 50  0001 C CNN
F 4 "3000-0000000582" H 5350 4750 50  0001 C CNN "PartSpecification"
	1    5350 4750
	1    0    0    -1  
$EndComp
Wire Wire Line
	5350 4600 5350 4350
$Comp
L power:GND #PWR?
U 1 1 60E79887
P 5350 5000
F 0 "#PWR?" H 5350 4750 50  0001 C CNN
F 1 "GND" H 5355 4827 50  0000 C CNN
F 2 "" H 5350 5000 50  0001 C CNN
F 3 "" H 5350 5000 50  0001 C CNN
	1    5350 5000
	1    0    0    -1  
$EndComp
$Comp
L power:GND #PWR?
U 1 1 60E7988D
P 5850 5000
F 0 "#PWR?" H 5850 4750 50  0001 C CNN
F 1 "GND" H 5855 4827 50  0000 C CNN
F 2 "" H 5850 5000 50  0001 C CNN
F 3 "" H 5850 5000 50  0001 C CNN
	1    5850 5000
	1    0    0    -1  
$EndComp
Wire Wire Line
	5850 5000 5850 4900
Wire Wire Line
	5850 4350 5850 4600
Wire Wire Line
	5350 4900 5350 5000
$Comp
L 000_PreferredParts:C_1nF C1425
U 1 1 60E7DFBD
P 5850 5750
F 0 "C1425" H 5965 5796 50  0000 L CNN
F 1 "C_1nF" H 5965 5705 50  0000 L CNN
F 2 "Capacitor_SMD:C_0402_1005Metric" H 5888 5600 50  0001 C CNN
F 3 "~" H 5850 5750 50  0001 C CNN
F 4 "3000-0000000128" H 5850 5750 50  0001 C CNN "PartSpecification"
	1    5850 5750
	1    0    0    -1  
$EndComp
$Comp
L 000_PreferredParts:C_10pF C1426
U 1 1 60E7DFC4
P 5350 5750
F 0 "C1426" H 5465 5796 50  0000 L CNN
F 1 "C_10pF" H 5465 5705 50  0000 L CNN
F 2 "Capacitor_SMD:C_0402_1005Metric" H 5388 5600 50  0001 C CNN
F 3 "~" H 5350 5750 50  0001 C CNN
F 4 "3000-0000000582" H 5350 5750 50  0001 C CNN "PartSpecification"
	1    5350 5750
	1    0    0    -1  
$EndComp
Wire Wire Line
	5350 5600 5350 5350
$Comp
L power:GND #PWR?
U 1 1 60E7DFCB
P 5350 6000
F 0 "#PWR?" H 5350 5750 50  0001 C CNN
F 1 "GND" H 5355 5827 50  0000 C CNN
F 2 "" H 5350 6000 50  0001 C CNN
F 3 "" H 5350 6000 50  0001 C CNN
	1    5350 6000
	1    0    0    -1  
$EndComp
$Comp
L power:GND #PWR?
U 1 1 60E7DFD1
P 5850 6000
F 0 "#PWR?" H 5850 5750 50  0001 C CNN
F 1 "GND" H 5855 5827 50  0000 C CNN
F 2 "" H 5850 6000 50  0001 C CNN
F 3 "" H 5850 6000 50  0001 C CNN
	1    5850 6000
	1    0    0    -1  
$EndComp
Wire Wire Line
	5850 6000 5850 5900
Wire Wire Line
	5850 5350 5850 5600
Wire Wire Line
	5350 5900 5350 6000
Wire Wire Line
	5000 3350 5350 3350
Connection ~ 5350 3350
Wire Wire Line
	5350 3350 5700 3350
Wire Wire Line
	5000 4350 5350 4350
Connection ~ 5350 4350
Wire Wire Line
	5350 4350 5700 4350
Wire Wire Line
	5000 5350 5350 5350
Connection ~ 5350 5350
Wire Wire Line
	5350 5350 5700 5350
Wire Wire Line
	5700 2350 5700 3350
Connection ~ 5700 2350
Wire Wire Line
	5700 2350 5850 2350
Connection ~ 5700 5350
Connection ~ 5700 4350
Wire Wire Line
	5700 4350 5700 5350
Connection ~ 5700 3350
Wire Wire Line
	5700 3350 5700 4350
$Comp
L power:PWR_FLAG #FLG?
U 1 1 610D25DA
P 5250 1400
F 0 "#FLG?" H 5250 1475 50  0001 C CNN
F 1 "PWR_FLAG" H 5250 1573 50  0000 C CNN
F 2 "" H 5250 1400 50  0001 C CNN
F 3 "~" H 5250 1400 50  0001 C CNN
	1    5250 1400
	1    0    0    -1  
$EndComp
Wire Wire Line
	5250 1400 5250 1500
Wire Wire Line
	5250 1500 5500 1500
Text Label 5500 1900 2    50   ~ 0
F_3_3
Wire Wire Line
	9100 5500 9000 5500
Wire Wire Line
	5700 5350 5850 5350
Wire Wire Line
	5700 4350 5850 4350
Wire Wire Line
	5700 3350 5850 3350
$Comp
L Device:R R?
U 1 1 627F1D4A
P 3250 2350
AR Path="/627F1D4A" Ref="R?"  Part="1" 
AR Path="/60767402/627F1D4A" Ref="R1418"  Part="1" 
F 0 "R1418" H 3320 2396 50  0000 L CNN
F 1 "69.8" H 3320 2305 50  0000 L CNN
F 2 "Resistor_SMD:R_0402_1005Metric" V 3180 2350 50  0001 C CNN
F 3 "~" H 3250 2350 50  0001 C CNN
F 4 "" H 3250 2350 50  0001 C CNN "Manufacturer"
F 5 "" H 3250 2350 50  0001 C CNN "PartNumber"
F 6 "3000-0000001287" H 3250 2350 50  0001 C CNN "PartSpecification"
	1    3250 2350
	0    1    1    0   
$EndComp
$Comp
L Device:R R?
U 1 1 627F20AC
P 3250 3350
AR Path="/627F20AC" Ref="R?"  Part="1" 
AR Path="/60767402/627F20AC" Ref="R1419"  Part="1" 
F 0 "R1419" H 3320 3396 50  0000 L CNN
F 1 "69.8" H 3320 3305 50  0000 L CNN
F 2 "Resistor_SMD:R_0402_1005Metric" V 3180 3350 50  0001 C CNN
F 3 "~" H 3250 3350 50  0001 C CNN
F 4 "" H 3250 3350 50  0001 C CNN "Manufacturer"
F 5 "" H 3250 3350 50  0001 C CNN "PartNumber"
F 6 "3000-0000001287" H 3250 3350 50  0001 C CNN "PartSpecification"
	1    3250 3350
	0    1    1    0   
$EndComp
$Comp
L Device:R R?
U 1 1 627F2469
P 3250 4350
AR Path="/627F2469" Ref="R?"  Part="1" 
AR Path="/60767402/627F2469" Ref="R1420"  Part="1" 
F 0 "R1420" H 3320 4396 50  0000 L CNN
F 1 "69.8" H 3320 4305 50  0000 L CNN
F 2 "Resistor_SMD:R_0402_1005Metric" V 3180 4350 50  0001 C CNN
F 3 "~" H 3250 4350 50  0001 C CNN
F 4 "" H 3250 4350 50  0001 C CNN "Manufacturer"
F 5 "" H 3250 4350 50  0001 C CNN "PartNumber"
F 6 "3000-0000001287" H 3250 4350 50  0001 C CNN "PartSpecification"
	1    3250 4350
	0    1    1    0   
$EndComp
$Comp
L Device:R R?
U 1 1 627F2722
P 3250 5350
AR Path="/627F2722" Ref="R?"  Part="1" 
AR Path="/60767402/627F2722" Ref="R1421"  Part="1" 
F 0 "R1421" H 3320 5396 50  0000 L CNN
F 1 "69.8" H 3320 5305 50  0000 L CNN
F 2 "Resistor_SMD:R_0402_1005Metric" V 3180 5350 50  0001 C CNN
F 3 "~" H 3250 5350 50  0001 C CNN
F 4 "" H 3250 5350 50  0001 C CNN "Manufacturer"
F 5 "" H 3250 5350 50  0001 C CNN "PartNumber"
F 6 "3000-0000001287" H 3250 5350 50  0001 C CNN "PartSpecification"
	1    3250 5350
	0    1    1    0   
$EndComp
Wire Wire Line
	3400 2350 3800 2350
Wire Wire Line
	3800 3350 3400 3350
Wire Wire Line
	3400 4350 3800 4350
Wire Wire Line
	3800 5350 3400 5350
Wire Wire Line
	2600 5350 3100 5350
Wire Wire Line
	2600 4350 3100 4350
Wire Wire Line
	2600 3350 3100 3350
Wire Wire Line
	2600 2350 3100 2350
Wire Bus Line
	2500 2000 2500 5250
Text Label 3550 5350 1    50   ~ 0
LNA_BIAS_R0
Text Label 3550 4350 1    50   ~ 0
LNA_BIAS_R1
Text Label 3550 3350 1    50   ~ 0
LNA_BIAS_R2
Text Label 3550 2350 1    50   ~ 0
LNA_BIAS_R3
$EndSCHEMATC
