EESchema Schematic File Version 4
EELAYER 26 0
EELAYER END
$Descr A4 11693 8268
encoding utf-8
Sheet 1 1
Title ""
Date ""
Rev ""
Comp ""
Comment1 ""
Comment2 ""
Comment3 ""
Comment4 ""
$EndDescr
$Comp
L POWDER_RF:coupler U101
U 1 1 5C5B63CD
P 5800 3450
F 0 "U101" H 5800 3825 50  0000 C CNN
F 1 "coupler" H 5800 3734 50  0000 C CNN
F 2 "POWDER_RF:coupler_1" H 5800 3450 50  0001 C CNN
F 3 "" H 5800 3450 50  0001 C CNN
	1    5800 3450
	1    0    0    -1  
$EndComp
$Comp
L Connector:Conn_Coaxial J102
U 1 1 5C5B65F0
P 4900 3600
F 0 "J102" H 4830 3838 50  0000 C CNN
F 1 "Conn_Coaxial" H 4830 3747 50  0000 C CNN
F 2 "POWDER_RF:SMA_EndLaunch_142-0761-881" H 4900 3600 50  0001 C CNN
F 3 " ~" H 4900 3600 50  0001 C CNN
	1    4900 3600
	-1   0    0    -1  
$EndComp
$Comp
L Connector:Conn_Coaxial J101
U 1 1 5C5B6667
P 4550 3300
F 0 "J101" H 4480 3538 50  0000 C CNN
F 1 "Conn_Coaxial" H 4480 3447 50  0000 C CNN
F 2 "POWDER_RF:SMA_EndLaunch_142-0761-881" H 4550 3300 50  0001 C CNN
F 3 " ~" H 4550 3300 50  0001 C CNN
	1    4550 3300
	-1   0    0    -1  
$EndComp
$Comp
L Connector:Conn_Coaxial J103
U 1 1 5C5B668F
P 6700 3600
F 0 "J103" H 6799 3576 50  0000 L CNN
F 1 "Conn_Coaxial" H 6799 3485 50  0000 L CNN
F 2 "POWDER_RF:SMA_EndLaunch_142-0761-881" H 6700 3600 50  0001 C CNN
F 3 " ~" H 6700 3600 50  0001 C CNN
	1    6700 3600
	1    0    0    -1  
$EndComp
$Comp
L Connector:Conn_Coaxial J104
U 1 1 5C5B6726
P 7050 3300
F 0 "J104" H 7149 3276 50  0000 L CNN
F 1 "Conn_Coaxial" H 7149 3185 50  0000 L CNN
F 2 "POWDER_RF:SMA_EndLaunch_142-0761-881" H 7050 3300 50  0001 C CNN
F 3 " ~" H 7050 3300 50  0001 C CNN
	1    7050 3300
	1    0    0    -1  
$EndComp
$Comp
L power:GND #PWR?
U 1 1 5C5B67CE
P 5800 4000
F 0 "#PWR?" H 5800 3750 50  0001 C CNN
F 1 "GND" H 5805 3827 50  0000 C CNN
F 2 "" H 5800 4000 50  0001 C CNN
F 3 "" H 5800 4000 50  0001 C CNN
	1    5800 4000
	1    0    0    -1  
$EndComp
Wire Wire Line
	5800 3700 5800 4000
$Comp
L power:GND #PWR?
U 1 1 5C5B67FC
P 6700 4000
F 0 "#PWR?" H 6700 3750 50  0001 C CNN
F 1 "GND" H 6705 3827 50  0000 C CNN
F 2 "" H 6700 4000 50  0001 C CNN
F 3 "" H 6700 4000 50  0001 C CNN
	1    6700 4000
	1    0    0    -1  
$EndComp
$Comp
L power:GND #PWR?
U 1 1 5C5B6811
P 7050 4000
F 0 "#PWR?" H 7050 3750 50  0001 C CNN
F 1 "GND" H 7055 3827 50  0000 C CNN
F 2 "" H 7050 4000 50  0001 C CNN
F 3 "" H 7050 4000 50  0001 C CNN
	1    7050 4000
	1    0    0    -1  
$EndComp
Wire Wire Line
	7050 4000 7050 3500
Wire Wire Line
	6700 3800 6700 4000
$Comp
L power:GND #PWR?
U 1 1 5C5B6843
P 4900 4000
F 0 "#PWR?" H 4900 3750 50  0001 C CNN
F 1 "GND" H 4905 3827 50  0000 C CNN
F 2 "" H 4900 4000 50  0001 C CNN
F 3 "" H 4900 4000 50  0001 C CNN
	1    4900 4000
	1    0    0    -1  
$EndComp
$Comp
L power:GND #PWR?
U 1 1 5C5B6858
P 4550 4000
F 0 "#PWR?" H 4550 3750 50  0001 C CNN
F 1 "GND" H 4555 3827 50  0000 C CNN
F 2 "" H 4550 4000 50  0001 C CNN
F 3 "" H 4550 4000 50  0001 C CNN
	1    4550 4000
	1    0    0    -1  
$EndComp
Wire Wire Line
	4550 4000 4550 3500
Wire Wire Line
	4900 4000 4900 3800
Wire Wire Line
	5100 3600 5300 3600
Wire Wire Line
	5300 3300 4750 3300
Wire Wire Line
	6300 3300 6850 3300
Wire Wire Line
	6500 3600 6300 3600
$EndSCHEMATC
