EESchema Schematic File Version 4
EELAYER 30 0
EELAYER END
$Descr A4 11693 8268
encoding utf-8
Sheet 2 39
Title ""
Date ""
Rev ""
Comp ""
Comment1 ""
Comment2 ""
Comment3 ""
Comment4 ""
$EndDescr
Text HLabel 3050 2050 0    50   Input ~ 0
EN
Text HLabel 3050 2150 0    50   Input ~ 0
PS_SYNC
Text HLabel 3050 2250 0    50   Input ~ 0
VSEL_1
Text HLabel 6650 1900 2    50   Output ~ 0
DCDC_PG
Wire Wire Line
	6650 1900 6500 1900
$Comp
L power:GND #PWR?
U 1 1 60577FBE
P 5800 2450
AR Path="/5D562501/60577FBE" Ref="#PWR?"  Part="1" 
AR Path="/5D587C46/60577FBE" Ref="#PWR?"  Part="1" 
AR Path="/5D591ABD/60577FBE" Ref="#PWR?"  Part="1" 
F 0 "#PWR?" H 5800 2200 50  0001 C CNN
F 1 "GND" H 5805 2277 50  0000 C CNN
F 2 "" H 5800 2450 50  0001 C CNN
F 3 "" H 5800 2450 50  0001 C CNN
	1    5800 2450
	1    0    0    -1  
$EndComp
$Comp
L power:GND #PWR?
U 1 1 60577FBF
P 6000 2450
AR Path="/5D562501/60577FBF" Ref="#PWR?"  Part="1" 
AR Path="/5D587C46/60577FBF" Ref="#PWR?"  Part="1" 
AR Path="/5D591ABD/60577FBF" Ref="#PWR?"  Part="1" 
F 0 "#PWR?" H 6000 2200 50  0001 C CNN
F 1 "GND" H 6005 2277 50  0000 C CNN
F 2 "" H 6000 2450 50  0001 C CNN
F 3 "" H 6000 2450 50  0001 C CNN
	1    6000 2450
	1    0    0    -1  
$EndComp
Wire Wire Line
	6000 2450 6000 2300
Wire Wire Line
	5800 2300 5800 2450
$Comp
L 000_PreferredParts:C_100nF C204
U 1 1 60577FC0
P 2550 1850
AR Path="/5D562501/60577FC0" Ref="C204"  Part="1" 
AR Path="/5D587C46/60577FC0" Ref="C204"  Part="1" 
AR Path="/5D591ABD/60577FC0" Ref="C?"  Part="1" 
F 0 "C204" H 2665 1896 50  0000 L CNN
F 1 "C_100nF" H 2575 1750 50  0001 L CNN
F 2 "Capacitor_SMD:C_0402_1005Metric" H 2588 1700 50  0001 C CNN
F 3 "~" H 2550 1850 50  0001 C CNN
F 4 "Murata Electronics" H 2550 1850 50  0001 C CNN "Manufacturer"
F 5 "GRM155R62A104KE14D" H 2550 1850 50  0001 C CNN "PartNumber"
F 6 "100nF" H 2700 1750 50  0000 C CNN "DisplayValue"
F 7 "3000-0000000125" H 2550 1850 50  0001 C CNN "PartSpecification"
	1    2550 1850
	1    0    0    -1  
$EndComp
Wire Wire Line
	2550 1700 2550 1550
$Comp
L power:GND #PWR?
U 1 1 5D56CAC8
P 2550 2150
AR Path="/5D562501/5D56CAC8" Ref="#PWR?"  Part="1" 
AR Path="/5D587C46/5D56CAC8" Ref="#PWR?"  Part="1" 
AR Path="/5D591ABD/5D56CAC8" Ref="#PWR?"  Part="1" 
F 0 "#PWR?" H 2550 1900 50  0001 C CNN
F 1 "GND" H 2555 1977 50  0000 C CNN
F 2 "" H 2550 2150 50  0001 C CNN
F 3 "" H 2550 2150 50  0001 C CNN
	1    2550 2150
	1    0    0    -1  
$EndComp
Wire Wire Line
	2550 2150 2550 2000
$Comp
L Device:C C203
U 1 1 60577FCC
P 2150 1650
AR Path="/5D562501/60577FCC" Ref="C203"  Part="1" 
AR Path="/5D587C46/60577FCC" Ref="C203"  Part="1" 
AR Path="/5D591ABD/60577FCC" Ref="C?"  Part="1" 
F 0 "C203" H 2265 1696 50  0000 L CNN
F 1 "10uF" H 2265 1605 50  0000 L CNN
F 2 "Capacitor_SMD:C_0603_1608Metric" H 2188 1500 50  0001 C CNN
F 3 "~" H 2150 1650 50  0001 C CNN
F 4 "Murata Electronics" H 2150 1650 50  0001 C CNN "Manufacturer"
F 5 "GRM188R6YA106MA73D" H 2150 1650 50  0001 C CNN "PartNumber"
F 6 "3000-0000000135" H 2150 1650 50  0001 C CNN "PartSpecification"
	1    2150 1650
	1    0    0    -1  
$EndComp
$Comp
L Device:C C202
U 1 1 5D56CBDC
P 1700 1650
AR Path="/5D562501/5D56CBDC" Ref="C202"  Part="1" 
AR Path="/5D587C46/5D56CBDC" Ref="C202"  Part="1" 
AR Path="/5D591ABD/5D56CBDC" Ref="C?"  Part="1" 
F 0 "C202" H 1815 1696 50  0000 L CNN
F 1 "10uF" H 1815 1605 50  0000 L CNN
F 2 "Capacitor_SMD:C_0805_2012Metric" H 1738 1500 50  0001 C CNN
F 3 "~" H 1700 1650 50  0001 C CNN
F 4 "Murata Electronics" H 1700 1650 50  0001 C CNN "Manufacturer"
F 5 "GRM21BC8YA106ME11L" H 1700 1650 50  0001 C CNN "PartNumber"
F 6 "3000-0000000134" H 1700 1650 50  0001 C CNN "PartSpecification"
	1    1700 1650
	1    0    0    -1  
$EndComp
$Comp
L Device:C C201
U 1 1 60577FC3
P 1250 1650
AR Path="/5D562501/60577FC3" Ref="C201"  Part="1" 
AR Path="/5D587C46/60577FC3" Ref="C201"  Part="1" 
AR Path="/5D591ABD/60577FC3" Ref="C?"  Part="1" 
F 0 "C201" H 1365 1696 50  0000 L CNN
F 1 "10uF" H 1365 1605 50  0000 L CNN
F 2 "Capacitor_SMD:C_0805_2012Metric" H 1288 1500 50  0001 C CNN
F 3 "~" H 1250 1650 50  0001 C CNN
F 4 "Murata Electronics" H 1250 1650 50  0001 C CNN "Manufacturer"
F 5 "GRM21BC8YA106ME11L" H 1250 1650 50  0001 C CNN "PartNumber"
F 6 "3000-0000000134" H 1250 1650 50  0001 C CNN "PartSpecification"
	1    1250 1650
	1    0    0    -1  
$EndComp
$Comp
L power:GND #PWR?
U 1 1 5D56CC55
P 2150 1900
AR Path="/5D562501/5D56CC55" Ref="#PWR?"  Part="1" 
AR Path="/5D587C46/5D56CC55" Ref="#PWR?"  Part="1" 
AR Path="/5D591ABD/5D56CC55" Ref="#PWR?"  Part="1" 
F 0 "#PWR?" H 2150 1650 50  0001 C CNN
F 1 "GND" H 2155 1727 50  0000 C CNN
F 2 "" H 2150 1900 50  0001 C CNN
F 3 "" H 2150 1900 50  0001 C CNN
	1    2150 1900
	1    0    0    -1  
$EndComp
$Comp
L power:GND #PWR?
U 1 1 5D56CC6A
P 1700 1900
AR Path="/5D562501/5D56CC6A" Ref="#PWR?"  Part="1" 
AR Path="/5D587C46/5D56CC6A" Ref="#PWR?"  Part="1" 
AR Path="/5D591ABD/5D56CC6A" Ref="#PWR?"  Part="1" 
F 0 "#PWR?" H 1700 1650 50  0001 C CNN
F 1 "GND" H 1705 1727 50  0000 C CNN
F 2 "" H 1700 1900 50  0001 C CNN
F 3 "" H 1700 1900 50  0001 C CNN
	1    1700 1900
	1    0    0    -1  
$EndComp
$Comp
L power:GND #PWR?
U 1 1 60577FCE
P 1250 1900
AR Path="/5D562501/60577FCE" Ref="#PWR?"  Part="1" 
AR Path="/5D587C46/60577FCE" Ref="#PWR?"  Part="1" 
AR Path="/5D591ABD/60577FCE" Ref="#PWR?"  Part="1" 
F 0 "#PWR?" H 1250 1650 50  0001 C CNN
F 1 "GND" H 1255 1727 50  0000 C CNN
F 2 "" H 1250 1900 50  0001 C CNN
F 3 "" H 1250 1900 50  0001 C CNN
	1    1250 1900
	1    0    0    -1  
$EndComp
Wire Wire Line
	1250 1900 1250 1800
Wire Wire Line
	1700 1900 1700 1800
Wire Wire Line
	2150 1900 2150 1800
Wire Wire Line
	5300 1300 5100 1300
Wire Wire Line
	2150 1300 2150 1500
Wire Wire Line
	2150 1300 1700 1300
Wire Wire Line
	1700 1300 1700 1500
Connection ~ 2150 1300
Wire Wire Line
	1700 1300 1250 1300
Wire Wire Line
	1250 1300 1250 1500
Connection ~ 1700 1300
Wire Wire Line
	5300 1200 5100 1200
Wire Wire Line
	5100 1200 5100 1300
Connection ~ 5100 1300
Wire Wire Line
	1250 1300 900  1300
Connection ~ 1250 1300
Text HLabel 900  1300 0    50   Input ~ 0
V_12
$Comp
L Device:L L201
U 1 1 60577FD0
P 5900 800
AR Path="/5D562501/60577FD0" Ref="L201"  Part="1" 
AR Path="/5D587C46/60577FD0" Ref="L201"  Part="1" 
AR Path="/5D591ABD/60577FD0" Ref="L?"  Part="1" 
F 0 "L201" V 6090 800 50  0000 C CNN
F 1 "1.5uH" V 5999 800 50  0000 C CNN
F 2 "Inductor_SMD:L_Taiyo-Yuden_MD-4040" H 5900 800 50  0001 C CNN
F 3 "~" H 5900 800 50  0001 C CNN
F 4 "ABRACON" H 5900 800 50  0001 C CNN "Manufacturer"
F 5 "ASPI-4030S-1R5N-T" H 5900 800 50  0001 C CNN "PartNumber"
F 6 "3000-0000000076" V 5900 800 50  0001 C CNN "PartSpecification"
	1    5900 800 
	0    -1   -1   0   
$EndComp
Wire Wire Line
	5750 800  5700 800 
Wire Wire Line
	5700 800  5700 950 
Wire Wire Line
	6050 800  6100 800 
Wire Wire Line
	6100 800  6100 950 
$Comp
L Device:C C205
U 1 1 60577FD2
P 8050 1500
AR Path="/5D562501/60577FD2" Ref="C205"  Part="1" 
AR Path="/5D587C46/60577FD2" Ref="C205"  Part="1" 
AR Path="/5D591ABD/60577FD2" Ref="C?"  Part="1" 
F 0 "C205" H 8165 1546 50  0000 L CNN
F 1 "10uF" H 8165 1455 50  0000 L CNN
F 2 "Capacitor_SMD:C_0603_1608Metric" H 8088 1350 50  0001 C CNN
F 3 "~" H 8050 1500 50  0001 C CNN
F 4 "Murata Electronics" H 8050 1500 50  0001 C CNN "Manufacturer"
F 5 "GRM188R6YA106MA73D" H 8050 1500 50  0001 C CNN "PartNumber"
F 6 "3000-0000000135" H 8050 1500 50  0001 C CNN "PartSpecification"
	1    8050 1500
	1    0    0    -1  
$EndComp
$Comp
L Device:R R202
U 1 1 5D67CCD7
P 7600 1500
AR Path="/5D562501/5D67CCD7" Ref="R202"  Part="1" 
AR Path="/5D587C46/5D67CCD7" Ref="R202"  Part="1" 
AR Path="/5D591ABD/5D67CCD7" Ref="R?"  Part="1" 
F 0 "R202" H 7670 1546 50  0000 L CNN
F 1 "604k" H 7670 1455 50  0000 L CNN
F 2 "Resistor_SMD:R_0402_1005Metric" V 7530 1500 50  0001 C CNN
F 3 "~" H 7600 1500 50  0001 C CNN
F 4 "" H 7600 1500 50  0001 C CNN "Manufacturer"
F 5 "" H 7600 1500 50  0001 C CNN "PartNumber"
F 6 "3000-0000000201" H 7600 1500 50  0001 C CNN "PartSpecification"
	1    7600 1500
	1    0    0    -1  
$EndComp
Wire Wire Line
	6500 1300 6700 1300
Wire Wire Line
	7600 1350 7600 1300
Connection ~ 7600 1300
$Comp
L Device:R R203
U 1 1 60577FD6
P 7600 1900
AR Path="/5D562501/60577FD6" Ref="R203"  Part="1" 
AR Path="/5D587C46/60577FD6" Ref="R203"  Part="1" 
AR Path="/5D591ABD/60577FD6" Ref="R?"  Part="1" 
F 0 "R203" H 7670 1946 50  0000 L CNN
F 1 "150k" H 7670 1855 50  0000 L CNN
F 2 "Resistor_SMD:R_0402_1005Metric" V 7530 1900 50  0001 C CNN
F 3 "~" H 7600 1900 50  0001 C CNN
F 4 "Stackpole Electronics Inc" H 7600 1900 50  0001 C CNN "Manufacturer"
F 5 "" H 7600 1900 50  0001 C CNN "PartNumber"
F 6 "3000-0000000579" H 7600 1900 50  0001 C CNN "PartSpecification"
	1    7600 1900
	1    0    0    -1  
$EndComp
$Comp
L Device:R R201
U 1 1 5D67CCD9
P 7250 1900
AR Path="/5D562501/5D67CCD9" Ref="R201"  Part="1" 
AR Path="/5D587C46/5D67CCD9" Ref="R201"  Part="1" 
AR Path="/5D591ABD/5D67CCD9" Ref="R?"  Part="1" 
F 0 "R201" H 7320 1946 50  0000 L CNN
F 1 "365k" H 7320 1855 50  0000 L CNN
F 2 "Resistor_SMD:R_0402_1005Metric" V 7180 1900 50  0001 C CNN
F 3 "~" H 7250 1900 50  0001 C CNN
F 4 "" H 7250 1900 50  0001 C CNN "Manufacturer"
F 5 "" H 7250 1900 50  0001 C CNN "PartNumber"
F 6 "3000-0000000233" H 7250 1900 50  0001 C CNN "PartSpecification"
	1    7250 1900
	1    0    0    -1  
$EndComp
Wire Wire Line
	7600 1650 7600 1700
Wire Wire Line
	6500 1550 7250 1550
Connection ~ 7600 1700
Wire Wire Line
	7600 1700 7600 1750
Wire Wire Line
	7250 1750 7250 1700
Connection ~ 7250 1700
Wire Wire Line
	7250 1700 7250 1550
Wire Wire Line
	7250 1700 7600 1700
$Comp
L power:GND #PWR?
U 1 1 5D67CCDA
P 7600 2150
AR Path="/5D562501/5D67CCDA" Ref="#PWR?"  Part="1" 
AR Path="/5D587C46/5D67CCDA" Ref="#PWR?"  Part="1" 
AR Path="/5D591ABD/5D67CCDA" Ref="#PWR?"  Part="1" 
F 0 "#PWR?" H 7600 1900 50  0001 C CNN
F 1 "GND" H 7605 1977 50  0000 C CNN
F 2 "" H 7600 2150 50  0001 C CNN
F 3 "" H 7600 2150 50  0001 C CNN
	1    7600 2150
	1    0    0    -1  
$EndComp
Wire Wire Line
	7600 2150 7600 2050
Wire Wire Line
	7250 2150 7250 2050
Wire Wire Line
	6500 1650 7100 1650
Wire Wire Line
	7100 1650 7100 2150
Wire Wire Line
	7100 2150 7250 2150
Wire Wire Line
	8050 1350 8050 1300
Wire Wire Line
	7600 1300 8050 1300
$Comp
L power:GND #PWR?
U 1 1 5D67CCDB
P 8050 1750
AR Path="/5D562501/5D67CCDB" Ref="#PWR?"  Part="1" 
AR Path="/5D587C46/5D67CCDB" Ref="#PWR?"  Part="1" 
AR Path="/5D591ABD/5D67CCDB" Ref="#PWR?"  Part="1" 
F 0 "#PWR?" H 8050 1500 50  0001 C CNN
F 1 "GND" H 8055 1577 50  0000 C CNN
F 2 "" H 8050 1750 50  0001 C CNN
F 3 "" H 8050 1750 50  0001 C CNN
	1    8050 1750
	1    0    0    -1  
$EndComp
Wire Wire Line
	8050 1750 8050 1650
$Comp
L power:GND #PWR?
U 1 1 5D572792
P 8550 1750
AR Path="/5D562501/5D572792" Ref="#PWR?"  Part="1" 
AR Path="/5D587C46/5D572792" Ref="#PWR?"  Part="1" 
AR Path="/5D591ABD/5D572792" Ref="#PWR?"  Part="1" 
F 0 "#PWR?" H 8550 1500 50  0001 C CNN
F 1 "GND" H 8555 1577 50  0000 C CNN
F 2 "" H 8550 1750 50  0001 C CNN
F 3 "" H 8550 1750 50  0001 C CNN
	1    8550 1750
	1    0    0    -1  
$EndComp
Wire Wire Line
	8550 1750 8550 1650
Wire Wire Line
	8550 1350 8550 1300
Wire Wire Line
	8550 1300 8400 1300
Connection ~ 8050 1300
$Comp
L power:GND #PWR?
U 1 1 60577FDC
P 9350 1750
AR Path="/5D562501/60577FDC" Ref="#PWR?"  Part="1" 
AR Path="/5D587C46/60577FDC" Ref="#PWR?"  Part="1" 
AR Path="/5D591ABD/60577FDC" Ref="#PWR?"  Part="1" 
F 0 "#PWR?" H 9350 1500 50  0001 C CNN
F 1 "GND" H 9355 1577 50  0000 C CNN
F 2 "" H 9350 1750 50  0001 C CNN
F 3 "" H 9350 1750 50  0001 C CNN
	1    9350 1750
	1    0    0    -1  
$EndComp
Wire Wire Line
	9350 1750 9350 1650
Wire Wire Line
	9350 1350 9350 1300
$Comp
L power:GND #PWR?
U 1 1 60577FDD
P 10150 1750
AR Path="/5D562501/60577FDD" Ref="#PWR?"  Part="1" 
AR Path="/5D587C46/60577FDD" Ref="#PWR?"  Part="1" 
AR Path="/5D591ABD/60577FDD" Ref="#PWR?"  Part="1" 
F 0 "#PWR?" H 10150 1500 50  0001 C CNN
F 1 "GND" H 10155 1577 50  0000 C CNN
F 2 "" H 10150 1750 50  0001 C CNN
F 3 "" H 10150 1750 50  0001 C CNN
	1    10150 1750
	1    0    0    -1  
$EndComp
Wire Wire Line
	10150 1750 10150 1650
Wire Wire Line
	10150 1350 10150 1300
Wire Wire Line
	8550 1300 9350 1300
Connection ~ 8550 1300
Connection ~ 9350 1300
Wire Wire Line
	9350 1300 10150 1300
Text HLabel 10900 4450 2    50   Output ~ 0
V_OUT
Text Label 2650 1550 0    50   ~ 0
V_AUX
Text Label 6700 1550 0    50   ~ 0
FB
Text Label 6700 1650 0    50   ~ 0
FB2
Text Label 5700 800  0    50   ~ 0
L1
Text Label 6100 800  0    50   ~ 0
L2
$Comp
L 000_PreferredParts:C_10uF_0805 C206
U 1 1 60577FDF
P 8550 1500
AR Path="/5D562501/60577FDF" Ref="C206"  Part="1" 
AR Path="/5D587C46/60577FDF" Ref="C206"  Part="1" 
F 0 "C206" H 8665 1546 50  0000 L CNN
F 1 "C_10uF_0805" H 8665 1455 50  0000 L CNN
F 2 "Capacitor_SMD:C_0805_2012Metric" H 8588 1350 50  0001 C CNN
F 3 "~" H 8550 1500 50  0001 C CNN
F 4 "Murata Electronics" H 8550 1500 50  0001 C CNN "Manufacturer"
F 5 "GRM21BC8YA106ME11L" H 8550 1500 50  0001 C CNN "PartNumber"
F 6 "3000-0000000134" H 8550 1500 50  0001 C CNN "PartSpecification"
	1    8550 1500
	1    0    0    -1  
$EndComp
$Comp
L 000_PreferredParts:C_10uF_0805 C208
U 1 1 60577FE1
P 9350 1500
AR Path="/5D562501/60577FE1" Ref="C208"  Part="1" 
AR Path="/5D587C46/60577FE1" Ref="C208"  Part="1" 
F 0 "C208" H 9465 1546 50  0000 L CNN
F 1 "C_10uF_0805" H 9465 1455 50  0000 L CNN
F 2 "Capacitor_SMD:C_0805_2012Metric" H 9388 1350 50  0001 C CNN
F 3 "~" H 9350 1500 50  0001 C CNN
F 4 "Murata Electronics" H 9350 1500 50  0001 C CNN "Manufacturer"
F 5 "GRM21BC8YA106ME11L" H 9350 1500 50  0001 C CNN "PartNumber"
F 6 "3000-0000000134" H 9350 1500 50  0001 C CNN "PartSpecification"
	1    9350 1500
	1    0    0    -1  
$EndComp
$Comp
L 000_PreferredParts:C_10uF_0805 C210
U 1 1 5D72B7F5
P 10150 1500
AR Path="/5D562501/5D72B7F5" Ref="C210"  Part="1" 
AR Path="/5D587C46/5D72B7F5" Ref="C210"  Part="1" 
F 0 "C210" H 10265 1546 50  0000 L CNN
F 1 "C_10uF_0805" H 10265 1455 50  0000 L CNN
F 2 "Capacitor_SMD:C_0805_2012Metric" H 10188 1350 50  0001 C CNN
F 3 "~" H 10150 1500 50  0001 C CNN
F 4 "Murata Electronics" H 10150 1500 50  0001 C CNN "Manufacturer"
F 5 "GRM21BC8YA106ME11L" H 10150 1500 50  0001 C CNN "PartNumber"
F 6 "3000-0000000134" H 10150 1500 50  0001 C CNN "PartSpecification"
	1    10150 1500
	1    0    0    -1  
$EndComp
$Comp
L power:GND #PWR?
U 1 1 5D72DE3A
P 8550 2500
AR Path="/5D562501/5D72DE3A" Ref="#PWR?"  Part="1" 
AR Path="/5D587C46/5D72DE3A" Ref="#PWR?"  Part="1" 
AR Path="/5D591ABD/5D72DE3A" Ref="#PWR?"  Part="1" 
F 0 "#PWR?" H 8550 2250 50  0001 C CNN
F 1 "GND" H 8555 2327 50  0000 C CNN
F 2 "" H 8550 2500 50  0001 C CNN
F 3 "" H 8550 2500 50  0001 C CNN
	1    8550 2500
	1    0    0    -1  
$EndComp
Wire Wire Line
	8550 2500 8550 2400
Wire Wire Line
	8550 2100 8550 2050
Wire Wire Line
	8550 2050 8400 2050
$Comp
L power:GND #PWR?
U 1 1 5D72DE43
P 9350 2500
AR Path="/5D562501/5D72DE43" Ref="#PWR?"  Part="1" 
AR Path="/5D587C46/5D72DE43" Ref="#PWR?"  Part="1" 
AR Path="/5D591ABD/5D72DE43" Ref="#PWR?"  Part="1" 
F 0 "#PWR?" H 9350 2250 50  0001 C CNN
F 1 "GND" H 9355 2327 50  0000 C CNN
F 2 "" H 9350 2500 50  0001 C CNN
F 3 "" H 9350 2500 50  0001 C CNN
	1    9350 2500
	1    0    0    -1  
$EndComp
Wire Wire Line
	9350 2500 9350 2400
Wire Wire Line
	9350 2100 9350 2050
$Comp
L power:GND #PWR?
U 1 1 60577FE6
P 10150 2500
AR Path="/5D562501/60577FE6" Ref="#PWR?"  Part="1" 
AR Path="/5D587C46/60577FE6" Ref="#PWR?"  Part="1" 
AR Path="/5D591ABD/60577FE6" Ref="#PWR?"  Part="1" 
F 0 "#PWR?" H 10150 2250 50  0001 C CNN
F 1 "GND" H 10155 2327 50  0000 C CNN
F 2 "" H 10150 2500 50  0001 C CNN
F 3 "" H 10150 2500 50  0001 C CNN
	1    10150 2500
	1    0    0    -1  
$EndComp
Wire Wire Line
	10150 2500 10150 2400
Wire Wire Line
	10150 2100 10150 2050
Wire Wire Line
	8550 2050 9350 2050
Connection ~ 8550 2050
Connection ~ 9350 2050
Wire Wire Line
	9350 2050 10150 2050
$Comp
L 000_PreferredParts:C_10uF_0805 C207
U 1 1 60577FE7
P 8550 2250
AR Path="/5D562501/60577FE7" Ref="C207"  Part="1" 
AR Path="/5D587C46/60577FE7" Ref="C207"  Part="1" 
F 0 "C207" H 8665 2296 50  0000 L CNN
F 1 "C_10uF_0805" H 8665 2205 50  0000 L CNN
F 2 "Capacitor_SMD:C_0805_2012Metric" H 8588 2100 50  0001 C CNN
F 3 "~" H 8550 2250 50  0001 C CNN
F 4 "Murata Electronics" H 8550 2250 50  0001 C CNN "Manufacturer"
F 5 "GRM21BC8YA106ME11L" H 8550 2250 50  0001 C CNN "PartNumber"
F 6 "3000-0000000134" H 8550 2250 50  0001 C CNN "PartSpecification"
	1    8550 2250
	1    0    0    -1  
$EndComp
$Comp
L 000_PreferredParts:C_10uF_0805 C209
U 1 1 60577FE9
P 9350 2250
AR Path="/5D562501/60577FE9" Ref="C209"  Part="1" 
AR Path="/5D587C46/60577FE9" Ref="C209"  Part="1" 
F 0 "C209" H 9465 2296 50  0000 L CNN
F 1 "C_10uF_0805" H 9465 2205 50  0000 L CNN
F 2 "Capacitor_SMD:C_0805_2012Metric" H 9388 2100 50  0001 C CNN
F 3 "~" H 9350 2250 50  0001 C CNN
F 4 "Murata Electronics" H 9350 2250 50  0001 C CNN "Manufacturer"
F 5 "GRM21BC8YA106ME11L" H 9350 2250 50  0001 C CNN "PartNumber"
F 6 "3000-0000000134" H 9350 2250 50  0001 C CNN "PartSpecification"
	1    9350 2250
	1    0    0    -1  
$EndComp
$Comp
L 000_PreferredParts:C_10uF_0805 C211
U 1 1 60577FEB
P 10150 2250
AR Path="/5D562501/60577FEB" Ref="C211"  Part="1" 
AR Path="/5D587C46/60577FEB" Ref="C211"  Part="1" 
F 0 "C211" H 10265 2296 50  0000 L CNN
F 1 "C_10uF_0805" H 10265 2205 50  0000 L CNN
F 2 "Capacitor_SMD:C_0805_2012Metric" H 10188 2100 50  0001 C CNN
F 3 "~" H 10150 2250 50  0001 C CNN
F 4 "Murata Electronics" H 10150 2250 50  0001 C CNN "Manufacturer"
F 5 "GRM21BC8YA106ME11L" H 10150 2250 50  0001 C CNN "PartNumber"
F 6 "3000-0000000134" H 10150 2250 50  0001 C CNN "PartSpecification"
	1    10150 2250
	1    0    0    -1  
$EndComp
Wire Wire Line
	8400 1300 8400 2050
Connection ~ 8400 1300
Wire Wire Line
	8400 1300 8050 1300
Wire Wire Line
	2550 1550 5300 1550
Wire Wire Line
	4550 2150 4550 1900
Wire Wire Line
	4950 2000 4950 2250
Wire Wire Line
	4550 1900 5300 1900
Wire Wire Line
	4100 1800 5300 1800
Wire Wire Line
	6500 1200 6700 1200
Wire Wire Line
	6700 1200 6700 1300
Connection ~ 6700 1300
Wire Wire Line
	6700 1300 7600 1300
Text Label 8850 1300 0    50   ~ 0
DCDC_OUT
$Comp
L POWDER_Power:TPS7A92 U202
U 1 1 60577FED
P 5900 4650
AR Path="/5D562501/60577FED" Ref="U202"  Part="1" 
AR Path="/5D587C46/60577FED" Ref="U202"  Part="1" 
F 0 "U202" H 6300 5100 50  0000 C CNN
F 1 "TPS7A92" H 5900 4900 50  0000 C CNN
F 2 "POWDER_Power:R-PWSON-N10" H 6650 3600 50  0001 C CNN
F 3 "" H 5900 4650 50  0001 C CNN
F 4 "3000-0000000193" H 5900 4650 50  0001 C CNN "PartSpecification"
	1    5900 4650
	1    0    0    -1  
$EndComp
Wire Wire Line
	5300 4550 5000 4550
Wire Wire Line
	5000 4550 5000 4450
Wire Wire Line
	5000 4450 5300 4450
Connection ~ 5000 4450
Text Label 4350 4450 0    50   ~ 0
DCDC_OUT
$Comp
L power:GND #PWR?
U 1 1 60577FEE
P 5950 5300
AR Path="/5D562501/60577FEE" Ref="#PWR?"  Part="1" 
AR Path="/5D587C46/60577FEE" Ref="#PWR?"  Part="1" 
AR Path="/5D591ABD/60577FEE" Ref="#PWR?"  Part="1" 
F 0 "#PWR?" H 5950 5050 50  0001 C CNN
F 1 "GND" H 5955 5127 50  0000 C CNN
F 2 "" H 5950 5300 50  0001 C CNN
F 3 "" H 5950 5300 50  0001 C CNN
	1    5950 5300
	1    0    0    -1  
$EndComp
Wire Wire Line
	5950 5300 5950 5150
$Comp
L power:GND #PWR?
U 1 1 5E976164
P 5850 5300
AR Path="/5D562501/5E976164" Ref="#PWR?"  Part="1" 
AR Path="/5D587C46/5E976164" Ref="#PWR?"  Part="1" 
AR Path="/5D591ABD/5E976164" Ref="#PWR?"  Part="1" 
F 0 "#PWR?" H 5850 5050 50  0001 C CNN
F 1 "GND" H 5855 5127 50  0000 C CNN
F 2 "" H 5850 5300 50  0001 C CNN
F 3 "" H 5850 5300 50  0001 C CNN
	1    5850 5300
	1    0    0    -1  
$EndComp
Wire Wire Line
	5850 5300 5850 5150
Wire Wire Line
	3150 2050 3150 4750
Wire Wire Line
	3150 4750 5300 4750
Connection ~ 3150 2050
Wire Wire Line
	3150 2050 3050 2050
Text HLabel 6800 4850 2    50   Output ~ 0
LDO_PG
$Comp
L 000_PreferredParts:C_1uF C213
U 1 1 60577FF1
P 4500 5050
AR Path="/5D562501/60577FF1" Ref="C213"  Part="1" 
AR Path="/5D587C46/60577FF1" Ref="C213"  Part="1" 
F 0 "C213" H 4525 5150 50  0000 L CNN
F 1 "C_1uF" H 4525 4950 50  0000 L CNN
F 2 "Capacitor_SMD:C_0603_1608Metric" H 4538 4900 50  0001 C CNN
F 3 "~" H 4500 5050 50  0001 C CNN
F 4 "3000-0000000136" H 4500 5050 50  0001 C CNN "PartSpecification"
	1    4500 5050
	1    0    0    -1  
$EndComp
Wire Wire Line
	4500 4900 4500 4650
Wire Wire Line
	4500 4650 5300 4650
$Comp
L power:GND #PWR?
U 1 1 5E9BE95E
P 4500 5350
AR Path="/5D562501/5E9BE95E" Ref="#PWR?"  Part="1" 
AR Path="/5D587C46/5E9BE95E" Ref="#PWR?"  Part="1" 
AR Path="/5D591ABD/5E9BE95E" Ref="#PWR?"  Part="1" 
F 0 "#PWR?" H 4500 5100 50  0001 C CNN
F 1 "GND" H 4505 5177 50  0000 C CNN
F 2 "" H 4500 5350 50  0001 C CNN
F 3 "" H 4500 5350 50  0001 C CNN
	1    4500 5350
	1    0    0    -1  
$EndComp
Wire Wire Line
	4500 5350 4500 5200
$Comp
L power:GND #PWR?
U 1 1 5E9C1699
P 5150 5250
AR Path="/5D562501/5E9C1699" Ref="#PWR?"  Part="1" 
AR Path="/5D587C46/5E9C1699" Ref="#PWR?"  Part="1" 
AR Path="/5D591ABD/5E9C1699" Ref="#PWR?"  Part="1" 
F 0 "#PWR?" H 5150 5000 50  0001 C CNN
F 1 "GND" H 5155 5077 50  0000 C CNN
F 2 "" H 5150 5250 50  0001 C CNN
F 3 "" H 5150 5250 50  0001 C CNN
	1    5150 5250
	1    0    0    -1  
$EndComp
Wire Wire Line
	5150 5250 5150 4850
Wire Wire Line
	5150 4850 5300 4850
Text Notes 7000 1200 0    50   ~ 0
This voltage is 4/6V corresponding to the LDO output of 3/5V.
$Comp
L POWDER_Power:CSD13385F5 U203
U 1 1 5E9CB0BC
P 7450 5700
AR Path="/5D562501/5E9CB0BC" Ref="U203"  Part="1" 
AR Path="/5D587C46/5E9CB0BC" Ref="U203"  Part="1" 
F 0 "U203" H 7300 5500 50  0000 C CNN
F 1 "CSD13385F5" H 7800 5800 50  0000 C CNN
F 2 "POWDER_Power:CSD13385F5" H 7200 5400 50  0001 C CNN
F 3 "" H 7450 5700 50  0001 C CNN
F 4 "3000-0000000191" H 7450 5700 50  0001 C CNN "PartSpecification"
	1    7450 5700
	1    0    0    -1  
$EndComp
Text Label 4250 2250 0    50   ~ 0
VSEL_1
$Comp
L power:GND #PWR?
U 1 1 60577FF8
P 7500 6000
AR Path="/5D562501/60577FF8" Ref="#PWR?"  Part="1" 
AR Path="/5D587C46/60577FF8" Ref="#PWR?"  Part="1" 
AR Path="/5D591ABD/60577FF8" Ref="#PWR?"  Part="1" 
F 0 "#PWR?" H 7500 5750 50  0001 C CNN
F 1 "GND" H 7505 5827 50  0000 C CNN
F 2 "" H 7500 6000 50  0001 C CNN
F 3 "" H 7500 6000 50  0001 C CNN
	1    7500 6000
	1    0    0    -1  
$EndComp
Wire Wire Line
	7500 6000 7500 5900
Text Label 6950 5700 0    50   ~ 0
VSEL_1
$Comp
L 000_PreferredParts:C_10uF_0805 C212
U 1 1 5E9F646E
P 3700 5000
AR Path="/5D562501/5E9F646E" Ref="C212"  Part="1" 
AR Path="/5D587C46/5E9F646E" Ref="C212"  Part="1" 
F 0 "C212" H 3815 5046 50  0000 L CNN
F 1 "C_10uF_0805" H 3815 4955 50  0000 L CNN
F 2 "Capacitor_SMD:C_0805_2012Metric" H 3738 4850 50  0001 C CNN
F 3 "~" H 3700 5000 50  0001 C CNN
F 4 "Murata Electronics" H 3700 5000 50  0001 C CNN "Manufacturer"
F 5 "GRM21BC8YA106ME11L" H 3700 5000 50  0001 C CNN "PartNumber"
F 6 "3000-0000000134" H 3700 5000 50  0001 C CNN "PartSpecification"
	1    3700 5000
	1    0    0    -1  
$EndComp
Wire Wire Line
	3700 4850 3700 4450
Wire Wire Line
	3700 4450 5000 4450
$Comp
L power:GND #PWR?
U 1 1 5E9FA0C1
P 3700 5350
AR Path="/5D562501/5E9FA0C1" Ref="#PWR?"  Part="1" 
AR Path="/5D587C46/5E9FA0C1" Ref="#PWR?"  Part="1" 
AR Path="/5D591ABD/5E9FA0C1" Ref="#PWR?"  Part="1" 
F 0 "#PWR?" H 3700 5100 50  0001 C CNN
F 1 "GND" H 3705 5177 50  0000 C CNN
F 2 "" H 3700 5350 50  0001 C CNN
F 3 "" H 3700 5350 50  0001 C CNN
	1    3700 5350
	1    0    0    -1  
$EndComp
Wire Wire Line
	3700 5350 3700 5150
Text Notes 7850 6300 0    50   ~ 0
Voltages:\n00 - 3.1  -4.15dB\n01 - 3.7  -2.62dB\n10 - 4.4  -1.11dB\n11 - 5.0  0 dB
Text Notes 6700 2750 0    50   ~ 0
Voltages:\n00 - 4.1\n01 - 4.7\n10 - 5.4\n11 - 6.0
$Comp
L POWDER_Power:CSD13385F5 U204
U 1 1 5EA10184
P 7800 2750
AR Path="/5D562501/5EA10184" Ref="U204"  Part="1" 
AR Path="/5D587C46/5EA10184" Ref="U204"  Part="1" 
F 0 "U204" H 7650 2550 50  0000 C CNN
F 1 "CSD13385F5" H 8150 2850 50  0000 C CNN
F 2 "POWDER_Power:CSD13385F5" H 7550 2450 50  0001 C CNN
F 3 "" H 7800 2750 50  0001 C CNN
F 4 "3000-0000000191" H 7800 2750 50  0001 C CNN "PartSpecification"
	1    7800 2750
	1    0    0    -1  
$EndComp
$Comp
L power:GND #PWR?
U 1 1 60577FFF
P 8200 5500
AR Path="/5D562501/60577FFF" Ref="#PWR?"  Part="1" 
AR Path="/5D587C46/60577FFF" Ref="#PWR?"  Part="1" 
AR Path="/5D591ABD/60577FFF" Ref="#PWR?"  Part="1" 
F 0 "#PWR?" H 8200 5250 50  0001 C CNN
F 1 "GND" H 8205 5327 50  0000 C CNN
F 2 "" H 8200 5500 50  0001 C CNN
F 3 "" H 8200 5500 50  0001 C CNN
	1    8200 5500
	1    0    0    -1  
$EndComp
Wire Wire Line
	8200 5500 8200 5400
$Comp
L Device:R R208
U 1 1 60578000
P 8200 5250
AR Path="/5D562501/60578000" Ref="R208"  Part="1" 
AR Path="/5D587C46/60578000" Ref="R208"  Part="1" 
F 0 "R208" V 8280 5250 50  0000 C CNN
F 1 "1.69k" V 8200 5250 50  0000 C CNN
F 2 "Resistor_SMD:R_0402_1005Metric" V 8130 5250 50  0001 C CNN
F 3 "~" H 8200 5250 50  0001 C CNN
F 4 "3000-0000000224" V 8200 5250 50  0001 C CNN "PartSpecification"
	1    8200 5250
	1    0    0    -1  
$EndComp
$Comp
L Device:R R205
U 1 1 5EA44045
P 7500 5250
AR Path="/5D562501/5EA44045" Ref="R205"  Part="1" 
AR Path="/5D587C46/5EA44045" Ref="R205"  Part="1" 
F 0 "R205" V 7580 5250 50  0000 C CNN
F 1 "3.00k" V 7500 5250 50  0000 C CNN
F 2 "Resistor_SMD:R_0402_1005Metric" V 7430 5250 50  0001 C CNN
F 3 "~" H 7500 5250 50  0001 C CNN
F 4 "3000-0000000230" V 7500 5250 50  0001 C CNN "PartSpecification"
	1    7500 5250
	1    0    0    -1  
$EndComp
$Comp
L Device:R R207
U 1 1 60578004
P 8200 4750
AR Path="/5D562501/60578004" Ref="R207"  Part="1" 
AR Path="/5D587C46/60578004" Ref="R207"  Part="1" 
F 0 "R207" V 8280 4750 50  0000 C CNN
F 1 "4.87k" V 8200 4750 50  0000 C CNN
F 2 "Resistor_SMD:R_0402_1005Metric" V 8130 4750 50  0001 C CNN
F 3 "~" H 8200 4750 50  0001 C CNN
F 4 "3000-0000000133" V 8200 4750 50  0001 C CNN "PartSpecification"
	1    8200 4750
	1    0    0    -1  
$EndComp
Wire Wire Line
	6500 4550 7000 4550
Wire Wire Line
	6500 4450 7000 4450
Wire Wire Line
	7000 4450 7000 4550
Wire Wire Line
	7000 4450 8200 4450
Connection ~ 7000 4450
Wire Wire Line
	8200 4450 8200 4600
Wire Wire Line
	8200 5100 8200 5000
Wire Wire Line
	8200 5000 7500 5000
Wire Wire Line
	7500 5000 7500 5100
Connection ~ 8200 5000
Wire Wire Line
	8200 5000 8200 4900
Wire Wire Line
	7500 5500 7500 5400
$Comp
L POWDER_Power:CSD13385F5 U205
U 1 1 60578005
P 8950 5700
AR Path="/5D562501/60578005" Ref="U205"  Part="1" 
AR Path="/5D587C46/60578005" Ref="U205"  Part="1" 
F 0 "U205" H 8800 5500 50  0000 C CNN
F 1 "CSD13385F5" H 9300 5800 50  0000 C CNN
F 2 "POWDER_Power:CSD13385F5" H 8700 5400 50  0001 C CNN
F 3 "" H 8950 5700 50  0001 C CNN
F 4 "3000-0000000191" H 8950 5700 50  0001 C CNN "PartSpecification"
	1    8950 5700
	-1   0    0    -1  
$EndComp
$Comp
L power:GND #PWR?
U 1 1 5EA608FF
P 8900 6000
AR Path="/5D562501/5EA608FF" Ref="#PWR?"  Part="1" 
AR Path="/5D587C46/5EA608FF" Ref="#PWR?"  Part="1" 
AR Path="/5D591ABD/5EA608FF" Ref="#PWR?"  Part="1" 
F 0 "#PWR?" H 8900 5750 50  0001 C CNN
F 1 "GND" H 8905 5827 50  0000 C CNN
F 2 "" H 8900 6000 50  0001 C CNN
F 3 "" H 8900 6000 50  0001 C CNN
	1    8900 6000
	-1   0    0    -1  
$EndComp
Wire Wire Line
	8900 6000 8900 5900
Text Label 9450 5700 2    50   ~ 0
VSEL_2
$Comp
L Device:R R209
U 1 1 60578007
P 8900 5250
AR Path="/5D562501/60578007" Ref="R209"  Part="1" 
AR Path="/5D587C46/60578007" Ref="R209"  Part="1" 
F 0 "R209" V 8980 5250 50  0000 C CNN
F 1 "6.49k" V 8900 5250 50  0000 C CNN
F 2 "Resistor_SMD:R_0402_1005Metric" V 8830 5250 50  0001 C CNN
F 3 "~" H 8900 5250 50  0001 C CNN
F 4 "3000-0000000227" V 8900 5250 50  0001 C CNN "PartSpecification"
	1    8900 5250
	-1   0    0    -1  
$EndComp
Wire Wire Line
	8200 5000 8900 5000
Wire Wire Line
	8900 5000 8900 5100
Wire Wire Line
	8900 5500 8900 5400
Wire Wire Line
	9150 5700 9450 5700
Wire Wire Line
	6950 5700 7250 5700
$Comp
L power:GND #PWR?
U 1 1 60578008
P 7850 3050
AR Path="/5D562501/60578008" Ref="#PWR?"  Part="1" 
AR Path="/5D587C46/60578008" Ref="#PWR?"  Part="1" 
AR Path="/5D591ABD/60578008" Ref="#PWR?"  Part="1" 
F 0 "#PWR?" H 7850 2800 50  0001 C CNN
F 1 "GND" H 7855 2877 50  0000 C CNN
F 2 "" H 7850 3050 50  0001 C CNN
F 3 "" H 7850 3050 50  0001 C CNN
	1    7850 3050
	1    0    0    -1  
$EndComp
Wire Wire Line
	7850 3050 7850 2950
$Comp
L Device:R R206
U 1 1 60578009
P 7850 2300
AR Path="/5D562501/60578009" Ref="R206"  Part="1" 
AR Path="/5D587C46/60578009" Ref="R206"  Part="1" 
AR Path="/5D591ABD/60578009" Ref="R?"  Part="1" 
F 0 "R206" H 7920 2346 50  0000 L CNN
F 1 "806k" H 7920 2255 50  0000 L CNN
F 2 "Resistor_SMD:R_0402_1005Metric" V 7780 2300 50  0001 C CNN
F 3 "~" H 7850 2300 50  0001 C CNN
F 4 "" H 7850 2300 50  0001 C CNN "Manufacturer"
F 5 "" H 7850 2300 50  0001 C CNN "PartNumber"
F 6 "3000-0000000236" H 7850 2300 50  0001 C CNN "PartSpecification"
	1    7850 2300
	1    0    0    -1  
$EndComp
Wire Wire Line
	7850 2450 7850 2550
Wire Wire Line
	7850 2150 7850 1700
Wire Wire Line
	7850 1700 7600 1700
Wire Wire Line
	7600 2750 7400 2750
Text HLabel 3050 2350 0    50   Input ~ 0
VSEL_2
Wire Wire Line
	3050 2350 3500 2350
Text Label 3300 2350 0    50   ~ 0
VSEL_2
Wire Wire Line
	3050 2250 4950 2250
Wire Wire Line
	4950 2000 5300 2000
$Comp
L POWDER_Power:TPS63070RNM U201
U 1 1 5D67CCCA
P 5900 1600
AR Path="/5D562501/5D67CCCA" Ref="U201"  Part="1" 
AR Path="/5D587C46/5D67CCCA" Ref="U201"  Part="1" 
AR Path="/5D591ABD/5D67CCCA" Ref="U?"  Part="1" 
F 0 "U201" H 6250 2200 60  0000 C CNN
F 1 "TPS63070RNM" H 5900 1800 60  0000 C CNN
F 2 "POWDER_Power:TPS63070RNMR" H 5900 1540 60  0001 C CNN
F 3 "" H 5900 1600 60  0000 C CNN
F 4 "Texas Instruments" H 5900 1600 50  0001 C CNN "Manufacturer"
F 5 "TPS63070RNMR" H 5900 1600 50  0001 C CNN "PartNumber"
F 6 "3000-0000000079" H 5900 1600 50  0001 C CNN "PartSpecification"
	1    5900 1600
	1    0    0    -1  
$EndComp
Wire Wire Line
	2150 1300 5100 1300
Wire Wire Line
	3150 2050 4100 2050
Wire Wire Line
	4100 1800 4100 2050
Wire Wire Line
	3050 2150 4550 2150
Wire Wire Line
	6500 4700 7500 4700
Wire Wire Line
	7500 4700 7500 5000
Connection ~ 7500 5000
Text Label 7500 2750 2    50   ~ 0
VSEL_2
$Comp
L Device:C C214
U 1 1 5EB22858
P 8900 4700
AR Path="/5D587C46/5EB22858" Ref="C214"  Part="1" 
AR Path="/5D562501/5EB22858" Ref="C214"  Part="1" 
F 0 "C214" H 8925 4800 50  0000 L CNN
F 1 "10nF" H 8925 4600 50  0000 L CNN
F 2 "Capacitor_SMD:C_0402_1005Metric" H 8938 4550 50  0001 C CNN
F 3 "~" H 8900 4700 50  0001 C CNN
F 4 "3000-0000000203" H 8900 4700 50  0001 C CNN "PartSpecification"
	1    8900 4700
	1    0    0    -1  
$EndComp
Wire Wire Line
	8900 4550 8900 4450
Wire Wire Line
	8900 4450 8200 4450
Connection ~ 8200 4450
Wire Wire Line
	8900 4850 8900 5000
Connection ~ 8900 5000
$Comp
L 000_PreferredParts:C_10uF_0603 C216
U 1 1 5EB2C04D
P 9500 4700
AR Path="/5D587C46/5EB2C04D" Ref="C216"  Part="1" 
AR Path="/5D562501/5EB2C04D" Ref="C216"  Part="1" 
F 0 "C216" H 9525 4800 50  0000 L CNN
F 1 "C_10uF_0603" H 9525 4600 50  0001 L CNN
F 2 "Capacitor_SMD:C_0603_1608Metric" H 9538 4550 50  0001 C CNN
F 3 "~" H 9500 4700 50  0001 C CNN
F 4 "10uF" H 9650 4600 50  0000 C CNN "DisplayValue"
F 5 "0603" H 9650 4500 50  0000 C CNN "DisplayFootprint"
F 6 "3000-0000000135" H 0   0   50  0001 C CNN "PartSpecification"
	1    9500 4700
	1    0    0    -1  
$EndComp
Wire Wire Line
	9500 4550 9500 4450
Wire Wire Line
	9500 4450 8900 4450
Connection ~ 8900 4450
$Comp
L power:GND #PWR?
U 1 1 5EB30875
P 9500 5000
AR Path="/5D562501/5EB30875" Ref="#PWR?"  Part="1" 
AR Path="/5D587C46/5EB30875" Ref="#PWR?"  Part="1" 
AR Path="/5D591ABD/5EB30875" Ref="#PWR?"  Part="1" 
F 0 "#PWR?" H 9500 4750 50  0001 C CNN
F 1 "GND" H 9505 4827 50  0000 C CNN
F 2 "" H 9500 5000 50  0001 C CNN
F 3 "" H 9500 5000 50  0001 C CNN
	1    9500 5000
	-1   0    0    -1  
$EndComp
Wire Wire Line
	9500 5000 9500 4850
$Comp
L 000_PreferredParts:C_10uF_0603 C218
U 1 1 6057800F
P 10000 4700
AR Path="/5D587C46/6057800F" Ref="C218"  Part="1" 
AR Path="/5D562501/6057800F" Ref="C218"  Part="1" 
F 0 "C218" H 10025 4800 50  0000 L CNN
F 1 "C_10uF_0603" H 10025 4600 50  0001 L CNN
F 2 "Capacitor_SMD:C_0603_1608Metric" H 10038 4550 50  0001 C CNN
F 3 "~" H 10000 4700 50  0001 C CNN
F 4 "10uF" H 10150 4600 50  0000 C CNN "DisplayValue"
F 5 "0603" H 10150 4500 50  0000 C CNN "DisplayFootprint"
F 6 "3000-0000000135" H 0   0   50  0001 C CNN "PartSpecification"
	1    10000 4700
	1    0    0    -1  
$EndComp
Wire Wire Line
	10000 4550 10000 4450
Wire Wire Line
	10000 4450 9500 4450
$Comp
L power:GND #PWR?
U 1 1 60578010
P 10000 5000
AR Path="/5D562501/60578010" Ref="#PWR?"  Part="1" 
AR Path="/5D587C46/60578010" Ref="#PWR?"  Part="1" 
AR Path="/5D591ABD/60578010" Ref="#PWR?"  Part="1" 
F 0 "#PWR?" H 10000 4750 50  0001 C CNN
F 1 "GND" H 10005 4827 50  0000 C CNN
F 2 "" H 10000 5000 50  0001 C CNN
F 3 "" H 10000 5000 50  0001 C CNN
	1    10000 5000
	-1   0    0    -1  
$EndComp
Wire Wire Line
	10000 5000 10000 4850
Connection ~ 9500 4450
$Comp
L 000_PreferredParts:C_10uF_0603 C220
U 1 1 60578011
P 10500 4700
AR Path="/5D587C46/60578011" Ref="C220"  Part="1" 
AR Path="/5D562501/60578011" Ref="C220"  Part="1" 
F 0 "C220" H 10525 4800 50  0000 L CNN
F 1 "C_10uF_0603" H 10525 4600 50  0001 L CNN
F 2 "Capacitor_SMD:C_0603_1608Metric" H 10538 4550 50  0001 C CNN
F 3 "~" H 10500 4700 50  0001 C CNN
F 4 "10uF" H 10650 4600 50  0000 C CNN "DisplayValue"
F 5 "0603" H 10650 4500 50  0000 C CNN "DisplayFootprint"
F 6 "3000-0000000135" H 0   0   50  0001 C CNN "PartSpecification"
	1    10500 4700
	1    0    0    -1  
$EndComp
Wire Wire Line
	10500 4550 10500 4450
Wire Wire Line
	10500 4450 10000 4450
$Comp
L power:GND #PWR?
U 1 1 60578012
P 10500 5000
AR Path="/5D562501/60578012" Ref="#PWR?"  Part="1" 
AR Path="/5D587C46/60578012" Ref="#PWR?"  Part="1" 
AR Path="/5D591ABD/60578012" Ref="#PWR?"  Part="1" 
F 0 "#PWR?" H 10500 4750 50  0001 C CNN
F 1 "GND" H 10505 4827 50  0000 C CNN
F 2 "" H 10500 5000 50  0001 C CNN
F 3 "" H 10500 5000 50  0001 C CNN
	1    10500 5000
	-1   0    0    -1  
$EndComp
Wire Wire Line
	10500 5000 10500 4850
Connection ~ 10000 4450
$Comp
L 000_PreferredParts:C_10uF_0603 C215
U 1 1 60578013
P 9500 3700
AR Path="/5D587C46/60578013" Ref="C215"  Part="1" 
AR Path="/5D562501/60578013" Ref="C215"  Part="1" 
F 0 "C215" H 9525 3800 50  0000 L CNN
F 1 "C_10uF_0603" H 9525 3600 50  0001 L CNN
F 2 "Capacitor_SMD:C_0603_1608Metric" H 9538 3550 50  0001 C CNN
F 3 "~" H 9500 3700 50  0001 C CNN
F 4 "10uF" H 9650 3600 50  0000 C CNN "DisplayValue"
F 5 "0603" H 9650 3500 50  0000 C CNN "DisplayFootprint"
F 6 "3000-0000000135" H 0   0   50  0001 C CNN "PartSpecification"
	1    9500 3700
	1    0    0    -1  
$EndComp
Wire Wire Line
	9500 3550 9500 3450
Wire Wire Line
	9500 3450 8900 3450
$Comp
L power:GND #PWR?
U 1 1 5EB6B16F
P 9500 4000
AR Path="/5D562501/5EB6B16F" Ref="#PWR?"  Part="1" 
AR Path="/5D587C46/5EB6B16F" Ref="#PWR?"  Part="1" 
AR Path="/5D591ABD/5EB6B16F" Ref="#PWR?"  Part="1" 
F 0 "#PWR?" H 9500 3750 50  0001 C CNN
F 1 "GND" H 9505 3827 50  0000 C CNN
F 2 "" H 9500 4000 50  0001 C CNN
F 3 "" H 9500 4000 50  0001 C CNN
	1    9500 4000
	-1   0    0    -1  
$EndComp
Wire Wire Line
	9500 4000 9500 3850
$Comp
L 000_PreferredParts:C_10uF_0603 C217
U 1 1 5EB6B178
P 10000 3700
AR Path="/5D587C46/5EB6B178" Ref="C217"  Part="1" 
AR Path="/5D562501/5EB6B178" Ref="C217"  Part="1" 
F 0 "C217" H 10025 3800 50  0000 L CNN
F 1 "C_10uF_0603" H 10025 3600 50  0001 L CNN
F 2 "Capacitor_SMD:C_0603_1608Metric" H 10038 3550 50  0001 C CNN
F 3 "~" H 10000 3700 50  0001 C CNN
F 4 "10uF" H 10150 3600 50  0000 C CNN "DisplayValue"
F 5 "0603" H 10150 3500 50  0000 C CNN "DisplayFootprint"
F 6 "3000-0000000135" H 0   0   50  0001 C CNN "PartSpecification"
	1    10000 3700
	1    0    0    -1  
$EndComp
Wire Wire Line
	10000 3550 10000 3450
Wire Wire Line
	10000 3450 9500 3450
$Comp
L power:GND #PWR?
U 1 1 5EB6B180
P 10000 4000
AR Path="/5D562501/5EB6B180" Ref="#PWR?"  Part="1" 
AR Path="/5D587C46/5EB6B180" Ref="#PWR?"  Part="1" 
AR Path="/5D591ABD/5EB6B180" Ref="#PWR?"  Part="1" 
F 0 "#PWR?" H 10000 3750 50  0001 C CNN
F 1 "GND" H 10005 3827 50  0000 C CNN
F 2 "" H 10000 4000 50  0001 C CNN
F 3 "" H 10000 4000 50  0001 C CNN
	1    10000 4000
	-1   0    0    -1  
$EndComp
Wire Wire Line
	10000 4000 10000 3850
Connection ~ 9500 3450
$Comp
L 000_PreferredParts:C_10uF_0603 C219
U 1 1 5EB6B18A
P 10500 3700
AR Path="/5D587C46/5EB6B18A" Ref="C219"  Part="1" 
AR Path="/5D562501/5EB6B18A" Ref="C219"  Part="1" 
F 0 "C219" H 10525 3800 50  0000 L CNN
F 1 "C_10uF_0603" H 10525 3600 50  0001 L CNN
F 2 "Capacitor_SMD:C_0603_1608Metric" H 10538 3550 50  0001 C CNN
F 3 "~" H 10500 3700 50  0001 C CNN
F 4 "10uF" H 10650 3600 50  0000 C CNN "DisplayValue"
F 5 "0603" H 10650 3500 50  0000 C CNN "DisplayFootprint"
F 6 "3000-0000000135" H 0   0   50  0001 C CNN "PartSpecification"
	1    10500 3700
	1    0    0    -1  
$EndComp
Wire Wire Line
	10500 3550 10500 3450
Wire Wire Line
	10500 3450 10000 3450
$Comp
L power:GND #PWR?
U 1 1 5EB6B192
P 10500 4000
AR Path="/5D562501/5EB6B192" Ref="#PWR?"  Part="1" 
AR Path="/5D587C46/5EB6B192" Ref="#PWR?"  Part="1" 
AR Path="/5D591ABD/5EB6B192" Ref="#PWR?"  Part="1" 
F 0 "#PWR?" H 10500 3750 50  0001 C CNN
F 1 "GND" H 10505 3827 50  0000 C CNN
F 2 "" H 10500 4000 50  0001 C CNN
F 3 "" H 10500 4000 50  0001 C CNN
	1    10500 4000
	-1   0    0    -1  
$EndComp
Wire Wire Line
	10500 4000 10500 3850
Connection ~ 10000 3450
Wire Wire Line
	8900 3450 8900 4450
Wire Wire Line
	10900 4450 10800 4450
Connection ~ 10500 4450
Text Label 8600 5000 0    50   ~ 0
LDO_FB
Text Label 4850 4650 0    50   ~ 0
NR_SS
Text Label 7500 5450 0    50   ~ 0
LDO_FB_PD_1
Text Label 8900 5450 0    50   ~ 0
LDO_FB_PD_2
Text Label 7850 2500 0    50   ~ 0
DCDC_FB_PD_2
$Comp
L Device:R R?
U 1 1 60621963
P 10800 5550
AR Path="/60621963" Ref="R?"  Part="1" 
AR Path="/5D587C46/60621963" Ref="R213"  Part="1" 
F 0 "R213" V 10880 5550 50  0000 C CNN
F 1 "10k" V 10800 5550 50  0000 C CNN
F 2 "Resistor_SMD:R_0402_1005Metric" V 10730 5550 50  0001 C CNN
F 3 "~" H 10800 5550 50  0001 C CNN
F 4 "3000-0000000131" V 10800 5550 50  0001 C CNN "PartSpecification"
	1    10800 5550
	-1   0    0    -1  
$EndComp
$Comp
L Device:R R?
U 1 1 6062196A
P 10800 5950
AR Path="/6062196A" Ref="R?"  Part="1" 
AR Path="/5D587C46/6062196A" Ref="R214"  Part="1" 
F 0 "R214" V 10880 5950 50  0000 C CNN
F 1 "4.87k" V 10800 5950 50  0000 C CNN
F 2 "Resistor_SMD:R_0402_1005Metric" V 10730 5950 50  0001 C CNN
F 3 "~" H 10800 5950 50  0001 C CNN
F 4 "3000-0000000133" V 10800 5950 50  0001 C CNN "PartSpecification"
	1    10800 5950
	-1   0    0    -1  
$EndComp
$Comp
L power:GND #PWR?
U 1 1 60621970
P 10800 6200
AR Path="/60621970" Ref="#PWR?"  Part="1" 
AR Path="/5D587C46/60621970" Ref="#PWR?"  Part="1" 
F 0 "#PWR?" H 10800 5950 50  0001 C CNN
F 1 "GND" H 10805 6027 50  0000 C CNN
F 2 "" H 10800 6200 50  0001 C CNN
F 3 "" H 10800 6200 50  0001 C CNN
	1    10800 6200
	-1   0    0    -1  
$EndComp
Wire Wire Line
	10800 6100 10800 6200
Wire Wire Line
	10800 5800 10800 5750
Connection ~ 10800 5750
Wire Wire Line
	10800 5750 10800 5700
Wire Wire Line
	10800 4450 10800 5400
Text Label 10200 5750 0    50   ~ 0
VSENSE_PA
Wire Wire Line
	10800 5750 10200 5750
Connection ~ 10800 4450
Wire Wire Line
	10800 4450 10500 4450
Text HLabel 10200 5750 0    50   Output ~ 0
VSENSE_OUT
Wire Wire Line
	6500 4850 6800 4850
$Comp
L Device:R R?
U 1 1 60A47CF6
P 3150 5250
AR Path="/605746B5/5F853053/60A47CF6" Ref="R?"  Part="1" 
AR Path="/605746B5/61256AAD/60A47CF6" Ref="R?"  Part="1" 
AR Path="/5D587C46/60A47CF6" Ref="R204"  Part="1" 
F 0 "R204" V 3230 5250 50  0000 C CNN
F 1 "10k" V 3150 5250 50  0000 C CNN
F 2 "Resistor_SMD:R_0402_1005Metric" V 3080 5250 50  0001 C CNN
F 3 "~" H 3150 5250 50  0001 C CNN
F 4 "3000-0000000131" H 3150 5250 50  0001 C CNN "PartSpecification"
	1    3150 5250
	1    0    0    -1  
$EndComp
$Comp
L power:GND #PWR?
U 1 1 60A47CFC
P 3150 5500
AR Path="/605746B5/5F853053/60A47CFC" Ref="#PWR?"  Part="1" 
AR Path="/5D587C46/60A47CFC" Ref="#PWR?"  Part="1" 
F 0 "#PWR?" H 3150 5250 50  0001 C CNN
F 1 "GND" H 3150 5350 50  0000 C CNN
F 2 "" H 3150 5500 50  0001 C CNN
F 3 "" H 3150 5500 50  0001 C CNN
	1    3150 5500
	1    0    0    -1  
$EndComp
Wire Wire Line
	3150 5500 3150 5400
Wire Wire Line
	3150 5100 3150 4750
Connection ~ 3150 4750
$EndSCHEMATC
