EESchema Schematic File Version 4
EELAYER 30 0
EELAYER END
$Descr A4 11693 8268
encoding utf-8
Sheet 17 27
Title ""
Date ""
Rev ""
Comp ""
Comment1 ""
Comment2 ""
Comment3 ""
Comment4 ""
$EndDescr
$Comp
L POWDER_Misc:TRS3232E-Q1 U?
U 1 1 5E1C5C12
P 4150 3050
AR Path="/5E1922DE/5E1C5C12" Ref="U?"  Part="1" 
AR Path="/5E1922DE/5E1C276C/5E1C5C12" Ref="U1901"  Part="1" 
F 0 "U1901" H 4650 3550 50  0000 C CNN
F 1 "TRS3232E-Q1" H 4600 1550 50  0000 C CNN
F 2 "Package_SO:TSSOP-16_4.4x5mm_P0.65mm" H 5050 3650 50  0001 C CNN
F 3 "" H 4150 3050 50  0001 C CNN
F 4 "3000-0000000533" H 4150 3050 50  0001 C CNN "PartSpecification"
	1    4150 3050
	1    0    0    -1  
$EndComp
$Comp
L power:GND #PWR?
U 1 1 5E1C5C18
P 4150 4750
AR Path="/5E1922DE/5E1C5C18" Ref="#PWR?"  Part="1" 
AR Path="/5E1922DE/5E1C276C/5E1C5C18" Ref="#PWR?"  Part="1" 
F 0 "#PWR?" H 4150 4500 50  0001 C CNN
F 1 "GND" H 4150 4600 50  0000 C CNN
F 2 "" H 4150 4750 50  0001 C CNN
F 3 "" H 4150 4750 50  0001 C CNN
	1    4150 4750
	1    0    0    -1  
$EndComp
Wire Wire Line
	4150 4750 4150 4600
$Comp
L power:+3.3V #PWR?
U 1 1 5E1C5C1F
P 4150 2300
AR Path="/5E1922DE/5E1C5C1F" Ref="#PWR?"  Part="1" 
AR Path="/5E1922DE/5E1C276C/5E1C5C1F" Ref="#PWR?"  Part="1" 
F 0 "#PWR?" H 4150 2150 50  0001 C CNN
F 1 "+3.3V" H 4150 2440 50  0000 C CNN
F 2 "" H 4150 2300 50  0001 C CNN
F 3 "" H 4150 2300 50  0001 C CNN
	1    4150 2300
	1    0    0    -1  
$EndComp
Wire Wire Line
	4150 2300 4150 2500
$Comp
L 000_PreferredParts:C_0_1uF C?
U 1 1 5E1C5C28
P 5350 2750
AR Path="/5E1922DE/5E1C5C28" Ref="C?"  Part="1" 
AR Path="/5E1922DE/5E1C276C/5E1C5C28" Ref="C1903"  Part="1" 
F 0 "C1903" H 5375 2850 50  0000 L CNN
F 1 "C_0_1uF" H 5375 2650 50  0001 L CNN
F 2 "Capacitor_SMD:C_0402_1005Metric" H 5388 2600 50  0001 C CNN
F 3 "~" H 5350 2750 50  0001 C CNN
F 4 "0.1uF" H 5500 2650 50  0000 C CNN "DisplayValue"
F 5 "3000-0000000125" H 5350 2750 50  0001 C CNN "PartSpecification"
	1    5350 2750
	0    1    1    0   
$EndComp
$Comp
L 000_PreferredParts:C_0_1uF C?
U 1 1 5E1C5C30
P 5750 3100
AR Path="/5E1922DE/5E1C5C30" Ref="C?"  Part="1" 
AR Path="/5E1922DE/5E1C276C/5E1C5C30" Ref="C1904"  Part="1" 
F 0 "C1904" H 5775 3200 50  0000 L CNN
F 1 "C_0_1uF" H 5775 3000 50  0001 L CNN
F 2 "Capacitor_SMD:C_0402_1005Metric" H 5788 2950 50  0001 C CNN
F 3 "~" H 5750 3100 50  0001 C CNN
F 4 "0.1uF" H 5900 3000 50  0000 C CNN "DisplayValue"
F 5 "3000-0000000125" H 5750 3100 50  0001 C CNN "PartSpecification"
	1    5750 3100
	-1   0    0    1   
$EndComp
$Comp
L 000_PreferredParts:C_0_1uF C?
U 1 1 5E1C5C38
P 3100 2750
AR Path="/5E1922DE/5E1C5C38" Ref="C?"  Part="1" 
AR Path="/5E1922DE/5E1C276C/5E1C5C38" Ref="C1902"  Part="1" 
F 0 "C1902" H 3125 2850 50  0000 L CNN
F 1 "C_0_1uF" H 3125 2650 50  0001 L CNN
F 2 "Capacitor_SMD:C_0402_1005Metric" H 3138 2600 50  0001 C CNN
F 3 "~" H 3100 2750 50  0001 C CNN
F 4 "0.1uF" H 3250 2650 50  0000 C CNN "DisplayValue"
F 5 "3000-0000000125" H 3100 2750 50  0001 C CNN "PartSpecification"
	1    3100 2750
	0    1    1    0   
$EndComp
$Comp
L 000_PreferredParts:C_0_1uF C?
U 1 1 5E1C5C40
P 2800 3150
AR Path="/5E1922DE/5E1C5C40" Ref="C?"  Part="1" 
AR Path="/5E1922DE/5E1C276C/5E1C5C40" Ref="C1901"  Part="1" 
F 0 "C1901" H 2825 3250 50  0000 L CNN
F 1 "C_0_1uF" H 2825 3050 50  0001 L CNN
F 2 "Capacitor_SMD:C_0402_1005Metric" H 2838 3000 50  0001 C CNN
F 3 "~" H 2800 3150 50  0001 C CNN
F 4 "0.1uF" H 2950 3050 50  0000 C CNN "DisplayValue"
F 5 "3000-0000000125" H 2800 3150 50  0001 C CNN "PartSpecification"
	1    2800 3150
	-1   0    0    1   
$EndComp
Wire Wire Line
	5200 2750 4950 2750
Wire Wire Line
	5500 2850 5500 2750
Wire Wire Line
	4950 2850 5500 2850
Wire Wire Line
	4950 2950 5750 2950
$Comp
L power:GND #PWR?
U 1 1 5E1C5C4A
P 5750 3350
AR Path="/5E1922DE/5E1C5C4A" Ref="#PWR?"  Part="1" 
AR Path="/5E1922DE/5E1C276C/5E1C5C4A" Ref="#PWR?"  Part="1" 
F 0 "#PWR?" H 5750 3100 50  0001 C CNN
F 1 "GND" H 5750 3200 50  0000 C CNN
F 2 "" H 5750 3350 50  0001 C CNN
F 3 "" H 5750 3350 50  0001 C CNN
	1    5750 3350
	1    0    0    -1  
$EndComp
Wire Wire Line
	5750 3250 5750 3350
Wire Wire Line
	3250 2750 3400 2750
Wire Wire Line
	2900 2850 2900 2750
Wire Wire Line
	2900 2750 2950 2750
Wire Wire Line
	2900 2850 3400 2850
Wire Wire Line
	3400 2950 2800 2950
Wire Wire Line
	2800 2950 2800 3000
$Comp
L power:GND #PWR?
U 1 1 5E1C5C57
P 2800 3400
AR Path="/5E1922DE/5E1C5C57" Ref="#PWR?"  Part="1" 
AR Path="/5E1922DE/5E1C276C/5E1C5C57" Ref="#PWR?"  Part="1" 
F 0 "#PWR?" H 2800 3150 50  0001 C CNN
F 1 "GND" H 2800 3250 50  0000 C CNN
F 2 "" H 2800 3400 50  0001 C CNN
F 3 "" H 2800 3400 50  0001 C CNN
	1    2800 3400
	1    0    0    -1  
$EndComp
Wire Wire Line
	2800 3400 2800 3300
Text HLabel 3250 3300 0    50   Input ~ 0
TX_1
Text HLabel 3250 3550 0    50   Input ~ 0
TX_2
Text HLabel 3250 3800 0    50   Output ~ 0
RX_1
Text HLabel 3250 4050 0    50   Output ~ 0
RX_2
Wire Wire Line
	3250 3300 3400 3300
Wire Wire Line
	3400 3550 3250 3550
Wire Wire Line
	3250 3800 3400 3800
Wire Wire Line
	3400 4050 3250 4050
$Comp
L power:GND #PWR?
U 1 1 5E1CBA7B
P 8500 4150
F 0 "#PWR?" H 8500 3900 50  0001 C CNN
F 1 "GND" H 8500 4000 50  0000 C CNN
F 2 "" H 8500 4150 50  0001 C CNN
F 3 "" H 8500 4150 50  0001 C CNN
	1    8500 4150
	1    0    0    -1  
$EndComp
$Comp
L power:GND #PWR?
U 1 1 5E1CC3A8
P 7100 4150
F 0 "#PWR?" H 7100 3900 50  0001 C CNN
F 1 "GND" H 7100 4000 50  0000 C CNN
F 2 "" H 7100 4150 50  0001 C CNN
F 3 "" H 7100 4150 50  0001 C CNN
	1    7100 4150
	1    0    0    -1  
$EndComp
NoConn ~ 8100 2700
$Comp
L power:GND #PWR?
U 1 1 5E1CE688
P 6200 3100
F 0 "#PWR?" H 6200 2850 50  0001 C CNN
F 1 "GND" H 6200 2950 50  0000 C CNN
F 2 "" H 6200 3100 50  0001 C CNN
F 3 "" H 6200 3100 50  0001 C CNN
	1    6200 3100
	1    0    0    -1  
$EndComp
Wire Wire Line
	6200 3100 6200 2900
Wire Wire Line
	6200 2900 6700 2900
NoConn ~ 8100 3000
NoConn ~ 8100 3300
NoConn ~ 8100 2600
NoConn ~ 8100 2800
Wire Wire Line
	8100 3200 7800 3200
Wire Wire Line
	8100 3100 7800 3100
Text Label 7800 3200 0    50   ~ 0
DOUT_1
Text Label 7800 3100 0    50   ~ 0
RIN_1
NoConn ~ 6700 2600
NoConn ~ 6700 2800
NoConn ~ 6700 3000
Wire Wire Line
	6700 3200 6400 3200
Wire Wire Line
	6700 3100 6400 3100
Text Label 6400 3200 0    50   ~ 0
DOUT_2
Text Label 6400 3100 0    50   ~ 0
RIN_2
Wire Wire Line
	8500 3500 8500 4150
Wire Wire Line
	7100 3500 7100 4150
Wire Wire Line
	4950 3550 5250 3550
Wire Wire Line
	4950 4050 5250 4050
Text Label 5250 3550 2    50   ~ 0
DOUT_2
Text Label 5250 4050 2    50   ~ 0
RIN_2
Wire Wire Line
	4950 3300 5250 3300
Wire Wire Line
	4950 3800 5250 3800
Text Label 5250 3300 2    50   ~ 0
DOUT_1
Text Label 5250 3800 2    50   ~ 0
RIN_1
$Comp
L Connector:RJ45_Shielded J1901
U 1 1 5E4248C2
P 7100 3000
F 0 "J1901" H 6900 3550 50  0000 R CNN
F 1 "RJ45_Shielded" H 7200 3550 50  0000 L CNN
F 2 "POWDER_Misc:MTJ-88TX1-FSD-PGB" V 7100 3025 50  0001 C CNN
F 3 "~" V 7100 3025 50  0001 C CNN
F 4 "3000-0000000491" H 7100 3000 50  0001 C CNN "PartSpecification"
	1    7100 3000
	-1   0    0    -1  
$EndComp
NoConn ~ 6700 2700
NoConn ~ 6700 3300
$Comp
L Connector:RJ45_Shielded J1902
U 1 1 5E43B385
P 8500 3000
F 0 "J1902" H 8300 3550 50  0000 R CNN
F 1 "RJ45_Shielded" H 8600 3550 50  0000 L CNN
F 2 "POWDER_Misc:MTJ-88TX1-FSD-PGB" V 8500 3025 50  0001 C CNN
F 3 "~" V 8500 3025 50  0001 C CNN
F 4 "3000-0000000491" H 8500 3000 50  0001 C CNN "PartSpecification"
	1    8500 3000
	-1   0    0    -1  
$EndComp
Wire Wire Line
	7600 3100 7600 2900
$Comp
L power:GND #PWR?
U 1 1 5E1CDF1E
P 7600 3100
F 0 "#PWR?" H 7600 2850 50  0001 C CNN
F 1 "GND" H 7600 2950 50  0000 C CNN
F 2 "" H 7600 3100 50  0001 C CNN
F 3 "" H 7600 3100 50  0001 C CNN
	1    7600 3100
	1    0    0    -1  
$EndComp
Wire Wire Line
	7600 2900 8100 2900
Text Label 2800 2950 0    50   ~ 0
V_P
Text Label 5050 2950 0    50   ~ 0
V_M
Text Label 5000 2850 0    50   ~ 0
C2_M
Text Label 5000 2750 0    50   ~ 0
C2_P
Text Label 3250 2750 0    50   ~ 0
C1_P
Text Label 3250 2850 0    50   ~ 0
C1_M
$Comp
L 000_PreferredParts:C_1uF C1905
U 1 1 5F5D7B69
P 4500 1750
F 0 "C1905" H 4525 1850 50  0000 L CNN
F 1 "C_1uF" H 4525 1650 50  0000 L CNN
F 2 "Capacitor_SMD:C_0603_1608Metric" H 4538 1600 50  0001 C CNN
F 3 "~" H 4500 1750 50  0001 C CNN
F 4 "3000-0000000136" H 4500 1750 50  0001 C CNN "PartSpecification"
	1    4500 1750
	1    0    0    -1  
$EndComp
$Comp
L power:+3.3V #PWR?
U 1 1 5F5D8E36
P 4500 1500
AR Path="/5E1922DE/5F5D8E36" Ref="#PWR?"  Part="1" 
AR Path="/5E1922DE/5E1C276C/5F5D8E36" Ref="#PWR?"  Part="1" 
F 0 "#PWR?" H 4500 1350 50  0001 C CNN
F 1 "+3.3V" H 4500 1640 50  0000 C CNN
F 2 "" H 4500 1500 50  0001 C CNN
F 3 "" H 4500 1500 50  0001 C CNN
	1    4500 1500
	1    0    0    -1  
$EndComp
Wire Wire Line
	4500 1500 4500 1600
$Comp
L power:GND #PWR?
U 1 1 5F5D98C3
P 4500 2000
F 0 "#PWR?" H 4500 1750 50  0001 C CNN
F 1 "GND" H 4500 1850 50  0000 C CNN
F 2 "" H 4500 2000 50  0001 C CNN
F 3 "" H 4500 2000 50  0001 C CNN
	1    4500 2000
	1    0    0    -1  
$EndComp
Wire Wire Line
	4500 2000 4500 1900
$EndSCHEMATC
