(export (version D)
  (design
    (source /home/sam/Documents/powder/eng/rf/pcbs/b210_header_board/b210_header_board.sch)
    (date "Thu 23 May 2019 01:15:53 PM MDT")
    (tool "Eeschema 5.1.0")
    (sheet (number 1) (name /) (tstamps /)
      (title_block
        (title)
        (company)
        (rev)
        (date)
        (source b210_header_board.sch)
        (comment (number 1) (value ""))
        (comment (number 2) (value ""))
        (comment (number 3) (value ""))
        (comment (number 4) (value "")))))
  (components
    (comp (ref J1)
      (value Conn_02x05_Odd_Even)
      (footprint Connector_PinSocket_2.54mm:PinSocket_2x05_P2.54mm_Vertical)
      (datasheet ~)
      (libsource (lib Connector_Generic) (part Conn_02x05_Odd_Even) (description "Generic connector, double row, 02x05, odd/even pin numbering scheme (row 1 odd numbers, row 2 even numbers), script generated (kicad-library-utils/schlib/autogen/connector/)"))
      (sheetpath (names /) (tstamps /))
      (tstamp 5CF6A4AB))
    (comp (ref J2)
      (value Conn_02x05_Odd_Even)
      (footprint Connector_PinSocket_1.27mm:PinSocket_2x05_P1.27mm_Horizontal)
      (datasheet ~)
      (libsource (lib Connector_Generic) (part Conn_02x05_Odd_Even) (description "Generic connector, double row, 02x05, odd/even pin numbering scheme (row 1 odd numbers, row 2 even numbers), script generated (kicad-library-utils/schlib/autogen/connector/)"))
      (sheetpath (names /) (tstamps /))
      (tstamp 5CF6AA14)))
  (libparts
    (libpart (lib Connector_Generic) (part Conn_02x05_Odd_Even)
      (description "Generic connector, double row, 02x05, odd/even pin numbering scheme (row 1 odd numbers, row 2 even numbers), script generated (kicad-library-utils/schlib/autogen/connector/)")
      (docs ~)
      (footprints
        (fp Connector*:*_2x??_*))
      (fields
        (field (name Reference) J)
        (field (name Value) Conn_02x05_Odd_Even))
      (pins
        (pin (num 1) (name Pin_1) (type passive))
        (pin (num 2) (name Pin_2) (type passive))
        (pin (num 3) (name Pin_3) (type passive))
        (pin (num 4) (name Pin_4) (type passive))
        (pin (num 5) (name Pin_5) (type passive))
        (pin (num 6) (name Pin_6) (type passive))
        (pin (num 7) (name Pin_7) (type passive))
        (pin (num 8) (name Pin_8) (type passive))
        (pin (num 9) (name Pin_9) (type passive))
        (pin (num 10) (name Pin_10) (type passive)))))
  (libraries
    (library (logical Connector_Generic)
      (uri /usr/share/kicad/library/Connector_Generic.lib)))
  (nets
    (net (code 1) (name "Net-(J1-Pad4)")
      (node (ref J1) (pin 4))
      (node (ref J2) (pin 4)))
    (net (code 2) (name "Net-(J1-Pad5)")
      (node (ref J1) (pin 5))
      (node (ref J2) (pin 5)))
    (net (code 3) (name "Net-(J1-Pad7)")
      (node (ref J1) (pin 7))
      (node (ref J2) (pin 7)))
    (net (code 4) (name "Net-(J1-Pad9)")
      (node (ref J2) (pin 9))
      (node (ref J1) (pin 9)))
    (net (code 5) (name "Net-(J1-Pad2)")
      (node (ref J2) (pin 2))
      (node (ref J1) (pin 2)))
    (net (code 6) (name "Net-(J1-Pad6)")
      (node (ref J1) (pin 6))
      (node (ref J2) (pin 6)))
    (net (code 7) (name "Net-(J1-Pad8)")
      (node (ref J1) (pin 8))
      (node (ref J2) (pin 8)))
    (net (code 8) (name "Net-(J1-Pad10)")
      (node (ref J1) (pin 10))
      (node (ref J2) (pin 10)))
    (net (code 9) (name "Net-(J1-Pad3)")
      (node (ref J1) (pin 3))
      (node (ref J2) (pin 3)))
    (net (code 10) (name "Net-(J1-Pad1)")
      (node (ref J1) (pin 1))
      (node (ref J2) (pin 1)))))