(module PQ2614BxA (layer F.Cu) (tedit 5EF53EDD)
  (attr smd)
  (fp_text reference REF** (at 0 18.55) (layer F.SilkS)
    (effects (font (size 1 1) (thickness 0.15)))
  )
  (fp_text value PQ2614BxA (at 0 -0.5) (layer F.Fab)
    (effects (font (size 1 1) (thickness 0.15)))
  )
  (fp_line (start -13.95 -10.36) (end 13.95 -10.36) (layer F.Fab) (width 0.1))
  (fp_line (start -13.95 9.44) (end 13.95 9.44) (layer F.Fab) (width 0.1))
  (fp_line (start 13.95 -10.36) (end 13.95 9.44) (layer F.Fab) (width 0.1))
  (fp_line (start -13.95 9.44) (end -13.95 -10.36) (layer F.Fab) (width 0.1))
  (fp_line (start 14.2 -10.65) (end 14.2 17.4) (layer F.CrtYd) (width 0.05))
  (fp_line (start 14.2 17.4) (end -14.2 17.4) (layer F.CrtYd) (width 0.05))
  (fp_line (start -14.2 17.4) (end -14.2 -10.65) (layer F.CrtYd) (width 0.05))
  (fp_line (start -14.2 -10.65) (end 14.2 -10.65) (layer F.CrtYd) (width 0.05))
  (fp_line (start 14.25 -10.7) (end 14.25 17.45) (layer F.SilkS) (width 0.12))
  (fp_line (start 14.25 17.45) (end -14.25 17.45) (layer F.SilkS) (width 0.12))
  (fp_line (start -14.25 17.45) (end -14.25 -10.7) (layer F.SilkS) (width 0.12))
  (fp_line (start -14.25 -10.7) (end 14.25 -10.7) (layer F.SilkS) (width 0.12))
  (pad 1 smd rect (at -5.075 14.355) (size 5.33 5.59) (layers F.Cu F.Paste F.Mask))
  (pad 2 smd rect (at 5.075 14.355) (size 5.33 5.59) (layers F.Cu F.Paste F.Mask))
  (pad NC smd rect (at 0 -7.72) (size 6.35 5.28) (layers F.Cu F.Paste F.Mask))
  (model ${POWDER_KICAD_LIBRARY}/models/POWDER_Power/PQ2614BHA.stp
    (at (xyz 0 0 0))
    (scale (xyz 1 1 1))
    (rotate (xyz 0 90 -90))
  )
)
