(footprint "PAC1951_WLCSP" (version 20211014) (generator pcbnew)
  (layer "F.Cu")
  (tedit 62857F9E)
  (descr "BGA-16, http://www.st.com/content/ccc/resource/technical/document/datasheet/group2/bc/cd/62/9e/8f/30/47/69/CD00151267/files/CD00151267.pdf/jcr:content/translations/en.CD00151267.pdf")
  (tags "BGA-16")
  (attr smd)
  (fp_text reference "REF**" (at 0 -2.6) (layer "F.SilkS")
    (effects (font (size 1 1) (thickness 0.15)))
    (tstamp 1f8281d6-fd22-45c6-847b-0f9e915a4b0e)
  )
  (fp_text value "PAC1951_WLCSP" (at 0 2) (layer "F.Fab")
    (effects (font (size 1 1) (thickness 0.15)))
    (tstamp 8d6d050b-4f80-400c-aaf2-38556affc131)
  )
  (fp_text user "${REFERENCE}" (at 0 0) (layer "F.Fab")
    (effects (font (size 0.4 0.4) (thickness 0.1)))
    (tstamp 649f2b44-dde4-4c53-9ae2-ea1cabbcb113)
  )
  (fp_line (start 1.2 1.2) (end -1.2 1.2) (layer "F.SilkS") (width 0.12) (tstamp 17e81229-2611-4510-bc0b-45a642cd3a73))
  (fp_line (start -1.4 -1.4) (end -1.4 -0.7) (layer "F.SilkS") (width 0.12) (tstamp 2910c7c5-ec66-4c86-9dcc-02dc8241a46e))
  (fp_line (start 1.2 -1.2) (end 1.2 1.2) (layer "F.SilkS") (width 0.12) (tstamp 2f091c68-0afd-4fe8-83ae-d95b1b557ce7))
  (fp_line (start -0.7 -1.4) (end -1.4 -1.4) (layer "F.SilkS") (width 0.12) (tstamp 99c7a074-f2f3-4183-b269-f0875fcd2425))
  (fp_line (start -1.2 1.2) (end -1.2 -1.2) (layer "F.SilkS") (width 0.12) (tstamp b40bd5a8-845d-4759-a98d-32c008c3d1f7))
  (fp_line (start -1.2 -1.2) (end 1.2 -1.2) (layer "F.SilkS") (width 0.12) (tstamp be4a82eb-9db2-4a5c-831c-ee6c8210da85))
  (fp_line (start 1.4 1.4) (end -1.4 1.4) (layer "F.CrtYd") (width 0.05) (tstamp 2aaf7be1-33a0-4b91-b3d8-8d365be9a9f9))
  (fp_line (start -1.4 -1.4) (end 1.4 -1.4) (layer "F.CrtYd") (width 0.05) (tstamp 53c2fe38-5cd4-43e3-9dd0-4f5a84ac8a72))
  (fp_line (start 1.4 1.4) (end 1.4 -1.4) (layer "F.CrtYd") (width 0.05) (tstamp 5dc7b93e-6ed1-4a8e-bd2b-f10dab65ed3c))
  (fp_line (start -1.4 -1.4) (end -1.4 1.4) (layer "F.CrtYd") (width 0.05) (tstamp ad9a4223-342c-4f4b-8a37-0708d88c17a4))
  (fp_line (start 1.1125 1.085) (end -1.1125 1.085) (layer "F.Fab") (width 0.1) (tstamp 2b52e9e7-855e-4f25-b578-4272fe24d6c2))
  (fp_line (start -1.1125 -0.55) (end -0.55 -1.085) (layer "F.Fab") (width 0.1) (tstamp 5936b45d-5c78-431a-b53e-e58f65c6e65e))
  (fp_line (start -0.55 -1.085) (end 1.1125 -1.085) (layer "F.Fab") (width 0.1) (tstamp 9e9b01cf-637a-406a-b108-296dc4b53e8e))
  (fp_line (start 1.1125 -1.085) (end 1.1125 1.085) (layer "F.Fab") (width 0.1) (tstamp aa6bc8bf-f920-479b-b166-9db56b8a76dd))
  (fp_line (start -1.1125 1.085) (end -1.1125 -0.55) (layer "F.Fab") (width 0.1) (tstamp c2754fed-bea9-4b76-9641-59887633599b))
  (pad "A1" smd circle (at -0.75 -0.75) (size 0.25 0.25) (layers "F.Cu" "F.Paste" "F.Mask") (tstamp 76ee6a17-6f52-43fc-bc58-53ba3c2da83a))
  (pad "A2" smd circle (at -0.25 -0.75) (size 0.25 0.25) (layers "F.Cu" "F.Paste" "F.Mask") (tstamp ebcfbe77-29f0-4811-9059-ab40bbe8d8fe))
  (pad "A3" smd circle (at 0.25 -0.75) (size 0.25 0.25) (layers "F.Cu" "F.Paste" "F.Mask") (tstamp 5fc7992b-754c-47ae-972c-e73fea6b804b))
  (pad "A4" smd circle (at 0.75 -0.75) (size 0.25 0.25) (layers "F.Cu" "F.Paste" "F.Mask") (tstamp 55e14413-e6e6-4924-bd5c-090d7d5462e3))
  (pad "B1" smd circle (at -0.75 -0.25) (size 0.25 0.25) (layers "F.Cu" "F.Paste" "F.Mask") (tstamp a732784e-9801-4816-8629-73b2f2f94367))
  (pad "B2" smd circle (at -0.25 -0.25) (size 0.25 0.25) (layers "F.Cu" "F.Paste" "F.Mask") (tstamp 5c37edc6-bb3d-4508-980b-3d05ef66bce6))
  (pad "B3" smd circle (at 0.25 -0.25) (size 0.25 0.25) (layers "F.Cu" "F.Paste" "F.Mask") (tstamp 74846c99-169e-4a7e-964c-1ec5a8c6d257))
  (pad "B4" smd circle (at 0.75 -0.25) (size 0.25 0.25) (layers "F.Cu" "F.Paste" "F.Mask") (tstamp 5075c1d4-4175-4c80-8617-0a06bbf40ab3))
  (pad "C1" smd circle (at -0.75 0.25) (size 0.25 0.25) (layers "F.Cu" "F.Paste" "F.Mask") (tstamp 021488e4-2bf5-44b1-b187-b39e4acb978b))
  (pad "C2" smd circle (at -0.25 0.25) (size 0.25 0.25) (layers "F.Cu" "F.Paste" "F.Mask") (tstamp 38e4b8eb-4b0d-4064-92e0-80900ee577f5))
  (pad "C3" smd circle (at 0.25 0.25) (size 0.25 0.25) (layers "F.Cu" "F.Paste" "F.Mask") (tstamp 6191b1b8-839a-4993-a6ec-92208d44da20))
  (pad "C4" smd circle (at 0.75 0.25) (size 0.25 0.25) (layers "F.Cu" "F.Paste" "F.Mask") (tstamp 2cd876f4-00ef-4083-a9d5-822ec83dafe7))
  (pad "D1" smd circle (at -0.75 0.75) (size 0.25 0.25) (layers "F.Cu" "F.Paste" "F.Mask") (tstamp 641554eb-c26b-43dc-90e7-222596c68ed8))
  (pad "D2" smd circle (at -0.25 0.75) (size 0.25 0.25) (layers "F.Cu" "F.Paste" "F.Mask") (tstamp 638c9ae7-b2f8-4453-abba-f8c49b1c8d18))
  (pad "D3" smd circle (at 0.25 0.75) (size 0.25 0.25) (layers "F.Cu" "F.Paste" "F.Mask") (tstamp 9298d99a-0742-4491-8ca7-6ff32554957d))
  (pad "D4" smd circle (at 0.75 0.75) (size 0.25 0.25) (layers "F.Cu" "F.Paste" "F.Mask") (tstamp b515cb74-fa9b-42aa-975a-fcba480f1e63))
  (model "${KICAD6_3DMODEL_DIR}/Package_BGA.3dshapes/BGA-16_1.92x1.92mm_Layout4x4_P0.5mm.wrl"
    (offset (xyz 0 0 0))
    (scale (xyz 1 1 1))
    (rotate (xyz 0 0 0))
  )
)
