(module SKY13286-359LF (layer F.Cu) (tedit 5DBB53B5)
  (attr smd)
  (fp_text reference REF** (at 0 3.5) (layer F.SilkS)
    (effects (font (size 1 1) (thickness 0.15)))
  )
  (fp_text value SKY13286-359LF (at 0 -3.15) (layer F.Fab)
    (effects (font (size 1 1) (thickness 0.15)))
  )
  (fp_line (start 2 -2) (end 2 2) (layer F.Fab) (width 0.1))
  (fp_line (start 2 2) (end -2 2) (layer F.Fab) (width 0.1))
  (fp_line (start -2 2) (end -2 -1) (layer F.Fab) (width 0.1))
  (fp_line (start -1 -2) (end 2 -2) (layer F.Fab) (width 0.1))
  (fp_line (start 2.3 -2.3) (end 2.3 2.3) (layer F.SilkS) (width 0.12))
  (fp_line (start 2.3 2.3) (end -2.3 2.3) (layer F.SilkS) (width 0.12))
  (fp_line (start -2.3 2.3) (end -2.3 -2.3) (layer F.SilkS) (width 0.12))
  (fp_line (start -2.3 -2.3) (end 2.3 -2.3) (layer F.SilkS) (width 0.12))
  (fp_line (start 2.4 -2.4) (end 2.4 2.4) (layer F.CrtYd) (width 0.05))
  (fp_line (start 2.4 2.4) (end -2.4 2.4) (layer F.CrtYd) (width 0.05))
  (fp_line (start -2.4 2.4) (end -2.4 -2.4) (layer F.CrtYd) (width 0.05))
  (fp_line (start -2.4 -2.4) (end 2.4 -2.4) (layer F.CrtYd) (width 0.05))
  (fp_line (start -1 -2) (end -2 -1) (layer F.Fab) (width 0.1))
  (pad 1 smd rect (at -1.875 -0.975) (size 0.55 0.3) (layers F.Cu F.Paste F.Mask))
  (pad 2 smd rect (at -1.875 -0.325) (size 0.55 0.3) (layers F.Cu F.Paste F.Mask))
  (pad 3 smd rect (at -1.875 0.325) (size 0.55 0.3) (layers F.Cu F.Paste F.Mask))
  (pad 4 smd rect (at -1.875 0.975) (size 0.55 0.3) (layers F.Cu F.Paste F.Mask))
  (pad 5 smd rect (at -0.975 1.875 90) (size 0.55 0.3) (layers F.Cu F.Paste F.Mask))
  (pad 6 smd rect (at -0.325 1.875 90) (size 0.55 0.3) (layers F.Cu F.Paste F.Mask))
  (pad 7 smd rect (at 0.325 1.875 90) (size 0.55 0.3) (layers F.Cu F.Paste F.Mask))
  (pad 8 smd rect (at 0.975 1.875 90) (size 0.55 0.3) (layers F.Cu F.Paste F.Mask))
  (pad 9 smd rect (at 1.875 0.975 180) (size 0.55 0.3) (layers F.Cu F.Paste F.Mask))
  (pad 10 smd rect (at 1.875 0.325 180) (size 0.55 0.3) (layers F.Cu F.Paste F.Mask))
  (pad 11 smd rect (at 1.875 -0.325 180) (size 0.55 0.3) (layers F.Cu F.Paste F.Mask))
  (pad 12 smd rect (at 1.875 -0.975 180) (size 0.55 0.3) (layers F.Cu F.Paste F.Mask))
  (pad 13 smd rect (at 0.975 -1.875 270) (size 0.55 0.3) (layers F.Cu F.Paste F.Mask))
  (pad 14 smd rect (at 0.325 -1.875 270) (size 0.55 0.3) (layers F.Cu F.Paste F.Mask))
  (pad 15 smd rect (at -0.325 -1.875 270) (size 0.55 0.3) (layers F.Cu F.Paste F.Mask))
  (pad 16 smd rect (at -0.975 -1.875 270) (size 0.55 0.3) (layers F.Cu F.Paste F.Mask))
  (pad 17 smd rect (at -0.675 -0.675) (size 1.35 1.35) (layers F.Cu F.Paste F.Mask)
    (solder_paste_margin_ratio -0.1))
  (pad 17 smd rect (at 0.675 -0.675) (size 1.35 1.35) (layers F.Cu F.Paste F.Mask)
    (solder_paste_margin_ratio -0.1))
  (pad 17 smd rect (at 0.675 0.675) (size 1.35 1.35) (layers F.Cu F.Paste F.Mask)
    (solder_paste_margin_ratio -0.1))
  (pad 17 smd rect (at -0.675 0.675) (size 1.35 1.35) (layers F.Cu F.Paste F.Mask)
    (solder_paste_margin_ratio -0.1))
)
