(module oshpark4_cbcpw_50 (layer F.Cu) (tedit 5D6E8E97)
  (attr virtual)
  (fp_text reference REF** (at 0 0.5) (layer F.SilkS) hide
    (effects (font (size 1 1) (thickness 0.15)))
  )
  (fp_text value oshpark4_cbcpw_50 (at 0 -0.5) (layer F.Fab) hide
    (effects (font (size 1 1) (thickness 0.15)))
  )
  (fp_line (start -0.25 0.65) (end -0.25 -0.65) (layer Dwgs.User) (width 0.05))
  (fp_line (start -0.25 -0.65) (end 0.25 -0.65) (layer Dwgs.User) (width 0.05))
  (fp_line (start 0.25 -0.65) (end 0.25 0.65) (layer Dwgs.User) (width 0.05))
  (fp_line (start 0.25 0.65) (end -0.25 0.65) (layer Dwgs.User) (width 0.05))
  (fp_text user "To be used on oshpark 4 layer process. Ground plane directly below (0.1702mm spacing). Space hole on 0.5mm spacing" (at 0 -1.45) (layer Cmts.User) hide
    (effects (font (size 1 1) (thickness 0.15)))
  )
  (pad 2 smd rect (at 0 0) (size 0.6 1.8) (layers In1.Cu Eco1.User)
    (zone_connect 2))
  (pad 2 thru_hole circle (at 0 0.65) (size 0.508 0.508) (drill 0.254) (layers *.Cu)
    (zone_connect 2))
  (pad 2 smd rect (at 0 0.65) (size 0.6 0.55) (layers F.Cu F.Mask)
    (zone_connect 2))
  (pad 2 smd rect (at 0 -0.65) (size 0.6 0.55) (layers F.Cu F.Mask)
    (zone_connect 2))
  (pad 1 smd rect (at 0 0) (size 0.6 0.35) (layers F.Cu F.Mask))
  (pad 2 thru_hole circle (at 0 -0.65) (size 0.508 0.508) (drill 0.254) (layers *.Cu)
    (zone_connect 2))
)
