(module SC70 (layer F.Cu) (tedit 5E1E676A)
  (fp_text reference REF** (at 0 2) (layer F.SilkS)
    (effects (font (size 1 1) (thickness 0.15)))
  )
  (fp_text value SC70 (at 0 -1.85) (layer F.Fab)
    (effects (font (size 1 1) (thickness 0.15)))
  )
  (fp_line (start 1.85 -1.15) (end 1.85 1.15) (layer F.CrtYd) (width 0.05))
  (fp_line (start 1.85 1.15) (end -1.85 1.15) (layer F.CrtYd) (width 0.05))
  (fp_line (start -1.85 1.15) (end -1.85 -1.15) (layer F.CrtYd) (width 0.05))
  (fp_line (start -1.85 -1.15) (end 1.85 -1.15) (layer F.CrtYd) (width 0.05))
  (fp_line (start 1.9 -1.2) (end 1.9 1.2) (layer F.SilkS) (width 0.12))
  (fp_line (start 1.9 1.2) (end -1.9 1.2) (layer F.SilkS) (width 0.12))
  (fp_line (start -1.9 1.2) (end -1.9 -1.2) (layer F.SilkS) (width 0.12))
  (fp_line (start -1.9 -1.2) (end 1.9 -1.2) (layer F.SilkS) (width 0.12))
  (fp_line (start 0.625 -1) (end 0.625 1) (layer F.Fab) (width 0.1))
  (fp_line (start 0.625 1) (end -0.625 1) (layer F.Fab) (width 0.1))
  (fp_line (start -0.625 1) (end -0.625 -0.5) (layer F.Fab) (width 0.1))
  (fp_line (start -0.625 -0.5) (end -0.125 -1) (layer F.Fab) (width 0.1))
  (fp_line (start -0.125 -1) (end 0.625 -1) (layer F.Fab) (width 0.1))
  (pad 1 smd rect (at -1.1 -0.65) (size 0.85 0.35) (layers F.Cu F.Paste F.Mask)
    (solder_mask_margin 0.05))
  (pad 2 smd rect (at -1.1 0) (size 0.85 0.35) (layers F.Cu F.Paste F.Mask)
    (solder_mask_margin 0.05))
  (pad 3 smd rect (at -1.1 0.65) (size 0.85 0.35) (layers F.Cu F.Paste F.Mask)
    (solder_mask_margin 0.05))
  (pad 4 smd rect (at 1.1 0.65) (size 0.85 0.35) (layers F.Cu F.Paste F.Mask)
    (solder_mask_margin 0.05))
  (pad 5 smd rect (at 1.1 -0.65) (size 0.85 0.35) (layers F.Cu F.Paste F.Mask)
    (solder_mask_margin 0.05))
)
