(module R_0508_1220Metric (layer F.Cu) (tedit 5D86E904)
  (attr smd)
  (fp_text reference REF** (at 0 2.05) (layer F.SilkS)
    (effects (font (size 1 1) (thickness 0.15)))
  )
  (fp_text value R_0508_1220Metric (at 0 -0.5) (layer F.Fab)
    (effects (font (size 1 1) (thickness 0.15)))
  )
  (fp_line (start 1 -0.625) (end 1 0.625) (layer F.Fab) (width 0.1))
  (fp_line (start 1 0.625) (end -1 0.625) (layer F.Fab) (width 0.1))
  (fp_line (start -1 0.625) (end -1 -0.625) (layer F.Fab) (width 0.1))
  (fp_line (start -1 -0.625) (end 1 -0.625) (layer F.Fab) (width 0.1))
  (fp_line (start 1.65 -1.4) (end 1.65 1.4) (layer F.CrtYd) (width 0.05))
  (fp_line (start 1.65 1.4) (end -1.65 1.4) (layer F.CrtYd) (width 0.05))
  (fp_line (start -1.65 1.4) (end -1.65 -1.4) (layer F.CrtYd) (width 0.05))
  (fp_line (start -1.65 -1.4) (end 1.65 -1.4) (layer F.CrtYd) (width 0.05))
  (fp_line (start 1.475 -1.225) (end 1.475 1.225) (layer F.SilkS) (width 0.12))
  (fp_line (start 1.475 1.225) (end -1.475 1.225) (layer F.SilkS) (width 0.12))
  (fp_line (start -1.475 1.225) (end -1.475 -1.225) (layer F.SilkS) (width 0.12))
  (fp_line (start -1.475 -1.225) (end 1.475 -1.225) (layer F.SilkS) (width 0.12))
  (pad 1 smd rect (at -0.825 0) (size 1.15 2.3) (layers F.Cu F.Paste F.Mask))
  (pad 2 smd rect (at 0.825 0) (size 1.15 2.3) (layers F.Cu F.Paste F.Mask))
)
