(module Molex_Mini-Fit_Jr_5566-24A2_2x12_P4.20mm_Vertical (layer F.Cu) (tedit 5F076115)
  (descr "Molex Mini-Fit Jr. Power Connectors, old mpn/engineering number: 5566-24A2, example for new mpn: 39-28-924x, 12 Pins per row, Mounting: Snap-in Plastic Peg PCB Lock (http://www.molex.com/pdm_docs/sd/039289068_sd.pdf), generated with kicad-footprint-generator")
  (tags "connector Molex Mini-Fit_Jr side entryplastic_peg")
  (fp_text reference REF** (at 23.1 -3.45) (layer F.SilkS)
    (effects (font (size 1 1) (thickness 0.15)))
  )
  (fp_text value Molex_Mini-Fit_Jr_5566-24A2_2x12_P4.20mm_Vertical (at 23.1 9.95) (layer F.Fab)
    (effects (font (size 1 1) (thickness 0.15)))
  )
  (fp_arc (start -4.7 5.04) (end -4.7 6.54) (angle 180) (layer F.Fab) (width 0.1))
  (fp_arc (start 50.9 5.04) (end 50.9 3.54) (angle 180) (layer F.Fab) (width 0.1))
  (fp_arc (start -4.7 5.04) (end -4.7 6.8) (angle 180) (layer F.SilkS) (width 0.12))
  (fp_arc (start 50.9 5.04) (end 50.9 3.28) (angle 180) (layer F.SilkS) (width 0.12))
  (fp_line (start -4.7 3.54) (end -2.7 3.54) (layer F.Fab) (width 0.1))
  (fp_line (start -4.7 6.54) (end -2.7 6.54) (layer F.Fab) (width 0.1))
  (fp_line (start 50.9 3.54) (end 48.9 3.54) (layer F.Fab) (width 0.1))
  (fp_line (start 50.9 6.54) (end 48.9 6.54) (layer F.Fab) (width 0.1))
  (fp_line (start -4.7 3.28) (end -2.81 3.28) (layer F.SilkS) (width 0.12))
  (fp_line (start -4.7 6.8) (end -2.81 6.8) (layer F.SilkS) (width 0.12))
  (fp_line (start 50.9 3.28) (end 49.01 3.28) (layer F.SilkS) (width 0.12))
  (fp_line (start 50.9 6.8) (end 49.01 6.8) (layer F.SilkS) (width 0.12))
  (fp_line (start -2.7 -2.25) (end -2.7 7.35) (layer F.Fab) (width 0.1))
  (fp_line (start -2.7 7.35) (end 48.9 7.35) (layer F.Fab) (width 0.1))
  (fp_line (start 48.9 7.35) (end 48.9 -2.25) (layer F.Fab) (width 0.1))
  (fp_line (start 48.9 -2.25) (end -2.7 -2.25) (layer F.Fab) (width 0.1))
  (fp_line (start 21.4 7.35) (end 21.4 8.75) (layer F.Fab) (width 0.1))
  (fp_line (start 21.4 8.75) (end 24.8 8.75) (layer F.Fab) (width 0.1))
  (fp_line (start 24.8 8.75) (end 24.8 7.35) (layer F.Fab) (width 0.1))
  (fp_line (start -1.65 -1) (end -1.65 2.3) (layer F.Fab) (width 0.1))
  (fp_line (start -1.65 2.3) (end 1.65 2.3) (layer F.Fab) (width 0.1))
  (fp_line (start 1.65 2.3) (end 1.65 -1) (layer F.Fab) (width 0.1))
  (fp_line (start 1.65 -1) (end -1.65 -1) (layer F.Fab) (width 0.1))
  (fp_line (start -1.65 6.5) (end -1.65 4.025) (layer F.Fab) (width 0.1))
  (fp_line (start -1.65 4.025) (end -0.825 3.2) (layer F.Fab) (width 0.1))
  (fp_line (start -0.825 3.2) (end 0.825 3.2) (layer F.Fab) (width 0.1))
  (fp_line (start 0.825 3.2) (end 1.65 4.025) (layer F.Fab) (width 0.1))
  (fp_line (start 1.65 4.025) (end 1.65 6.5) (layer F.Fab) (width 0.1))
  (fp_line (start 1.65 6.5) (end -1.65 6.5) (layer F.Fab) (width 0.1))
  (fp_line (start 2.55 3.2) (end 2.55 6.5) (layer F.Fab) (width 0.1))
  (fp_line (start 2.55 6.5) (end 5.85 6.5) (layer F.Fab) (width 0.1))
  (fp_line (start 5.85 6.5) (end 5.85 3.2) (layer F.Fab) (width 0.1))
  (fp_line (start 5.85 3.2) (end 2.55 3.2) (layer F.Fab) (width 0.1))
  (fp_line (start 2.55 2.3) (end 2.55 -0.175) (layer F.Fab) (width 0.1))
  (fp_line (start 2.55 -0.175) (end 3.375 -1) (layer F.Fab) (width 0.1))
  (fp_line (start 3.375 -1) (end 5.025 -1) (layer F.Fab) (width 0.1))
  (fp_line (start 5.025 -1) (end 5.85 -0.175) (layer F.Fab) (width 0.1))
  (fp_line (start 5.85 -0.175) (end 5.85 2.3) (layer F.Fab) (width 0.1))
  (fp_line (start 5.85 2.3) (end 2.55 2.3) (layer F.Fab) (width 0.1))
  (fp_line (start 6.75 3.2) (end 6.75 6.5) (layer F.Fab) (width 0.1))
  (fp_line (start 6.75 6.5) (end 10.05 6.5) (layer F.Fab) (width 0.1))
  (fp_line (start 10.05 6.5) (end 10.05 3.2) (layer F.Fab) (width 0.1))
  (fp_line (start 10.05 3.2) (end 6.75 3.2) (layer F.Fab) (width 0.1))
  (fp_line (start 6.75 2.3) (end 6.75 -0.175) (layer F.Fab) (width 0.1))
  (fp_line (start 6.75 -0.175) (end 7.575 -1) (layer F.Fab) (width 0.1))
  (fp_line (start 7.575 -1) (end 9.225 -1) (layer F.Fab) (width 0.1))
  (fp_line (start 9.225 -1) (end 10.05 -0.175) (layer F.Fab) (width 0.1))
  (fp_line (start 10.05 -0.175) (end 10.05 2.3) (layer F.Fab) (width 0.1))
  (fp_line (start 10.05 2.3) (end 6.75 2.3) (layer F.Fab) (width 0.1))
  (fp_line (start 10.95 -1) (end 10.95 2.3) (layer F.Fab) (width 0.1))
  (fp_line (start 10.95 2.3) (end 14.25 2.3) (layer F.Fab) (width 0.1))
  (fp_line (start 14.25 2.3) (end 14.25 -1) (layer F.Fab) (width 0.1))
  (fp_line (start 14.25 -1) (end 10.95 -1) (layer F.Fab) (width 0.1))
  (fp_line (start 10.95 6.5) (end 10.95 4.025) (layer F.Fab) (width 0.1))
  (fp_line (start 10.95 4.025) (end 11.775 3.2) (layer F.Fab) (width 0.1))
  (fp_line (start 11.775 3.2) (end 13.425 3.2) (layer F.Fab) (width 0.1))
  (fp_line (start 13.425 3.2) (end 14.25 4.025) (layer F.Fab) (width 0.1))
  (fp_line (start 14.25 4.025) (end 14.25 6.5) (layer F.Fab) (width 0.1))
  (fp_line (start 14.25 6.5) (end 10.95 6.5) (layer F.Fab) (width 0.1))
  (fp_line (start 15.15 -1) (end 15.15 2.3) (layer F.Fab) (width 0.1))
  (fp_line (start 15.15 2.3) (end 18.45 2.3) (layer F.Fab) (width 0.1))
  (fp_line (start 18.45 2.3) (end 18.45 -1) (layer F.Fab) (width 0.1))
  (fp_line (start 18.45 -1) (end 15.15 -1) (layer F.Fab) (width 0.1))
  (fp_line (start 15.15 6.5) (end 15.15 4.025) (layer F.Fab) (width 0.1))
  (fp_line (start 15.15 4.025) (end 15.975 3.2) (layer F.Fab) (width 0.1))
  (fp_line (start 15.975 3.2) (end 17.625 3.2) (layer F.Fab) (width 0.1))
  (fp_line (start 17.625 3.2) (end 18.45 4.025) (layer F.Fab) (width 0.1))
  (fp_line (start 18.45 4.025) (end 18.45 6.5) (layer F.Fab) (width 0.1))
  (fp_line (start 18.45 6.5) (end 15.15 6.5) (layer F.Fab) (width 0.1))
  (fp_line (start 19.35 3.2) (end 19.35 6.5) (layer F.Fab) (width 0.1))
  (fp_line (start 19.35 6.5) (end 22.65 6.5) (layer F.Fab) (width 0.1))
  (fp_line (start 22.65 6.5) (end 22.65 3.2) (layer F.Fab) (width 0.1))
  (fp_line (start 22.65 3.2) (end 19.35 3.2) (layer F.Fab) (width 0.1))
  (fp_line (start 19.35 2.3) (end 19.35 -0.175) (layer F.Fab) (width 0.1))
  (fp_line (start 19.35 -0.175) (end 20.175 -1) (layer F.Fab) (width 0.1))
  (fp_line (start 20.175 -1) (end 21.825 -1) (layer F.Fab) (width 0.1))
  (fp_line (start 21.825 -1) (end 22.65 -0.175) (layer F.Fab) (width 0.1))
  (fp_line (start 22.65 -0.175) (end 22.65 2.3) (layer F.Fab) (width 0.1))
  (fp_line (start 22.65 2.3) (end 19.35 2.3) (layer F.Fab) (width 0.1))
  (fp_line (start 23.55 3.2) (end 23.55 6.5) (layer F.Fab) (width 0.1))
  (fp_line (start 23.55 6.5) (end 26.85 6.5) (layer F.Fab) (width 0.1))
  (fp_line (start 26.85 6.5) (end 26.85 3.2) (layer F.Fab) (width 0.1))
  (fp_line (start 26.85 3.2) (end 23.55 3.2) (layer F.Fab) (width 0.1))
  (fp_line (start 23.55 2.3) (end 23.55 -0.175) (layer F.Fab) (width 0.1))
  (fp_line (start 23.55 -0.175) (end 24.375 -1) (layer F.Fab) (width 0.1))
  (fp_line (start 24.375 -1) (end 26.025 -1) (layer F.Fab) (width 0.1))
  (fp_line (start 26.025 -1) (end 26.85 -0.175) (layer F.Fab) (width 0.1))
  (fp_line (start 26.85 -0.175) (end 26.85 2.3) (layer F.Fab) (width 0.1))
  (fp_line (start 26.85 2.3) (end 23.55 2.3) (layer F.Fab) (width 0.1))
  (fp_line (start 27.75 -1) (end 27.75 2.3) (layer F.Fab) (width 0.1))
  (fp_line (start 27.75 2.3) (end 31.05 2.3) (layer F.Fab) (width 0.1))
  (fp_line (start 31.05 2.3) (end 31.05 -1) (layer F.Fab) (width 0.1))
  (fp_line (start 31.05 -1) (end 27.75 -1) (layer F.Fab) (width 0.1))
  (fp_line (start 27.75 6.5) (end 27.75 4.025) (layer F.Fab) (width 0.1))
  (fp_line (start 27.75 4.025) (end 28.575 3.2) (layer F.Fab) (width 0.1))
  (fp_line (start 28.575 3.2) (end 30.225 3.2) (layer F.Fab) (width 0.1))
  (fp_line (start 30.225 3.2) (end 31.05 4.025) (layer F.Fab) (width 0.1))
  (fp_line (start 31.05 4.025) (end 31.05 6.5) (layer F.Fab) (width 0.1))
  (fp_line (start 31.05 6.5) (end 27.75 6.5) (layer F.Fab) (width 0.1))
  (fp_line (start 31.95 -1) (end 31.95 2.3) (layer F.Fab) (width 0.1))
  (fp_line (start 31.95 2.3) (end 35.25 2.3) (layer F.Fab) (width 0.1))
  (fp_line (start 35.25 2.3) (end 35.25 -1) (layer F.Fab) (width 0.1))
  (fp_line (start 35.25 -1) (end 31.95 -1) (layer F.Fab) (width 0.1))
  (fp_line (start 31.95 6.5) (end 31.95 4.025) (layer F.Fab) (width 0.1))
  (fp_line (start 31.95 4.025) (end 32.775 3.2) (layer F.Fab) (width 0.1))
  (fp_line (start 32.775 3.2) (end 34.425 3.2) (layer F.Fab) (width 0.1))
  (fp_line (start 34.425 3.2) (end 35.25 4.025) (layer F.Fab) (width 0.1))
  (fp_line (start 35.25 4.025) (end 35.25 6.5) (layer F.Fab) (width 0.1))
  (fp_line (start 35.25 6.5) (end 31.95 6.5) (layer F.Fab) (width 0.1))
  (fp_line (start 36.15 3.2) (end 36.15 6.5) (layer F.Fab) (width 0.1))
  (fp_line (start 36.15 6.5) (end 39.45 6.5) (layer F.Fab) (width 0.1))
  (fp_line (start 39.45 6.5) (end 39.45 3.2) (layer F.Fab) (width 0.1))
  (fp_line (start 39.45 3.2) (end 36.15 3.2) (layer F.Fab) (width 0.1))
  (fp_line (start 36.15 2.3) (end 36.15 -0.175) (layer F.Fab) (width 0.1))
  (fp_line (start 36.15 -0.175) (end 36.975 -1) (layer F.Fab) (width 0.1))
  (fp_line (start 36.975 -1) (end 38.625 -1) (layer F.Fab) (width 0.1))
  (fp_line (start 38.625 -1) (end 39.45 -0.175) (layer F.Fab) (width 0.1))
  (fp_line (start 39.45 -0.175) (end 39.45 2.3) (layer F.Fab) (width 0.1))
  (fp_line (start 39.45 2.3) (end 36.15 2.3) (layer F.Fab) (width 0.1))
  (fp_line (start 40.35 3.2) (end 40.35 6.5) (layer F.Fab) (width 0.1))
  (fp_line (start 40.35 6.5) (end 43.65 6.5) (layer F.Fab) (width 0.1))
  (fp_line (start 43.65 6.5) (end 43.65 3.2) (layer F.Fab) (width 0.1))
  (fp_line (start 43.65 3.2) (end 40.35 3.2) (layer F.Fab) (width 0.1))
  (fp_line (start 40.35 2.3) (end 40.35 -0.175) (layer F.Fab) (width 0.1))
  (fp_line (start 40.35 -0.175) (end 41.175 -1) (layer F.Fab) (width 0.1))
  (fp_line (start 41.175 -1) (end 42.825 -1) (layer F.Fab) (width 0.1))
  (fp_line (start 42.825 -1) (end 43.65 -0.175) (layer F.Fab) (width 0.1))
  (fp_line (start 43.65 -0.175) (end 43.65 2.3) (layer F.Fab) (width 0.1))
  (fp_line (start 43.65 2.3) (end 40.35 2.3) (layer F.Fab) (width 0.1))
  (fp_line (start 44.55 -1) (end 44.55 2.3) (layer F.Fab) (width 0.1))
  (fp_line (start 44.55 2.3) (end 47.85 2.3) (layer F.Fab) (width 0.1))
  (fp_line (start 47.85 2.3) (end 47.85 -1) (layer F.Fab) (width 0.1))
  (fp_line (start 47.85 -1) (end 44.55 -1) (layer F.Fab) (width 0.1))
  (fp_line (start 44.55 6.5) (end 44.55 4.025) (layer F.Fab) (width 0.1))
  (fp_line (start 44.55 4.025) (end 45.375 3.2) (layer F.Fab) (width 0.1))
  (fp_line (start 45.375 3.2) (end 47.025 3.2) (layer F.Fab) (width 0.1))
  (fp_line (start 47.025 3.2) (end 47.85 4.025) (layer F.Fab) (width 0.1))
  (fp_line (start 47.85 4.025) (end 47.85 6.5) (layer F.Fab) (width 0.1))
  (fp_line (start 47.85 6.5) (end 44.55 6.5) (layer F.Fab) (width 0.1))
  (fp_line (start 23.1 -2.36) (end -2.81 -2.36) (layer F.SilkS) (width 0.12))
  (fp_line (start -2.81 -2.36) (end -2.81 7.46) (layer F.SilkS) (width 0.12))
  (fp_line (start -2.81 7.46) (end 21.29 7.46) (layer F.SilkS) (width 0.12))
  (fp_line (start 21.29 7.46) (end 21.29 8.86) (layer F.SilkS) (width 0.12))
  (fp_line (start 21.29 8.86) (end 23.1 8.86) (layer F.SilkS) (width 0.12))
  (fp_line (start 23.1 -2.36) (end 49.01 -2.36) (layer F.SilkS) (width 0.12))
  (fp_line (start 49.01 -2.36) (end 49.01 7.46) (layer F.SilkS) (width 0.12))
  (fp_line (start 49.01 7.46) (end 24.91 7.46) (layer F.SilkS) (width 0.12))
  (fp_line (start 24.91 7.46) (end 24.91 8.86) (layer F.SilkS) (width 0.12))
  (fp_line (start 24.91 8.86) (end 23.1 8.86) (layer F.SilkS) (width 0.12))
  (fp_line (start -0.2 -2.6) (end -3.05 -2.6) (layer F.SilkS) (width 0.12))
  (fp_line (start -3.05 -2.6) (end -3.05 0.25) (layer F.SilkS) (width 0.12))
  (fp_line (start -0.2 -2.6) (end -3.05 -2.6) (layer F.Fab) (width 0.1))
  (fp_line (start -3.05 -2.6) (end -3.05 0.25) (layer F.Fab) (width 0.1))
  (fp_line (start -3.2 -2.75) (end -3.2 3.04) (layer F.CrtYd) (width 0.05))
  (fp_line (start -3.2 3.04) (end -6.7 3.04) (layer F.CrtYd) (width 0.05))
  (fp_line (start -6.7 3.04) (end -6.7 7.1) (layer F.CrtYd) (width 0.05))
  (fp_line (start 52.9 7.1) (end 52.9 3.04) (layer F.CrtYd) (width 0.05))
  (fp_line (start 52.9 3.04) (end 49.4 3.04) (layer F.CrtYd) (width 0.05))
  (fp_line (start 49.4 3.04) (end 49.4 -2.75) (layer F.CrtYd) (width 0.05))
  (fp_line (start 49.4 -2.75) (end -3.2 -2.75) (layer F.CrtYd) (width 0.05))
  (fp_text user %R (at 23.1 -1.55) (layer F.Fab)
    (effects (font (size 1 1) (thickness 0.15)))
  )
  (fp_line (start -3.2 7.1) (end -6.7 7.1) (layer F.CrtYd) (width 0.05))
  (fp_line (start -3.2 7.1) (end -3.2 7.9) (layer F.CrtYd) (width 0.05))
  (fp_line (start -3.2 7.9) (end 20.9 7.9) (layer F.CrtYd) (width 0.05))
  (fp_line (start 20.9 7.9) (end 20.9 9.3) (layer F.CrtYd) (width 0.05))
  (fp_line (start 20.9 9.3) (end 25.3 9.3) (layer F.CrtYd) (width 0.05))
  (fp_line (start 25.3 9.3) (end 25.3 7.9) (layer F.CrtYd) (width 0.05))
  (fp_line (start 25.3 7.9) (end 49.4 7.9) (layer F.CrtYd) (width 0.05))
  (fp_line (start 49.4 7.9) (end 49.4 7.1) (layer F.CrtYd) (width 0.05))
  (fp_line (start 49.4 7.1) (end 52.9 7.1) (layer F.CrtYd) (width 0.05))
  (pad 1 thru_hole roundrect (at 0 0) (size 2.7 3.3) (drill 1.4) (layers *.Cu *.Mask) (roundrect_rratio 0.09259299999999999))
  (pad 2 thru_hole oval (at 4.2 0) (size 2.7 3.3) (drill 1.4) (layers *.Cu *.Mask))
  (pad 3 thru_hole oval (at 8.4 0) (size 2.7 3.3) (drill 1.4) (layers *.Cu *.Mask))
  (pad 4 thru_hole oval (at 12.6 0) (size 2.7 3.3) (drill 1.4) (layers *.Cu *.Mask))
  (pad 5 thru_hole oval (at 16.8 0) (size 2.7 3.3) (drill 1.4) (layers *.Cu *.Mask))
  (pad 6 thru_hole oval (at 21 0) (size 2.7 3.3) (drill 1.4) (layers *.Cu *.Mask))
  (pad 7 thru_hole oval (at 25.2 0) (size 2.7 3.3) (drill 1.4) (layers *.Cu *.Mask))
  (pad 8 thru_hole oval (at 29.4 0) (size 2.7 3.3) (drill 1.4) (layers *.Cu *.Mask))
  (pad 9 thru_hole oval (at 33.6 0) (size 2.7 3.3) (drill 1.4) (layers *.Cu *.Mask))
  (pad 10 thru_hole oval (at 37.8 0) (size 2.7 3.3) (drill 1.4) (layers *.Cu *.Mask))
  (pad 11 thru_hole oval (at 42 0) (size 2.7 3.3) (drill 1.4) (layers *.Cu *.Mask))
  (pad 12 thru_hole oval (at 46.2 0) (size 2.7 3.3) (drill 1.4) (layers *.Cu *.Mask))
  (pad 13 thru_hole oval (at 0 5.5) (size 2.7 3.3) (drill 1.4) (layers *.Cu *.Mask))
  (pad 14 thru_hole oval (at 4.2 5.5) (size 2.7 3.3) (drill 1.4) (layers *.Cu *.Mask))
  (pad 15 thru_hole oval (at 8.4 5.5) (size 2.7 3.3) (drill 1.4) (layers *.Cu *.Mask))
  (pad 16 thru_hole oval (at 12.6 5.5) (size 2.7 3.3) (drill 1.4) (layers *.Cu *.Mask))
  (pad 17 thru_hole oval (at 16.8 5.5) (size 2.7 3.3) (drill 1.4) (layers *.Cu *.Mask))
  (pad 18 thru_hole oval (at 21 5.5) (size 2.7 3.3) (drill 1.4) (layers *.Cu *.Mask))
  (pad 19 thru_hole oval (at 25.2 5.5) (size 2.7 3.3) (drill 1.4) (layers *.Cu *.Mask))
  (pad 20 thru_hole oval (at 29.4 5.5) (size 2.7 3.3) (drill 1.4) (layers *.Cu *.Mask))
  (pad 21 thru_hole oval (at 33.6 5.5) (size 2.7 3.3) (drill 1.4) (layers *.Cu *.Mask))
  (pad 22 thru_hole oval (at 37.8 5.5) (size 2.7 3.3) (drill 1.4) (layers *.Cu *.Mask))
  (pad 23 thru_hole oval (at 42 5.5) (size 2.7 3.3) (drill 1.4) (layers *.Cu *.Mask))
  (pad 24 thru_hole oval (at 46.2 5.5) (size 2.7 3.3) (drill 1.4) (layers *.Cu *.Mask))
  (pad "" np_thru_hole circle (at -4.7 5.04) (size 3 3) (drill 3) (layers *.Cu *.Mask))
  (pad "" np_thru_hole circle (at 50.9 5.04) (size 3 3) (drill 3) (layers *.Cu *.Mask))
  (model ${POWDER_KICAD_LIBRARY}/models/POWDER_Power/442060001.stp
    (offset (xyz 23.1 -2.1 13))
    (scale (xyz 1 1 1))
    (rotate (xyz 0 0 180))
  )
)
