(footprint "DSBGA_4_P0.35" (version 20211014) (generator pcbnew)
  (layer "F.Cu")
  (tedit 630E32CD)
  (attr smd)
  (fp_text reference "REF**" (at 0 -1.25 unlocked) (layer "F.SilkS")
    (effects (font (size 0.5 0.5) (thickness 0.1)))
    (tstamp 4c55b51d-b022-4e8c-9870-f86b5b547747)
  )
  (fp_text value "DSBGA_4_P0.35" (at 0 2.3 unlocked) (layer "F.Fab")
    (effects (font (size 1 1) (thickness 0.15)))
    (tstamp f796b659-a19b-431e-a58d-3bfe0aa335d0)
  )
  (fp_text user "${REFERENCE}" (at 0 1.1 unlocked) (layer "F.Fab")
    (effects (font (size 1 1) (thickness 0.15)))
    (tstamp 05498609-5573-4a40-bfed-87d74bf45594)
  )
  (fp_line (start -0.6 -0.1) (end -0.6 -0.6) (layer "F.SilkS") (width 0.12) (tstamp 17d84b6c-ab94-401c-957b-ad5875fdcb44))
  (fp_line (start 0.375 0.375) (end -0.375 0.375) (layer "F.SilkS") (width 0.1) (tstamp 227796fe-c1ca-4ec8-bf9e-c6b13250f366))
  (fp_line (start -0.375 0.375) (end -0.375 -0.375) (layer "F.SilkS") (width 0.1) (tstamp 339f3a05-a669-407e-bfcc-896f454ddbed))
  (fp_line (start -0.6 -0.6) (end -0.1 -0.6) (layer "F.SilkS") (width 0.12) (tstamp 4515fcae-24fb-4e0d-af9c-772b2ddb3754))
  (fp_line (start 0.375 -0.375) (end 0.375 0.375) (layer "F.SilkS") (width 0.1) (tstamp 4e2bbadd-2145-4432-8878-5234116be3a7))
  (fp_line (start -0.375 -0.375) (end 0.375 -0.375) (layer "F.SilkS") (width 0.1) (tstamp 6feadc61-c71a-4b8f-8cda-f061fe372ebd))
  (fp_line (start 0.4725 -0.4725) (end -0.4725 -0.4725) (layer "F.CrtYd") (width 0.05) (tstamp 22b04add-0220-4373-b44a-c5946a16aea4))
  (fp_line (start -0.4725 -0.4725) (end -0.4725 0.4725) (layer "F.CrtYd") (width 0.05) (tstamp 3e0c4c70-aa94-4346-babf-00305a701ae0))
  (fp_line (start -0.4725 0.4725) (end 0.4725 0.4725) (layer "F.CrtYd") (width 0.05) (tstamp 60db758d-33bd-45d9-a497-bb5401df3f35))
  (fp_line (start 0.4725 0.4725) (end 0.4725 -0.4725) (layer "F.CrtYd") (width 0.05) (tstamp 8f9b0c4f-230f-40e9-b305-b23510f4b2d2))
  (fp_line (start 0.3225 0.3225) (end -0.3225 0.3225) (layer "F.Fab") (width 0.1) (tstamp 376ec57d-bd80-41f4-ac77-04ce29ff90e1))
  (fp_line (start -0.3225 -0.3225) (end 0.3225 -0.3225) (layer "F.Fab") (width 0.1) (tstamp 39f7ee70-efb7-4716-98d3-39982455703d))
  (fp_line (start -0.3225 0.3225) (end -0.3225 -0.3225) (layer "F.Fab") (width 0.1) (tstamp 7ad68bf1-8956-4161-a72c-cfca8f986be1))
  (fp_line (start 0.3225 -0.3225) (end 0.3225 0.3225) (layer "F.Fab") (width 0.1) (tstamp f8bd8852-f113-4db1-a408-88268050f34f))
  (pad "A1" smd circle (at -0.175 -0.175) (size 0.18 0.18) (layers "F.Cu" "F.Paste" "F.Mask")
    (solder_mask_margin 0.0375) (tstamp 55ef318f-4b57-4311-ad4c-c18d94830c82))
  (pad "A2" smd circle (at 0.175 -0.175) (size 0.18 0.18) (layers "F.Cu" "F.Paste" "F.Mask")
    (solder_mask_margin 0.0375) (tstamp d6cce1e3-0924-4ed8-a48c-d94c6189220c))
  (pad "B1" smd circle (at -0.175 0.175) (size 0.18 0.18) (layers "F.Cu" "F.Paste" "F.Mask")
    (solder_mask_margin 0.0375) (tstamp 5544b8e0-9d2f-435b-b49f-37adf92defe2))
  (pad "B2" smd circle (at 0.175 0.175) (size 0.18 0.18) (layers "F.Cu" "F.Paste" "F.Mask")
    (solder_mask_margin 0.0375) (tstamp cf73876d-98da-4f1d-90e6-79e83e65f3d4))
  (model "${POWDER_KICAD_LIBRARY}/models/POWDER_Power/TI_YKE4_DSBGA_4_P_0_35.step"
    (offset (xyz 0 0 0))
    (scale (xyz 1 1 1))
    (rotate (xyz 0 0 0))
  )
)
