(module ARM_JTAG_0.127_10 (layer F.Cu) (tedit 5D87E9A8)
  (descr "surface-mounted straight pin header, 2x05, 1.27mm pitch, double rows")
  (tags "Surface mounted pin header SMD 2x05 1.27mm double row")
  (attr smd)
  (fp_text reference J501 (at 0 -4.235) (layer F.SilkS)
    (effects (font (size 0.6 0.6) (thickness 0.15)))
  )
  (fp_text value Conn_02x05_Odd_Even (at 0 4.235) (layer F.Fab)
    (effects (font (size 0.6 0.6) (thickness 0.15)))
  )
  (fp_line (start 2.55 6.325) (end -2.55 6.325) (layer F.Fab) (width 0.1))
  (fp_line (start -2.05 -6.325) (end 2.55 -6.325) (layer F.Fab) (width 0.1))
  (fp_line (start -2.55 6.325) (end -2.55 -5.825) (layer F.Fab) (width 0.1))
  (fp_line (start -2.55 -5.825) (end -2.05 -6.325) (layer F.Fab) (width 0.1))
  (fp_line (start 2.55 -6.325) (end 2.55 6.325) (layer F.Fab) (width 0.1))
  (fp_line (start -1.705 -2.74) (end -2.75 -2.74) (layer F.Fab) (width 0.1))
  (fp_line (start -2.75 -2.74) (end -2.75 -2.34) (layer F.Fab) (width 0.1))
  (fp_line (start -2.75 -2.34) (end -1.705 -2.34) (layer F.Fab) (width 0.1))
  (fp_line (start 1.705 -2.74) (end 2.75 -2.74) (layer F.Fab) (width 0.1))
  (fp_line (start 2.75 -2.74) (end 2.75 -2.34) (layer F.Fab) (width 0.1))
  (fp_line (start 2.75 -2.34) (end 1.705 -2.34) (layer F.Fab) (width 0.1))
  (fp_line (start -1.705 -1.47) (end -2.75 -1.47) (layer F.Fab) (width 0.1))
  (fp_line (start -2.75 -1.47) (end -2.75 -1.07) (layer F.Fab) (width 0.1))
  (fp_line (start -2.75 -1.07) (end -1.705 -1.07) (layer F.Fab) (width 0.1))
  (fp_line (start 1.705 -1.47) (end 2.75 -1.47) (layer F.Fab) (width 0.1))
  (fp_line (start 2.75 -1.47) (end 2.75 -1.07) (layer F.Fab) (width 0.1))
  (fp_line (start 2.75 -1.07) (end 1.705 -1.07) (layer F.Fab) (width 0.1))
  (fp_line (start -1.705 -0.2) (end -2.75 -0.2) (layer F.Fab) (width 0.1))
  (fp_line (start -2.75 -0.2) (end -2.75 0.2) (layer F.Fab) (width 0.1))
  (fp_line (start -2.75 0.2) (end -1.705 0.2) (layer F.Fab) (width 0.1))
  (fp_line (start 1.705 -0.2) (end 2.75 -0.2) (layer F.Fab) (width 0.1))
  (fp_line (start 2.75 -0.2) (end 2.75 0.2) (layer F.Fab) (width 0.1))
  (fp_line (start 2.75 0.2) (end 1.705 0.2) (layer F.Fab) (width 0.1))
  (fp_line (start -1.705 1.07) (end -2.75 1.07) (layer F.Fab) (width 0.1))
  (fp_line (start -2.75 1.07) (end -2.75 1.47) (layer F.Fab) (width 0.1))
  (fp_line (start -2.75 1.47) (end -1.705 1.47) (layer F.Fab) (width 0.1))
  (fp_line (start 1.705 1.07) (end 2.75 1.07) (layer F.Fab) (width 0.1))
  (fp_line (start 2.75 1.07) (end 2.75 1.47) (layer F.Fab) (width 0.1))
  (fp_line (start 2.75 1.47) (end 1.705 1.47) (layer F.Fab) (width 0.1))
  (fp_line (start -1.705 2.34) (end -2.75 2.34) (layer F.Fab) (width 0.1))
  (fp_line (start -2.75 2.34) (end -2.75 2.74) (layer F.Fab) (width 0.1))
  (fp_line (start -2.75 2.74) (end -1.705 2.74) (layer F.Fab) (width 0.1))
  (fp_line (start 1.705 2.34) (end 2.75 2.34) (layer F.Fab) (width 0.1))
  (fp_line (start 2.75 2.34) (end 2.75 2.74) (layer F.Fab) (width 0.1))
  (fp_line (start 2.75 2.74) (end 1.705 2.74) (layer F.Fab) (width 0.1))
  (fp_line (start -1.765 -3.235) (end 1.765 -3.235) (layer F.SilkS) (width 0.12))
  (fp_line (start -1.765 3.235) (end 1.765 3.235) (layer F.SilkS) (width 0.12))
  (fp_line (start -3.09 -3.17) (end -1.765 -3.17) (layer F.SilkS) (width 0.12))
  (fp_line (start -1.765 -3.235) (end -1.765 -3.17) (layer F.SilkS) (width 0.12))
  (fp_line (start 1.765 -3.235) (end 1.765 -3.17) (layer F.SilkS) (width 0.12))
  (fp_line (start -1.765 3.17) (end -1.765 3.235) (layer F.SilkS) (width 0.12))
  (fp_line (start 1.765 3.17) (end 1.765 3.235) (layer F.SilkS) (width 0.12))
  (fp_line (start -4.3 -6.575) (end -4.3 6.575) (layer F.CrtYd) (width 0.05))
  (fp_line (start -4.3 6.575) (end 4.3 6.575) (layer F.CrtYd) (width 0.05))
  (fp_line (start 4.3 6.575) (end 4.3 -6.575) (layer F.CrtYd) (width 0.05))
  (fp_line (start 4.3 -6.575) (end -4.3 -6.575) (layer F.CrtYd) (width 0.05))
  (fp_text user %R (at 1.6 -0.2 90) (layer F.Fab)
    (effects (font (size 0.6 0.6) (thickness 0.15)))
  )
  (pad 1 smd rect (at -1.95 -2.54) (size 2.4 0.74) (layers F.Cu F.Paste F.Mask))
  (pad 2 smd rect (at 1.95 -2.54) (size 2.4 0.74) (layers F.Cu F.Paste F.Mask))
  (pad 3 smd rect (at -1.95 -1.27) (size 2.4 0.74) (layers F.Cu F.Paste F.Mask))
  (pad 4 smd rect (at 1.95 -1.27) (size 2.4 0.74) (layers F.Cu F.Paste F.Mask))
  (pad 5 smd rect (at -1.95 0) (size 2.4 0.74) (layers F.Cu F.Paste F.Mask))
  (pad 6 smd rect (at 1.95 0) (size 2.4 0.74) (layers F.Cu F.Paste F.Mask))
  (pad 7 smd rect (at -1.95 1.27) (size 2.4 0.74) (layers F.Cu F.Paste F.Mask))
  (pad 8 smd rect (at 1.95 1.27) (size 2.4 0.74) (layers F.Cu F.Paste F.Mask))
  (pad 9 smd rect (at -1.95 2.54) (size 2.4 0.74) (layers F.Cu F.Paste F.Mask))
  (pad 10 smd rect (at 1.95 2.54) (size 2.4 0.74) (layers F.Cu F.Paste F.Mask))
  (model ${KISYS3DMOD}/Connector_PinHeader_1.27mm.3dshapes/PinHeader_2x05_P1.27mm_Vertical_SMD.wrl
    (at (xyz 0 0 0))
    (scale (xyz 1 1 1))
    (rotate (xyz 0 0 0))
  )
)
