(module Amphenol_ICC_10144517-101802LF (layer F.Cu) (tedit 5F0488C9)
  (descr Amphenol_ICC_10144517-101802LF)
  (attr smd)
  (fp_text reference REF** (at 0 -4.85) (layer F.SilkS)
    (effects (font (size 1 1) (thickness 0.15)))
  )
  (fp_text value Amphenol_ICC_10144517-101802LF (at 0 4.85) (layer F.Fab)
    (effects (font (size 1 1) (thickness 0.15)))
  )
  (fp_line (start -23.75 -4.1) (end 23.75 -4.1) (layer F.CrtYd) (width 0.05))
  (fp_line (start 23.75 -4.1) (end 23.75 4.1) (layer F.CrtYd) (width 0.05))
  (fp_line (start 23.75 4.1) (end -23.75 4.1) (layer F.CrtYd) (width 0.05))
  (fp_line (start -23.75 4.1) (end -23.75 -4.1) (layer F.CrtYd) (width 0.05))
  (fp_line (start -22.9 -3.4) (end -22.9 3.4) (layer F.Fab) (width 0.1))
  (fp_line (start -22.9 3.4) (end 22.9 3.4) (layer F.Fab) (width 0.1))
  (fp_line (start 22.9 3.4) (end 22.9 -2.4) (layer F.Fab) (width 0.1))
  (fp_line (start 21.9 -3.4) (end -22.9 -3.4) (layer F.Fab) (width 0.1))
  (fp_line (start -23 -3.7) (end -23 0) (layer F.SilkS) (width 0.12))
  (fp_line (start -23.5 3.7) (end 23.5 3.7) (layer F.SilkS) (width 0.12))
  (fp_line (start 23 0) (end 23 -3.7) (layer F.SilkS) (width 0.12))
  (fp_line (start 23 -3.7) (end -23 -3.7) (layer F.SilkS) (width 0.12))
  (fp_line (start 22.9 -2.4) (end 21.9 -3.4) (layer F.Fab) (width 0.1))
  (fp_circle (center 23.5 -3.7) (end 23.7 -3.7) (layer F.SilkS) (width 0.15))
  (fp_line (start 21.25 -2.65) (end 20.75 -1.9) (layer F.Fab) (width 0.12))
  (fp_line (start 20.75 -1.9) (end 20.25 -2.65) (layer F.Fab) (width 0.12))
  (fp_line (start 20.25 -2.65) (end 21.25 -2.65) (layer F.Fab) (width 0.12))
  (fp_line (start -22.5 2.9) (end -22.5 0) (layer Dwgs.User) (width 0.12))
  (fp_line (start -22.5 0) (end -21.5 0) (layer Dwgs.User) (width 0.12))
  (fp_line (start -21.5 0) (end -21.5 -2.9) (layer Dwgs.User) (width 0.12))
  (fp_line (start -21.5 -2.9) (end 21.5 -2.9) (layer Dwgs.User) (width 0.12))
  (fp_line (start 22.5 0) (end 22.5 2.9) (layer Dwgs.User) (width 0.12))
  (fp_line (start 22.5 2.9) (end -22.5 2.9) (layer Dwgs.User) (width 0.12))
  (fp_line (start 22.5 0) (end 21.5 0) (layer Dwgs.User) (width 0.12))
  (fp_line (start 21.5 0) (end 21.5 -2.9) (layer Dwgs.User) (width 0.12))
  (fp_line (start 23.5 3.7) (end 23.5 0) (layer F.SilkS) (width 0.12))
  (fp_line (start 23.5 0) (end 23 0) (layer F.SilkS) (width 0.12))
  (fp_line (start -23 0) (end -23.5 0) (layer F.SilkS) (width 0.12))
  (fp_line (start -23.5 0) (end -23.5 3.7) (layer F.SilkS) (width 0.12))
  (pad 1 smd rect (at 19.6 -2.2) (size 0.5 2.4) (layers F.Cu F.Paste F.Mask))
  (pad 2 smd rect (at 19.6 2.2) (size 0.5 2.4) (layers F.Cu F.Paste F.Mask))
  (pad 3 smd rect (at 18.8 -2.2) (size 0.5 2.4) (layers F.Cu F.Paste F.Mask))
  (pad 4 smd rect (at 18.8 2.2) (size 0.5 2.4) (layers F.Cu F.Paste F.Mask))
  (pad 5 smd rect (at 18 -2.2) (size 0.5 2.4) (layers F.Cu F.Paste F.Mask))
  (pad 6 smd rect (at 18 2.2) (size 0.5 2.4) (layers F.Cu F.Paste F.Mask))
  (pad 7 smd rect (at 17.2 -2.2) (size 0.5 2.4) (layers F.Cu F.Paste F.Mask))
  (pad 8 smd rect (at 17.2 2.2) (size 0.5 2.4) (layers F.Cu F.Paste F.Mask))
  (pad 9 smd rect (at 16.4 -2.2) (size 0.5 2.4) (layers F.Cu F.Paste F.Mask))
  (pad 10 smd rect (at 16.4 2.2) (size 0.5 2.4) (layers F.Cu F.Paste F.Mask))
  (pad 11 smd rect (at 15.6 -2.2) (size 0.5 2.4) (layers F.Cu F.Paste F.Mask))
  (pad 12 smd rect (at 15.6 2.2) (size 0.5 2.4) (layers F.Cu F.Paste F.Mask))
  (pad 13 smd rect (at 14.8 -2.2) (size 0.5 2.4) (layers F.Cu F.Paste F.Mask))
  (pad 14 smd rect (at 14.8 2.2) (size 0.5 2.4) (layers F.Cu F.Paste F.Mask))
  (pad 15 smd rect (at 14 -2.2) (size 0.5 2.4) (layers F.Cu F.Paste F.Mask))
  (pad 16 smd rect (at 14 2.2) (size 0.5 2.4) (layers F.Cu F.Paste F.Mask))
  (pad 17 smd rect (at 13.2 -2.2) (size 0.5 2.4) (layers F.Cu F.Paste F.Mask))
  (pad 18 smd rect (at 13.2 2.2) (size 0.5 2.4) (layers F.Cu F.Paste F.Mask))
  (pad 19 smd rect (at 12.4 -2.2) (size 0.5 2.4) (layers F.Cu F.Paste F.Mask))
  (pad 20 smd rect (at 12.4 2.2) (size 0.5 2.4) (layers F.Cu F.Paste F.Mask))
  (pad 21 smd rect (at 11.6 -2.2) (size 0.5 2.4) (layers F.Cu F.Paste F.Mask))
  (pad 22 smd rect (at 11.6 2.2) (size 0.5 2.4) (layers F.Cu F.Paste F.Mask))
  (pad 23 smd rect (at 10.8 -2.2) (size 0.5 2.4) (layers F.Cu F.Paste F.Mask))
  (pad 24 smd rect (at 10.8 2.2) (size 0.5 2.4) (layers F.Cu F.Paste F.Mask))
  (pad 25 smd rect (at 10 -2.2) (size 0.5 2.4) (layers F.Cu F.Paste F.Mask))
  (pad 26 smd rect (at 10 2.2) (size 0.5 2.4) (layers F.Cu F.Paste F.Mask))
  (pad 27 smd rect (at 9.2 -2.2) (size 0.5 2.4) (layers F.Cu F.Paste F.Mask))
  (pad 28 smd rect (at 9.2 2.2) (size 0.5 2.4) (layers F.Cu F.Paste F.Mask))
  (pad 29 smd rect (at 8.4 -2.2) (size 0.5 2.4) (layers F.Cu F.Paste F.Mask))
  (pad 30 smd rect (at 8.4 2.2) (size 0.5 2.4) (layers F.Cu F.Paste F.Mask))
  (pad 31 smd rect (at 7.6 -2.2) (size 0.5 2.4) (layers F.Cu F.Paste F.Mask))
  (pad 32 smd rect (at 7.6 2.2) (size 0.5 2.4) (layers F.Cu F.Paste F.Mask))
  (pad 33 smd rect (at 6.8 -2.2) (size 0.5 2.4) (layers F.Cu F.Paste F.Mask))
  (pad 34 smd rect (at 6.8 2.2) (size 0.5 2.4) (layers F.Cu F.Paste F.Mask))
  (pad 35 smd rect (at 6 -2.2) (size 0.5 2.4) (layers F.Cu F.Paste F.Mask))
  (pad 36 smd rect (at 6 2.2) (size 0.5 2.4) (layers F.Cu F.Paste F.Mask))
  (pad 37 smd rect (at 5.2 -2.2) (size 0.5 2.4) (layers F.Cu F.Paste F.Mask))
  (pad 38 smd rect (at 5.2 2.2) (size 0.5 2.4) (layers F.Cu F.Paste F.Mask))
  (pad 39 smd rect (at 4.4 -2.2) (size 0.5 2.4) (layers F.Cu F.Paste F.Mask))
  (pad 40 smd rect (at 4.4 2.2) (size 0.5 2.4) (layers F.Cu F.Paste F.Mask))
  (pad 41 smd rect (at 3.6 -2.2) (size 0.5 2.4) (layers F.Cu F.Paste F.Mask))
  (pad 42 smd rect (at 3.6 2.2) (size 0.5 2.4) (layers F.Cu F.Paste F.Mask))
  (pad 43 smd rect (at 2.8 -2.2) (size 0.5 2.4) (layers F.Cu F.Paste F.Mask))
  (pad 44 smd rect (at 2.8 2.2) (size 0.5 2.4) (layers F.Cu F.Paste F.Mask))
  (pad 45 smd rect (at 2 -2.2) (size 0.5 2.4) (layers F.Cu F.Paste F.Mask))
  (pad 46 smd rect (at 2 2.2) (size 0.5 2.4) (layers F.Cu F.Paste F.Mask))
  (pad 47 smd rect (at 1.2 -2.2) (size 0.5 2.4) (layers F.Cu F.Paste F.Mask))
  (pad 48 smd rect (at 1.2 2.2) (size 0.5 2.4) (layers F.Cu F.Paste F.Mask))
  (pad 49 smd rect (at 0.4 -2.2) (size 0.5 2.4) (layers F.Cu F.Paste F.Mask))
  (pad 50 smd rect (at 0.4 2.2) (size 0.5 2.4) (layers F.Cu F.Paste F.Mask))
  (pad 51 smd rect (at -0.4 -2.2) (size 0.5 2.4) (layers F.Cu F.Paste F.Mask))
  (pad 52 smd rect (at -0.4 2.2) (size 0.5 2.4) (layers F.Cu F.Paste F.Mask))
  (pad 53 smd rect (at -1.2 -2.2) (size 0.5 2.4) (layers F.Cu F.Paste F.Mask))
  (pad 54 smd rect (at -1.2 2.2) (size 0.5 2.4) (layers F.Cu F.Paste F.Mask))
  (pad 55 smd rect (at -2 -2.2) (size 0.5 2.4) (layers F.Cu F.Paste F.Mask))
  (pad 56 smd rect (at -2 2.2) (size 0.5 2.4) (layers F.Cu F.Paste F.Mask))
  (pad 57 smd rect (at -2.8 -2.2) (size 0.5 2.4) (layers F.Cu F.Paste F.Mask))
  (pad 58 smd rect (at -2.8 2.2) (size 0.5 2.4) (layers F.Cu F.Paste F.Mask))
  (pad 59 smd rect (at -3.6 -2.2) (size 0.5 2.4) (layers F.Cu F.Paste F.Mask))
  (pad 60 smd rect (at -3.6 2.2) (size 0.5 2.4) (layers F.Cu F.Paste F.Mask))
  (pad 61 smd rect (at -4.4 -2.2) (size 0.5 2.4) (layers F.Cu F.Paste F.Mask))
  (pad 62 smd rect (at -4.4 2.2) (size 0.5 2.4) (layers F.Cu F.Paste F.Mask))
  (pad 63 smd rect (at -5.2 -2.2) (size 0.5 2.4) (layers F.Cu F.Paste F.Mask))
  (pad 64 smd rect (at -5.2 2.2) (size 0.5 2.4) (layers F.Cu F.Paste F.Mask))
  (pad 65 smd rect (at -6 -2.2) (size 0.5 2.4) (layers F.Cu F.Paste F.Mask))
  (pad 66 smd rect (at -6 2.2) (size 0.5 2.4) (layers F.Cu F.Paste F.Mask))
  (pad 67 smd rect (at -6.8 -2.2) (size 0.5 2.4) (layers F.Cu F.Paste F.Mask))
  (pad 68 smd rect (at -6.8 2.2) (size 0.5 2.4) (layers F.Cu F.Paste F.Mask))
  (pad 69 smd rect (at -7.6 -2.2) (size 0.5 2.4) (layers F.Cu F.Paste F.Mask))
  (pad 70 smd rect (at -7.6 2.2) (size 0.5 2.4) (layers F.Cu F.Paste F.Mask))
  (pad 71 smd rect (at -8.4 -2.2) (size 0.5 2.4) (layers F.Cu F.Paste F.Mask))
  (pad 72 smd rect (at -8.4 2.2) (size 0.5 2.4) (layers F.Cu F.Paste F.Mask))
  (pad 73 smd rect (at -9.2 -2.2) (size 0.5 2.4) (layers F.Cu F.Paste F.Mask))
  (pad 74 smd rect (at -9.2 2.2) (size 0.5 2.4) (layers F.Cu F.Paste F.Mask))
  (pad 75 smd rect (at -10 -2.2) (size 0.5 2.4) (layers F.Cu F.Paste F.Mask))
  (pad 76 smd rect (at -10 2.2) (size 0.5 2.4) (layers F.Cu F.Paste F.Mask))
  (pad 77 smd rect (at -10.8 -2.2) (size 0.5 2.4) (layers F.Cu F.Paste F.Mask))
  (pad 78 smd rect (at -10.8 2.2) (size 0.5 2.4) (layers F.Cu F.Paste F.Mask))
  (pad 79 smd rect (at -11.6 -2.2) (size 0.5 2.4) (layers F.Cu F.Paste F.Mask))
  (pad 80 smd rect (at -11.6 2.2) (size 0.5 2.4) (layers F.Cu F.Paste F.Mask))
  (pad 81 smd rect (at -12.4 -2.2) (size 0.5 2.4) (layers F.Cu F.Paste F.Mask))
  (pad 82 smd rect (at -12.4 2.2) (size 0.5 2.4) (layers F.Cu F.Paste F.Mask))
  (pad 83 smd rect (at -13.2 -2.2) (size 0.5 2.4) (layers F.Cu F.Paste F.Mask))
  (pad 84 smd rect (at -13.2 2.2) (size 0.5 2.4) (layers F.Cu F.Paste F.Mask))
  (pad 85 smd rect (at -14 -2.2) (size 0.5 2.4) (layers F.Cu F.Paste F.Mask))
  (pad 86 smd rect (at -14 2.2) (size 0.5 2.4) (layers F.Cu F.Paste F.Mask))
  (pad 87 smd rect (at -14.8 -2.2) (size 0.5 2.4) (layers F.Cu F.Paste F.Mask))
  (pad 88 smd rect (at -14.8 2.2) (size 0.5 2.4) (layers F.Cu F.Paste F.Mask))
  (pad 89 smd rect (at -15.6 -2.2) (size 0.5 2.4) (layers F.Cu F.Paste F.Mask))
  (pad 90 smd rect (at -15.6 2.2) (size 0.5 2.4) (layers F.Cu F.Paste F.Mask))
  (pad 91 smd rect (at -16.4 -2.2) (size 0.5 2.4) (layers F.Cu F.Paste F.Mask))
  (pad 92 smd rect (at -16.4 2.2) (size 0.5 2.4) (layers F.Cu F.Paste F.Mask))
  (pad 93 smd rect (at -17.2 -2.2) (size 0.5 2.4) (layers F.Cu F.Paste F.Mask))
  (pad 94 smd rect (at -17.2 2.2) (size 0.5 2.4) (layers F.Cu F.Paste F.Mask))
  (pad 95 smd rect (at -18 -2.2) (size 0.5 2.4) (layers F.Cu F.Paste F.Mask))
  (pad 96 smd rect (at -18 2.2) (size 0.5 2.4) (layers F.Cu F.Paste F.Mask))
  (pad 97 smd rect (at -18.8 -2.2) (size 0.5 2.4) (layers F.Cu F.Paste F.Mask))
  (pad 98 smd rect (at -18.8 2.2) (size 0.5 2.4) (layers F.Cu F.Paste F.Mask))
  (pad 99 smd rect (at -19.6 -2.2) (size 0.5 2.4) (layers F.Cu F.Paste F.Mask))
  (pad 100 smd rect (at -19.6 2.2) (size 0.5 2.4) (layers F.Cu F.Paste F.Mask))
  (pad "" np_thru_hole circle (at -22.1 0) (size 1.524 1.524) (drill 0.8) (layers *.Cu *.Mask))
  (pad "" np_thru_hole circle (at 22.1 0) (size 1.524 1.524) (drill 1.2) (layers *.Cu *.Mask))
  (model ${POWDER_KICAD_LIBRARY}/models/POWDER_Connector/10144517-101x0xlf.stp
    (at (xyz 0 0 0))
    (scale (xyz 1 1 1))
    (rotate (xyz -90 0 0))
  )
)
