(kicad_symbol_lib (version 20211014) (generator kicad_symbol_editor)
  (symbol "MSP432E401YTPDTR" (pin_names (offset 0.254)) (in_bom yes) (on_board yes)
    (property "Reference" "U" (id 0) (at 0 -7.62 0)
      (effects (font (size 1.524 1.524)))
    )
    (property "Value" "MSP432E401YTPDTR" (id 1) (at 0 6.35 0)
      (effects (font (size 1.524 1.524)))
    )
    (property "Footprint" "POWDER_MCU:MSP432E401YTPDTR" (id 2) (at 0 -11.684 0)
      (effects (font (size 1.524 1.524)) hide)
    )
    (property "Datasheet" "" (id 3) (at 0 -10.16 0)
      (effects (font (size 1.524 1.524)))
    )
    (property "Manufacturer" "Texas Instruments" (id 4) (at 0 0 0)
      (effects (font (size 1.27 1.27)) hide)
    )
    (property "PartNumber" "MSP432E401YTPDTR" (id 5) (at 0 0 0)
      (effects (font (size 1.27 1.27)) hide)
    )
    (property "ki_description" "SimpleLink EthernetMicrocontroller" (id 6) (at 0 0 0)
      (effects (font (size 1.27 1.27)) hide)
    )
    (property "ki_fp_filters" "PDT0128A" (id 7) (at 0 0 0)
      (effects (font (size 1.27 1.27)) hide)
    )
    (symbol "MSP432E401YTPDTR_1_0"
      (rectangle (start -20.32 44.45) (end 20.32 -41.91)
        (stroke (width 0.2032) (type default) (color 0 0 0 0))
        (fill (type background))
      )
      (pin bidirectional line (at -22.86 -21.59 0) (length 2.54)
        (name "PD0" (effects (font (size 1.27 1.27))))
        (number "1" (effects (font (size 1.27 1.27))))
      )
      (pin bidirectional line (at -22.86 1.27 0) (length 2.54)
        (name "PC0_TCK_SWCLK" (effects (font (size 1.27 1.27))))
        (number "100" (effects (font (size 1.27 1.27))))
      )
      (pin bidirectional line (at 22.86 -11.43 180) (length 2.54)
        (name "PJ0" (effects (font (size 1.27 1.27))))
        (number "116" (effects (font (size 1.27 1.27))))
      )
      (pin bidirectional line (at 22.86 -13.97 180) (length 2.54)
        (name "PJ1" (effects (font (size 1.27 1.27))))
        (number "117" (effects (font (size 1.27 1.27))))
      )
      (pin bidirectional line (at 22.86 34.29 180) (length 2.54)
        (name "PE3" (effects (font (size 1.27 1.27))))
        (number "12" (effects (font (size 1.27 1.27))))
      )
      (pin bidirectional line (at -22.86 6.35 0) (length 2.54)
        (name "PB5" (effects (font (size 1.27 1.27))))
        (number "120" (effects (font (size 1.27 1.27))))
      )
      (pin bidirectional line (at -22.86 8.89 0) (length 2.54)
        (name "PB4" (effects (font (size 1.27 1.27))))
        (number "121" (effects (font (size 1.27 1.27))))
      )
      (pin bidirectional line (at 22.86 31.75 180) (length 2.54)
        (name "PE4" (effects (font (size 1.27 1.27))))
        (number "123" (effects (font (size 1.27 1.27))))
      )
      (pin bidirectional line (at 22.86 29.21 180) (length 2.54)
        (name "PE5" (effects (font (size 1.27 1.27))))
        (number "124" (effects (font (size 1.27 1.27))))
      )
      (pin bidirectional line (at -22.86 -31.75 0) (length 2.54)
        (name "PD4" (effects (font (size 1.27 1.27))))
        (number "125" (effects (font (size 1.27 1.27))))
      )
      (pin bidirectional line (at -22.86 -34.29 0) (length 2.54)
        (name "PD5" (effects (font (size 1.27 1.27))))
        (number "126" (effects (font (size 1.27 1.27))))
      )
      (pin bidirectional line (at -22.86 -36.83 0) (length 2.54)
        (name "PD6" (effects (font (size 1.27 1.27))))
        (number "127" (effects (font (size 1.27 1.27))))
      )
      (pin bidirectional line (at -22.86 -39.37 0) (length 2.54)
        (name "PD7" (effects (font (size 1.27 1.27))))
        (number "128" (effects (font (size 1.27 1.27))))
      )
      (pin bidirectional line (at 22.86 36.83 180) (length 2.54)
        (name "PE2" (effects (font (size 1.27 1.27))))
        (number "13" (effects (font (size 1.27 1.27))))
      )
      (pin bidirectional line (at 22.86 39.37 180) (length 2.54)
        (name "PE1" (effects (font (size 1.27 1.27))))
        (number "14" (effects (font (size 1.27 1.27))))
      )
      (pin bidirectional line (at 22.86 41.91 180) (length 2.54)
        (name "PE0" (effects (font (size 1.27 1.27))))
        (number "15" (effects (font (size 1.27 1.27))))
      )
      (pin bidirectional line (at 22.86 -19.05 180) (length 2.54)
        (name "PK0" (effects (font (size 1.27 1.27))))
        (number "18" (effects (font (size 1.27 1.27))))
      )
      (pin bidirectional line (at 22.86 -21.59 180) (length 2.54)
        (name "PK1" (effects (font (size 1.27 1.27))))
        (number "19" (effects (font (size 1.27 1.27))))
      )
      (pin bidirectional line (at -22.86 -24.13 0) (length 2.54)
        (name "PD1" (effects (font (size 1.27 1.27))))
        (number "2" (effects (font (size 1.27 1.27))))
      )
      (pin bidirectional line (at 22.86 -24.13 180) (length 2.54)
        (name "PK2" (effects (font (size 1.27 1.27))))
        (number "20" (effects (font (size 1.27 1.27))))
      )
      (pin bidirectional line (at 22.86 -26.67 180) (length 2.54)
        (name "PK3" (effects (font (size 1.27 1.27))))
        (number "21" (effects (font (size 1.27 1.27))))
      )
      (pin bidirectional line (at -22.86 -16.51 0) (length 2.54)
        (name "PC7" (effects (font (size 1.27 1.27))))
        (number "22" (effects (font (size 1.27 1.27))))
      )
      (pin bidirectional line (at -22.86 -13.97 0) (length 2.54)
        (name "PC6" (effects (font (size 1.27 1.27))))
        (number "23" (effects (font (size 1.27 1.27))))
      )
      (pin bidirectional line (at -22.86 -11.43 0) (length 2.54)
        (name "PC5" (effects (font (size 1.27 1.27))))
        (number "24" (effects (font (size 1.27 1.27))))
      )
      (pin bidirectional line (at -22.86 -8.89 0) (length 2.54)
        (name "PC4" (effects (font (size 1.27 1.27))))
        (number "25" (effects (font (size 1.27 1.27))))
      )
      (pin bidirectional line (at 22.86 1.27 180) (length 2.54)
        (name "PH0" (effects (font (size 1.27 1.27))))
        (number "29" (effects (font (size 1.27 1.27))))
      )
      (pin bidirectional line (at -22.86 -26.67 0) (length 2.54)
        (name "PD2" (effects (font (size 1.27 1.27))))
        (number "3" (effects (font (size 1.27 1.27))))
      )
      (pin bidirectional line (at 22.86 -1.27 180) (length 2.54)
        (name "PH1" (effects (font (size 1.27 1.27))))
        (number "30" (effects (font (size 1.27 1.27))))
      )
      (pin bidirectional line (at 22.86 -3.81 180) (length 2.54)
        (name "PH2" (effects (font (size 1.27 1.27))))
        (number "31" (effects (font (size 1.27 1.27))))
      )
      (pin bidirectional line (at 22.86 -6.35 180) (length 2.54)
        (name "PH3" (effects (font (size 1.27 1.27))))
        (number "32" (effects (font (size 1.27 1.27))))
      )
      (pin bidirectional line (at -22.86 41.91 0) (length 2.54)
        (name "PA0" (effects (font (size 1.27 1.27))))
        (number "33" (effects (font (size 1.27 1.27))))
      )
      (pin bidirectional line (at -22.86 39.37 0) (length 2.54)
        (name "PA1" (effects (font (size 1.27 1.27))))
        (number "34" (effects (font (size 1.27 1.27))))
      )
      (pin bidirectional line (at -22.86 36.83 0) (length 2.54)
        (name "PA2" (effects (font (size 1.27 1.27))))
        (number "35" (effects (font (size 1.27 1.27))))
      )
      (pin bidirectional line (at -22.86 34.29 0) (length 2.54)
        (name "PA3" (effects (font (size 1.27 1.27))))
        (number "36" (effects (font (size 1.27 1.27))))
      )
      (pin bidirectional line (at -22.86 31.75 0) (length 2.54)
        (name "PA4" (effects (font (size 1.27 1.27))))
        (number "37" (effects (font (size 1.27 1.27))))
      )
      (pin bidirectional line (at -22.86 29.21 0) (length 2.54)
        (name "PA5" (effects (font (size 1.27 1.27))))
        (number "38" (effects (font (size 1.27 1.27))))
      )
      (pin bidirectional line (at -22.86 -29.21 0) (length 2.54)
        (name "PD3" (effects (font (size 1.27 1.27))))
        (number "4" (effects (font (size 1.27 1.27))))
      )
      (pin bidirectional line (at -22.86 26.67 0) (length 2.54)
        (name "PA6" (effects (font (size 1.27 1.27))))
        (number "40" (effects (font (size 1.27 1.27))))
      )
      (pin bidirectional line (at -22.86 24.13 0) (length 2.54)
        (name "PA7" (effects (font (size 1.27 1.27))))
        (number "41" (effects (font (size 1.27 1.27))))
      )
      (pin bidirectional line (at 22.86 24.13 180) (length 2.54)
        (name "PF0" (effects (font (size 1.27 1.27))))
        (number "42" (effects (font (size 1.27 1.27))))
      )
      (pin bidirectional line (at 22.86 21.59 180) (length 2.54)
        (name "PF1" (effects (font (size 1.27 1.27))))
        (number "43" (effects (font (size 1.27 1.27))))
      )
      (pin bidirectional line (at 22.86 19.05 180) (length 2.54)
        (name "PF2" (effects (font (size 1.27 1.27))))
        (number "44" (effects (font (size 1.27 1.27))))
      )
      (pin bidirectional line (at 22.86 16.51 180) (length 2.54)
        (name "PF3" (effects (font (size 1.27 1.27))))
        (number "45" (effects (font (size 1.27 1.27))))
      )
      (pin bidirectional line (at 22.86 13.97 180) (length 2.54)
        (name "PF4" (effects (font (size 1.27 1.27))))
        (number "46" (effects (font (size 1.27 1.27))))
      )
      (pin bidirectional line (at 22.86 8.89 180) (length 2.54)
        (name "PG0" (effects (font (size 1.27 1.27))))
        (number "49" (effects (font (size 1.27 1.27))))
      )
      (pin bidirectional line (at 22.86 6.35 180) (length 2.54)
        (name "PG1" (effects (font (size 1.27 1.27))))
        (number "50" (effects (font (size 1.27 1.27))))
      )
      (pin bidirectional line (at 22.86 -36.83 180) (length 2.54)
        (name "PK7" (effects (font (size 1.27 1.27))))
        (number "60" (effects (font (size 1.27 1.27))))
      )
      (pin bidirectional line (at 22.86 -34.29 180) (length 2.54)
        (name "PK6" (effects (font (size 1.27 1.27))))
        (number "61" (effects (font (size 1.27 1.27))))
      )
      (pin bidirectional line (at 22.86 -31.75 180) (length 2.54)
        (name "PK5" (effects (font (size 1.27 1.27))))
        (number "62" (effects (font (size 1.27 1.27))))
      )
      (pin bidirectional line (at 22.86 -29.21 180) (length 2.54)
        (name "PK4" (effects (font (size 1.27 1.27))))
        (number "63" (effects (font (size 1.27 1.27))))
      )
      (pin bidirectional line (at -22.86 13.97 0) (length 2.54)
        (name "PB2" (effects (font (size 1.27 1.27))))
        (number "91" (effects (font (size 1.27 1.27))))
      )
      (pin bidirectional line (at -22.86 11.43 0) (length 2.54)
        (name "PB3" (effects (font (size 1.27 1.27))))
        (number "92" (effects (font (size 1.27 1.27))))
      )
      (pin bidirectional line (at -22.86 19.05 0) (length 2.54)
        (name "PB0" (effects (font (size 1.27 1.27))))
        (number "95" (effects (font (size 1.27 1.27))))
      )
      (pin bidirectional line (at -22.86 16.51 0) (length 2.54)
        (name "PB1" (effects (font (size 1.27 1.27))))
        (number "96" (effects (font (size 1.27 1.27))))
      )
      (pin bidirectional line (at -22.86 -6.35 0) (length 2.54)
        (name "PC3_TDO_SWO" (effects (font (size 1.27 1.27))))
        (number "97" (effects (font (size 1.27 1.27))))
      )
      (pin bidirectional line (at -22.86 -3.81 0) (length 2.54)
        (name "PC2_TDI" (effects (font (size 1.27 1.27))))
        (number "98" (effects (font (size 1.27 1.27))))
      )
      (pin bidirectional line (at -22.86 -1.27 0) (length 2.54)
        (name "PC1_TMS_SWDIO" (effects (font (size 1.27 1.27))))
        (number "99" (effects (font (size 1.27 1.27))))
      )
    )
    (symbol "MSP432E401YTPDTR_2_0"
      (rectangle (start -19.05 31.75) (end 20.32 -31.75)
        (stroke (width 0.2032) (type default) (color 0 0 0 0))
        (fill (type background))
      )
      (pin bidirectional line (at 22.86 -21.59 180) (length 2.54)
        (name "PQ4" (effects (font (size 1.27 1.27))))
        (number "102" (effects (font (size 1.27 1.27))))
      )
      (pin bidirectional line (at 22.86 6.35 180) (length 2.54)
        (name "PP2" (effects (font (size 1.27 1.27))))
        (number "103" (effects (font (size 1.27 1.27))))
      )
      (pin bidirectional line (at 22.86 3.81 180) (length 2.54)
        (name "PP3" (effects (font (size 1.27 1.27))))
        (number "104" (effects (font (size 1.27 1.27))))
      )
      (pin bidirectional line (at 22.86 1.27 180) (length 2.54)
        (name "PP4" (effects (font (size 1.27 1.27))))
        (number "105" (effects (font (size 1.27 1.27))))
      )
      (pin bidirectional line (at 22.86 -6.35 180) (length 2.54)
        (name "PP5" (effects (font (size 1.27 1.27))))
        (number "106" (effects (font (size 1.27 1.27))))
      )
      (pin bidirectional line (at -21.59 -16.51 0) (length 2.54)
        (name "PN0" (effects (font (size 1.27 1.27))))
        (number "107" (effects (font (size 1.27 1.27))))
      )
      (pin bidirectional line (at -21.59 -19.05 0) (length 2.54)
        (name "PN1" (effects (font (size 1.27 1.27))))
        (number "108" (effects (font (size 1.27 1.27))))
      )
      (pin bidirectional line (at -21.59 -21.59 0) (length 2.54)
        (name "PN2" (effects (font (size 1.27 1.27))))
        (number "109" (effects (font (size 1.27 1.27))))
      )
      (pin bidirectional line (at 22.86 -16.51 180) (length 2.54)
        (name "PQ2" (effects (font (size 1.27 1.27))))
        (number "11" (effects (font (size 1.27 1.27))))
      )
      (pin bidirectional line (at -21.59 -24.13 0) (length 2.54)
        (name "PN3" (effects (font (size 1.27 1.27))))
        (number "110" (effects (font (size 1.27 1.27))))
      )
      (pin bidirectional line (at -21.59 -26.67 0) (length 2.54)
        (name "PN4" (effects (font (size 1.27 1.27))))
        (number "111" (effects (font (size 1.27 1.27))))
      )
      (pin bidirectional line (at -21.59 -29.21 0) (length 2.54)
        (name "PN5" (effects (font (size 1.27 1.27))))
        (number "112" (effects (font (size 1.27 1.27))))
      )
      (pin bidirectional line (at 22.86 11.43 180) (length 2.54)
        (name "PP0" (effects (font (size 1.27 1.27))))
        (number "118" (effects (font (size 1.27 1.27))))
      )
      (pin bidirectional line (at 22.86 8.89 180) (length 2.54)
        (name "PP1" (effects (font (size 1.27 1.27))))
        (number "119" (effects (font (size 1.27 1.27))))
      )
      (pin bidirectional line (at 22.86 -19.05 180) (length 2.54)
        (name "PQ3" (effects (font (size 1.27 1.27))))
        (number "27" (effects (font (size 1.27 1.27))))
      )
      (pin bidirectional line (at 22.86 -11.43 180) (length 2.54)
        (name "PQ0" (effects (font (size 1.27 1.27))))
        (number "5" (effects (font (size 1.27 1.27))))
      )
      (pin bidirectional line (at 22.86 -13.97 180) (length 2.54)
        (name "PQ1" (effects (font (size 1.27 1.27))))
        (number "6" (effects (font (size 1.27 1.27))))
      )
      (pin bidirectional line (at -21.59 -11.43 0) (length 2.54)
        (name "PM7" (effects (font (size 1.27 1.27))))
        (number "71" (effects (font (size 1.27 1.27))))
      )
      (pin bidirectional line (at -21.59 -8.89 0) (length 2.54)
        (name "PM6" (effects (font (size 1.27 1.27))))
        (number "72" (effects (font (size 1.27 1.27))))
      )
      (pin bidirectional line (at -21.59 -6.35 0) (length 2.54)
        (name "PM5" (effects (font (size 1.27 1.27))))
        (number "73" (effects (font (size 1.27 1.27))))
      )
      (pin bidirectional line (at -21.59 -3.81 0) (length 2.54)
        (name "PM4" (effects (font (size 1.27 1.27))))
        (number "74" (effects (font (size 1.27 1.27))))
      )
      (pin bidirectional line (at -21.59 -1.27 0) (length 2.54)
        (name "PM3" (effects (font (size 1.27 1.27))))
        (number "75" (effects (font (size 1.27 1.27))))
      )
      (pin bidirectional line (at -21.59 1.27 0) (length 2.54)
        (name "PM2" (effects (font (size 1.27 1.27))))
        (number "76" (effects (font (size 1.27 1.27))))
      )
      (pin bidirectional line (at -21.59 3.81 0) (length 2.54)
        (name "PM1" (effects (font (size 1.27 1.27))))
        (number "77" (effects (font (size 1.27 1.27))))
      )
      (pin bidirectional line (at -21.59 6.35 0) (length 2.54)
        (name "PM0" (effects (font (size 1.27 1.27))))
        (number "78" (effects (font (size 1.27 1.27))))
      )
      (pin bidirectional line (at -21.59 29.21 0) (length 2.54)
        (name "PL0" (effects (font (size 1.27 1.27))))
        (number "81" (effects (font (size 1.27 1.27))))
      )
      (pin bidirectional line (at -21.59 26.67 0) (length 2.54)
        (name "PL1" (effects (font (size 1.27 1.27))))
        (number "82" (effects (font (size 1.27 1.27))))
      )
      (pin bidirectional line (at -21.59 24.13 0) (length 2.54)
        (name "PL2" (effects (font (size 1.27 1.27))))
        (number "83" (effects (font (size 1.27 1.27))))
      )
      (pin bidirectional line (at -21.59 21.59 0) (length 2.54)
        (name "PL3" (effects (font (size 1.27 1.27))))
        (number "84" (effects (font (size 1.27 1.27))))
      )
      (pin bidirectional line (at -21.59 19.05 0) (length 2.54)
        (name "PL4" (effects (font (size 1.27 1.27))))
        (number "85" (effects (font (size 1.27 1.27))))
      )
      (pin bidirectional line (at -21.59 16.51 0) (length 2.54)
        (name "PL5" (effects (font (size 1.27 1.27))))
        (number "86" (effects (font (size 1.27 1.27))))
      )
      (pin bidirectional line (at -21.59 11.43 0) (length 2.54)
        (name "PL7" (effects (font (size 1.27 1.27))))
        (number "93" (effects (font (size 1.27 1.27))))
      )
      (pin bidirectional line (at -21.59 13.97 0) (length 2.54)
        (name "PL6" (effects (font (size 1.27 1.27))))
        (number "94" (effects (font (size 1.27 1.27))))
      )
    )
    (symbol "MSP432E401YTPDTR_3_0"
      (rectangle (start -17.78 15.24) (end 17.78 -21.59)
        (stroke (width 0.2032) (type default) (color 0 0 0 0))
        (fill (type background))
      )
      (pin bidirectional line (at -20.32 3.81 0) (length 2.54)
        (name "EN0RXIN" (effects (font (size 1.27 1.27))))
        (number "53" (effects (font (size 1.27 1.27))))
      )
      (pin bidirectional line (at -20.32 1.27 0) (length 2.54)
        (name "EN0RXIP" (effects (font (size 1.27 1.27))))
        (number "54" (effects (font (size 1.27 1.27))))
      )
      (pin bidirectional line (at -20.32 -6.35 0) (length 2.54)
        (name "EN0TXON" (effects (font (size 1.27 1.27))))
        (number "56" (effects (font (size 1.27 1.27))))
      )
      (pin bidirectional line (at -20.32 -8.89 0) (length 2.54)
        (name "EN0TXOP" (effects (font (size 1.27 1.27))))
        (number "57" (effects (font (size 1.27 1.27))))
      )
      (pin output line (at 20.32 7.62 180) (length 2.54)
        (name "RBIAS" (effects (font (size 1.27 1.27))))
        (number "59" (effects (font (size 1.27 1.27))))
      )
      (pin input line (at -20.32 12.7 0) (length 2.54)
        (name "WAKE_N" (effects (font (size 1.27 1.27))))
        (number "64" (effects (font (size 1.27 1.27))))
      )
      (pin output line (at 20.32 10.16 180) (length 2.54)
        (name "HIB_N" (effects (font (size 1.27 1.27))))
        (number "65" (effects (font (size 1.27 1.27))))
      )
      (pin input line (at 20.32 1.27 180) (length 2.54)
        (name "XOSC0" (effects (font (size 1.27 1.27))))
        (number "66" (effects (font (size 1.27 1.27))))
      )
      (pin output line (at 20.32 -6.35 180) (length 2.54)
        (name "XOSC1" (effects (font (size 1.27 1.27))))
        (number "67" (effects (font (size 1.27 1.27))))
      )
      (pin input line (at -20.32 10.16 0) (length 2.54)
        (name "RST_N" (effects (font (size 1.27 1.27))))
        (number "70" (effects (font (size 1.27 1.27))))
      )
      (pin input line (at 20.32 -11.43 180) (length 2.54)
        (name "OSC0" (effects (font (size 1.27 1.27))))
        (number "88" (effects (font (size 1.27 1.27))))
      )
      (pin output line (at 20.32 -19.05 180) (length 2.54)
        (name "OSC1" (effects (font (size 1.27 1.27))))
        (number "89" (effects (font (size 1.27 1.27))))
      )
    )
    (symbol "MSP432E401YTPDTR_4_0"
      (pin power_in line (at 17.78 5.08 180) (length 2.54)
        (name "GNDA" (effects (font (size 1.27 1.27))))
        (number "10" (effects (font (size 1.27 1.27))))
      )
      (pin power_in line (at -17.78 10.16 0) (length 2.54)
        (name "VDD" (effects (font (size 1.27 1.27))))
        (number "101" (effects (font (size 1.27 1.27))))
      )
      (pin power_in line (at -17.78 25.4 0) (length 2.54)
        (name "VDD" (effects (font (size 1.27 1.27))))
        (number "113" (effects (font (size 1.27 1.27))))
      )
      (pin power_in line (at 17.78 0 180) (length 2.54)
        (name "GND" (effects (font (size 1.27 1.27))))
        (number "114" (effects (font (size 1.27 1.27))))
      )
      (pin passive line (at -17.78 -15.24 0) (length 2.54)
        (name "VDDC" (effects (font (size 1.27 1.27))))
        (number "115" (effects (font (size 1.27 1.27))))
      )
      (pin power_in line (at -17.78 22.86 0) (length 2.54)
        (name "VDD" (effects (font (size 1.27 1.27))))
        (number "122" (effects (font (size 1.27 1.27))))
      )
      (pin power_in line (at -17.78 20.32 0) (length 2.54)
        (name "VDD" (effects (font (size 1.27 1.27))))
        (number "16" (effects (font (size 1.27 1.27))))
      )
      (pin power_in line (at 17.78 -12.7 180) (length 2.54)
        (name "GND" (effects (font (size 1.27 1.27))))
        (number "17" (effects (font (size 1.27 1.27))))
      )
      (pin power_in line (at -17.78 17.78 0) (length 2.54)
        (name "VDD" (effects (font (size 1.27 1.27))))
        (number "26" (effects (font (size 1.27 1.27))))
      )
      (pin power_in line (at -17.78 -5.08 0) (length 2.54)
        (name "VDD" (effects (font (size 1.27 1.27))))
        (number "28" (effects (font (size 1.27 1.27))))
      )
      (pin power_in line (at -17.78 -2.54 0) (length 2.54)
        (name "VDD" (effects (font (size 1.27 1.27))))
        (number "39" (effects (font (size 1.27 1.27))))
      )
      (pin power_in line (at -17.78 0 0) (length 2.54)
        (name "VDD" (effects (font (size 1.27 1.27))))
        (number "47" (effects (font (size 1.27 1.27))))
      )
      (pin power_in line (at 17.78 -10.16 180) (length 2.54)
        (name "GND" (effects (font (size 1.27 1.27))))
        (number "48" (effects (font (size 1.27 1.27))))
      )
      (pin power_in line (at -17.78 2.54 0) (length 2.54)
        (name "VDD" (effects (font (size 1.27 1.27))))
        (number "51" (effects (font (size 1.27 1.27))))
      )
      (pin power_in line (at -17.78 5.08 0) (length 2.54)
        (name "VDD" (effects (font (size 1.27 1.27))))
        (number "52" (effects (font (size 1.27 1.27))))
      )
      (pin power_in line (at 17.78 -7.62 180) (length 2.54)
        (name "GND" (effects (font (size 1.27 1.27))))
        (number "55" (effects (font (size 1.27 1.27))))
      )
      (pin power_in line (at 17.78 -5.08 180) (length 2.54)
        (name "GND" (effects (font (size 1.27 1.27))))
        (number "58" (effects (font (size 1.27 1.27))))
      )
      (pin power_in line (at -17.78 -29.21 0) (length 2.54)
        (name "VBAT" (effects (font (size 1.27 1.27))))
        (number "68" (effects (font (size 1.27 1.27))))
      )
      (pin power_in line (at -17.78 27.94 0) (length 2.54)
        (name "VDD" (effects (font (size 1.27 1.27))))
        (number "69" (effects (font (size 1.27 1.27))))
      )
      (pin power_in line (at -17.78 15.24 0) (length 2.54)
        (name "VDD" (effects (font (size 1.27 1.27))))
        (number "7" (effects (font (size 1.27 1.27))))
      )
      (pin power_in line (at -17.78 7.62 0) (length 2.54)
        (name "VDD" (effects (font (size 1.27 1.27))))
        (number "79" (effects (font (size 1.27 1.27))))
      )
      (pin power_in line (at -17.78 -10.16 0) (length 2.54)
        (name "VDDA" (effects (font (size 1.27 1.27))))
        (number "8" (effects (font (size 1.27 1.27))))
      )
      (pin power_in line (at 17.78 -2.54 180) (length 2.54)
        (name "GND" (effects (font (size 1.27 1.27))))
        (number "80" (effects (font (size 1.27 1.27))))
      )
      (pin passive line (at -17.78 -17.78 0) (length 2.54)
        (name "VDDC" (effects (font (size 1.27 1.27))))
        (number "87" (effects (font (size 1.27 1.27))))
      )
      (pin power_in line (at -17.78 -22.86 0) (length 2.54)
        (name "VREFA+" (effects (font (size 1.27 1.27))))
        (number "9" (effects (font (size 1.27 1.27))))
      )
      (pin power_in line (at -17.78 12.7 0) (length 2.54)
        (name "VDD" (effects (font (size 1.27 1.27))))
        (number "90" (effects (font (size 1.27 1.27))))
      )
    )
    (symbol "MSP432E401YTPDTR_4_1"
      (rectangle (start -15.24 30.48) (end 15.24 -31.75)
        (stroke (width 0.2032) (type default) (color 0 0 0 0))
        (fill (type background))
      )
    )
  )
)
