(footprint "R_kelvin_0306" (version 20211014) (generator pcbnew)
  (layer "F.Cu")
  (tedit 628D0A31)
  (attr smd)
  (fp_text reference "REF**" (at 0 -1.5 unlocked) (layer "F.SilkS")
    (effects (font (size 1 1) (thickness 0.15)))
    (tstamp de3f1ab0-3472-447e-9d74-ceb7f7c5a013)
  )
  (fp_text value "R_kelvin_0306" (at 0 1.75 unlocked) (layer "F.Fab")
    (effects (font (size 1 1) (thickness 0.15)))
    (tstamp 96868862-d11b-49b7-9f23-82fa37650729)
  )
  (fp_text user "${REFERENCE}" (at 0 3.25 unlocked) (layer "F.Fab")
    (effects (font (size 1 1) (thickness 0.15)))
    (tstamp 4f2299bc-5836-4e38-a358-01b79ba9a671)
  )
  (fp_line (start -0.95 0.575) (end 0.95 0.575) (layer "F.SilkS") (width 0.12) (tstamp 10ae636e-5865-4ba4-9c00-03932cc595f9))
  (fp_line (start -0.95 -0.575) (end -0.95 0.575) (layer "F.SilkS") (width 0.12) (tstamp 91eec633-6449-4cc9-bc3e-7c123698d0e2))
  (fp_line (start -0.75 1) (end 0.75 1) (layer "F.SilkS") (width 0.12) (tstamp d7fb12d8-c45a-4083-b88c-3cc53fbea9db))
  (fp_line (start 0.95 -0.575) (end -0.95 -0.575) (layer "F.SilkS") (width 0.12) (tstamp e11718b2-de67-4d67-a64a-8c6630141051))
  (fp_line (start 0.95 0.575) (end 0.95 -0.575) (layer "F.SilkS") (width 0.12) (tstamp ed2dca0b-d08b-4e25-87b8-5a64b63a01f4))
  (fp_line (start -1.125 0.75) (end 1.125 0.75) (layer "F.CrtYd") (width 0.05) (tstamp 13707cd1-3d89-4fad-940c-a219d6781a15))
  (fp_line (start 1.125 -0.75) (end -1.125 -0.75) (layer "F.CrtYd") (width 0.05) (tstamp 872a0c91-5943-43f4-855b-36120a569c76))
  (fp_line (start -1.125 -0.75) (end -1.125 0.75) (layer "F.CrtYd") (width 0.05) (tstamp dad021f5-671d-46ef-949a-ac980054a47c))
  (fp_line (start 1.125 0.75) (end 1.125 -0.75) (layer "F.CrtYd") (width 0.05) (tstamp fb2b69f7-2cac-4331-a2f5-6be6afe12e63))
  (fp_line (start -0.8 -0.4) (end -0.8 0.4) (layer "F.Fab") (width 0.1) (tstamp 14dea162-617e-4a25-bdd5-87c79ea151a7))
  (fp_line (start 0.8 0.4) (end 0.8 -0.4) (layer "F.Fab") (width 0.1) (tstamp 398cb112-e7bf-4e16-af71-4a6320a96985))
  (fp_line (start -0.8 0.4) (end 0.8 0.4) (layer "F.Fab") (width 0.1) (tstamp caf57981-a05f-48e6-899a-4da66a45517b))
  (fp_line (start 0.8 -0.4) (end -0.8 -0.4) (layer "F.Fab") (width 0.1) (tstamp e62284c4-e29a-40f9-9fef-0c2dc157f6b6))
  (pad "1" smd rect (at 0.275 -0.3) (size 1.2 0.4) (layers "F.Cu" "F.Paste" "F.Mask") (tstamp 00bd9350-6912-449a-ba52-8456cdbda14d))
  (pad "2" smd rect (at -0.7 -0.3) (size 0.35 0.4) (layers "F.Cu" "F.Paste" "F.Mask") (tstamp 981fdb0f-6bb8-4725-aa75-206fcad9f8b3))
  (pad "3" smd rect (at -0.7 0.3) (size 0.35 0.4) (layers "F.Cu" "F.Paste" "F.Mask") (tstamp aff82dbe-fb73-490b-b6a2-f9c5bd228dc3))
  (pad "4" smd rect (at 0.275 0.3) (size 1.2 0.4) (layers "F.Cu" "F.Paste" "F.Mask") (tstamp 95270ac5-8a23-44f3-8c8a-815bcf5a3193))
)
