(kicad_symbol_lib (version 20211014) (generator kicad_symbol_editor)
  (symbol "D5V0P4UR6SO" (pin_names (offset 1.016)) (in_bom yes) (on_board yes)
    (property "Reference" "U" (id 0) (at 8.89 12.7 0)
      (effects (font (size 1.27 1.27)))
    )
    (property "Value" "D5V0P4UR6SO" (id 1) (at -8.89 12.7 0)
      (effects (font (size 1.27 1.27)))
    )
    (property "Footprint" "Package_TO_SOT_SMD:SOT-23-6" (id 2) (at 16.51 16.51 0)
      (effects (font (size 1.27 1.27)) hide)
    )
    (property "Datasheet" "" (id 3) (at 0 0 0)
      (effects (font (size 1.27 1.27)) hide)
    )
    (property "ki_description" "4 Channel Low Capacitance TVS Diode Array" (id 4) (at 0 0 0)
      (effects (font (size 1.27 1.27)) hide)
    )
    (symbol "D5V0P4UR6SO_0_1"
      (polyline
        (pts
          (xy 2.54 -1.905)
          (xy 3.81 -1.905)
        )
        (stroke (width 0) (type default) (color 0 0 0 0))
        (fill (type none))
      )
      (polyline
        (pts
          (xy 2.54 1.27)
          (xy 3.81 1.27)
        )
        (stroke (width 0) (type default) (color 0 0 0 0))
        (fill (type none))
      )
      (polyline
        (pts
          (xy 3.175 -1.905)
          (xy 3.175 0)
        )
        (stroke (width 0) (type default) (color 0 0 0 0))
        (fill (type none))
      )
      (polyline
        (pts
          (xy 5.08 0.635)
          (xy 6.35 0.635)
        )
        (stroke (width 0) (type default) (color 0 0 0 0))
        (fill (type none))
      )
      (polyline
        (pts
          (xy 5.08 3.175)
          (xy 6.35 3.175)
        )
        (stroke (width 0) (type default) (color 0 0 0 0))
        (fill (type none))
      )
      (polyline
        (pts
          (xy 5.715 1.905)
          (xy 5.715 0.635)
        )
        (stroke (width 0) (type default) (color 0 0 0 0))
        (fill (type none))
      )
      (polyline
        (pts
          (xy -1.27 1.27)
          (xy -0.635 0.635)
          (xy 0.635 0.635)
          (xy 1.27 0)
        )
        (stroke (width 0) (type default) (color 0 0 0 0))
        (fill (type none))
      )
      (polyline
        (pts
          (xy 0 0.635)
          (xy -0.635 -0.635)
          (xy 0.635 -0.635)
          (xy 0 0.635)
        )
        (stroke (width 0) (type default) (color 0 0 0 0))
        (fill (type outline))
      )
      (polyline
        (pts
          (xy 3.175 -1.905)
          (xy 3.81 -3.175)
          (xy 2.54 -3.175)
          (xy 3.175 -1.905)
        )
        (stroke (width 0) (type default) (color 0 0 0 0))
        (fill (type outline))
      )
      (polyline
        (pts
          (xy 3.81 0)
          (xy 2.54 0)
          (xy 3.175 1.27)
          (xy 3.81 0)
        )
        (stroke (width 0) (type default) (color 0 0 0 0))
        (fill (type outline))
      )
      (polyline
        (pts
          (xy 5.08 -0.635)
          (xy 6.35 -0.635)
          (xy 5.715 0.635)
          (xy 5.08 -0.635)
        )
        (stroke (width 0) (type default) (color 0 0 0 0))
        (fill (type outline))
      )
      (polyline
        (pts
          (xy 6.35 1.905)
          (xy 5.08 1.905)
          (xy 5.715 3.175)
          (xy 6.35 1.905)
        )
        (stroke (width 0) (type default) (color 0 0 0 0))
        (fill (type outline))
      )
    )
    (symbol "D5V0P4UR6SO_1_1"
      (rectangle (start -11.43 11.43) (end 11.43 -11.43)
        (stroke (width 0) (type default) (color 0 0 0 0))
        (fill (type background))
      )
      (circle (center -3.175 -4.445) (radius 0.1778)
        (stroke (width 0) (type default) (color 0 0 0 0))
        (fill (type outline))
      )
      (circle (center -3.175 4.445) (radius 0.1778)
        (stroke (width 0) (type default) (color 0 0 0 0))
        (fill (type outline))
      )
      (circle (center 0 -4.445) (radius 0.1778)
        (stroke (width 0) (type default) (color 0 0 0 0))
        (fill (type outline))
      )
      (polyline
        (pts
          (xy -6.35 -1.905)
          (xy -5.08 -1.905)
        )
        (stroke (width 0) (type default) (color 0 0 0 0))
        (fill (type none))
      )
      (polyline
        (pts
          (xy -6.35 1.27)
          (xy -5.08 1.27)
        )
        (stroke (width 0) (type default) (color 0 0 0 0))
        (fill (type none))
      )
      (polyline
        (pts
          (xy -5.715 -1.905)
          (xy -5.715 0)
        )
        (stroke (width 0) (type default) (color 0 0 0 0))
        (fill (type none))
      )
      (polyline
        (pts
          (xy -3.81 0.635)
          (xy -2.54 0.635)
        )
        (stroke (width 0) (type default) (color 0 0 0 0))
        (fill (type none))
      )
      (polyline
        (pts
          (xy -3.81 3.175)
          (xy -2.54 3.175)
        )
        (stroke (width 0) (type default) (color 0 0 0 0))
        (fill (type none))
      )
      (polyline
        (pts
          (xy -3.175 -0.635)
          (xy -3.175 -4.445)
        )
        (stroke (width 0) (type default) (color 0 0 0 0))
        (fill (type none))
      )
      (polyline
        (pts
          (xy -3.175 1.905)
          (xy -3.175 0.635)
        )
        (stroke (width 0) (type default) (color 0 0 0 0))
        (fill (type none))
      )
      (polyline
        (pts
          (xy -3.175 3.175)
          (xy -3.175 4.445)
        )
        (stroke (width 0) (type default) (color 0 0 0 0))
        (fill (type none))
      )
      (polyline
        (pts
          (xy 0 -5.715)
          (xy 0 -0.635)
        )
        (stroke (width 0) (type default) (color 0 0 0 0))
        (fill (type none))
      )
      (polyline
        (pts
          (xy 0 0.635)
          (xy 0 5.715)
        )
        (stroke (width 0) (type default) (color 0 0 0 0))
        (fill (type none))
      )
      (polyline
        (pts
          (xy 3.175 -3.175)
          (xy 3.175 -4.445)
        )
        (stroke (width 0) (type default) (color 0 0 0 0))
        (fill (type none))
      )
      (polyline
        (pts
          (xy 3.175 1.27)
          (xy 3.175 4.445)
        )
        (stroke (width 0) (type default) (color 0 0 0 0))
        (fill (type none))
      )
      (polyline
        (pts
          (xy -5.715 -3.175)
          (xy -5.715 -4.445)
          (xy 5.715 -4.445)
          (xy 5.715 -0.635)
        )
        (stroke (width 0) (type default) (color 0 0 0 0))
        (fill (type none))
      )
      (polyline
        (pts
          (xy -5.715 -1.905)
          (xy -5.08 -3.175)
          (xy -6.35 -3.175)
          (xy -5.715 -1.905)
        )
        (stroke (width 0) (type default) (color 0 0 0 0))
        (fill (type outline))
      )
      (polyline
        (pts
          (xy -5.08 0)
          (xy -6.35 0)
          (xy -5.715 1.27)
          (xy -5.08 0)
        )
        (stroke (width 0) (type default) (color 0 0 0 0))
        (fill (type outline))
      )
      (polyline
        (pts
          (xy -3.81 -0.635)
          (xy -2.54 -0.635)
          (xy -3.175 0.635)
          (xy -3.81 -0.635)
        )
        (stroke (width 0) (type default) (color 0 0 0 0))
        (fill (type outline))
      )
      (polyline
        (pts
          (xy -2.54 1.905)
          (xy -3.81 1.905)
          (xy -3.175 3.175)
          (xy -2.54 1.905)
        )
        (stroke (width 0) (type default) (color 0 0 0 0))
        (fill (type outline))
      )
      (polyline
        (pts
          (xy 5.715 3.175)
          (xy 5.715 4.445)
          (xy -5.715 4.445)
          (xy -5.715 1.27)
        )
        (stroke (width 0) (type default) (color 0 0 0 0))
        (fill (type none))
      )
      (circle (center 0 4.445) (radius 0.1778)
        (stroke (width 0) (type default) (color 0 0 0 0))
        (fill (type outline))
      )
      (circle (center 3.175 -4.445) (radius 0.1778)
        (stroke (width 0) (type default) (color 0 0 0 0))
        (fill (type outline))
      )
      (circle (center 3.175 4.445) (radius 0.1778)
        (stroke (width 0) (type default) (color 0 0 0 0))
        (fill (type outline))
      )
      (pin bidirectional line (at -13.97 1.27 0) (length 2.54)
        (name "IO1" (effects (font (size 1.27 1.27))))
        (number "1" (effects (font (size 1.27 1.27))))
      )
      (pin power_in line (at 0 -13.97 90) (length 2.54)
        (name "GND" (effects (font (size 1.27 1.27))))
        (number "2" (effects (font (size 1.27 1.27))))
      )
      (pin bidirectional line (at -13.97 -1.27 0) (length 2.54)
        (name "IO2" (effects (font (size 1.27 1.27))))
        (number "3" (effects (font (size 1.27 1.27))))
      )
      (pin bidirectional line (at 13.97 1.27 180) (length 2.54)
        (name "IO3" (effects (font (size 1.27 1.27))))
        (number "4" (effects (font (size 1.27 1.27))))
      )
      (pin power_in line (at 0 13.97 270) (length 2.54)
        (name "VCC" (effects (font (size 1.27 1.27))))
        (number "5" (effects (font (size 1.27 1.27))))
      )
      (pin bidirectional line (at 13.97 -1.27 180) (length 2.54)
        (name "IO4" (effects (font (size 1.27 1.27))))
        (number "6" (effects (font (size 1.27 1.27))))
      )
    )
  )
  (symbol "ESDS314" (in_bom yes) (on_board yes)
    (property "Reference" "U" (id 0) (at 10.16 13.97 0)
      (effects (font (size 1.27 1.27)))
    )
    (property "Value" "ESDS314" (id 1) (at -6.35 -6.35 0)
      (effects (font (size 1.27 1.27)))
    )
    (property "Footprint" "Package_TO_SOT_SMD:SOT-23-5" (id 2) (at 38.1 -16.51 0)
      (effects (font (size 1.27 1.27)) hide)
    )
    (property "Datasheet" "" (id 3) (at 0 16.51 0)
      (effects (font (size 1.27 1.27)) hide)
    )
    (property "ki_description" "Data-Line Surge and ESD Protection Diode Array" (id 4) (at 0 0 0)
      (effects (font (size 1.27 1.27)) hide)
    )
    (symbol "ESDS314_0_1"
      (rectangle (start -12.7 12.7) (end 12.7 -12.7)
        (stroke (width 0) (type default) (color 0 0 0 0))
        (fill (type background))
      )
      (polyline
        (pts
          (xy -7.62 -3.81)
          (xy 7.62 -3.81)
        )
        (stroke (width 0) (type default) (color 0 0 0 0))
        (fill (type none))
      )
      (polyline
        (pts
          (xy -7.62 -1.27)
          (xy -7.62 -3.81)
        )
        (stroke (width 0) (type default) (color 0 0 0 0))
        (fill (type none))
      )
      (polyline
        (pts
          (xy -7.62 1.27)
          (xy -7.62 5.08)
        )
        (stroke (width 0) (type default) (color 0 0 0 0))
        (fill (type none))
      )
      (polyline
        (pts
          (xy -2.54 -1.27)
          (xy -2.54 -3.81)
        )
        (stroke (width 0) (type default) (color 0 0 0 0))
        (fill (type none))
      )
      (polyline
        (pts
          (xy -2.54 1.27)
          (xy -2.54 5.08)
        )
        (stroke (width 0) (type default) (color 0 0 0 0))
        (fill (type none))
      )
      (polyline
        (pts
          (xy 0 -3.81)
          (xy 0 -7.62)
        )
        (stroke (width 0) (type default) (color 0 0 0 0))
        (fill (type none))
      )
      (polyline
        (pts
          (xy 2.54 -1.27)
          (xy 2.54 -3.81)
        )
        (stroke (width 0) (type default) (color 0 0 0 0))
        (fill (type none))
      )
      (polyline
        (pts
          (xy 2.54 1.27)
          (xy 2.54 5.08)
        )
        (stroke (width 0) (type default) (color 0 0 0 0))
        (fill (type none))
      )
      (polyline
        (pts
          (xy 7.62 -1.27)
          (xy 7.62 -3.81)
        )
        (stroke (width 0) (type default) (color 0 0 0 0))
        (fill (type none))
      )
      (polyline
        (pts
          (xy 7.62 1.27)
          (xy 7.62 5.08)
        )
        (stroke (width 0) (type default) (color 0 0 0 0))
        (fill (type none))
      )
      (polyline
        (pts
          (xy -7.62 1.27)
          (xy -8.89 1.27)
          (xy -9.525 2.54)
        )
        (stroke (width 0) (type default) (color 0 0 0 0))
        (fill (type none))
      )
      (polyline
        (pts
          (xy -7.62 1.27)
          (xy -6.35 1.27)
          (xy -5.715 0)
        )
        (stroke (width 0) (type default) (color 0 0 0 0))
        (fill (type none))
      )
      (polyline
        (pts
          (xy -2.54 1.27)
          (xy -3.81 1.27)
          (xy -4.445 2.54)
        )
        (stroke (width 0) (type default) (color 0 0 0 0))
        (fill (type none))
      )
      (polyline
        (pts
          (xy -2.54 1.27)
          (xy -1.27 1.27)
          (xy -0.635 0)
        )
        (stroke (width 0) (type default) (color 0 0 0 0))
        (fill (type none))
      )
      (polyline
        (pts
          (xy 2.54 1.27)
          (xy 1.27 1.27)
          (xy 0.635 2.54)
        )
        (stroke (width 0) (type default) (color 0 0 0 0))
        (fill (type none))
      )
      (polyline
        (pts
          (xy 2.54 1.27)
          (xy 3.81 1.27)
          (xy 4.445 0)
        )
        (stroke (width 0) (type default) (color 0 0 0 0))
        (fill (type none))
      )
      (polyline
        (pts
          (xy 7.62 1.27)
          (xy 6.35 1.27)
          (xy 5.715 2.54)
        )
        (stroke (width 0) (type default) (color 0 0 0 0))
        (fill (type none))
      )
      (polyline
        (pts
          (xy 7.62 1.27)
          (xy 8.89 1.27)
          (xy 9.525 0)
        )
        (stroke (width 0) (type default) (color 0 0 0 0))
        (fill (type none))
      )
      (polyline
        (pts
          (xy -8.89 -1.27)
          (xy -7.62 1.27)
          (xy -6.35 -1.27)
          (xy -8.89 -1.27)
        )
        (stroke (width 0) (type default) (color 0 0 0 0))
        (fill (type outline))
      )
      (polyline
        (pts
          (xy -3.81 -1.27)
          (xy -2.54 1.27)
          (xy -1.27 -1.27)
          (xy -3.81 -1.27)
        )
        (stroke (width 0) (type default) (color 0 0 0 0))
        (fill (type outline))
      )
      (polyline
        (pts
          (xy 1.27 -1.27)
          (xy 2.54 1.27)
          (xy 3.81 -1.27)
          (xy 1.27 -1.27)
        )
        (stroke (width 0) (type default) (color 0 0 0 0))
        (fill (type outline))
      )
      (polyline
        (pts
          (xy 6.35 -1.27)
          (xy 7.62 1.27)
          (xy 8.89 -1.27)
          (xy 6.35 -1.27)
        )
        (stroke (width 0) (type default) (color 0 0 0 0))
        (fill (type outline))
      )
    )
    (symbol "ESDS314_1_1"
      (pin passive line (at -7.62 16.51 270) (length 3.81)
        (name "IO1" (effects (font (size 1.27 1.27))))
        (number "1" (effects (font (size 1.27 1.27))))
      )
      (pin passive line (at 0 -16.51 90) (length 3.81)
        (name "GND" (effects (font (size 1.27 1.27))))
        (number "2" (effects (font (size 1.27 1.27))))
      )
      (pin passive line (at -2.54 16.51 270) (length 3.81)
        (name "IO2" (effects (font (size 1.27 1.27))))
        (number "3" (effects (font (size 1.27 1.27))))
      )
      (pin passive line (at 2.54 16.51 270) (length 3.81)
        (name "IO3" (effects (font (size 1.27 1.27))))
        (number "4" (effects (font (size 1.27 1.27))))
      )
      (pin passive line (at 7.62 16.51 270) (length 3.81)
        (name "IO4" (effects (font (size 1.27 1.27))))
        (number "5" (effects (font (size 1.27 1.27))))
      )
    )
  )
  (symbol "RClamp2502L" (pin_names (offset 1.016)) (in_bom yes) (on_board yes)
    (property "Reference" "U" (id 0) (at 13.97 16.51 0)
      (effects (font (size 1.27 1.27)))
    )
    (property "Value" "RClamp2502L" (id 1) (at 0 16.51 0)
      (effects (font (size 1.27 1.27)))
    )
    (property "Footprint" "Package_SO:SOIC-8_3.9x4.9mm_P1.27mm" (id 2) (at -1.27 22.86 0)
      (effects (font (size 1.27 1.27)) hide)
    )
    (property "Datasheet" "" (id 3) (at -1.27 22.86 0)
      (effects (font (size 1.27 1.27)) hide)
    )
    (property "Manufacturer" "Semtech Corporation" (id 4) (at 0 0 0)
      (effects (font (size 1.27 1.27)) hide)
    )
    (property "PartNumber" "RCLAMP2502L.TBT" (id 5) (at 0 0 0)
      (effects (font (size 1.27 1.27)) hide)
    )
    (property "ki_description" "TVS Diode 2.5V 20V" (id 6) (at 0 0 0)
      (effects (font (size 1.27 1.27)) hide)
    )
    (symbol "RClamp2502L_0_1"
      (rectangle (start -16.51 15.24) (end 16.51 -15.24)
        (stroke (width 0.2032) (type default) (color 0 0 0 0))
        (fill (type background))
      )
      (polyline
        (pts
          (xy -6.35 0)
          (xy -12.7 0)
        )
        (stroke (width 0.2032) (type default) (color 0 0 0 0))
        (fill (type none))
      )
      (polyline
        (pts
          (xy -2.54 -7.62)
          (xy -5.08 -10.16)
        )
        (stroke (width 0.2032) (type default) (color 0 0 0 0))
        (fill (type none))
      )
      (polyline
        (pts
          (xy 0 -12.7)
          (xy -16.51 -12.7)
        )
        (stroke (width 0.2032) (type default) (color 0 0 0 0))
        (fill (type none))
      )
      (polyline
        (pts
          (xy 0 -12.7)
          (xy 16.51 -12.7)
        )
        (stroke (width 0.2032) (type default) (color 0 0 0 0))
        (fill (type none))
      )
      (polyline
        (pts
          (xy 0 12.7)
          (xy -16.51 12.7)
        )
        (stroke (width 0.2032) (type default) (color 0 0 0 0))
        (fill (type none))
      )
      (polyline
        (pts
          (xy 0 12.7)
          (xy 16.51 12.7)
        )
        (stroke (width 0.2032) (type default) (color 0 0 0 0))
        (fill (type none))
      )
      (polyline
        (pts
          (xy 5.08 0)
          (xy 12.7 0)
        )
        (stroke (width 0.2032) (type default) (color 0 0 0 0))
        (fill (type none))
      )
      (polyline
        (pts
          (xy 6.35 -8.89)
          (xy 3.81 -6.35)
        )
        (stroke (width 0.2032) (type default) (color 0 0 0 0))
        (fill (type none))
      )
      (polyline
        (pts
          (xy 6.35 8.89)
          (xy 3.81 6.35)
        )
        (stroke (width 0.2032) (type default) (color 0 0 0 0))
        (fill (type none))
      )
      (polyline
        (pts
          (xy -16.51 3.81)
          (xy -13.97 3.81)
          (xy -13.97 1.27)
        )
        (stroke (width 0.2032) (type default) (color 0 0 0 0))
        (fill (type none))
      )
      (polyline
        (pts
          (xy -13.97 0)
          (xy -13.97 1.27)
          (xy -16.51 1.27)
        )
        (stroke (width 0.2032) (type default) (color 0 0 0 0))
        (fill (type none))
      )
      (polyline
        (pts
          (xy -3.81 8.89)
          (xy -2.54 7.62)
          (xy -5.08 10.16)
        )
        (stroke (width 0.2032) (type default) (color 0 0 0 0))
        (fill (type none))
      )
      (polyline
        (pts
          (xy 5.08 0)
          (xy 5.08 -2.54)
          (xy 6.35 -3.81)
        )
        (stroke (width 0.2032) (type default) (color 0 0 0 0))
        (fill (type none))
      )
      (polyline
        (pts
          (xy -3.81 -8.89)
          (xy -3.81 -6.35)
          (xy -6.35 -8.89)
          (xy -3.81 -8.89)
        )
        (stroke (width 0.2032) (type default) (color 0 0 0 0))
        (fill (type outline))
      )
      (polyline
        (pts
          (xy -3.81 8.89)
          (xy -3.81 6.35)
          (xy -6.35 8.89)
          (xy -3.81 8.89)
        )
        (stroke (width 0.2032) (type default) (color 0 0 0 0))
        (fill (type outline))
      )
      (polyline
        (pts
          (xy -2.54 0)
          (xy -1.27 1.27)
          (xy -1.27 -1.27)
          (xy -2.54 0)
        )
        (stroke (width 0.2032) (type default) (color 0 0 0 0))
        (fill (type outline))
      )
      (polyline
        (pts
          (xy -1.27 0)
          (xy 5.08 0)
          (xy 5.08 2.54)
          (xy 3.81 3.81)
        )
        (stroke (width 0.2032) (type default) (color 0 0 0 0))
        (fill (type none))
      )
      (polyline
        (pts
          (xy 5.08 -7.62)
          (xy 5.08 -10.16)
          (xy 2.54 -7.62)
          (xy 5.08 -7.62)
        )
        (stroke (width 0.2032) (type default) (color 0 0 0 0))
        (fill (type outline))
      )
      (polyline
        (pts
          (xy 5.08 0)
          (xy 1.27 -2.54)
          (xy 1.27 2.54)
          (xy 5.08 0)
        )
        (stroke (width 0.2032) (type default) (color 0 0 0 0))
        (fill (type outline))
      )
      (polyline
        (pts
          (xy 5.08 10.16)
          (xy 2.54 7.62)
          (xy 5.08 7.62)
          (xy 5.08 10.16)
        )
        (stroke (width 0.2032) (type default) (color 0 0 0 0))
        (fill (type outline))
      )
      (polyline
        (pts
          (xy -6.35 0)
          (xy -2.54 0)
          (xy -2.54 1.27)
          (xy -2.54 -1.27)
          (xy -2.54 0)
        )
        (stroke (width 0.2032) (type default) (color 0 0 0 0))
        (fill (type none))
      )
      (polyline
        (pts
          (xy 12.7 0)
          (xy 0 12.7)
          (xy -12.7 0)
          (xy 0 -12.7)
          (xy 12.7 0)
        )
        (stroke (width 0.2032) (type default) (color 0 0 0 0))
        (fill (type none))
      )
      (polyline
        (pts
          (xy -12.7 0)
          (xy -13.97 0)
          (xy -13.97 -3.81)
          (xy -16.51 -3.81)
          (xy -16.51 -1.27)
          (xy -13.97 -1.27)
        )
        (stroke (width 0.2032) (type default) (color 0 0 0 0))
        (fill (type none))
      )
    )
    (symbol "RClamp2502L_1_0"
      (pin passive line (at -19.05 12.7 0) (length 2.54)
        (name "P1" (effects (font (size 1.27 1.27))))
        (number "1" (effects (font (size 1.27 1.27))))
      )
      (pin unspecified line (at -19.05 3.81 0) (length 2.54)
        (name "P2" (effects (font (size 1.27 1.27))))
        (number "2" (effects (font (size 1.27 1.27))))
      )
      (pin unspecified line (at -19.05 1.27 0) (length 2.54)
        (name "P3" (effects (font (size 1.27 1.27))))
        (number "3" (effects (font (size 1.27 1.27))))
      )
      (pin passive line (at -19.05 -12.7 0) (length 2.54)
        (name "P4" (effects (font (size 1.27 1.27))))
        (number "4" (effects (font (size 1.27 1.27))))
      )
      (pin passive line (at 19.05 -12.7 180) (length 2.54)
        (name "P5" (effects (font (size 1.27 1.27))))
        (number "5" (effects (font (size 1.27 1.27))))
      )
      (pin unspecified line (at -19.05 -1.27 0) (length 2.54)
        (name "P6" (effects (font (size 1.27 1.27))))
        (number "6" (effects (font (size 1.27 1.27))))
      )
      (pin unspecified line (at -19.05 -3.81 0) (length 2.54)
        (name "P7" (effects (font (size 1.27 1.27))))
        (number "7" (effects (font (size 1.27 1.27))))
      )
      (pin passive line (at 19.05 12.7 180) (length 2.54)
        (name "P8" (effects (font (size 1.27 1.27))))
        (number "8" (effects (font (size 1.27 1.27))))
      )
    )
  )
  (symbol "TPD4S012" (pin_names (offset 1.016)) (in_bom yes) (on_board yes)
    (property "Reference" "U" (id 0) (at 17.78 15.24 0)
      (effects (font (size 1.27 1.27)))
    )
    (property "Value" "TPD4S012" (id 1) (at 0 15.24 0)
      (effects (font (size 1.27 1.27)))
    )
    (property "Footprint" "Package_SON:WSON-6_1.5x1.5mm_P0.5mm" (id 2) (at 0 20.32 0)
      (effects (font (size 1.27 1.27)) hide)
    )
    (property "Datasheet" "" (id 3) (at 0 20.32 0)
      (effects (font (size 1.27 1.27)) hide)
    )
    (property "Manufacturer" "Texas Instruments" (id 4) (at 0 0 0)
      (effects (font (size 1.27 1.27)) hide)
    )
    (property "PartNumber" "TPD4S012DRYR" (id 5) (at 0 0 0)
      (effects (font (size 1.27 1.27)) hide)
    )
    (property "ki_description" "4-Channel USB ESD Solution with Power Clamp" (id 6) (at 0 0 0)
      (effects (font (size 1.27 1.27)) hide)
    )
    (symbol "TPD4S012_0_1"
      (rectangle (start -25.4 13.97) (end 19.05 -13.97)
        (stroke (width 0) (type default) (color 0 0 0 0))
        (fill (type background))
      )
      (circle (center -16.51 -1.27) (radius 0.2794)
        (stroke (width 0) (type default) (color 0 0 0 0))
        (fill (type outline))
      )
      (circle (center -11.43 2.54) (radius 0.2794)
        (stroke (width 0) (type default) (color 0 0 0 0))
        (fill (type outline))
      )
      (circle (center -11.43 11.43) (radius 0.2794)
        (stroke (width 0) (type default) (color 0 0 0 0))
        (fill (type outline))
      )
      (circle (center -6.35 6.35) (radius 0.2794)
        (stroke (width 0) (type default) (color 0 0 0 0))
        (fill (type outline))
      )
      (circle (center -6.35 11.43) (radius 0.2794)
        (stroke (width 0) (type default) (color 0 0 0 0))
        (fill (type outline))
      )
      (polyline
        (pts
          (xy -16.51 -1.27)
          (xy -21.59 -1.27)
        )
        (stroke (width 0) (type default) (color 0 0 0 0))
        (fill (type none))
      )
      (polyline
        (pts
          (xy -11.43 2.54)
          (xy -21.59 2.54)
        )
        (stroke (width 0) (type default) (color 0 0 0 0))
        (fill (type none))
      )
      (polyline
        (pts
          (xy -10.16 -7.62)
          (xy 0 -7.62)
        )
        (stroke (width 0) (type default) (color 0 0 0 0))
        (fill (type none))
      )
      (polyline
        (pts
          (xy -6.35 6.35)
          (xy -21.59 6.35)
        )
        (stroke (width 0) (type default) (color 0 0 0 0))
        (fill (type none))
      )
      (polyline
        (pts
          (xy 0 -7.62)
          (xy 0 11.43)
        )
        (stroke (width 0) (type default) (color 0 0 0 0))
        (fill (type none))
      )
      (polyline
        (pts
          (xy -16.51 -3.81)
          (xy -16.51 -7.62)
          (xy -10.16 -7.62)
        )
        (stroke (width 0) (type default) (color 0 0 0 0))
        (fill (type none))
      )
      (polyline
        (pts
          (xy -16.51 3.81)
          (xy -16.51 11.43)
          (xy -11.43 11.43)
        )
        (stroke (width 0) (type default) (color 0 0 0 0))
        (fill (type none))
      )
      (polyline
        (pts
          (xy -11.43 0)
          (xy -11.43 -7.62)
          (xy -5.08 -7.62)
        )
        (stroke (width 0) (type default) (color 0 0 0 0))
        (fill (type none))
      )
      (polyline
        (pts
          (xy -11.43 7.62)
          (xy -11.43 11.43)
          (xy 0 11.43)
        )
        (stroke (width 0) (type default) (color 0 0 0 0))
        (fill (type none))
      )
      (polyline
        (pts
          (xy -6.35 3.81)
          (xy -6.35 -7.62)
          (xy 0 -7.62)
        )
        (stroke (width 0) (type default) (color 0 0 0 0))
        (fill (type none))
      )
      (polyline
        (pts
          (xy 0 2.54)
          (xy -1.27 2.54)
          (xy -2.54 3.81)
        )
        (stroke (width 0) (type default) (color 0 0 0 0))
        (fill (type none))
      )
      (polyline
        (pts
          (xy 0 2.54)
          (xy 1.27 2.54)
          (xy 2.54 1.27)
        )
        (stroke (width 0) (type default) (color 0 0 0 0))
        (fill (type none))
      )
      (polyline
        (pts
          (xy 11.43 1.27)
          (xy 11.43 -7.62)
          (xy 0 -7.62)
        )
        (stroke (width 0) (type default) (color 0 0 0 0))
        (fill (type none))
      )
      (polyline
        (pts
          (xy 11.43 2.54)
          (xy 10.16 2.54)
          (xy 8.89 3.81)
        )
        (stroke (width 0) (type default) (color 0 0 0 0))
        (fill (type none))
      )
      (polyline
        (pts
          (xy -16.51 -2.54)
          (xy -17.78 -3.81)
          (xy -15.24 -3.81)
          (xy -16.51 -2.54)
        )
        (stroke (width 0) (type default) (color 0 0 0 0))
        (fill (type outline))
      )
      (polyline
        (pts
          (xy -16.51 0)
          (xy -16.51 -2.54)
          (xy -15.24 -2.54)
          (xy -17.78 -2.54)
        )
        (stroke (width 0) (type default) (color 0 0 0 0))
        (fill (type none))
      )
      (polyline
        (pts
          (xy -16.51 1.27)
          (xy -17.78 0)
          (xy -15.24 0)
          (xy -16.51 1.27)
        )
        (stroke (width 0) (type default) (color 0 0 0 0))
        (fill (type outline))
      )
      (polyline
        (pts
          (xy -16.51 3.81)
          (xy -16.51 1.27)
          (xy -15.24 1.27)
          (xy -17.78 1.27)
        )
        (stroke (width 0) (type default) (color 0 0 0 0))
        (fill (type none))
      )
      (polyline
        (pts
          (xy -11.43 1.27)
          (xy -12.7 0)
          (xy -10.16 0)
          (xy -11.43 1.27)
        )
        (stroke (width 0) (type default) (color 0 0 0 0))
        (fill (type outline))
      )
      (polyline
        (pts
          (xy -11.43 3.81)
          (xy -11.43 1.27)
          (xy -10.16 1.27)
          (xy -12.7 1.27)
        )
        (stroke (width 0) (type default) (color 0 0 0 0))
        (fill (type none))
      )
      (polyline
        (pts
          (xy -11.43 5.08)
          (xy -12.7 3.81)
          (xy -10.16 3.81)
          (xy -11.43 5.08)
        )
        (stroke (width 0) (type default) (color 0 0 0 0))
        (fill (type outline))
      )
      (polyline
        (pts
          (xy -11.43 7.62)
          (xy -11.43 5.08)
          (xy -10.16 5.08)
          (xy -12.7 5.08)
        )
        (stroke (width 0) (type default) (color 0 0 0 0))
        (fill (type none))
      )
      (polyline
        (pts
          (xy -6.35 5.08)
          (xy -7.62 3.81)
          (xy -5.08 3.81)
          (xy -6.35 5.08)
        )
        (stroke (width 0) (type default) (color 0 0 0 0))
        (fill (type outline))
      )
      (polyline
        (pts
          (xy -6.35 7.62)
          (xy -6.35 5.08)
          (xy -5.08 5.08)
          (xy -7.62 5.08)
        )
        (stroke (width 0) (type default) (color 0 0 0 0))
        (fill (type none))
      )
      (polyline
        (pts
          (xy -6.35 8.89)
          (xy -7.62 7.62)
          (xy -5.08 7.62)
          (xy -6.35 8.89)
        )
        (stroke (width 0) (type default) (color 0 0 0 0))
        (fill (type outline))
      )
      (polyline
        (pts
          (xy -6.35 11.43)
          (xy -6.35 8.89)
          (xy -5.08 8.89)
          (xy -7.62 8.89)
        )
        (stroke (width 0) (type default) (color 0 0 0 0))
        (fill (type none))
      )
      (polyline
        (pts
          (xy 0 2.54)
          (xy -1.27 1.27)
          (xy 1.27 1.27)
          (xy 0 2.54)
        )
        (stroke (width 0) (type default) (color 0 0 0 0))
        (fill (type outline))
      )
      (polyline
        (pts
          (xy 11.43 2.54)
          (xy 12.7 1.27)
          (xy 10.16 1.27)
          (xy 11.43 2.54)
        )
        (stroke (width 0) (type default) (color 0 0 0 0))
        (fill (type outline))
      )
      (polyline
        (pts
          (xy 11.43 6.35)
          (xy 11.43 2.54)
          (xy 12.7 2.54)
          (xy 13.97 1.27)
        )
        (stroke (width 0) (type default) (color 0 0 0 0))
        (fill (type none))
      )
    )
    (symbol "TPD4S012_1_1"
      (pin passive line (at -29.21 6.35 0) (length 3.81)
        (name "DP" (effects (font (size 1.27 1.27))))
        (number "1" (effects (font (size 1.27 1.27))))
      )
      (pin passive line (at -29.21 2.54 0) (length 3.81)
        (name "DN" (effects (font (size 1.27 1.27))))
        (number "2" (effects (font (size 1.27 1.27))))
      )
      (pin passive line (at -29.21 -1.27 0) (length 3.81)
        (name "ID" (effects (font (size 1.27 1.27))))
        (number "3" (effects (font (size 1.27 1.27))))
      )
      (pin passive line (at 0 -17.78 90) (length 3.81)
        (name "GND" (effects (font (size 1.27 1.27))))
        (number "4" (effects (font (size 1.27 1.27))))
      )
      (pin passive line (at 22.86 6.35 180) (length 3.81)
        (name "VBUS" (effects (font (size 1.27 1.27))))
        (number "6" (effects (font (size 1.27 1.27))))
      )
    )
  )
  (symbol "TPD6E004" (pin_names (offset 1.016)) (in_bom yes) (on_board yes)
    (property "Reference" "U" (id 0) (at 17.78 19.05 0)
      (effects (font (size 1.27 1.27)))
    )
    (property "Value" "TPD6E004" (id 1) (at -15.24 19.05 0)
      (effects (font (size 1.27 1.27)))
    )
    (property "Footprint" "POWDER_ESD:TPD6E004_RSE_8" (id 2) (at -19.05 29.21 0)
      (effects (font (size 1.27 1.27)) hide)
    )
    (property "Datasheet" "" (id 3) (at -17.78 21.59 0)
      (effects (font (size 1.27 1.27)) hide)
    )
    (property "Manufacturer" "Texas Instruments" (id 4) (at 0 0 0)
      (effects (font (size 1.27 1.27)) hide)
    )
    (property "PartNumber" "TPD6E004RSER" (id 5) (at 0 0 0)
      (effects (font (size 1.27 1.27)) hide)
    )
    (property "ki_description" "DO NOT USE!!! Low-Capacitance 6-Channel +/-15 kV ESD Protection Array for High-Speed Data Interfaces" (id 6) (at 0 0 0)
      (effects (font (size 1.27 1.27)) hide)
    )
    (symbol "TPD6E004_0_1"
      (rectangle (start -20.32 17.78) (end 20.32 -17.78)
        (stroke (width 0) (type default) (color 0 0 0 0))
        (fill (type background))
      )
      (polyline
        (pts
          (xy -15.24 0)
          (xy -10.16 0)
        )
        (stroke (width 0) (type default) (color 0 0 0 0))
        (fill (type none))
      )
      (polyline
        (pts
          (xy -15.24 3.81)
          (xy -6.35 3.81)
        )
        (stroke (width 0) (type default) (color 0 0 0 0))
        (fill (type none))
      )
      (polyline
        (pts
          (xy -13.97 -3.81)
          (xy -15.24 -3.81)
        )
        (stroke (width 0) (type default) (color 0 0 0 0))
        (fill (type none))
      )
      (polyline
        (pts
          (xy -10.16 -5.08)
          (xy -10.16 -8.89)
        )
        (stroke (width 0) (type default) (color 0 0 0 0))
        (fill (type none))
      )
      (polyline
        (pts
          (xy -10.16 5.08)
          (xy -10.16 8.89)
        )
        (stroke (width 0) (type default) (color 0 0 0 0))
        (fill (type none))
      )
      (polyline
        (pts
          (xy -6.35 -1.27)
          (xy -6.35 -8.89)
        )
        (stroke (width 0) (type default) (color 0 0 0 0))
        (fill (type none))
      )
      (polyline
        (pts
          (xy -1.27 0)
          (xy -2.54 1.27)
        )
        (stroke (width 0) (type default) (color 0 0 0 0))
        (fill (type none))
      )
      (polyline
        (pts
          (xy -1.27 0)
          (xy 1.27 0)
        )
        (stroke (width 0) (type default) (color 0 0 0 0))
        (fill (type none))
      )
      (polyline
        (pts
          (xy 0 -11.43)
          (xy 0 -1.27)
        )
        (stroke (width 0) (type default) (color 0 0 0 0))
        (fill (type none))
      )
      (polyline
        (pts
          (xy 0 -8.89)
          (xy -13.97 -8.89)
        )
        (stroke (width 0) (type default) (color 0 0 0 0))
        (fill (type none))
      )
      (polyline
        (pts
          (xy 0 0)
          (xy 0 8.89)
        )
        (stroke (width 0) (type default) (color 0 0 0 0))
        (fill (type none))
      )
      (polyline
        (pts
          (xy 0 8.89)
          (xy 0 11.43)
        )
        (stroke (width 0) (type default) (color 0 0 0 0))
        (fill (type none))
      )
      (polyline
        (pts
          (xy 0 8.89)
          (xy 13.97 8.89)
        )
        (stroke (width 0) (type default) (color 0 0 0 0))
        (fill (type none))
      )
      (polyline
        (pts
          (xy 1.27 0)
          (xy 2.54 -1.27)
        )
        (stroke (width 0) (type default) (color 0 0 0 0))
        (fill (type none))
      )
      (polyline
        (pts
          (xy 6.35 -8.89)
          (xy 0 -8.89)
        )
        (stroke (width 0) (type default) (color 0 0 0 0))
        (fill (type none))
      )
      (polyline
        (pts
          (xy 6.35 1.27)
          (xy 6.35 8.89)
        )
        (stroke (width 0) (type default) (color 0 0 0 0))
        (fill (type none))
      )
      (polyline
        (pts
          (xy 10.16 -5.08)
          (xy 10.16 -8.89)
        )
        (stroke (width 0) (type default) (color 0 0 0 0))
        (fill (type none))
      )
      (polyline
        (pts
          (xy 10.16 0)
          (xy 15.24 0)
        )
        (stroke (width 0) (type default) (color 0 0 0 0))
        (fill (type none))
      )
      (polyline
        (pts
          (xy 10.16 5.08)
          (xy 10.16 8.89)
        )
        (stroke (width 0) (type default) (color 0 0 0 0))
        (fill (type none))
      )
      (polyline
        (pts
          (xy 15.24 -3.81)
          (xy 6.35 -3.81)
        )
        (stroke (width 0) (type default) (color 0 0 0 0))
        (fill (type none))
      )
      (polyline
        (pts
          (xy 15.24 3.81)
          (xy 13.97 3.81)
        )
        (stroke (width 0) (type default) (color 0 0 0 0))
        (fill (type none))
      )
      (polyline
        (pts
          (xy -13.97 1.27)
          (xy -13.97 8.89)
          (xy 0 8.89)
        )
        (stroke (width 0) (type default) (color 0 0 0 0))
        (fill (type none))
      )
      (polyline
        (pts
          (xy 6.35 -8.89)
          (xy 13.97 -8.89)
          (xy 13.97 -1.27)
        )
        (stroke (width 0) (type default) (color 0 0 0 0))
        (fill (type none))
      )
      (polyline
        (pts
          (xy -1.27 -1.27)
          (xy 1.27 -1.27)
          (xy 0 0)
          (xy -1.27 -1.27)
        )
        (stroke (width 0) (type default) (color 0 0 0 0))
        (fill (type outline))
      )
      (polyline
        (pts
          (xy -6.35 8.89)
          (xy -6.35 6.35)
          (xy -5.08 6.35)
          (xy -7.62 6.35)
          (xy -6.35 6.35)
          (xy -7.62 5.08)
          (xy -5.08 5.08)
          (xy -6.35 6.35)
          (xy -6.35 2.54)
        )
        (stroke (width 0) (type default) (color 0 0 0 0))
        (fill (type outline))
      )
    )
    (symbol "TPD6E004_1_1"
      (circle (center -13.97 -3.81) (radius 0.254)
        (stroke (width 0) (type default) (color 0 0 0 0))
        (fill (type outline))
      )
      (circle (center -10.16 -8.89) (radius 0.254)
        (stroke (width 0) (type default) (color 0 0 0 0))
        (fill (type outline))
      )
      (circle (center -10.16 0) (radius 0.254)
        (stroke (width 0) (type default) (color 0 0 0 0))
        (fill (type outline))
      )
      (circle (center -10.16 8.89) (radius 0.254)
        (stroke (width 0) (type default) (color 0 0 0 0))
        (fill (type outline))
      )
      (circle (center -6.35 -8.89) (radius 0.254)
        (stroke (width 0) (type default) (color 0 0 0 0))
        (fill (type outline))
      )
      (circle (center -6.35 3.81) (radius 0.254)
        (stroke (width 0) (type default) (color 0 0 0 0))
        (fill (type outline))
      )
      (circle (center -6.35 8.89) (radius 0.254)
        (stroke (width 0) (type default) (color 0 0 0 0))
        (fill (type outline))
      )
      (circle (center 0 -8.89) (radius 0.254)
        (stroke (width 0) (type default) (color 0 0 0 0))
        (fill (type outline))
      )
      (polyline
        (pts
          (xy -13.97 -2.54)
          (xy -13.97 -5.08)
          (xy -12.7 -5.08)
          (xy -15.24 -5.08)
          (xy -13.97 -5.08)
          (xy -15.24 -6.35)
          (xy -12.7 -6.35)
          (xy -13.97 -5.08)
          (xy -13.97 -8.89)
        )
        (stroke (width 0) (type default) (color 0 0 0 0))
        (fill (type outline))
      )
      (polyline
        (pts
          (xy -13.97 1.27)
          (xy -13.97 -1.27)
          (xy -12.7 -1.27)
          (xy -15.24 -1.27)
          (xy -13.97 -1.27)
          (xy -15.24 -2.54)
          (xy -12.7 -2.54)
          (xy -13.97 -1.27)
          (xy -13.97 -5.08)
        )
        (stroke (width 0) (type default) (color 0 0 0 0))
        (fill (type outline))
      )
      (polyline
        (pts
          (xy -10.16 1.27)
          (xy -10.16 -1.27)
          (xy -8.89 -1.27)
          (xy -11.43 -1.27)
          (xy -10.16 -1.27)
          (xy -11.43 -2.54)
          (xy -8.89 -2.54)
          (xy -10.16 -1.27)
          (xy -10.16 -5.08)
        )
        (stroke (width 0) (type default) (color 0 0 0 0))
        (fill (type outline))
      )
      (polyline
        (pts
          (xy -10.16 5.08)
          (xy -10.16 2.54)
          (xy -8.89 2.54)
          (xy -11.43 2.54)
          (xy -10.16 2.54)
          (xy -11.43 1.27)
          (xy -8.89 1.27)
          (xy -10.16 2.54)
          (xy -10.16 -1.27)
        )
        (stroke (width 0) (type default) (color 0 0 0 0))
        (fill (type outline))
      )
      (polyline
        (pts
          (xy -6.35 5.08)
          (xy -6.35 2.54)
          (xy -5.08 2.54)
          (xy -7.62 2.54)
          (xy -6.35 2.54)
          (xy -7.62 1.27)
          (xy -5.08 1.27)
          (xy -6.35 2.54)
          (xy -6.35 -1.27)
        )
        (stroke (width 0) (type default) (color 0 0 0 0))
        (fill (type outline))
      )
      (polyline
        (pts
          (xy 6.35 -2.54)
          (xy 6.35 -5.08)
          (xy 7.62 -5.08)
          (xy 5.08 -5.08)
          (xy 6.35 -5.08)
          (xy 5.08 -6.35)
          (xy 7.62 -6.35)
          (xy 6.35 -5.08)
          (xy 6.35 -8.89)
        )
        (stroke (width 0) (type default) (color 0 0 0 0))
        (fill (type outline))
      )
      (polyline
        (pts
          (xy 6.35 1.27)
          (xy 6.35 -1.27)
          (xy 7.62 -1.27)
          (xy 5.08 -1.27)
          (xy 6.35 -1.27)
          (xy 5.08 -2.54)
          (xy 7.62 -2.54)
          (xy 6.35 -1.27)
          (xy 6.35 -5.08)
        )
        (stroke (width 0) (type default) (color 0 0 0 0))
        (fill (type outline))
      )
      (polyline
        (pts
          (xy 10.16 1.27)
          (xy 10.16 -1.27)
          (xy 11.43 -1.27)
          (xy 8.89 -1.27)
          (xy 10.16 -1.27)
          (xy 8.89 -2.54)
          (xy 11.43 -2.54)
          (xy 10.16 -1.27)
          (xy 10.16 -5.08)
        )
        (stroke (width 0) (type default) (color 0 0 0 0))
        (fill (type outline))
      )
      (polyline
        (pts
          (xy 10.16 5.08)
          (xy 10.16 2.54)
          (xy 11.43 2.54)
          (xy 8.89 2.54)
          (xy 10.16 2.54)
          (xy 8.89 1.27)
          (xy 11.43 1.27)
          (xy 10.16 2.54)
          (xy 10.16 -1.27)
        )
        (stroke (width 0) (type default) (color 0 0 0 0))
        (fill (type outline))
      )
      (polyline
        (pts
          (xy 13.97 5.08)
          (xy 13.97 2.54)
          (xy 15.24 2.54)
          (xy 12.7 2.54)
          (xy 13.97 2.54)
          (xy 12.7 1.27)
          (xy 15.24 1.27)
          (xy 13.97 2.54)
          (xy 13.97 -1.27)
        )
        (stroke (width 0) (type default) (color 0 0 0 0))
        (fill (type outline))
      )
      (polyline
        (pts
          (xy 13.97 8.89)
          (xy 13.97 6.35)
          (xy 15.24 6.35)
          (xy 12.7 6.35)
          (xy 13.97 6.35)
          (xy 12.7 5.08)
          (xy 15.24 5.08)
          (xy 13.97 6.35)
          (xy 13.97 2.54)
        )
        (stroke (width 0) (type default) (color 0 0 0 0))
        (fill (type outline))
      )
      (circle (center 0 8.89) (radius 0.254)
        (stroke (width 0) (type default) (color 0 0 0 0))
        (fill (type outline))
      )
      (circle (center 6.35 -8.89) (radius 0.254)
        (stroke (width 0) (type default) (color 0 0 0 0))
        (fill (type outline))
      )
      (circle (center 6.35 -3.81) (radius 0.254)
        (stroke (width 0) (type default) (color 0 0 0 0))
        (fill (type outline))
      )
      (circle (center 6.35 8.89) (radius 0.254)
        (stroke (width 0) (type default) (color 0 0 0 0))
        (fill (type outline))
      )
      (circle (center 10.16 -8.89) (radius 0.254)
        (stroke (width 0) (type default) (color 0 0 0 0))
        (fill (type outline))
      )
      (circle (center 10.16 0) (radius 0.254)
        (stroke (width 0) (type default) (color 0 0 0 0))
        (fill (type outline))
      )
      (circle (center 10.16 8.89) (radius 0.254)
        (stroke (width 0) (type default) (color 0 0 0 0))
        (fill (type outline))
      )
      (circle (center 13.97 3.81) (radius 0.254)
        (stroke (width 0) (type default) (color 0 0 0 0))
        (fill (type outline))
      )
      (pin passive line (at -24.13 3.81 0) (length 3.81)
        (name "IO1" (effects (font (size 1.27 1.27))))
        (number "1" (effects (font (size 1.27 1.27))))
      )
      (pin passive line (at -24.13 0 0) (length 3.81)
        (name "IO2" (effects (font (size 1.27 1.27))))
        (number "2" (effects (font (size 1.27 1.27))))
      )
      (pin passive line (at -24.13 -3.81 0) (length 3.81)
        (name "IO3" (effects (font (size 1.27 1.27))))
        (number "3" (effects (font (size 1.27 1.27))))
      )
      (pin passive line (at 0 -21.59 90) (length 3.81)
        (name "GND" (effects (font (size 1.27 1.27))))
        (number "4" (effects (font (size 1.27 1.27))))
      )
      (pin passive line (at 24.13 -3.81 180) (length 3.81)
        (name "IO4" (effects (font (size 1.27 1.27))))
        (number "5" (effects (font (size 1.27 1.27))))
      )
      (pin passive line (at 24.13 0 180) (length 3.81)
        (name "IO5" (effects (font (size 1.27 1.27))))
        (number "6" (effects (font (size 1.27 1.27))))
      )
      (pin passive line (at 24.13 3.81 180) (length 3.81)
        (name "IO6" (effects (font (size 1.27 1.27))))
        (number "7" (effects (font (size 1.27 1.27))))
      )
      (pin passive line (at 0 21.59 270) (length 3.81)
        (name "VCC" (effects (font (size 1.27 1.27))))
        (number "8" (effects (font (size 1.27 1.27))))
      )
    )
  )
)
