(module SKY66288-11 (layer F.Cu) (tedit 5DBB50FB)
  (attr smd)
  (fp_text reference REF** (at 0 -3.81) (layer F.SilkS)
    (effects (font (size 1 1) (thickness 0.15)))
  )
  (fp_text value SKY66288-11 (at 0 3.81) (layer F.Fab)
    (effects (font (size 1 1) (thickness 0.15)))
  )
  (fp_line (start 2.625 -2.625) (end 2.125 -2.625) (layer F.SilkS) (width 0.15))
  (fp_line (start 2.625 -2.625) (end 2.625 -2.125) (layer F.SilkS) (width 0.15))
  (fp_line (start 2.125 2.625) (end 2.625 2.625) (layer F.SilkS) (width 0.15))
  (fp_line (start 2.625 2.625) (end 2.625 2.125) (layer F.SilkS) (width 0.15))
  (fp_line (start -2.125 2.625) (end -2.625 2.625) (layer F.SilkS) (width 0.15))
  (fp_line (start -2.625 2.625) (end -2.625 2.125) (layer F.SilkS) (width 0.15))
  (fp_line (start -2.625 -2.125) (end -2.125 -2.625) (layer F.SilkS) (width 0.15))
  (fp_poly (pts (xy -0.4375 -0.4375) (xy 0.4375 -0.4375) (xy 0.4375 0.4375) (xy -0.4375 0.4375)) (layer F.Paste) (width 0))
  (fp_poly (pts (xy 0.5625 -1.4375) (xy 1.4375 -1.4375) (xy 1.4375 -0.5625) (xy 0.5625 -0.5625)) (layer F.Paste) (width 0))
  (fp_poly (pts (xy -0.4375 -1.4375) (xy 0.4375 -1.4375) (xy 0.4375 -0.5625) (xy -0.4375 -0.5625)) (layer F.Paste) (width 0))
  (fp_poly (pts (xy -1.4375 -1.4375) (xy -0.5625 -1.4375) (xy -0.5625 -0.5625) (xy -1.4375 -0.5625)) (layer F.Paste) (width 0))
  (fp_poly (pts (xy -1.4375 -0.4375) (xy -0.5625 -0.4375) (xy -0.5625 0.4375) (xy -1.4375 0.4375)) (layer F.Paste) (width 0))
  (fp_poly (pts (xy -1.4375 0.5625) (xy -0.5625 0.5625) (xy -0.5625 1.4375) (xy -1.4375 1.4375)) (layer F.Paste) (width 0))
  (fp_poly (pts (xy -0.4375 0.5625) (xy 0.4375 0.5625) (xy 0.4375 1.4375) (xy -0.4375 1.4375)) (layer F.Paste) (width 0))
  (fp_poly (pts (xy 0.5625 0.5625) (xy 1.4375 0.5625) (xy 1.4375 1.4375) (xy 0.5625 1.4375)) (layer F.Paste) (width 0))
  (fp_poly (pts (xy 0.5625 -0.4375) (xy 1.4375 -0.4375) (xy 1.4375 0.4375) (xy 0.5625 0.4375)) (layer F.Paste) (width 0))
  (fp_line (start -2.5 -1.5) (end -2.5 2.5) (layer F.Fab) (width 0.1))
  (fp_line (start -2.5 2.5) (end 2.5 2.5) (layer F.Fab) (width 0.1))
  (fp_line (start 2.5 2.5) (end 2.5 -2.5) (layer F.Fab) (width 0.1))
  (fp_line (start 2.5 -2.5) (end -1.5 -2.5) (layer F.Fab) (width 0.1))
  (fp_line (start -1.5 -2.5) (end -2.5 -1.5) (layer F.Fab) (width 0.1))
  (fp_line (start 2.9 2.9) (end 2.9 -2.9) (layer F.CrtYd) (width 0.05))
  (fp_line (start 2.9 -2.9) (end -2.9 -2.9) (layer F.CrtYd) (width 0.05))
  (fp_line (start -2.9 -2.9) (end -2.9 2.9) (layer F.CrtYd) (width 0.05))
  (fp_line (start -2.9 2.9) (end 2.9 2.9) (layer F.CrtYd) (width 0.05))
  (pad 1 smd rect (at -2.315 -1.2) (size 0.67 0.5) (layers F.Cu F.Paste F.Mask)
    (solder_mask_margin 0.05))
  (pad 2 smd rect (at -2.315 -0.4) (size 0.67 0.5) (layers F.Cu F.Paste F.Mask)
    (solder_mask_margin 0.05))
  (pad 3 smd rect (at -2.315 0.4) (size 0.67 0.5) (layers F.Cu F.Paste F.Mask)
    (solder_mask_margin 0.05))
  (pad 4 smd rect (at -2.315 1.2) (size 0.67 0.5) (layers F.Cu F.Paste F.Mask)
    (solder_mask_margin 0.05))
  (pad 9 smd rect (at 2.315 1.2) (size 0.67 0.5) (layers F.Cu F.Paste F.Mask)
    (solder_mask_margin 0.05))
  (pad 10 smd rect (at 2.315 0.4) (size 0.67 0.5) (layers F.Cu F.Paste F.Mask)
    (solder_mask_margin 0.05))
  (pad 11 smd rect (at 2.315 -0.4) (size 0.67 0.5) (layers F.Cu F.Paste F.Mask)
    (solder_mask_margin 0.05))
  (pad 12 smd rect (at 2.315 -1.2) (size 0.67 0.5) (layers F.Cu F.Paste F.Mask)
    (solder_mask_margin 0.05))
  (pad 5 smd rect (at -1.2 2.315) (size 0.5 0.67) (layers F.Cu F.Paste F.Mask)
    (solder_mask_margin 0.05))
  (pad 6 smd rect (at -0.4 2.315) (size 0.5 0.67) (layers F.Cu F.Paste F.Mask)
    (solder_mask_margin 0.05))
  (pad 7 smd rect (at 0.4 2.315) (size 0.5 0.67) (layers F.Cu F.Paste F.Mask)
    (solder_mask_margin 0.05))
  (pad 8 smd rect (at 1.2 2.315) (size 0.5 0.67) (layers F.Cu F.Paste F.Mask)
    (solder_mask_margin 0.05))
  (pad 13 smd rect (at 1.2 -2.315) (size 0.5 0.67) (layers F.Cu F.Paste F.Mask)
    (solder_mask_margin 0.05))
  (pad 14 smd rect (at 0.4 -2.315) (size 0.5 0.67) (layers F.Cu F.Paste F.Mask)
    (solder_mask_margin 0.05))
  (pad 15 smd rect (at -0.4 -2.315) (size 0.5 0.67) (layers F.Cu F.Paste F.Mask)
    (solder_mask_margin 0.05))
  (pad 16 smd rect (at -1.2 -2.315) (size 0.5 0.67) (layers F.Cu F.Paste F.Mask)
    (solder_mask_margin 0.05))
  (pad 17 smd rect (at 0 0) (size 3.46 3.46) (layers F.Cu F.Mask)
    (solder_mask_margin -0.2925))
)
