(module Fiducial_1.2mm_Mask2.5mm (layer F.Cu) (tedit 5E3CA190)
  (descr "Circular Fiducial, 1mm bare copper, 2mm soldermask opening (Level A)")
  (tags fiducial)
  (attr smd)
  (fp_text reference REF** (at 0 -2.25) (layer F.SilkS)
    (effects (font (size 1 1) (thickness 0.15)))
  )
  (fp_text value Fiducial_1.2mm_Mask2.5mm (at 0 2.25) (layer F.Fab)
    (effects (font (size 1 1) (thickness 0.15)))
  )
  (fp_circle (center 0 0) (end 1 0) (layer F.Fab) (width 0.1))
  (fp_text user %R (at 0 0) (layer F.Fab)
    (effects (font (size 0.4 0.4) (thickness 0.06)))
  )
  (fp_circle (center 0 0) (end 1.5 0) (layer F.CrtYd) (width 0.05))
  (pad "" smd circle (at 0 0) (size 1.2 1.2) (layers F.Cu F.Mask)
    (solder_mask_margin 0.65) (clearance 0.65))
)
