(module TVSOP-56 (layer F.Cu) (tedit 5E292F41)
  (attr smd)
  (fp_text reference REF** (at -7 0 90) (layer F.SilkS)
    (effects (font (size 1 1) (thickness 0.15)))
  )
  (fp_text value TVSOP-56 (at 0 0) (layer F.Fab)
    (effects (font (size 1 1) (thickness 0.15)))
  )
  (fp_line (start -5.2 4.15) (end -6 3.35) (layer F.SilkS) (width 0.12))
  (fp_line (start -6 3.35) (end -6 -4.15) (layer F.SilkS) (width 0.12))
  (fp_line (start -6 -4.15) (end 6 -4.15) (layer F.SilkS) (width 0.12))
  (fp_line (start 6 -4.15) (end 6 4.15) (layer F.SilkS) (width 0.12))
  (fp_line (start 6 4.15) (end -5.2 4.15) (layer F.SilkS) (width 0.12))
  (fp_line (start -5.75 -3.9) (end 5.75 -3.9) (layer F.CrtYd) (width 0.05))
  (fp_line (start 5.75 -3.9) (end 5.75 3.9) (layer F.CrtYd) (width 0.05))
  (fp_line (start 5.75 3.9) (end -5.75 3.9) (layer F.CrtYd) (width 0.05))
  (fp_line (start -5.75 3.9) (end -5.75 -3.9) (layer F.CrtYd) (width 0.05))
  (fp_line (start 5.65 2.2) (end 5.65 -2.2) (layer F.Fab) (width 0.1))
  (fp_line (start 5.65 -2.2) (end -5.65 -2.2) (layer F.Fab) (width 0.1))
  (fp_line (start -5.65 -2.2) (end -5.65 1.2) (layer F.Fab) (width 0.1))
  (fp_line (start -4.65 2.2) (end 5.65 2.2) (layer F.Fab) (width 0.1))
  (fp_line (start -5.65 1.2) (end -4.65 2.2) (layer F.Fab) (width 0.1))
  (pad 56 smd rect (at -5.4 -2.9) (size 0.2 1.5) (layers F.Cu F.Paste F.Mask))
  (pad 1 smd rect (at -5.4 2.9) (size 0.2 1.5) (layers F.Cu F.Paste F.Mask))
  (pad 55 smd rect (at -5 -2.9) (size 0.2 1.5) (layers F.Cu F.Paste F.Mask))
  (pad 2 smd rect (at -5 2.9) (size 0.2 1.5) (layers F.Cu F.Paste F.Mask))
  (pad 54 smd rect (at -4.6 -2.9) (size 0.2 1.5) (layers F.Cu F.Paste F.Mask))
  (pad 3 smd rect (at -4.6 2.9) (size 0.2 1.5) (layers F.Cu F.Paste F.Mask))
  (pad 53 smd rect (at -4.2 -2.9) (size 0.2 1.5) (layers F.Cu F.Paste F.Mask))
  (pad 4 smd rect (at -4.2 2.9) (size 0.2 1.5) (layers F.Cu F.Paste F.Mask))
  (pad 52 smd rect (at -3.8 -2.9) (size 0.2 1.5) (layers F.Cu F.Paste F.Mask))
  (pad 5 smd rect (at -3.8 2.9) (size 0.2 1.5) (layers F.Cu F.Paste F.Mask))
  (pad 51 smd rect (at -3.4 -2.9) (size 0.2 1.5) (layers F.Cu F.Paste F.Mask))
  (pad 6 smd rect (at -3.4 2.9) (size 0.2 1.5) (layers F.Cu F.Paste F.Mask))
  (pad 50 smd rect (at -3 -2.9) (size 0.2 1.5) (layers F.Cu F.Paste F.Mask))
  (pad 7 smd rect (at -3 2.9) (size 0.2 1.5) (layers F.Cu F.Paste F.Mask))
  (pad 49 smd rect (at -2.6 -2.9) (size 0.2 1.5) (layers F.Cu F.Paste F.Mask))
  (pad 8 smd rect (at -2.6 2.9) (size 0.2 1.5) (layers F.Cu F.Paste F.Mask))
  (pad 48 smd rect (at -2.2 -2.9) (size 0.2 1.5) (layers F.Cu F.Paste F.Mask))
  (pad 9 smd rect (at -2.2 2.9) (size 0.2 1.5) (layers F.Cu F.Paste F.Mask))
  (pad 47 smd rect (at -1.8 -2.9) (size 0.2 1.5) (layers F.Cu F.Paste F.Mask))
  (pad 10 smd rect (at -1.8 2.9) (size 0.2 1.5) (layers F.Cu F.Paste F.Mask))
  (pad 46 smd rect (at -1.4 -2.9) (size 0.2 1.5) (layers F.Cu F.Paste F.Mask))
  (pad 11 smd rect (at -1.4 2.9) (size 0.2 1.5) (layers F.Cu F.Paste F.Mask))
  (pad 45 smd rect (at -1 -2.9) (size 0.2 1.5) (layers F.Cu F.Paste F.Mask))
  (pad 12 smd rect (at -1 2.9) (size 0.2 1.5) (layers F.Cu F.Paste F.Mask))
  (pad 44 smd rect (at -0.6 -2.9) (size 0.2 1.5) (layers F.Cu F.Paste F.Mask))
  (pad 13 smd rect (at -0.6 2.9) (size 0.2 1.5) (layers F.Cu F.Paste F.Mask))
  (pad 43 smd rect (at -0.2 -2.9) (size 0.2 1.5) (layers F.Cu F.Paste F.Mask))
  (pad 14 smd rect (at -0.2 2.9) (size 0.2 1.5) (layers F.Cu F.Paste F.Mask))
  (pad 42 smd rect (at 0.2 -2.9) (size 0.2 1.5) (layers F.Cu F.Paste F.Mask))
  (pad 15 smd rect (at 0.2 2.9) (size 0.2 1.5) (layers F.Cu F.Paste F.Mask))
  (pad 41 smd rect (at 0.6 -2.9) (size 0.2 1.5) (layers F.Cu F.Paste F.Mask))
  (pad 16 smd rect (at 0.6 2.9) (size 0.2 1.5) (layers F.Cu F.Paste F.Mask))
  (pad 40 smd rect (at 1 -2.9) (size 0.2 1.5) (layers F.Cu F.Paste F.Mask))
  (pad 17 smd rect (at 1 2.9) (size 0.2 1.5) (layers F.Cu F.Paste F.Mask))
  (pad 39 smd rect (at 1.4 -2.9) (size 0.2 1.5) (layers F.Cu F.Paste F.Mask))
  (pad 18 smd rect (at 1.4 2.9) (size 0.2 1.5) (layers F.Cu F.Paste F.Mask))
  (pad 38 smd rect (at 1.8 -2.9) (size 0.2 1.5) (layers F.Cu F.Paste F.Mask))
  (pad 19 smd rect (at 1.8 2.9) (size 0.2 1.5) (layers F.Cu F.Paste F.Mask))
  (pad 37 smd rect (at 2.2 -2.9) (size 0.2 1.5) (layers F.Cu F.Paste F.Mask))
  (pad 20 smd rect (at 2.2 2.9) (size 0.2 1.5) (layers F.Cu F.Paste F.Mask))
  (pad 36 smd rect (at 2.6 -2.9) (size 0.2 1.5) (layers F.Cu F.Paste F.Mask))
  (pad 21 smd rect (at 2.6 2.9) (size 0.2 1.5) (layers F.Cu F.Paste F.Mask))
  (pad 35 smd rect (at 3 -2.9) (size 0.2 1.5) (layers F.Cu F.Paste F.Mask))
  (pad 22 smd rect (at 3 2.9) (size 0.2 1.5) (layers F.Cu F.Paste F.Mask))
  (pad 34 smd rect (at 3.4 -2.9) (size 0.2 1.5) (layers F.Cu F.Paste F.Mask))
  (pad 23 smd rect (at 3.4 2.9) (size 0.2 1.5) (layers F.Cu F.Paste F.Mask))
  (pad 33 smd rect (at 3.8 -2.9) (size 0.2 1.5) (layers F.Cu F.Paste F.Mask))
  (pad 24 smd rect (at 3.8 2.9) (size 0.2 1.5) (layers F.Cu F.Paste F.Mask))
  (pad 32 smd rect (at 4.2 -2.9) (size 0.2 1.5) (layers F.Cu F.Paste F.Mask))
  (pad 25 smd rect (at 4.2 2.9) (size 0.2 1.5) (layers F.Cu F.Paste F.Mask))
  (pad 31 smd rect (at 4.6 -2.9) (size 0.2 1.5) (layers F.Cu F.Paste F.Mask))
  (pad 26 smd rect (at 4.6 2.9) (size 0.2 1.5) (layers F.Cu F.Paste F.Mask))
  (pad 30 smd rect (at 5 -2.9) (size 0.2 1.5) (layers F.Cu F.Paste F.Mask))
  (pad 27 smd rect (at 5 2.9) (size 0.2 1.5) (layers F.Cu F.Paste F.Mask))
  (pad 29 smd rect (at 5.4 -2.9) (size 0.2 1.5) (layers F.Cu F.Paste F.Mask))
  (pad 28 smd rect (at 5.4 2.9) (size 0.2 1.5) (layers F.Cu F.Paste F.Mask))
)
