(footprint "TTM_Technologies_ATT_2010_5025Metric_XRA_Series"
	(version 20240108)
	(generator "pcbnew")
	(generator_version "8.0")
	(layer "F.Cu")
	(property "Reference" "REF**"
		(at 0 3.5 0)
		(unlocked yes)
		(layer "F.SilkS")
		(uuid "81e1b1b7-5e43-4aba-8685-e321efc11e77")
		(effects
			(font
				(size 1 1)
				(thickness 0.1)
			)
		)
	)
	(property "Value" "TTM_Technologies_ATT_2010_5025Metric_XRA_Series"
		(at 0 5 0)
		(unlocked yes)
		(layer "F.Fab")
		(uuid "6b3188ec-2f66-46e9-ba00-acdd02e12e17")
		(effects
			(font
				(size 1 1)
				(thickness 0.15)
			)
		)
	)
	(property "Footprint" "TTM_Technologies_ATT_2010_5025Metric_XRA_Series"
		(at 0 4 0)
		(unlocked yes)
		(layer "F.Fab")
		(hide yes)
		(uuid "484ba621-f3de-433d-b061-8e132676cadf")
		(effects
			(font
				(size 1 1)
				(thickness 0.15)
			)
		)
	)
	(property "Datasheet" ""
		(at 0 4 0)
		(unlocked yes)
		(layer "F.Fab")
		(hide yes)
		(uuid "546abbbc-e93c-4bf1-984d-1b94325f623c")
		(effects
			(font
				(size 1 1)
				(thickness 0.15)
			)
		)
	)
	(property "Description" ""
		(at 0 4 0)
		(unlocked yes)
		(layer "F.Fab")
		(hide yes)
		(uuid "fd7c055e-4925-4e4d-bf58-a1f2253523ee")
		(effects
			(font
				(size 1 1)
				(thickness 0.15)
			)
		)
	)
	(attr smd)
	(fp_rect
		(start -1.7 -3.55)
		(end 1.7 3.5)
		(stroke
			(width 0.05)
			(type default)
		)
		(fill none)
		(layer "F.CrtYd")
		(uuid "87068304-76d4-4a82-8d16-c68d38c43663")
	)
	(fp_rect
		(start -1.27 -2.54)
		(end 1.27 2.54)
		(stroke
			(width 0.1)
			(type default)
		)
		(fill none)
		(layer "F.Fab")
		(uuid "00d3f94a-a1dc-4dee-8613-647526fcb66d")
	)
	(fp_line
		(start -0.4318 -3.1)
		(end -0.4318 -0.4064)
		(stroke
			(width 0.1)
			(type default)
		)
		(layer "User.2")
		(uuid "a4b1da19-1c47-4e0e-9ffa-b92ffd0c1bbd")
	)
	(fp_line
		(start -0.4318 -0.4064)
		(end 1.95 -0.4064)
		(stroke
			(width 0.1)
			(type default)
		)
		(layer "User.2")
		(uuid "1c7e0e85-eec1-432c-87b3-7ffce8227397")
	)
	(fp_line
		(start -0.4318 0.4064)
		(end -0.4318 2.8)
		(stroke
			(width 0.1)
			(type default)
		)
		(layer "User.2")
		(uuid "e0a8bc8a-ef01-4ab9-9cbc-40344001a1b0")
	)
	(fp_line
		(start -0.4318 0.4064)
		(end 1.95 0.4064)
		(stroke
			(width 0.1)
			(type default)
		)
		(layer "User.2")
		(uuid "b0e99cee-6f39-421a-bf27-037f8b9eba40")
	)
	(fp_line
		(start 0.4318 -2.8)
		(end 0.4318 -1.27)
		(stroke
			(width 0.1)
			(type default)
		)
		(layer "User.2")
		(uuid "08ff1a6c-f175-44e8-a841-f1e767a17ec5")
	)
	(fp_line
		(start 0.4318 -1.27)
		(end 1.95 -1.27)
		(stroke
			(width 0.1)
			(type default)
		)
		(layer "User.2")
		(uuid "7165331f-c10d-4e3f-8bf6-015942178f1b")
	)
	(fp_line
		(start 0.4318 1.27)
		(end 0.4318 2.8)
		(stroke
			(width 0.1)
			(type default)
		)
		(layer "User.2")
		(uuid "26b27840-8926-455d-a954-7ff2ca74e4ce")
	)
	(fp_line
		(start 0.4318 1.27)
		(end 1.95 1.27)
		(stroke
			(width 0.1)
			(type default)
		)
		(layer "User.2")
		(uuid "e9624c99-556a-49e7-a12c-0cfd95a64bd1")
	)
	(fp_text user "${REFERENCE}"
		(at 0 6.5 0)
		(unlocked yes)
		(layer "F.Fab")
		(uuid "6105aaf8-7607-4c80-bb93-4d22e8c72d61")
		(effects
			(font
				(size 1 1)
				(thickness 0.15)
			)
		)
	)
	(pad "1" smd roundrect
		(at -0.9318 -2.27 90)
		(size 2 1)
		(layers "F.Cu" "F.Paste" "F.Mask")
		(roundrect_rratio 0.25)
		(thermal_bridge_angle 45)
		(uuid "15b935d0-1be1-4fc5-88d4-b4eb81c88a31")
	)
	(pad "2" smd roundrect
		(at -0.9318 2.27 90)
		(size 2 1)
		(layers "F.Cu" "F.Paste" "F.Mask")
		(roundrect_rratio 0.25)
		(thermal_bridge_angle 45)
		(uuid "ef8be2c5-bafc-405b-9fe8-a242364bca71")
	)
	(pad "3" smd roundrect
		(at 0.9318 2.27 90)
		(size 2 1)
		(layers "F.Cu" "F.Paste" "F.Mask")
		(roundrect_rratio 0.25)
		(thermal_bridge_angle 45)
		(uuid "5d0344bd-a1f9-4d72-aee7-c2bb0ae8d59a")
	)
	(pad "4" smd roundrect
		(at 0.9318 -2.27 90)
		(size 2 1)
		(layers "F.Cu" "F.Paste" "F.Mask")
		(roundrect_rratio 0.25)
		(thermal_bridge_angle 45)
		(uuid "b64c0bcc-9862-4101-a42f-b68d3079a54f")
	)
	(zone
		(net 0)
		(net_name "")
		(layers "F.Cu" "User.2")
		(uuid "bf3e60ec-44d0-42a1-9d24-b126c4e6afca")
		(hatch edge 0.5)
		(connect_pads
			(clearance 0)
		)
		(min_thickness 0.25)
		(filled_areas_thickness no)
		(keepout
			(tracks allowed)
			(vias allowed)
			(pads allowed)
			(copperpour not_allowed)
			(footprints allowed)
		)
		(fill
			(thermal_gap 0.5)
			(thermal_bridge_width 0.5)
		)
		(polygon
			(pts
				(xy -0.4318 -0.4064) (xy 1.27 -0.4064) (xy 1.27 -1.27) (xy 0.4318 -1.27) (xy 0.4318 -2.54) (xy -0.4318 -2.54)
			)
		)
	)
	(zone
		(net 0)
		(net_name "")
		(layers "F.Cu" "User.2")
		(uuid "537d64f7-34c8-4d35-9d81-b53ae67e350e")
		(hatch edge 0.5)
		(connect_pads
			(clearance 0)
		)
		(min_thickness 0.25)
		(filled_areas_thickness no)
		(keepout
			(tracks allowed)
			(vias allowed)
			(pads allowed)
			(copperpour not_allowed)
			(footprints allowed)
		)
		(fill
			(thermal_gap 0.5)
			(thermal_bridge_width 0.5)
		)
		(polygon
			(pts
				(xy -0.4318 0.4064) (xy 1.27 0.4064) (xy 1.27 1.27) (xy 0.4318 1.27) (xy 0.4318 2.54) (xy -0.4318 2.54)
			)
		)
	)
)
