(footprint "TerminalBlock_bornier-2_P6.35mm" (version 20211014) (generator pcbnew)
  (layer "F.Cu")
  (tedit 59FF03AB)
  (descr "simple 2-pin terminal block, pitch 6.35mm, revamped version of bornier2")
  (tags "terminal block bornier2")
  (attr through_hole)
  (fp_text reference "REF**" (at 2.54 -5.08) (layer "F.SilkS")
    (effects (font (size 1 1) (thickness 0.15)))
    (tstamp 58a768f0-cbed-4992-a8f5-68a9cb9221fd)
  )
  (fp_text value "TerminalBlock_bornier-2_P6.35mm" (at 2.54 5.08) (layer "F.Fab")
    (effects (font (size 1 1) (thickness 0.15)))
    (tstamp e6b5beef-cd67-490e-836f-44290a595873)
  )
  (fp_text user "${REFERENCE}" (at 2.54 0) (layer "F.Fab")
    (effects (font (size 1 1) (thickness 0.15)))
    (tstamp 107497c8-9ab4-407c-8c4a-38b42f271e19)
  )
  (fp_line (start -3.25 -3.81) (end -3.25 3.81) (layer "F.SilkS") (width 0.12) (tstamp 0f458660-0073-4b7d-9d1c-660fafd54624))
  (fp_line (start 9.61 3.81) (end 9.61 -3.81) (layer "F.SilkS") (width 0.12) (tstamp 4eda392a-22e0-4771-bf7f-96fbf6c1c41c))
  (fp_line (start 9.61 2.54) (end -3.25 2.54) (layer "F.SilkS") (width 0.12) (tstamp 5b8957ce-1b22-4c96-b846-1b10aec97d40))
  (fp_line (start -3.25 3.81) (end 9.61 3.81) (layer "F.SilkS") (width 0.12) (tstamp d3275a28-4e24-45f5-81f7-1f75e0117c79))
  (fp_line (start 9.61 -3.81) (end -3.25 -3.81) (layer "F.SilkS") (width 0.12) (tstamp f23eec8b-479e-4b68-8e9e-cbfc531e55fd))
  (fp_line (start 9.78 4) (end 9.78 -4) (layer "F.CrtYd") (width 0.05) (tstamp 29ba8f8d-d516-4e34-bbd7-ddb1067c0ca8))
  (fp_line (start -3.42 -4) (end -3.42 4) (layer "F.CrtYd") (width 0.05) (tstamp 321253bb-0fdb-403a-ac4e-c054e8688864))
  (fp_line (start -3.42 -4) (end 9.78 -4) (layer "F.CrtYd") (width 0.05) (tstamp 7474484a-23bb-4d99-aa0b-e910a3bce07f))
  (fp_line (start 9.78 4) (end -3.42 4) (layer "F.CrtYd") (width 0.05) (tstamp bc1a491e-58bf-4ded-8885-7f8bf0b4ad6c))
  (fp_line (start 9.53 -3.75) (end -3.17 -3.75) (layer "F.Fab") (width 0.1) (tstamp 0421dce9-a3d4-484c-9263-5bb82b4662e9))
  (fp_line (start -3.17 -3.75) (end -3.17 3.75) (layer "F.Fab") (width 0.1) (tstamp 33e0b5e5-358e-4992-8470-97ef93aaadbe))
  (fp_line (start -3.17 3.75) (end 9.53 3.75) (layer "F.Fab") (width 0.1) (tstamp 964d1bbc-7451-4461-918f-7f9f966f13e3))
  (fp_line (start 9.53 3.75) (end 9.53 -3.75) (layer "F.Fab") (width 0.1) (tstamp b1721349-1a92-4e1c-90ec-0622be5f75ba))
  (fp_line (start -3.17 2.55) (end 9.53 2.55) (layer "F.Fab") (width 0.1) (tstamp bdc1824c-5fbc-4cdf-a4c5-08eb73fc39cc))
  (pad "1" thru_hole rect (at 0 0) (size 3 3) (drill 1.52) (layers *.Cu *.Mask) (tstamp ed716211-f3bc-4748-85ae-29b0c1f147de))
  (pad "2" thru_hole circle (at 6.35 0) (size 3 3) (drill 1.52) (layers *.Cu *.Mask) (tstamp 359ae08d-fb10-46a9-ada1-91305e0b3340))
  (model "${KICAD6_3DMODEL_DIR}/TerminalBlock.3dshapes/TerminalBlock_bornier-2_P5.08mm.wrl"
    (offset (xyz 2.539999962 0 0))
    (scale (xyz 1 1 1))
    (rotate (xyz 0 0 0))
  )
)
