(footprint "coupler_2_polygon" (version 20211014) (generator pcbnew)
  (layer "F.Cu")
  (tedit 6268243C)
  (attr exclude_from_pos_files exclude_from_bom)
  (fp_text reference "REF**" (at 0 0.5) (layer "F.SilkS")
    (effects (font (size 1 1) (thickness 0.15)))
    (tstamp 9d6ad8b1-96d8-4970-af7e-9f8c2af1dccd)
  )
  (fp_text value "coupler_2" (at 0 -0.5) (layer "F.Fab")
    (effects (font (size 1 1) (thickness 0.15)))
    (tstamp 2a138168-6a73-4cbb-bf5d-502abd29bce2)
  )
  (fp_text user "strip width, space: 1.4, 0.35" (at 0 5) (layer "Cmts.User")
    (effects (font (size 1 1) (thickness 0.15)))
    (tstamp 7ae71584-4ff1-4d9b-9a0c-5a5807284567)
  )
  (fp_poly (pts
      (xy 7.633333 -5)
      (xy 7.633333 -3.6)
      (xy 7.261029 -2.642647)
      (xy 6.666666 -2.5)
      (xy 5.833333 -2.3)
      (xy 5 -2.14)
      (xy 4.166666 -1.89)
      (xy 3.333333 -1.76)
      (xy 2.5 -1.661)
      (xy 1.666666 -1.567)
      (xy 0.833333 -1.51)
      (xy 0 -1.507)
      (xy 0 -0.067)
      (xy 0.833333 -0.07)
      (xy 1.666666 -0.095)
      (xy 2.5 -0.125)
      (xy 3.333333 -0.16)
      (xy 4.166666 -0.21)
      (xy 5 -0.3)
      (xy 5.833333 -0.4)
      (xy 6.666666 -0.5)
      (xy 7.5 -0.6)
      (xy 7.633333 -1.2)
      (xy 9.033333 -3)
      (xy 9.033333 -5)
    ) (layer "In1.Cu") (width 0) (fill solid) (tstamp 05f191cb-1f40-4484-a95f-f5cecb0626f1))
  (fp_poly (pts
      (xy 7.633333 5)
      (xy 7.633333 3.6)
      (xy 7.261029 2.642647)
      (xy 6.666666 2.5)
      (xy 5.833333 2.3)
      (xy 5 2.14)
      (xy 4.166666 1.89)
      (xy 3.333333 1.76)
      (xy 2.5 1.661)
      (xy 1.666666 1.567)
      (xy 0.833333 1.51)
      (xy 0 1.507)
      (xy 0 0.067)
      (xy 0.833333 0.07)
      (xy 1.666666 0.095)
      (xy 2.5 0.125)
      (xy 3.333333 0.16)
      (xy 4.166666 0.21)
      (xy 5 0.3)
      (xy 5.833333 0.4)
      (xy 6.666666 0.5)
      (xy 7.5 0.6)
      (xy 7.633333 1.2)
      (xy 9.033333 3)
      (xy 9.033333 5)
    ) (layer "In1.Cu") (width 0) (fill solid) (tstamp 2278ac72-f3c8-4784-95e2-30afa30878c4))
  (fp_poly (pts
      (xy -7.633333 -5)
      (xy -7.633333 -3.6)
      (xy -7.261029 -2.642647)
      (xy -6.666666 -2.5)
      (xy -5.833333 -2.3)
      (xy -5 -2.14)
      (xy -4.166666 -1.89)
      (xy -3.333333 -1.76)
      (xy -2.5 -1.661)
      (xy -1.666666 -1.567)
      (xy -0.833333 -1.51)
      (xy 0 -1.507)
      (xy 0 -0.067)
      (xy -0.833333 -0.07)
      (xy -1.666666 -0.095)
      (xy -2.5 -0.125)
      (xy -3.333333 -0.16)
      (xy -4.166666 -0.21)
      (xy -5 -0.3)
      (xy -5.833333 -0.4)
      (xy -6.666666 -0.5)
      (xy -7.5 -0.6)
      (xy -7.633333 -1.2)
      (xy -9.033333 -3)
      (xy -9.033333 -5)
    ) (layer "In1.Cu") (width 0) (fill solid) (tstamp 6189c38d-2186-4743-b989-89d151fa635b))
  (fp_poly (pts
      (xy -7.633333 5)
      (xy -7.633333 3.6)
      (xy -7.261029 2.642647)
      (xy -6.666666 2.5)
      (xy -5.833333 2.3)
      (xy -5 2.14)
      (xy -4.166666 1.89)
      (xy -3.333333 1.76)
      (xy -2.5 1.661)
      (xy -1.666666 1.567)
      (xy -0.833333 1.51)
      (xy 0 1.507)
      (xy 0 0.067)
      (xy -0.833333 0.07)
      (xy -1.666666 0.095)
      (xy -2.5 0.125)
      (xy -3.333333 0.16)
      (xy -4.166666 0.21)
      (xy -5 0.3)
      (xy -5.833333 0.4)
      (xy -6.666666 0.5)
      (xy -7.5 0.6)
      (xy -7.633333 1.2)
      (xy -9.033333 3)
      (xy -9.033333 5)
    ) (layer "In1.Cu") (width 0) (fill solid) (tstamp e558d2ce-c76d-44f6-a558-303c08cb0381))
  (fp_poly (pts
      (xy -7.633333 5)
      (xy -7.633333 3.6)
      (xy -7.261029 2.642647)
      (xy -6.666666 2.5)
      (xy -5.833333 2.3)
      (xy -5 2.14)
      (xy -4.166666 1.89)
      (xy -3.333333 1.76)
      (xy -2.5 1.661)
      (xy -1.666666 1.567)
      (xy -0.833333 1.51)
      (xy 0 1.507)
      (xy 0 0.067)
      (xy -0.833333 0.07)
      (xy -1.666666 0.095)
      (xy -2.5 0.125)
      (xy -3.333333 0.16)
      (xy -4.166666 0.21)
      (xy -5 0.3)
      (xy -5.833333 0.4)
      (xy -6.666666 0.5)
      (xy -7.5 0.6)
      (xy -7.633333 1.2)
      (xy -9.033333 3)
      (xy -9.033333 5)
    ) (layer "Eco1.User") (width 0) (fill solid) (tstamp 3a46ea1c-2f86-42cf-8873-f1bb8c788898))
  (fp_poly (pts
      (xy -7.633333 -5)
      (xy -7.633333 -3.6)
      (xy -7.261029 -2.642647)
      (xy -6.666666 -2.5)
      (xy -5.833333 -2.3)
      (xy -5 -2.14)
      (xy -4.166666 -1.89)
      (xy -3.333333 -1.76)
      (xy -2.5 -1.661)
      (xy -1.666666 -1.567)
      (xy -0.833333 -1.51)
      (xy 0 -1.507)
      (xy 0 -0.067)
      (xy -0.833333 -0.07)
      (xy -1.666666 -0.095)
      (xy -2.5 -0.125)
      (xy -3.333333 -0.16)
      (xy -4.166666 -0.21)
      (xy -5 -0.3)
      (xy -5.833333 -0.4)
      (xy -6.666666 -0.5)
      (xy -7.5 -0.6)
      (xy -7.633333 -1.2)
      (xy -9.033333 -3)
      (xy -9.033333 -5)
    ) (layer "Eco1.User") (width 0) (fill solid) (tstamp 7f6cdbbd-6217-4120-9848-950840649a9a))
  (fp_poly (pts
      (xy 7.633333 -5)
      (xy 7.633333 -3.6)
      (xy 7.261029 -2.642647)
      (xy 6.666666 -2.5)
      (xy 5.833333 -2.3)
      (xy 5 -2.14)
      (xy 4.166666 -1.89)
      (xy 3.333333 -1.76)
      (xy 2.5 -1.661)
      (xy 1.666666 -1.567)
      (xy 0.833333 -1.51)
      (xy 0 -1.507)
      (xy 0 -0.067)
      (xy 0.833333 -0.07)
      (xy 1.666666 -0.095)
      (xy 2.5 -0.125)
      (xy 3.333333 -0.16)
      (xy 4.166666 -0.21)
      (xy 5 -0.3)
      (xy 5.833333 -0.4)
      (xy 6.666666 -0.5)
      (xy 7.5 -0.6)
      (xy 7.633333 -1.2)
      (xy 9.033333 -3)
      (xy 9.033333 -5)
    ) (layer "Eco1.User") (width 0) (fill solid) (tstamp e11b42f0-40df-438c-be5a-65903038de2e))
  (fp_poly (pts
      (xy 7.633333 5)
      (xy 7.633333 3.6)
      (xy 7.261029 2.642647)
      (xy 6.666666 2.5)
      (xy 5.833333 2.3)
      (xy 5 2.14)
      (xy 4.166666 1.89)
      (xy 3.333333 1.76)
      (xy 2.5 1.661)
      (xy 1.666666 1.567)
      (xy 0.833333 1.51)
      (xy 0 1.507)
      (xy 0 0.067)
      (xy 0.833333 0.07)
      (xy 1.666666 0.095)
      (xy 2.5 0.125)
      (xy 3.333333 0.16)
      (xy 4.166666 0.21)
      (xy 5 0.3)
      (xy 5.833333 0.4)
      (xy 6.666666 0.5)
      (xy 7.5 0.6)
      (xy 7.633333 1.2)
      (xy 9.033333 3)
      (xy 9.033333 5)
    ) (layer "Eco1.User") (width 0) (fill solid) (tstamp fbddb89a-b34f-419b-8061-db7b555e200b))
  (pad "" smd rect (at 0 0) (size 20.7 15) (layers "F.Mask") (tstamp 513ee46d-0e65-497d-a6b0-d217fdccb0c7))
  (pad "1" smd roundrect (at -8.333333 6) (size 1.4 3.4) (layers "In1.Cu" "Eco1.User") (roundrect_rratio 0.5)
    (clearance 0.35) (zone_connect 2) (tstamp 21a4aa40-a413-4728-b54b-2a273a10a6e1))
  (pad "1" thru_hole circle (at -8.333333 6.95) (size 0.4572 0.4572) (drill 0.254) (layers *.Cu *.Mask)
    (zone_connect 2) (tstamp a191ed31-8906-4d89-86cf-70c1c0f91c5c))
  (pad "2" thru_hole circle (at 8.333333 7) (size 0.4572 0.4572) (drill 0.254) (layers *.Cu *.Mask)
    (zone_connect 2) (tstamp 8db6a077-2221-4ad9-887d-567ea36f2ff1))
  (pad "2" smd roundrect (at 8.333333 6.05) (size 1.4 3.4) (layers "In1.Cu" "Eco1.User") (roundrect_rratio 0.5)
    (clearance 0.35) (zone_connect 2) (tstamp c1b28922-d556-474e-a19f-a0c855d01c01))
  (pad "3" smd roundrect (at -8.333333 -6 180) (size 1.4 3.4) (layers "In1.Cu" "Eco1.User") (roundrect_rratio 0.5)
    (clearance 0.35) (zone_connect 2) (tstamp 38c85cc3-5db9-401d-b589-2a3f3e3a7069))
  (pad "3" thru_hole circle (at -8.333333 -7 180) (size 0.4572 0.4572) (drill 0.254) (layers *.Cu *.Mask)
    (zone_connect 2) (tstamp d9b0df9e-e852-4a7e-8cb0-7314918175c4))
  (pad "4" thru_hole circle (at 8.333333 -7 180) (size 0.4572 0.4572) (drill 0.254) (layers *.Cu *.Mask)
    (zone_connect 2) (tstamp 14edb3e2-071b-4454-a590-2f3e72f5ead6))
  (pad "4" smd roundrect (at 8.333333 -6.05 180) (size 1.4 3.4) (layers "In1.Cu" "Eco1.User") (roundrect_rratio 0.5)
    (clearance 0.35) (zone_connect 2) (tstamp bea7ad34-0c0a-4fab-aad2-875d2dce23de))
  (pad "5" thru_hole circle (at -6.2 5) (size 0.4572 0.4572) (drill 0.254) (layers *.Cu *.Mask)
    (zone_connect 2) (tstamp 0017297a-7de7-4b26-ac36-da2a8ebddace))
  (pad "5" thru_hole circle (at 4 5) (size 0.4572 0.4572) (drill 0.254) (layers *.Cu *.Mask)
    (zone_connect 2) (tstamp 0489dffc-494f-44a7-bef4-1d6f41b97b42))
  (pad "5" thru_hole circle (at 10 -2) (size 0.4572 0.4572) (drill 0.254) (layers *.Cu *.Mask)
    (zone_connect 2) (tstamp 08fb2f75-95b4-45dd-bbb1-478d89494c68))
  (pad "5" thru_hole circle (at 9 -1) (size 0.4572 0.4572) (drill 0.254) (layers *.Cu *.Mask)
    (zone_connect 2) (tstamp 0c0915c8-0dc6-47a6-8afc-d364e786986a))
  (pad "5" thru_hole circle (at 10 5) (size 0.4572 0.4572) (drill 0.254) (layers *.Cu *.Mask)
    (zone_connect 2) (tstamp 0c394182-f563-4cb7-8696-3d48d79587e6))
  (pad "5" thru_hole circle (at 3 -5) (size 0.4572 0.4572) (drill 0.254) (layers *.Cu *.Mask)
    (zone_connect 2) (tstamp 1b9cef90-4d8f-4c7b-9f25-8e93e2c82926))
  (pad "5" thru_hole circle (at 3 5) (size 0.4572 0.4572) (drill 0.254) (layers *.Cu *.Mask)
    (zone_connect 2) (tstamp 1c35566e-2559-4f17-8234-9650b4a10d88))
  (pad "5" thru_hole circle (at -5 5) (size 0.4572 0.4572) (drill 0.254) (layers *.Cu *.Mask)
    (zone_connect 2) (tstamp 1f5a60c4-0b65-42e8-a7bb-f4f53a05b55c))
  (pad "5" thru_hole circle (at 6.2 -5) (size 0.4572 0.4572) (drill 0.254) (layers *.Cu *.Mask)
    (zone_connect 2) (tstamp 22dc3848-ca6e-4994-bfa5-d5c3608fbcf7))
  (pad "5" thru_hole circle (at -9 1) (size 0.4572 0.4572) (drill 0.254) (layers *.Cu *.Mask)
    (zone_connect 2) (tstamp 23e8f6d6-dc05-413b-bdf4-3972f7aaa452))
  (pad "5" thru_hole circle (at -10 5) (size 0.4572 0.4572) (drill 0.254) (layers *.Cu *.Mask)
    (zone_connect 2) (tstamp 2a550c03-cba4-4a5d-b5f2-4509a5ed3d99))
  (pad "5" thru_hole circle (at -10 4) (size 0.4572 0.4572) (drill 0.254) (layers *.Cu *.Mask)
    (zone_connect 2) (tstamp 2fc0535a-9526-4bf9-9cf3-bacd342c13b7))
  (pad "5" smd custom (at 0 -5) (size 0.01 0.01) (layers "In1.Cu" "Eco1.User")
    (zone_connect 2)
    (options (clearance outline) (anchor circle))
    (primitives
      (gr_poly (pts
          (xy 7.283333 -2)
          (xy 7.283333 0.9)
          (xy 6.283915 1.899419)
          (xy 5.833333 2.04)
          (xy 5 2.26)
          (xy 4.166667 2.51)
          (xy 3.333333 2.64)
          (xy 2.5 2.739)
          (xy 1.666667 2.833)
          (xy 0.833333 2.89)
          (xy 0 2.893)
          (xy -0.833333 2.89)
          (xy -1.666667 2.833)
          (xy -2.5 2.739)
          (xy -3.333333 2.64)
          (xy -4.166667 2.51)
          (xy -5 2.26)
          (xy -5.833333 2.04)
          (xy -6.283915 1.899419)
          (xy -7.283333 0.9)
          (xy -7.283333 -2)
        ) (width 0) (fill yes))
    ) (tstamp 3858be5f-9f33-48a6-b939-08493f4167fd))
  (pad "5" thru_hole circle (at -2 -5) (size 0.4572 0.4572) (drill 0.254) (layers *.Cu *.Mask)
    (zone_connect 2) (tstamp 4728b3c5-9840-4ae0-83dd-d8f25e1a2501))
  (pad "5" thru_hole circle (at 10 2) (size 0.4572 0.4572) (drill 0.254) (layers *.Cu *.Mask)
    (zone_connect 2) (tstamp 5dcf857d-f1ad-402b-886f-63523af8197b))
  (pad "5" thru_hole circle (at 9 1) (size 0.4572 0.4572) (drill 0.254) (layers *.Cu *.Mask)
    (zone_connect 2) (tstamp 5ecab3a5-2aa9-4ac2-adb3-5cfbb3769f36))
  (pad "5" thru_hole circle (at -10 2) (size 0.4572 0.4572) (drill 0.254) (layers *.Cu *.Mask)
    (zone_connect 2) (tstamp 5effda4f-f509-4c42-bf3f-632077643ed1))
  (pad "5" thru_hole circle (at 5 5) (size 0.4572 0.4572) (drill 0.254) (layers *.Cu *.Mask)
    (zone_connect 2) (tstamp 6335c066-acf9-49c8-b7d5-0e655198b949))
  (pad "5" thru_hole circle (at -10 -5) (size 0.4572 0.4572) (drill 0.254) (layers *.Cu *.Mask)
    (zone_connect 2) (tstamp 640a57b1-c089-43e1-adb4-6c50a96856b8))
  (pad "5" thru_hole circle (at -2 5) (size 0.4572 0.4572) (drill 0.254) (layers *.Cu *.Mask)
    (zone_connect 2) (tstamp 7252cf63-d7d1-4028-b449-5792fc6d1955))
  (pad "5" thru_hole circle (at 10 -3) (size 0.4572 0.4572) (drill 0.254) (layers *.Cu *.Mask)
    (zone_connect 2) (tstamp 7e177dab-d792-4f03-9143-3cc95615e0d6))
  (pad "5" thru_hole circle (at -10 3) (size 0.4572 0.4572) (drill 0.254) (layers *.Cu *.Mask)
    (zone_connect 2) (tstamp 8433836f-c1f9-4b5e-9a5f-e924e63e7942))
  (pad "5" thru_hole circle (at -6.2 -5) (size 0.4572 0.4572) (drill 0.254) (layers *.Cu *.Mask)
    (zone_connect 2) (tstamp 8bef3269-07f2-4003-98a5-e0476df200f9))
  (pad "5" thru_hole circle (at 10 -5) (size 0.4572 0.4572) (drill 0.254) (layers *.Cu *.Mask)
    (zone_connect 2) (tstamp 8ee9e747-62ba-4924-8569-0c230a7db8de))
  (pad "5" thru_hole circle (at -4 -5) (size 0.4572 0.4572) (drill 0.254) (layers *.Cu *.Mask)
    (zone_connect 2) (tstamp 90872d08-1d12-472c-928b-b8ba166eab5b))
  (pad "5" thru_hole circle (at -3 -5) (size 0.4572 0.4572) (drill 0.254) (layers *.Cu *.Mask)
    (zone_connect 2) (tstamp 9602dd49-46a5-4816-996a-189b43457fe7))
  (pad "5" thru_hole circle (at 0 5) (size 0.4572 0.4572) (drill 0.254) (layers *.Cu *.Mask)
    (zone_connect 2) (tstamp 9cb50ff2-32ae-4f47-8b1e-b2e61cbc6c6a))
  (pad "5" thru_hole circle (at 4 -5) (size 0.4572 0.4572) (drill 0.254) (layers *.Cu *.Mask)
    (zone_connect 2) (tstamp 9e6d28c1-0957-4626-a6ca-021f6f3aa544))
  (pad "5" smd custom (at 10.383333 0) (size 0.01 0.01) (layers "In1.Cu" "Eco1.User")
    (zone_connect 2)
    (options (clearance outline) (anchor circle))
    (primitives
      (gr_poly (pts
          (xy -1 7)
          (xy -1 2.1)
          (xy -3.1 0)
          (xy -1 -2.1)
          (xy -1 -7)
          (xy 0 -7)
          (xy 0 7)
        ) (width 0) (fill yes))
    ) (tstamp a1a80f1b-ac68-42ad-a04d-f6cb80589583))
  (pad "5" thru_hole circle (at -9 -1) (size 0.4572 0.4572) (drill 0.254) (layers *.Cu *.Mask)
    (zone_connect 2) (tstamp a8fb4119-650e-4ac6-94c5-3cf1ab9f9325))
  (pad "5" thru_hole circle (at 6.2 5) (size 0.4572 0.4572) (drill 0.254) (layers *.Cu *.Mask)
    (zone_connect 2) (tstamp aee7a529-6ac6-4a80-9568-e26a40779fdc))
  (pad "5" thru_hole circle (at 2 5) (size 0.4572 0.4572) (drill 0.254) (layers *.Cu *.Mask)
    (zone_connect 2) (tstamp b2973652-5fdc-4c00-a836-7919e93cad4f))
  (pad "5" thru_hole circle (at -3 5) (size 0.4572 0.4572) (drill 0.254) (layers *.Cu *.Mask)
    (zone_connect 2) (tstamp b6cb281c-0c44-4868-a193-52cdbcb16da2))
  (pad "5" thru_hole circle (at -1 -5) (size 0.4572 0.4572) (drill 0.254) (layers *.Cu *.Mask)
    (zone_connect 2) (tstamp bb5a5641-1fe5-4c37-9754-346a94c7e3f0))
  (pad "5" thru_hole circle (at 8.333333 0) (size 0.4572 0.4572) (drill 0.254) (layers *.Cu *.Mask)
    (zone_connect 2) (tstamp bc60d2d6-e199-4ca5-8bb0-d6641fcb087d))
  (pad "5" thru_hole circle (at 0 -5) (size 0.4572 0.4572) (drill 0.254) (layers *.Cu *.Mask)
    (zone_connect 2) (tstamp c5876706-c689-4c6f-ac7c-1478ecaa5e58))
  (pad "5" thru_hole circle (at 10 -4) (size 0.4572 0.4572) (drill 0.254) (layers *.Cu *.Mask)
    (zone_connect 2) (tstamp c7c08868-5b26-40ca-94ba-cdb1cda09dbd))
  (pad "5" thru_hole circle (at -10 -2) (size 0.4572 0.4572) (drill 0.254) (layers *.Cu *.Mask)
    (zone_connect 2) (tstamp cd8b6ef6-f2d8-48ae-bd83-6d4627d39e9b))
  (pad "5" thru_hole circle (at 10 3) (size 0.4572 0.4572) (drill 0.254) (layers *.Cu *.Mask)
    (zone_connect 2) (tstamp cedc68b5-bf0a-4ea3-898a-c84039b645c5))
  (pad "5" smd custom (at 0 5) (size 0.01 0.01) (layers "In1.Cu" "Eco1.User")
    (zone_connect 2)
    (options (clearance outline) (anchor circle))
    (primitives
      (gr_poly (pts
          (xy 7.283333 2)
          (xy 7.283333 -0.9)
          (xy 6.283915 -1.899419)
          (xy 5.833333 -2.04)
          (xy 5 -2.26)
          (xy 4.166667 -2.51)
          (xy 3.333333 -2.64)
          (xy 2.5 -2.739)
          (xy 1.666667 -2.833)
          (xy 0.833333 -2.89)
          (xy 0 -2.893)
          (xy -0.833333 -2.89)
          (xy -1.666667 -2.833)
          (xy -2.5 -2.739)
          (xy -3.333333 -2.64)
          (xy -4.166667 -2.51)
          (xy -5 -2.26)
          (xy -5.833333 -2.04)
          (xy -6.283915 -1.899419)
          (xy -7.283333 -0.9)
          (xy -7.283333 2)
        ) (width 0) (fill yes))
    ) (tstamp cfdb8465-34cf-4ca2-b40f-dcb9094a6c75))
  (pad "5" thru_hole circle (at -1 5) (size 0.4572 0.4572) (drill 0.254) (layers *.Cu *.Mask)
    (zone_connect 2) (tstamp d7678225-9962-4b6c-8ac6-79810f77c6a5))
  (pad "5" thru_hole circle (at -8.333333 0) (size 0.4572 0.4572) (drill 0.254) (layers *.Cu *.Mask)
    (zone_connect 2) (tstamp d980360c-b360-421a-a044-a46b1936fa56))
  (pad "5" thru_hole circle (at -4 5) (size 0.4572 0.4572) (drill 0.254) (layers *.Cu *.Mask)
    (zone_connect 2) (tstamp e165e83c-6f01-4850-ac2e-250d8cb59303))
  (pad "5" thru_hole circle (at -5 -5) (size 0.4572 0.4572) (drill 0.254) (layers *.Cu *.Mask)
    (zone_connect 2) (tstamp e3fbf23c-e20e-4416-bbc6-27e25a75d7b9))
  (pad "5" thru_hole circle (at -10 -4) (size 0.4572 0.4572) (drill 0.254) (layers *.Cu *.Mask)
    (zone_connect 2) (tstamp e65300a0-fc18-4db7-b27f-2d7614c69ac0))
  (pad "5" thru_hole circle (at 1 5) (size 0.4572 0.4572) (drill 0.254) (layers *.Cu *.Mask)
    (zone_connect 2) (tstamp e6b2cc6a-89a9-4005-82f7-65741cef7903))
  (pad "5" thru_hole circle (at 2 -5) (size 0.4572 0.4572) (drill 0.254) (layers *.Cu *.Mask)
    (zone_connect 2) (tstamp e813cf80-47bd-4d3e-b1be-856704f5f3d9))
  (pad "5" thru_hole circle (at 5 -5) (size 0.4572 0.4572) (drill 0.254) (layers *.Cu *.Mask)
    (zone_connect 2) (tstamp f1e04cac-c87f-4a0f-9be3-06d942906de7))
  (pad "5" smd custom (at -10.383333 0) (size 0.01 0.01) (layers "In1.Cu" "Eco1.User")
    (zone_connect 2)
    (options (clearance outline) (anchor circle))
    (primitives
      (gr_poly (pts
          (xy 1 7)
          (xy 1 2.1)
          (xy 3.1 0)
          (xy 1 -2.1)
          (xy 1 -7)
          (xy 0 -7)
          (xy 0 7)
        ) (width 0) (fill yes))
    ) (tstamp f5410483-b232-4090-99ff-809aab4a63bc))
  (pad "5" thru_hole circle (at -10 -3) (size 0.4572 0.4572) (drill 0.254) (layers *.Cu *.Mask)
    (zone_connect 2) (tstamp f71826d8-34d8-4930-98c5-11e184143d2a))
  (pad "5" thru_hole circle (at 10 4) (size 0.4572 0.4572) (drill 0.254) (layers *.Cu *.Mask)
    (zone_connect 2) (tstamp f825eea6-b282-4200-ab09-2a9fbed1f3a5))
  (pad "5" thru_hole circle (at 1 -5) (size 0.4572 0.4572) (drill 0.254) (layers *.Cu *.Mask)
    (zone_connect 2) (tstamp ff944fa1-7b77-41c2-8dee-6fa441187350))
  (zone (net 0) (net_name "") (layer "F.Cu") (tstamp 80cf8585-90ff-4f4e-a81f-4dbf7e59ef63) (hatch edge 0.508)
    (connect_pads (clearance 0))
    (min_thickness 0.254)
    (keepout (tracks allowed) (vias not_allowed) (pads not_allowed) (copperpour not_allowed) (footprints not_allowed))
    (fill (thermal_gap 0.508) (thermal_bridge_width 0.508))
    (polygon
      (pts
        (xy 10.35 7.85)
        (xy -10.35 7.85)
        (xy -10.35 -7.85)
        (xy 10.35 -7.85)
      )
    )
  )
  (zone (net 0) (net_name "") (layer "In1.Cu") (tstamp 80cf8585-90ff-4f4e-a81f-4dbf7e59ef63) (hatch edge 0.508)
    (connect_pads (clearance 0))
    (min_thickness 0.254)
    (keepout (tracks allowed) (vias not_allowed) (pads not_allowed) (copperpour not_allowed) (footprints not_allowed))
    (fill (thermal_gap 0.508) (thermal_bridge_width 0.508))
    (polygon
      (pts
        (xy 10.35 6.99)
        (xy -10.35 6.99)
        (xy -10.35 -6.99)
        (xy 10.35 -6.99)
      )
    )
  )
)
