(module ODS_1072 (layer F.Cu) (tedit 5FD23C74)
  (fp_text reference REF** (at 0 4) (layer F.SilkS)
    (effects (font (size 1 1) (thickness 0.15)))
  )
  (fp_text value ODS_1072 (at 0 -4) (layer F.Fab)
    (effects (font (size 1 1) (thickness 0.15)))
  )
  (fp_line (start 1.111 -0.555) (end 1.111 1.111) (layer F.Fab) (width 0.1))
  (fp_line (start 1.111 1.111) (end -1.111 1.111) (layer F.Fab) (width 0.1))
  (fp_line (start -1.111 1.111) (end -1.111 -0.555) (layer F.Fab) (width 0.1))
  (fp_line (start -0.555 -1.111) (end 0.555 -1.111) (layer F.Fab) (width 0.1))
  (fp_line (start -1.111 -0.555) (end -0.555 -1.111) (layer F.Fab) (width 0.1))
  (fp_line (start 0.555 -1.111) (end 1.111 -0.555) (layer F.Fab) (width 0.1))
  (fp_line (start 1.45 2.3) (end 1.45 -2.3) (layer F.CrtYd) (width 0.05))
  (fp_line (start 1.45 -2.3) (end -1.45 -2.3) (layer F.CrtYd) (width 0.05))
  (fp_line (start -1.45 -2.3) (end -1.45 2.3) (layer F.CrtYd) (width 0.05))
  (fp_line (start -1.45 2.3) (end 1.45 2.3) (layer F.CrtYd) (width 0.05))
  (fp_line (start 1.5 2.35) (end 1.5 -2.35) (layer F.SilkS) (width 0.12))
  (fp_line (start 1.5 -2.35) (end -1.5 -2.35) (layer F.SilkS) (width 0.12))
  (fp_line (start -1.5 -2.35) (end -1.5 2.35) (layer F.SilkS) (width 0.12))
  (fp_line (start -1.5 2.35) (end 1.5 2.35) (layer F.SilkS) (width 0.12))
  (fp_circle (center 1.75 -2.6) (end 1.75 -2.5) (layer F.SilkS) (width 0.12))
  (fp_circle (center -1.75 -2.6) (end -1.75 -2.5) (layer F.SilkS) (width 0.12))
  (pad 1 smd rect (at 0 -1.395) (size 2.36 1.27) (layers F.Cu F.Paste F.Mask))
  (pad 2 smd rect (at 0 1.395) (size 2.36 1.27) (layers F.Cu F.Paste F.Mask))
)
