(footprint "Molex_SMSJ_Circulator"
	(version 20240108)
	(generator "pcbnew")
	(generator_version "8.0")
	(layer "F.Cu")
	(property "Reference" "U101"
		(at 0 -0.5 0)
		(unlocked yes)
		(layer "F.SilkS")
		(uuid "da92b3c4-ecdb-4e6b-81e9-7f95e931b43c")
		(effects
			(font
				(size 0.6 0.6)
				(thickness 0.15)
			)
		)
	)
	(property "Value" "~"
		(at 0 1 0)
		(unlocked yes)
		(layer "F.Fab")
		(hide yes)
		(uuid "6f6c2a34-81c1-4547-9ca0-f7d1b223299a")
		(effects
			(font
				(size 0.6 0.6)
				(thickness 0.15)
			)
		)
	)
	(property "Footprint" "POWDER_RF:Molex_SMSJ_Circulator"
		(at 0 0 0)
		(unlocked yes)
		(layer "F.Fab")
		(hide yes)
		(uuid "dcc9c79d-b1f6-4c13-8fc8-c58048e49f40")
		(effects
			(font
				(size 1.27 1.27)
				(thickness 0.15)
			)
		)
	)
	(property "Datasheet" ""
		(at 0 0 0)
		(unlocked yes)
		(layer "F.Fab")
		(hide yes)
		(uuid "7245df97-3825-4098-a677-32a246e40a42")
		(effects
			(font
				(size 1.27 1.27)
				(thickness 0.15)
			)
		)
	)
	(property "Description" ""
		(at 0 0 0)
		(unlocked yes)
		(layer "F.Fab")
		(hide yes)
		(uuid "ae04e20b-ecb7-45bc-95a9-621a3fac83e5")
		(effects
			(font
				(size 1.27 1.27)
				(thickness 0.15)
			)
		)
	)
	(property "Manufacturer" "Molex"
		(at 0 0 0)
		(unlocked yes)
		(layer "F.Fab")
		(hide yes)
		(uuid "5e251cbe-da56-4096-9ad2-37fa1c08caa1")
		(effects
			(font
				(size 0.6 0.6)
				(thickness 0.15)
			)
		)
	)
	(property "PartNumber" "735912048"
		(at 0 0 0)
		(unlocked yes)
		(layer "F.Fab")
		(hide yes)
		(uuid "0cebd52e-290e-4fc8-850e-9f5de7923157")
		(effects
			(font
				(size 0.6 0.6)
				(thickness 0.15)
			)
		)
	)
	(attr smd)
	(fp_circle
		(center -4.425 -2.55)
		(end -3.625 -2.55)
		(stroke
			(width 0)
			(type solid)
		)
		(fill solid)
		(layer "F.Paste")
		(uuid "9043de45-3a90-4ba2-b680-15ea7c2735ed")
	)
	(fp_circle
		(center 0 5.1)
		(end 0.8 5.1)
		(stroke
			(width 0)
			(type solid)
		)
		(fill solid)
		(layer "F.Paste")
		(uuid "eda01aee-11c3-4e9d-b3d4-7310305853c5")
	)
	(fp_circle
		(center 4.425 -2.55)
		(end 5.225 -2.55)
		(stroke
			(width 0)
			(type solid)
		)
		(fill solid)
		(layer "F.Paste")
		(uuid "3bae0cd7-832e-4aa1-95e9-a671559c8276")
	)
	(fp_line
		(start 4.75 3.5)
		(end 5.5 2.25)
		(stroke
			(width 0.1)
			(type default)
		)
		(layer "F.SilkS")
		(uuid "66d52c02-afac-4579-aae7-74baf5e6403f")
	)
	(fp_line
		(start 5.5 2.25)
		(end 5.25 2.25)
		(stroke
			(width 0.1)
			(type default)
		)
		(layer "F.SilkS")
		(uuid "35263b97-cd5a-4ad4-a478-9fd76c60fa4d")
	)
	(fp_line
		(start 5.5 2.25)
		(end 5.5 2.5)
		(stroke
			(width 0.1)
			(type default)
		)
		(layer "F.SilkS")
		(uuid "c0b3a71f-78df-45a4-aaa3-f47633a71e07")
	)
	(fp_arc
		(start -2.937216 -4.656743)
		(mid 0.017349 -5.505651)
		(end 2.966506 -4.638139)
		(stroke
			(width 0.1)
			(type default)
		)
		(layer "F.SilkS")
		(uuid "19cb9cd1-c109-4612-871c-62b4b7e3b1a4")
	)
	(fp_arc
		(start -2.56425 4.872075)
		(mid -4.776708 2.7378)
		(end -5.499999 -0.25)
		(stroke
			(width 0.1)
			(type default)
		)
		(layer "F.SilkS")
		(uuid "7137f147-ac34-45e9-9600-1355b4c88bc4")
	)
	(fp_arc
		(start 5.499999 -0.25)
		(mid 4.747935 2.787401)
		(end 2.462214 4.924428)
		(stroke
			(width 0.1)
			(type default)
		)
		(layer "F.SilkS")
		(uuid "e3a07496-5d4f-4912-9e76-988607688542")
	)
	(fp_circle
		(center 0 0)
		(end 5 0)
		(stroke
			(width 0.1)
			(type default)
		)
		(fill none)
		(layer "F.Fab")
		(uuid "66b3827a-8f76-44fe-a766-367e4cff47ae")
	)
	(pad "" smd roundrect
		(at -4.75 -0.25)
		(size 0.4 0.4)
		(layers "F.Paste")
		(roundrect_rratio 0.25)
		(uuid "9298e022-f96a-4a52-b6be-c508dc5a7847")
	)
	(pad "" smd roundrect
		(at -4.5 0.5)
		(size 0.85 0.85)
		(layers "F.Paste")
		(roundrect_rratio 0.25)
		(uuid "35b9a71c-99e3-4d52-886a-a4bc3620fe8f")
	)
	(pad "" smd roundrect
		(at -4.5 1.5)
		(size 0.85 0.85)
		(layers "F.Paste")
		(roundrect_rratio 0.25)
		(uuid "79b5b2a1-1beb-4439-8adc-c1ab1faf132e")
	)
	(pad "" smd roundrect
		(at -4.25 -0.25)
		(size 0.4 0.4)
		(layers "F.Paste")
		(roundrect_rratio 0.25)
		(uuid "46502bd9-553e-4b0f-aee1-9fd310d6f04b")
	)
	(pad "" smd roundrect
		(at -4.25 2.25)
		(size 0.4 0.4)
		(layers "F.Paste")
		(roundrect_rratio 0.25)
		(uuid "bb9146c0-bf94-4dee-9bdc-9de38d0d46bd")
	)
	(pad "" smd roundrect
		(at -3.75 -0.25)
		(size 0.4 0.4)
		(layers "F.Paste")
		(roundrect_rratio 0.25)
		(uuid "ec1462f9-9599-4c2f-946f-73b6701ed22f")
	)
	(pad "" smd roundrect
		(at -3.75 3.25)
		(size 0.4 0.4)
		(layers "F.Paste")
		(roundrect_rratio 0.25)
		(uuid "e72521bd-a6d0-4103-8062-1775f20bcc2d")
	)
	(pad "" smd roundrect
		(at -3.5 0.5)
		(size 0.85 0.85)
		(layers "F.Paste")
		(roundrect_rratio 0.25)
		(uuid "99805304-c020-4dfd-9e7f-8acabc91681a")
	)
	(pad "" smd roundrect
		(at -3.5 1.5)
		(size 0.85 0.85)
		(layers "F.Paste")
		(roundrect_rratio 0.25)
		(uuid "a8f7de47-21dd-4c95-ae74-1a18e47131a4")
	)
	(pad "" smd roundrect
		(at -3.5 2.5)
		(size 0.85 0.85)
		(layers "F.Paste")
		(roundrect_rratio 0.25)
		(uuid "6d0f4f75-2059-4120-a568-5faec740bf3b")
	)
	(pad "" smd roundrect
		(at -3.25 -0.25)
		(size 0.4 0.4)
		(layers "F.Paste")
		(roundrect_rratio 0.25)
		(uuid "0727a863-6b38-44a5-aa7d-1063b0eb3f89")
	)
	(pad "" smd roundrect
		(at -3.25 3.25)
		(size 0.4 0.4)
		(layers "F.Paste")
		(roundrect_rratio 0.25)
		(uuid "dcdabc8c-83b7-40ef-814f-6ab1cb0a83d1")
	)
	(pad "" smd roundrect
		(at -3.25 3.75)
		(size 0.4 0.4)
		(layers "F.Paste")
		(roundrect_rratio 0.25)
		(uuid "c1418737-8b4e-487a-812a-016024ffec07")
	)
	(pad "" smd roundrect
		(at -2.5 -0.5)
		(size 0.85 0.85)
		(layers "F.Paste")
		(roundrect_rratio 0.25)
		(uuid "d30e1581-1bbc-4ec9-81ad-3fbe841576e3")
	)
	(pad "" smd roundrect
		(at -2.5 0.5)
		(size 0.85 0.85)
		(layers "F.Paste")
		(roundrect_rratio 0.25)
		(uuid "08e165a2-6ad8-45ba-b7d0-187e5b355603")
	)
	(pad "" smd roundrect
		(at -2.5 1.5)
		(size 0.85 0.85)
		(layers "F.Paste")
		(roundrect_rratio 0.25)
		(uuid "d53da9b2-c372-44b2-a0e0-95e125918c73")
	)
	(pad "" smd roundrect
		(at -2.5 2.5)
		(size 0.85 0.85)
		(layers "F.Paste")
		(roundrect_rratio 0.25)
		(uuid "8f8e1951-130e-4a7e-b2c9-7ca905549333")
	)
	(pad "" smd roundrect
		(at -2.5 3.5)
		(size 0.85 0.85)
		(layers "F.Paste")
		(roundrect_rratio 0.25)
		(uuid "ca02148b-1aec-4985-87a9-2d28fad0bff0")
	)
	(pad "" smd roundrect
		(at -2.25 -4.25)
		(size 0.4 0.4)
		(layers "F.Paste")
		(roundrect_rratio 0.25)
		(uuid "0d2e6ae5-db03-4d0d-89b5-3ef2f7f0c94e")
	)
	(pad "" smd roundrect
		(at -2.25 -3.75)
		(size 0.4 0.4)
		(layers "F.Paste")
		(roundrect_rratio 0.25)
		(uuid "6e557eb0-0a3a-48da-8b1f-0f492ecfb5af")
	)
	(pad "" smd roundrect
		(at -2.25 -1.75)
		(size 0.4 0.4)
		(layers "F.Paste")
		(roundrect_rratio 0.25)
		(uuid "ff21d996-f180-4238-874b-c20c01567041")
	)
	(pad "" smd roundrect
		(at -2.25 -1.25)
		(size 0.4 0.4)
		(layers "F.Paste")
		(roundrect_rratio 0.25)
		(uuid "10bde4d4-b61e-49d7-9332-f0baab268fec")
	)
	(pad "" smd roundrect
		(at -2.25 4.25)
		(size 0.4 0.4)
		(layers "F.Paste")
		(roundrect_rratio 0.25)
		(uuid "671467c8-bf50-44f6-a643-8be63cdab4a8")
	)
	(pad "" smd roundrect
		(at -1.75 3.25)
		(size 0.4 0.4)
		(layers "F.Paste")
		(roundrect_rratio 0.25)
		(uuid "e0dc7e38-da6a-4d5e-baee-fd2370338735")
	)
	(pad "" smd roundrect
		(at -1.5 -4.5)
		(size 0.85 0.85)
		(layers "F.Paste")
		(roundrect_rratio 0.25)
		(uuid "26733658-9c39-4742-ba60-158e0427750f")
	)
	(pad "" smd roundrect
		(at -1.5 -3.5)
		(size 0.85 0.85)
		(layers "F.Paste")
		(roundrect_rratio 0.25)
		(uuid "d87ece28-2ad8-4c3b-a2df-d6f8e6524bab")
	)
	(pad "" smd roundrect
		(at -1.5 -2.5)
		(size 0.85 0.85)
		(layers "F.Paste")
		(roundrect_rratio 0.25)
		(uuid "abbd8edf-74eb-4f81-944c-5fdc7310298f")
	)
	(pad "" smd roundrect
		(at -1.5 -1.5)
		(size 0.85 0.85)
		(layers "F.Paste")
		(roundrect_rratio 0.25)
		(uuid "d66e9234-7f9e-4fb3-bb36-2197923767a6")
	)
	(pad "" smd roundrect
		(at -1.5 -0.5)
		(size 0.85 0.85)
		(layers "F.Paste")
		(roundrect_rratio 0.25)
		(uuid "9bdf20f8-f35f-4fe8-b2b7-bf853500ccd6")
	)
	(pad "" smd roundrect
		(at -1.5 0.5)
		(size 0.85 0.85)
		(layers "F.Paste")
		(roundrect_rratio 0.25)
		(uuid "52b225ef-89e4-4261-bd05-82664ae7759a")
	)
	(pad "" smd roundrect
		(at -1.5 1.5)
		(size 0.85 0.85)
		(layers "F.Paste")
		(roundrect_rratio 0.25)
		(uuid "eee01b2d-a39f-42ca-b2dc-cbda605d31cb")
	)
	(pad "" smd roundrect
		(at -1.5 2.5)
		(size 0.85 0.85)
		(layers "F.Paste")
		(roundrect_rratio 0.25)
		(uuid "26028ee7-6078-4df8-88b7-edb692c65b32")
	)
	(pad "" smd roundrect
		(at -0.5 -4.5)
		(size 0.85 0.85)
		(layers "F.Paste")
		(roundrect_rratio 0.25)
		(uuid "7c21cb7d-0cb2-438f-be8d-bfb048f16827")
	)
	(pad "" smd roundrect
		(at -0.5 -3.5)
		(size 0.85 0.85)
		(layers "F.Paste")
		(roundrect_rratio 0.25)
		(uuid "0a5fe944-cf9b-4a1f-b129-e59eea2e39e4")
	)
	(pad "" smd roundrect
		(at -0.5 -2.5)
		(size 0.85 0.85)
		(layers "F.Paste")
		(roundrect_rratio 0.25)
		(uuid "a870db80-994d-4675-94a8-6fbea8254426")
	)
	(pad "" smd roundrect
		(at -0.5 -1.5)
		(size 0.85 0.85)
		(layers "F.Paste")
		(roundrect_rratio 0.25)
		(uuid "9bf260af-9aef-4d04-b108-fe40e6bce804")
	)
	(pad "" smd roundrect
		(at -0.5 -0.5)
		(size 0.85 0.85)
		(layers "F.Paste")
		(roundrect_rratio 0.25)
		(uuid "3d17e8a5-32b6-45c2-8f3d-0742c23a9219")
	)
	(pad "" smd roundrect
		(at -0.5 0.5)
		(size 0.85 0.85)
		(layers "F.Paste")
		(roundrect_rratio 0.25)
		(uuid "a2bfe23d-3743-4baa-af60-0d926f902adb")
	)
	(pad "" smd roundrect
		(at -0.5 1.5)
		(size 0.85 0.85)
		(layers "F.Paste")
		(roundrect_rratio 0.25)
		(uuid "b226b953-d37c-4e7d-a0bf-57caea555b3c")
	)
	(pad "" smd roundrect
		(at -0.5 2.5)
		(size 0.85 0.85)
		(layers "F.Paste")
		(roundrect_rratio 0.25)
		(uuid "f7c6b1b7-9847-4b93-af2f-e1a405faea2b")
	)
	(pad "" smd roundrect
		(at 0.5 -4.5)
		(size 0.85 0.85)
		(layers "F.Paste")
		(roundrect_rratio 0.25)
		(uuid "7be7d660-a0c5-4488-9bd4-35a8b9867592")
	)
	(pad "" smd roundrect
		(at 0.5 -3.5)
		(size 0.85 0.85)
		(layers "F.Paste")
		(roundrect_rratio 0.25)
		(uuid "cf34d2c6-9a70-448e-bb7c-6d61adee7bd3")
	)
	(pad "" smd roundrect
		(at 0.5 -2.5)
		(size 0.85 0.85)
		(layers "F.Paste")
		(roundrect_rratio 0.25)
		(uuid "be09be75-b749-471d-b22e-60fcb53515df")
	)
	(pad "" smd roundrect
		(at 0.5 -1.5)
		(size 0.85 0.85)
		(layers "F.Paste")
		(roundrect_rratio 0.25)
		(uuid "33fbed02-cf20-4732-b5cc-64aaec5ffdc5")
	)
	(pad "" smd roundrect
		(at 0.5 -0.5)
		(size 0.85 0.85)
		(layers "F.Paste")
		(roundrect_rratio 0.25)
		(uuid "a6714d33-162d-413f-a1dd-5e5ab56e03d9")
	)
	(pad "" smd roundrect
		(at 0.5 0.5)
		(size 0.85 0.85)
		(layers "F.Paste")
		(roundrect_rratio 0.25)
		(uuid "3399ee36-7e72-4c14-b82f-e00dacc8a788")
	)
	(pad "" smd roundrect
		(at 0.5 1.5)
		(size 0.85 0.85)
		(layers "F.Paste")
		(roundrect_rratio 0.25)
		(uuid "375fa518-b5e6-43c8-9b00-d0306333eae3")
	)
	(pad "" smd roundrect
		(at 0.5 2.5)
		(size 0.85 0.85)
		(layers "F.Paste")
		(roundrect_rratio 0.25)
		(uuid "97535010-89e0-4665-aa43-2d385c04e6d8")
	)
	(pad "" smd roundrect
		(at 1.5 -4.5)
		(size 0.85 0.85)
		(layers "F.Paste")
		(roundrect_rratio 0.25)
		(uuid "8dd6d5e0-47db-4f09-b73a-2e29d97dfba1")
	)
	(pad "" smd roundrect
		(at 1.5 -3.5)
		(size 0.85 0.85)
		(layers "F.Paste")
		(roundrect_rratio 0.25)
		(uuid "0a8445e7-bfe0-42b2-8b60-bbca9952921b")
	)
	(pad "" smd roundrect
		(at 1.5 -2.5)
		(size 0.85 0.85)
		(layers "F.Paste")
		(roundrect_rratio 0.25)
		(uuid "7499c2ed-be2a-4680-ad87-4acf3928c41c")
	)
	(pad "" smd roundrect
		(at 1.5 -1.5)
		(size 0.85 0.85)
		(layers "F.Paste")
		(roundrect_rratio 0.25)
		(uuid "d6edd0e0-7cd1-4657-8c6d-3a5ddc8012cf")
	)
	(pad "" smd roundrect
		(at 1.5 -0.5)
		(size 0.85 0.85)
		(layers "F.Paste")
		(roundrect_rratio 0.25)
		(uuid "acfdc7fb-2125-419f-9db8-147bd220e13a")
	)
	(pad "" smd roundrect
		(at 1.5 0.5)
		(size 0.85 0.85)
		(layers "F.Paste")
		(roundrect_rratio 0.25)
		(uuid "f722ea36-aeb5-4dae-9949-2493396f13f7")
	)
	(pad "" smd roundrect
		(at 1.5 1.5)
		(size 0.85 0.85)
		(layers "F.Paste")
		(roundrect_rratio 0.25)
		(uuid "9e956ca5-df1a-42e0-bda7-64795d6e2092")
	)
	(pad "" smd roundrect
		(at 1.5 2.5)
		(size 0.85 0.85)
		(layers "F.Paste")
		(roundrect_rratio 0.25)
		(uuid "a3316a5f-4962-47d1-9f5e-f10025f33db0")
	)
	(pad "" smd roundrect
		(at 1.75 3.25)
		(size 0.4 0.4)
		(layers "F.Paste")
		(roundrect_rratio 0.25)
		(uuid "5c27493a-dcde-4a42-9129-8e22f4556ad3")
	)
	(pad "" smd roundrect
		(at 2.25 -4.25)
		(size 0.4 0.4)
		(layers "F.Paste")
		(roundrect_rratio 0.25)
		(uuid "d72dbe5d-ddbc-4f01-8861-8ecae1e1b1cc")
	)
	(pad "" smd roundrect
		(at 2.25 -3.75)
		(size 0.4 0.4)
		(layers "F.Paste")
		(roundrect_rratio 0.25)
		(uuid "301807b1-7d54-47ed-ace6-fab9da7de241")
	)
	(pad "" smd roundrect
		(at 2.25 -1.75)
		(size 0.4 0.4)
		(layers "F.Paste")
		(roundrect_rratio 0.25)
		(uuid "a7a3800d-3b74-4885-988d-b625a39e427f")
	)
	(pad "" smd roundrect
		(at 2.25 -1.25)
		(size 0.4 0.4)
		(layers "F.Paste")
		(roundrect_rratio 0.25)
		(uuid "12f32fa4-f0e8-4759-9725-bb6ba84855e1")
	)
	(pad "" smd roundrect
		(at 2.25 4.25)
		(size 0.4 0.4)
		(layers "F.Paste")
		(roundrect_rratio 0.25)
		(uuid "94aebccc-c6ec-4a3a-ba02-b4fb1d78c4ae")
	)
	(pad "" smd roundrect
		(at 2.5 -0.5)
		(size 0.85 0.85)
		(layers "F.Paste")
		(roundrect_rratio 0.25)
		(uuid "688059d0-16ba-4303-9c5b-9e68521aa075")
	)
	(pad "" smd roundrect
		(at 2.5 0.5)
		(size 0.85 0.85)
		(layers "F.Paste")
		(roundrect_rratio 0.25)
		(uuid "c2fc6b6f-0740-4b4d-ad9e-b4e69385e0e5")
	)
	(pad "" smd roundrect
		(at 2.5 1.5)
		(size 0.85 0.85)
		(layers "F.Paste")
		(roundrect_rratio 0.25)
		(uuid "54a5aae4-e4f5-4216-affb-93080894eaa6")
	)
	(pad "" smd roundrect
		(at 2.5 2.5)
		(size 0.85 0.85)
		(layers "F.Paste")
		(roundrect_rratio 0.25)
		(uuid "610698c3-5d16-4844-908d-55ffa7daf64a")
	)
	(pad "" smd roundrect
		(at 2.5 3.5)
		(size 0.85 0.85)
		(layers "F.Paste")
		(roundrect_rratio 0.25)
		(uuid "5077b3c1-c51f-45b5-955f-ae990b0b9548")
	)
	(pad "" smd roundrect
		(at 3.25 -0.25)
		(size 0.4 0.4)
		(layers "F.Paste")
		(roundrect_rratio 0.25)
		(uuid "b3daabe0-c7b5-493c-bf03-18aca4d6892c")
	)
	(pad "" smd roundrect
		(at 3.25 3.25)
		(size 0.4 0.4)
		(layers "F.Paste")
		(roundrect_rratio 0.25)
		(uuid "3cf629b2-060f-44f5-ade6-a3be2e32fe64")
	)
	(pad "" smd roundrect
		(at 3.25 3.75)
		(size 0.4 0.4)
		(layers "F.Paste")
		(roundrect_rratio 0.25)
		(uuid "c45ced80-8d8b-4003-83d3-d97bef40586c")
	)
	(pad "" smd roundrect
		(at 3.5 0.5)
		(size 0.85 0.85)
		(layers "F.Paste")
		(roundrect_rratio 0.25)
		(uuid "61dd2a35-6b18-41c7-83a8-a22cbd55f48e")
	)
	(pad "" smd roundrect
		(at 3.5 1.5)
		(size 0.85 0.85)
		(layers "F.Paste")
		(roundrect_rratio 0.25)
		(uuid "ae70b068-0dfc-49cc-ad13-dff80460238e")
	)
	(pad "" smd roundrect
		(at 3.5 2.5)
		(size 0.85 0.85)
		(layers "F.Paste")
		(roundrect_rratio 0.25)
		(uuid "b74c8855-ae4a-4971-8b76-870e848932d8")
	)
	(pad "" smd roundrect
		(at 3.75 -0.25)
		(size 0.4 0.4)
		(layers "F.Paste")
		(roundrect_rratio 0.25)
		(uuid "4ab4a2aa-2f98-44b4-85b5-d3855f712bae")
	)
	(pad "" smd roundrect
		(at 3.75 3.25)
		(size 0.4 0.4)
		(layers "F.Paste")
		(roundrect_rratio 0.25)
		(uuid "df280a52-ebff-45db-a092-bb225547a117")
	)
	(pad "" smd roundrect
		(at 4.25 -0.25)
		(size 0.4 0.4)
		(layers "F.Paste")
		(roundrect_rratio 0.25)
		(uuid "0cc971b7-8335-4912-8146-635ed0e3bf9c")
	)
	(pad "" smd roundrect
		(at 4.25 2.25)
		(size 0.4 0.4)
		(layers "F.Paste")
		(roundrect_rratio 0.25)
		(uuid "b05d124d-4cd0-4800-a8c7-27868927ffa7")
	)
	(pad "" smd roundrect
		(at 4.5 0.5)
		(size 0.85 0.85)
		(layers "F.Paste")
		(roundrect_rratio 0.25)
		(uuid "e03aa9fa-bb8b-4a11-bbaf-eac8b9ea4b09")
	)
	(pad "" smd roundrect
		(at 4.5 1.5)
		(size 0.85 0.85)
		(layers "F.Paste")
		(roundrect_rratio 0.25)
		(uuid "89453218-5309-4e7c-b2cf-52695ea1c164")
	)
	(pad "" smd roundrect
		(at 4.75 -0.25)
		(size 0.4 0.4)
		(layers "F.Paste")
		(roundrect_rratio 0.25)
		(uuid "d47fa2f4-eb92-495c-bfa9-0927c18aa825")
	)
	(pad "1" smd roundrect
		(at 5.152821 -2.975 30)
		(size 3.7 2)
		(layers "F.Cu" "F.Mask")
		(roundrect_rratio 0.5)
		(clearance 1.1)
		(uuid "17a1ea63-0661-4651-baf6-fd04592b2574")
	)
	(pad "2" smd roundrect
		(at -5.152821 -2.975 330)
		(size 3.7 2)
		(layers "F.Cu" "F.Mask")
		(roundrect_rratio 0.5)
		(clearance 1.1)
		(uuid "79df6270-26dc-4a49-af42-507318dcb3ec")
	)
	(pad "3" smd roundrect
		(at 0 5.95 90)
		(size 3.7 2)
		(layers "F.Cu" "F.Mask")
		(roundrect_rratio 0.5)
		(clearance 1.1)
		(uuid "11ffd9e6-609d-4fa7-ad9b-797995575e0c")
	)
	(pad "4" thru_hole circle
		(at -4.9 -0.175)
		(size 0.6096 0.6096)
		(drill 0.3048)
		(layers "*.Cu" "*.Mask")
		(remove_unused_layers no)
		(uuid "2f25ad12-a6eb-493e-9d4b-2509a50b622b")
	)
	(pad "4" thru_hole circle
		(at -4.5 0.9)
		(size 0.6096 0.6096)
		(drill 0.3048)
		(layers "*.Cu" "*.Mask")
		(remove_unused_layers no)
		(uuid "665e001e-abc6-4b0e-b7e8-a7478fe97e19")
	)
	(pad "4" thru_hole circle
		(at -4.5 1.5)
		(size 0.6096 0.6096)
		(drill 0.3048)
		(layers "*.Cu" "*.Mask")
		(remove_unused_layers no)
		(uuid "8b86e910-15ee-494f-8037-78d65b94db20")
	)
	(pad "4" thru_hole circle
		(at -4.3 -0.125)
		(size 0.6096 0.6096)
		(drill 0.3048)
		(layers "*.Cu" "*.Mask")
		(remove_unused_layers no)
		(uuid "ce0d0d3f-b476-4e18-a421-7ef4ce838255")
	)
	(pad "4" thru_hole circle
		(at -4 0.6)
		(size 0.6096 0.6096)
		(drill 0.3048)
		(layers "*.Cu" "*.Mask")
		(remove_unused_layers no)
		(uuid "ac3fde7e-c4d7-4dad-87cb-93d50f16f9a4")
	)
	(pad "4" thru_hole circle
		(at -4 1.2)
		(size 0.6096 0.6096)
		(drill 0.3048)
		(layers "*.Cu" "*.Mask")
		(remove_unused_layers no)
		(uuid "70ba9ff9-865b-4e93-8d5f-dcb3886ce25f")
	)
	(pad "4" thru_hole circle
		(at -4 1.8)
		(size 0.6096 0.6096)
		(drill 0.3048)
		(layers "*.Cu" "*.Mask")
		(remove_unused_layers no)
		(uuid "983d69d7-fddf-4afa-84ed-750a9f3c5f54")
	)
	(pad "4" thru_hole circle
		(at -4 2.4)
		(size 0.6096 0.6096)
		(drill 0.3048)
		(layers "*.Cu" "*.Mask")
		(remove_unused_layers no)
		(uuid "67e41b33-3026-4350-a27a-7b7ca3350533")
	)
	(pad "4" thru_hole circle
		(at -3.7 -0.225)
		(size 0.6096 0.6096)
		(drill 0.3048)
		(layers "*.Cu" "*.Mask")
		(remove_unused_layers no)
		(uuid "c932d0dc-8533-43cc-99c0-1de39ab4a866")
	)
	(pad "4" thru_hole circle
		(at -3.5 0.3)
		(size 0.6096 0.6096)
		(drill 0.3048)
		(layers "*.Cu" "*.Mask")
		(remove_unused_layers no)
		(uuid "6e680ddd-5219-4968-87d6-be0662ffebd9")
	)
	(pad "4" thru_hole circle
		(at -3.5 0.9)
		(size 0.6096 0.6096)
		(drill 0.3048)
		(layers "*.Cu" "*.Mask")
		(remove_unused_layers no)
		(uuid "cd737cc0-d14b-43e6-92ef-2c1b20364c84")
	)
	(pad "4" thru_hole circle
		(at -3.5 1.5)
		(size 0.6096 0.6096)
		(drill 0.3048)
		(layers "*.Cu" "*.Mask")
		(remove_unused_layers no)
		(uuid "3be10ba7-74f8-46d2-9150-d5e9e427555e")
	)
	(pad "4" thru_hole circle
		(at -3.5 2.1)
		(size 0.6096 0.6096)
		(drill 0.3048)
		(layers "*.Cu" "*.Mask")
		(remove_unused_layers no)
		(uuid "4479755e-a2a4-4845-a9e4-7fce9107b7d7")
	)
	(pad "4" thru_hole circle
		(at -3.5 2.7)
		(size 0.6096 0.6096)
		(drill 0.3048)
		(layers "*.Cu" "*.Mask")
		(remove_unused_layers no)
		(uuid "22501ebb-0d02-4c1e-8a79-323ea59e9056")
	)
	(pad "4" thru_hole circle
		(at -3.5 3.3)
		(size 0.6096 0.6096)
		(drill 0.3048)
		(layers "*.Cu" "*.Mask")
		(remove_unused_layers no)
		(uuid "5d541945-6393-4d82-bfad-d1050aff9e14")
	)
	(pad "4" thru_hole circle
		(at -3.125 -0.5)
		(size 0.6096 0.6096)
		(drill 0.3048)
		(layers "*.Cu" "*.Mask")
		(remove_unused_layers no)
		(uuid "90e55125-6b6a-4dc8-a62a-92c3675b61fc")
	)
	(pad "4" thru_hole circle
		(at -3 0)
		(size 0.6096 0.6096)
		(drill 0.3048)
		(layers "*.Cu" "*.Mask")
		(remove_unused_layers no)
		(uuid "896b9453-08f7-4aa5-ae33-42354410af63")
	)
	(pad "4" thru_hole circle
		(at -3 0.6)
		(size 0.6096 0.6096)
		(drill 0.3048)
		(layers "*.Cu" "*.Mask")
		(remove_unused_layers no)
		(uuid "548de45c-8c59-432b-bf0f-c69fe64d34d3")
	)
	(pad "4" thru_hole circle
		(at -3 1.2)
		(size 0.6096 0.6096)
		(drill 0.3048)
		(layers "*.Cu" "*.Mask")
		(remove_unused_layers no)
		(uuid "f6cce9e4-9174-40b8-8573-92683e0663e5")
	)
	(pad "4" thru_hole circle
		(at -3 1.8)
		(size 0.6096 0.6096)
		(drill 0.3048)
		(layers "*.Cu" "*.Mask")
		(remove_unused_layers no)
		(uuid "9049a4ba-f9f9-498b-a17a-9eba0a25d3d4")
	)
	(pad "4" thru_hole circle
		(at -3 2.4)
		(size 0.6096 0.6096)
		(drill 0.3048)
		(layers "*.Cu" "*.Mask")
		(remove_unused_layers no)
		(uuid "83d3d38b-5897-4973-a150-99ec200b88df")
	)
	(pad "4" thru_hole circle
		(at -3 3)
		(size 0.6096 0.6096)
		(drill 0.3048)
		(layers "*.Cu" "*.Mask")
		(remove_unused_layers no)
		(uuid "a5de2810-0c88-4c82-a163-26f8597f4c62")
	)
	(pad "4" thru_hole circle
		(at -3 3.6)
		(size 0.6096 0.6096)
		(drill 0.3048)
		(layers "*.Cu" "*.Mask")
		(remove_unused_layers no)
		(uuid "c6895e75-1af8-4b14-bd27-abc11b980ef7")
	)
	(pad "4" thru_hole circle
		(at -2.625 -0.9)
		(size 0.6096 0.6096)
		(drill 0.3048)
		(layers "*.Cu" "*.Mask")
		(remove_unused_layers no)
		(uuid "4ab5bbb5-664b-4036-832d-456d08c348c3")
	)
	(pad "4" thru_hole circle
		(at -2.575 -4.125)
		(size 0.6096 0.6096)
		(drill 0.3048)
		(layers "*.Cu" "*.Mask")
		(remove_unused_layers no)
		(uuid "f188aa5b-31c9-4f51-923a-fe7d518dabac")
	)
	(pad "4" thru_hole circle
		(at -2.5 -0.3)
		(size 0.6096 0.6096)
		(drill 0.3048)
		(layers "*.Cu" "*.Mask")
		(remove_unused_layers no)
		(uuid "75ac9308-61a7-44a3-8427-5d47316e97b3")
	)
	(pad "4" thru_hole circle
		(at -2.5 0.3)
		(size 0.6096 0.6096)
		(drill 0.3048)
		(layers "*.Cu" "*.Mask")
		(remove_unused_layers no)
		(uuid "c8e08e3d-dee1-4978-9bea-f416cf72b5cf")
	)
	(pad "4" thru_hole circle
		(at -2.5 0.9)
		(size 0.6096 0.6096)
		(drill 0.3048)
		(layers "*.Cu" "*.Mask")
		(remove_unused_layers no)
		(uuid "0956007b-da43-48ba-b78b-431aa9d295bd")
	)
	(pad "4" thru_hole circle
		(at -2.5 1.5)
		(size 0.6096 0.6096)
		(drill 0.3048)
		(layers "*.Cu" "*.Mask")
		(remove_unused_layers no)
		(uuid "5c420165-0237-4272-a4dd-b45cf1b08ff1")
	)
	(pad "4" thru_hole circle
		(at -2.5 2.1)
		(size 0.6096 0.6096)
		(drill 0.3048)
		(layers "*.Cu" "*.Mask")
		(remove_unused_layers no)
		(uuid "209f8104-8589-47e3-ba7e-7b73ae75ffb5")
	)
	(pad "4" thru_hole circle
		(at -2.5 2.7)
		(size 0.6096 0.6096)
		(drill 0.3048)
		(layers "*.Cu" "*.Mask")
		(remove_unused_layers no)
		(uuid "0a7a7147-214e-4352-bd18-40a3348dcc3a")
	)
	(pad "4" thru_hole circle
		(at -2.5 3.3)
		(size 0.6096 0.6096)
		(drill 0.3048)
		(layers "*.Cu" "*.Mask")
		(remove_unused_layers no)
		(uuid "519092df-9417-4c22-b443-9392ebad972f")
	)
	(pad "4" thru_hole circle
		(at -2.275 -3.675)
		(size 0.6096 0.6096)
		(drill 0.3048)
		(layers "*.Cu" "*.Mask")
		(remove_unused_layers no)
		(uuid "df237bcb-1ef1-44f3-8fa1-7153ffb08315")
	)
	(pad "4" thru_hole circle
		(at -2.275 -1.4)
		(size 0.6096 0.6096)
		(drill 0.3048)
		(layers "*.Cu" "*.Mask")
		(remove_unused_layers no)
		(uuid "aa95cd47-52d2-43f0-912b-174dcdeecc96")
	)
	(pad "4" thru_hole circle
		(at -2.275 4.3)
		(size 0.6096 0.6096)
		(drill 0.3048)
		(layers "*.Cu" "*.Mask")
		(remove_unused_layers no)
		(uuid "86d2b7d1-5676-48f7-8d48-76ebb55d4cc0")
	)
	(pad "4" thru_hole circle
		(at -2.075 -3.2)
		(size 0.6096 0.6096)
		(drill 0.3048)
		(layers "*.Cu" "*.Mask")
		(remove_unused_layers no)
		(uuid "23c9d1ca-6f54-4da3-9c1a-12d18caa366b")
	)
	(pad "4" thru_hole circle
		(at -2.05 -1.975)
		(size 0.6096 0.6096)
		(drill 0.3048)
		(layers "*.Cu" "*.Mask")
		(remove_unused_layers no)
		(uuid "dbab0f5b-1632-4b38-a384-b8d7250ac5d5")
	)
	(pad "4" thru_hole circle
		(at -2 -4.2)
		(size 0.6096 0.6096)
		(drill 0.3048)
		(layers "*.Cu" "*.Mask")
		(remove_unused_layers no)
		(uuid "d5dc2133-a488-430b-970a-62905514c468")
	)
	(pad "4" thru_hole circle
		(at -2 -2.6)
		(size 0.6096 0.6096)
		(drill 0.3048)
		(layers "*.Cu" "*.Mask")
		(remove_unused_layers no)
		(uuid "aca435a5-23d0-46ec-9854-c596844682fa")
	)
	(pad "4" thru_hole circle
		(at -2 -0.6)
		(size 0.6096 0.6096)
		(drill 0.3048)
		(layers "*.Cu" "*.Mask")
		(remove_unused_layers no)
		(uuid "6be9d07d-1797-4430-aba8-69e066f8c70b")
	)
	(pad "4" thru_hole circle
		(at -2 0)
		(size 0.6096 0.6096)
		(drill 0.3048)
		(layers "*.Cu" "*.Mask")
		(remove_unused_layers no)
		(uuid "d6472ac1-1714-48a0-bfee-2d8a1fd0c995")
	)
	(pad "4" thru_hole circle
		(at -2 0.6)
		(size 0.6096 0.6096)
		(drill 0.3048)
		(layers "*.Cu" "*.Mask")
		(remove_unused_layers no)
		(uuid "a4c1bbe4-2b3b-4f15-b76b-14d68ca95221")
	)
	(pad "4" thru_hole circle
		(at -2 1.2)
		(size 0.6096 0.6096)
		(drill 0.3048)
		(layers "*.Cu" "*.Mask")
		(remove_unused_layers no)
		(uuid "67ea418b-08ff-4004-951b-0b71dc97fc09")
	)
	(pad "4" thru_hole circle
		(at -2 1.8)
		(size 0.6096 0.6096)
		(drill 0.3048)
		(layers "*.Cu" "*.Mask")
		(remove_unused_layers no)
		(uuid "d6ddb57a-80fc-42cc-9755-fdd46761af16")
	)
	(pad "4" thru_hole circle
		(at -2 2.4)
		(size 0.6096 0.6096)
		(drill 0.3048)
		(layers "*.Cu" "*.Mask")
		(remove_unused_layers no)
		(uuid "828c0205-8239-4c5f-bdb7-1b5c4958a36b")
	)
	(pad "4" thru_hole circle
		(at -2 3.75)
		(size 0.6096 0.6096)
		(drill 0.3048)
		(layers "*.Cu" "*.Mask")
		(remove_unused_layers no)
		(uuid "f4d9786f-7b83-4839-a504-86bf90620e82")
	)
	(pad "4" thru_hole circle
		(at -1.6 3.275)
		(size 0.6096 0.6096)
		(drill 0.3048)
		(layers "*.Cu" "*.Mask")
		(remove_unused_layers no)
		(uuid "23d16a84-64e2-4a81-aab3-55e2ac9b1a5a")
	)
	(pad "4" thru_hole circle
		(at -1.5 -4.5)
		(size 0.6096 0.6096)
		(drill 0.3048)
		(layers "*.Cu" "*.Mask")
		(remove_unused_layers no)
		(uuid "cd17a160-e0e1-41a6-b226-9168ee5a76df")
	)
	(pad "4" thru_hole circle
		(at -1.5 -3.9)
		(size 0.6096 0.6096)
		(drill 0.3048)
		(layers "*.Cu" "*.Mask")
		(remove_unused_layers no)
		(uuid "fc10d02d-61b9-4a97-b20a-d0a12b1c6340")
	)
	(pad "4" thru_hole circle
		(at -1.5 -3.3)
		(size 0.6096 0.6096)
		(drill 0.3048)
		(layers "*.Cu" "*.Mask")
		(remove_unused_layers no)
		(uuid "5ee6f96f-59a4-4665-a63a-7503d88f89cf")
	)
	(pad "4" thru_hole circle
		(at -1.5 -2.7)
		(size 0.6096 0.6096)
		(drill 0.3048)
		(layers "*.Cu" "*.Mask")
		(remove_unused_layers no)
		(uuid "adfedd05-e7ae-409b-b7b2-cc4af93fcfe1")
	)
	(pad "4" thru_hole circle
		(at -1.5 -2.1)
		(size 0.6096 0.6096)
		(drill 0.3048)
		(layers "*.Cu" "*.Mask")
		(remove_unused_layers no)
		(uuid "c14b4c4d-b802-4bdb-bbf8-e2b114e173ca")
	)
	(pad "4" thru_hole circle
		(at -1.5 -1.5)
		(size 0.6096 0.6096)
		(drill 0.3048)
		(layers "*.Cu" "*.Mask")
		(remove_unused_layers no)
		(uuid "ad50b800-5c72-4227-a221-6a874fae4ac5")
	)
	(pad "4" thru_hole circle
		(at -1.5 -0.9)
		(size 0.6096 0.6096)
		(drill 0.3048)
		(layers "*.Cu" "*.Mask")
		(remove_unused_layers no)
		(uuid "7408b768-b04f-409f-9bf4-a1b3291a856b")
	)
	(pad "4" thru_hole circle
		(at -1.5 -0.3)
		(size 0.6096 0.6096)
		(drill 0.3048)
		(layers "*.Cu" "*.Mask")
		(remove_unused_layers no)
		(uuid "184b52bf-77d2-45a0-a723-b57028e0fbef")
	)
	(pad "4" thru_hole circle
		(at -1.5 0.3)
		(size 0.6096 0.6096)
		(drill 0.3048)
		(layers "*.Cu" "*.Mask")
		(remove_unused_layers no)
		(uuid "39a759b8-b681-4341-a20a-6b030d5b0f26")
	)
	(pad "4" thru_hole circle
		(at -1.5 0.9)
		(size 0.6096 0.6096)
		(drill 0.3048)
		(layers "*.Cu" "*.Mask")
		(remove_unused_layers no)
		(uuid "9b01750d-1885-43da-b9fe-0fc565e7c271")
	)
	(pad "4" thru_hole circle
		(at -1.5 1.5)
		(size 0.6096 0.6096)
		(drill 0.3048)
		(layers "*.Cu" "*.Mask")
		(remove_unused_layers no)
		(uuid "865ca330-31c6-418c-bc13-8c0c46a59747")
	)
	(pad "4" thru_hole circle
		(at -1.5 2.1)
		(size 0.6096 0.6096)
		(drill 0.3048)
		(layers "*.Cu" "*.Mask")
		(remove_unused_layers no)
		(uuid "7c9f5073-dd8f-47d1-9f75-e7e83df6261b")
	)
	(pad "4" thru_hole circle
		(at -1.075 2.925)
		(size 0.6096 0.6096)
		(drill 0.3048)
		(layers "*.Cu" "*.Mask")
		(remove_unused_layers no)
		(uuid "5b3b64a1-7b73-4609-9c1e-b7160f2a7590")
	)
	(pad "4" thru_hole circle
		(at -1 -4.8)
		(size 0.6096 0.6096)
		(drill 0.3048)
		(layers "*.Cu" "*.Mask")
		(remove_unused_layers no)
		(uuid "99699d99-c6c2-4c0c-a728-1249345a0724")
	)
	(pad "4" thru_hole circle
		(at -1 -4.2)
		(size 0.6096 0.6096)
		(drill 0.3048)
		(layers "*.Cu" "*.Mask")
		(remove_unused_layers no)
		(uuid "1da130db-fb64-4219-aeb1-676607d13fd4")
	)
	(pad "4" thru_hole circle
		(at -1 -3.6)
		(size 0.6096 0.6096)
		(drill 0.3048)
		(layers "*.Cu" "*.Mask")
		(remove_unused_layers no)
		(uuid "3f0c1e2e-71d7-4eba-8247-041475654231")
	)
	(pad "4" thru_hole circle
		(at -1 -3)
		(size 0.6096 0.6096)
		(drill 0.3048)
		(layers "*.Cu" "*.Mask")
		(remove_unused_layers no)
		(uuid "76dc2209-dae4-4937-a27b-6036c466c9dd")
	)
	(pad "4" thru_hole circle
		(at -1 -2.4)
		(size 0.6096 0.6096)
		(drill 0.3048)
		(layers "*.Cu" "*.Mask")
		(remove_unused_layers no)
		(uuid "85d75117-7960-4bd1-bc8b-28345d5007b8")
	)
	(pad "4" thru_hole circle
		(at -1 -1.8)
		(size 0.6096 0.6096)
		(drill 0.3048)
		(layers "*.Cu" "*.Mask")
		(remove_unused_layers no)
		(uuid "7250612b-8177-4945-bca1-a3fa8f4b11b9")
	)
	(pad "4" thru_hole circle
		(at -1 -1.2)
		(size 0.6096 0.6096)
		(drill 0.3048)
		(layers "*.Cu" "*.Mask")
		(remove_unused_layers no)
		(uuid "b4035bed-0e5c-46ad-af5e-8cf9acea2e86")
	)
	(pad "4" thru_hole circle
		(at -1 -0.6)
		(size 0.6096 0.6096)
		(drill 0.3048)
		(layers "*.Cu" "*.Mask")
		(remove_unused_layers no)
		(uuid "512723c5-4216-42a0-9362-8603e05896e4")
	)
	(pad "4" thru_hole circle
		(at -1 0)
		(size 0.6096 0.6096)
		(drill 0.3048)
		(layers "*.Cu" "*.Mask")
		(remove_unused_layers no)
		(uuid "11c4925a-2d4c-4d7a-9cc1-97a37a5ea0db")
	)
	(pad "4" thru_hole circle
		(at -1 0.6)
		(size 0.6096 0.6096)
		(drill 0.3048)
		(layers "*.Cu" "*.Mask")
		(remove_unused_layers no)
		(uuid "67aaaa80-bc11-4007-8ca8-9115eec4c69c")
	)
	(pad "4" thru_hole circle
		(at -1 1.2)
		(size 0.6096 0.6096)
		(drill 0.3048)
		(layers "*.Cu" "*.Mask")
		(remove_unused_layers no)
		(uuid "c3ddf826-5388-492e-8a20-39ae0e1577c0")
	)
	(pad "4" thru_hole circle
		(at -1 1.8)
		(size 0.6096 0.6096)
		(drill 0.3048)
		(layers "*.Cu" "*.Mask")
		(remove_unused_layers no)
		(uuid "1aa1dd5f-f271-4e3d-94e3-d09e81f9a87f")
	)
	(pad "4" thru_hole circle
		(at -1 2.4)
		(size 0.6096 0.6096)
		(drill 0.3048)
		(layers "*.Cu" "*.Mask")
		(remove_unused_layers no)
		(uuid "0b8fc19a-4edc-4897-92a6-4ce36c4c003b")
	)
	(pad "4" thru_hole circle
		(at -0.55 2.725)
		(size 0.6096 0.6096)
		(drill 0.3048)
		(layers "*.Cu" "*.Mask")
		(remove_unused_layers no)
		(uuid "96284d4c-0b73-4df3-aef5-00a42055bb02")
	)
	(pad "4" thru_hole circle
		(at -0.5 -4.5)
		(size 0.6096 0.6096)
		(drill 0.3048)
		(layers "*.Cu" "*.Mask")
		(remove_unused_layers no)
		(uuid "53a34887-8250-4632-b813-fe0395824572")
	)
	(pad "4" thru_hole circle
		(at -0.5 -3.9)
		(size 0.6096 0.6096)
		(drill 0.3048)
		(layers "*.Cu" "*.Mask")
		(remove_unused_layers no)
		(uuid "2ac2ff7b-c21f-439a-b43f-2a40c26e904e")
	)
	(pad "4" thru_hole circle
		(at -0.5 -3.3)
		(size 0.6096 0.6096)
		(drill 0.3048)
		(layers "*.Cu" "*.Mask")
		(remove_unused_layers no)
		(uuid "5f0251dc-ea08-40bf-9008-86655a4ed7e7")
	)
	(pad "4" thru_hole circle
		(at -0.5 -2.7)
		(size 0.6096 0.6096)
		(drill 0.3048)
		(layers "*.Cu" "*.Mask")
		(remove_unused_layers no)
		(uuid "1ee6f9ce-1910-4c4c-b229-9ccfbbf51f55")
	)
	(pad "4" thru_hole circle
		(at -0.5 -2.1)
		(size 0.6096 0.6096)
		(drill 0.3048)
		(layers "*.Cu" "*.Mask")
		(remove_unused_layers no)
		(uuid "97f811e7-9223-4131-81eb-537fa619dc6b")
	)
	(pad "4" thru_hole circle
		(at -0.5 -1.5)
		(size 0.6096 0.6096)
		(drill 0.3048)
		(layers "*.Cu" "*.Mask")
		(remove_unused_layers no)
		(uuid "19b4e7f1-5a8c-4eaf-883e-4b6597118760")
	)
	(pad "4" thru_hole circle
		(at -0.5 -0.9)
		(size 0.6096 0.6096)
		(drill 0.3048)
		(layers "*.Cu" "*.Mask")
		(remove_unused_layers no)
		(uuid "a77b590c-c631-4e5c-b219-3adaded840ca")
	)
	(pad "4" thru_hole circle
		(at -0.5 -0.3)
		(size 0.6096 0.6096)
		(drill 0.3048)
		(layers "*.Cu" "*.Mask")
		(remove_unused_layers no)
		(uuid "49b533ce-6c37-445e-878b-acb4318ddc69")
	)
	(pad "4" thru_hole circle
		(at -0.5 0.3)
		(size 0.6096 0.6096)
		(drill 0.3048)
		(layers "*.Cu" "*.Mask")
		(remove_unused_layers no)
		(uuid "20ee6ef3-a2bb-48a2-9a36-d2c7b4d13cbf")
	)
	(pad "4" thru_hole circle
		(at -0.5 0.9)
		(size 0.6096 0.6096)
		(drill 0.3048)
		(layers "*.Cu" "*.Mask")
		(remove_unused_layers no)
		(uuid "5fab02aa-866b-4800-9a6e-2c15bcc0def0")
	)
	(pad "4" thru_hole circle
		(at -0.5 1.5)
		(size 0.6096 0.6096)
		(drill 0.3048)
		(layers "*.Cu" "*.Mask")
		(remove_unused_layers no)
		(uuid "b6a2458f-cbb4-4c13-ba75-c0fac06b0f18")
	)
	(pad "4" thru_hole circle
		(at -0.5 2.1)
		(size 0.6096 0.6096)
		(drill 0.3048)
		(layers "*.Cu" "*.Mask")
		(remove_unused_layers no)
		(uuid "e0243766-fbcf-4ff2-815c-584f5ce4d977")
	)
	(pad "4" thru_hole circle
		(at 0 -4.8)
		(size 0.6096 0.6096)
		(drill 0.3048)
		(layers "*.Cu" "*.Mask")
		(remove_unused_layers no)
		(uuid "6fa7c65a-ca4c-4fcc-bdfc-1163bdd26fe4")
	)
	(pad "4" thru_hole circle
		(at 0 -4.2)
		(size 0.6096 0.6096)
		(drill 0.3048)
		(layers "*.Cu" "*.Mask")
		(remove_unused_layers no)
		(uuid "51b57891-2f5d-440b-8a17-0808d637f5af")
	)
	(pad "4" thru_hole circle
		(at 0 -3.6)
		(size 0.6096 0.6096)
		(drill 0.3048)
		(layers "*.Cu" "*.Mask")
		(remove_unused_layers no)
		(uuid "35471fd9-f6ce-4815-b0b9-19e07b0a63c2")
	)
	(pad "4" thru_hole circle
		(at 0 -3)
		(size 0.6096 0.6096)
		(drill 0.3048)
		(layers "*.Cu" "*.Mask")
		(remove_unused_layers no)
		(uuid "9e863462-eae9-491e-9d4d-fd37d9374c59")
	)
	(pad "4" thru_hole circle
		(at 0 -2.4)
		(size 0.6096 0.6096)
		(drill 0.3048)
		(layers "*.Cu" "*.Mask")
		(remove_unused_layers no)
		(uuid "5a16eb5f-cfb4-4ebe-ba96-211c9f32cf5a")
	)
	(pad "4" thru_hole circle
		(at 0 -1.8)
		(size 0.6096 0.6096)
		(drill 0.3048)
		(layers "*.Cu" "*.Mask")
		(remove_unused_layers no)
		(uuid "40369c9b-6d42-4535-adc4-1c36444effd9")
	)
	(pad "4" thru_hole circle
		(at 0 -1.2)
		(size 0.6096 0.6096)
		(drill 0.3048)
		(layers "*.Cu" "*.Mask")
		(remove_unused_layers no)
		(uuid "4b73d000-9dcd-4504-bc7e-79f872b8511f")
	)
	(pad "4" thru_hole circle
		(at 0 -0.6)
		(size 0.6096 0.6096)
		(drill 0.3048)
		(layers "*.Cu" "*.Mask")
		(remove_unused_layers no)
		(uuid "13f7f78b-322a-46cd-8993-a34fbf3908b5")
	)
	(pad "4" thru_hole circle
		(at 0 0)
		(size 0.6096 0.6096)
		(drill 0.3048)
		(layers "*.Cu" "*.Mask")
		(remove_unused_layers no)
		(uuid "6b82d5c5-21c3-4640-95e4-ec643221c366")
	)
	(pad "4" smd custom
		(at 0 0)
		(size 2 2)
		(layers "F.Cu" "F.Mask")
		(thermal_bridge_angle 90)
		(options
			(clearance outline)
			(anchor circle)
		)
		(primitives
			(gr_poly
				(pts
					(xy -2.92246 -4.167832) (xy -1.7 -4.8) (xy -0.3 -5.1) (xy 0.85 -5.05) (xy 1.95 -4.7) (xy 2.92246 -4.167832)
					(xy 2.45 -3.6) (xy 2.2 -2.7) (xy 2.3 -1.85) (xy 2.7 -1.15) (xy 3.25 -0.7) (xy 4 -0.35) (xy 5.070678 -0.447009)
					(xy 5 0.95) (xy 4.75 1.8) (xy 4.408366 2.545171) (xy 3.8 3.35) (xy 3.1 4.05) (xy 2.148218 4.61484)
					(xy 1.85 3.8) (xy 1.35 3.3) (xy 0.7 3) (xy 0 2.889349) (xy -0.8 3.05) (xy -1.45 3.4) (xy -1.85 3.85)
					(xy -2.148218 4.614839) (xy -3.2 3.95) (xy -3.8 3.4) (xy -4.408366 2.545171) (xy -4.9 1.45) (xy -5.05 0.55)
					(xy -5.070678 -0.447009) (xy -4.2 -0.35) (xy -3.4 -0.6) (xy -2.65 -1.2) (xy -2.3 -2) (xy -2.2 -2.75)
					(xy -2.5 -3.65)
				)
				(width 0)
				(fill yes)
			)
			(gr_arc
				(start -2.92246 -4.167832)
				(mid -2.502249 -1.444674)
				(end -5.070678 -0.447009)
				(width 0.2)
			)
			(gr_arc
				(start -2.92246 -4.167832)
				(mid 0 -5.090343)
				(end 2.92246 -4.167832)
				(width 0.2)
			)
			(gr_arc
				(start -2.148218 4.614839)
				(mid -4.408366 2.545171)
				(end -5.070677 -0.447009)
				(width 0.2)
			)
			(gr_arc
				(start -2.148218 4.61484)
				(mid 0 2.889349)
				(end 2.148218 4.61484)
				(width 0.2)
			)
			(gr_arc
				(start 5.070678 -0.447009)
				(mid 4.408366 2.545171)
				(end 2.148218 4.61484)
				(width 0.2)
			)
			(gr_arc
				(start 5.070678 -0.447009)
				(mid 2.502247 -1.444672)
				(end 2.92246 -4.167832)
				(width 0.2)
			)
		)
		(uuid "da6da572-97c6-4125-8013-390697f24d3f")
	)
	(pad "4" thru_hole circle
		(at 0 0.6)
		(size 0.6096 0.6096)
		(drill 0.3048)
		(layers "*.Cu" "*.Mask")
		(remove_unused_layers no)
		(uuid "38f3c624-a830-4277-b381-3a0a24d161a5")
	)
	(pad "4" thru_hole circle
		(at 0 1.2)
		(size 0.6096 0.6096)
		(drill 0.3048)
		(layers "*.Cu" "*.Mask")
		(remove_unused_layers no)
		(uuid "41312f07-ec54-462e-b33d-1eaa391f0aad")
	)
	(pad "4" thru_hole circle
		(at 0 1.8)
		(size 0.6096 0.6096)
		(drill 0.3048)
		(layers "*.Cu" "*.Mask")
		(remove_unused_layers no)
		(uuid "30166bf2-a535-4e87-9b2f-dbb0fefab377")
	)
	(pad "4" thru_hole circle
		(at 0 2.675)
		(size 0.6096 0.6096)
		(drill 0.3048)
		(layers "*.Cu" "*.Mask")
		(remove_unused_layers no)
		(uuid "baeee420-fb76-415a-bd40-c2da6efe2143")
	)
	(pad "4" thru_hole circle
		(at 0.5 -4.5)
		(size 0.6096 0.6096)
		(drill 0.3048)
		(layers "*.Cu" "*.Mask")
		(remove_unused_layers no)
		(uuid "affb64c8-abb3-43fe-b347-80be5ad7d3b3")
	)
	(pad "4" thru_hole circle
		(at 0.5 -3.9)
		(size 0.6096 0.6096)
		(drill 0.3048)
		(layers "*.Cu" "*.Mask")
		(remove_unused_layers no)
		(uuid "b645cbce-c0f1-4855-b3fe-a99839b2f46d")
	)
	(pad "4" thru_hole circle
		(at 0.5 -3.3)
		(size 0.6096 0.6096)
		(drill 0.3048)
		(layers "*.Cu" "*.Mask")
		(remove_unused_layers no)
		(uuid "57e2b796-74c1-4dee-b84d-523a6ae85834")
	)
	(pad "4" thru_hole circle
		(at 0.5 -2.7)
		(size 0.6096 0.6096)
		(drill 0.3048)
		(layers "*.Cu" "*.Mask")
		(remove_unused_layers no)
		(uuid "93e0182e-eedc-4078-a956-1258d9048d29")
	)
	(pad "4" thru_hole circle
		(at 0.5 -2.1)
		(size 0.6096 0.6096)
		(drill 0.3048)
		(layers "*.Cu" "*.Mask")
		(remove_unused_layers no)
		(uuid "f25ff7da-68dd-49d6-b590-688f4859b369")
	)
	(pad "4" thru_hole circle
		(at 0.5 -1.5)
		(size 0.6096 0.6096)
		(drill 0.3048)
		(layers "*.Cu" "*.Mask")
		(remove_unused_layers no)
		(uuid "445c836b-87d1-4112-b69f-e66322a01eef")
	)
	(pad "4" thru_hole circle
		(at 0.5 -0.9)
		(size 0.6096 0.6096)
		(drill 0.3048)
		(layers "*.Cu" "*.Mask")
		(remove_unused_layers no)
		(uuid "f8176e0b-7868-49b1-80cd-9cb01cf3f801")
	)
	(pad "4" thru_hole circle
		(at 0.5 -0.3)
		(size 0.6096 0.6096)
		(drill 0.3048)
		(layers "*.Cu" "*.Mask")
		(remove_unused_layers no)
		(uuid "aa59be8a-5dbb-4dc8-9783-ea3d3aa60b13")
	)
	(pad "4" thru_hole circle
		(at 0.5 0.3)
		(size 0.6096 0.6096)
		(drill 0.3048)
		(layers "*.Cu" "*.Mask")
		(remove_unused_layers no)
		(uuid "1db5f1d9-bfa6-4d9a-b459-9009f74729e6")
	)
	(pad "4" thru_hole circle
		(at 0.5 0.9)
		(size 0.6096 0.6096)
		(drill 0.3048)
		(layers "*.Cu" "*.Mask")
		(remove_unused_layers no)
		(uuid "5af2afb3-465b-47f3-84db-48b6d891ead0")
	)
	(pad "4" thru_hole circle
		(at 0.5 1.5)
		(size 0.6096 0.6096)
		(drill 0.3048)
		(layers "*.Cu" "*.Mask")
		(remove_unused_layers no)
		(uuid "87386d6e-34cb-4402-b4db-545c1b3e1f88")
	)
	(pad "4" thru_hole circle
		(at 0.5 2.1)
		(size 0.6096 0.6096)
		(drill 0.3048)
		(layers "*.Cu" "*.Mask")
		(remove_unused_layers no)
		(uuid "5aa9a108-eb93-457e-9325-d81af74f3ed1")
	)
	(pad "4" thru_hole circle
		(at 0.525 2.725)
		(size 0.6096 0.6096)
		(drill 0.3048)
		(layers "*.Cu" "*.Mask")
		(remove_unused_layers no)
		(uuid "8c2a052b-65d6-49d1-af68-c4a5f3d2e842")
	)
	(pad "4" thru_hole circle
		(at 1 -4.8)
		(size 0.6096 0.6096)
		(drill 0.3048)
		(layers "*.Cu" "*.Mask")
		(remove_unused_layers no)
		(uuid "24849057-d4f1-472d-a822-7d6d55c47b35")
	)
	(pad "4" thru_hole circle
		(at 1 -4.2)
		(size 0.6096 0.6096)
		(drill 0.3048)
		(layers "*.Cu" "*.Mask")
		(remove_unused_layers no)
		(uuid "ecd7f54b-745b-42f0-bd93-ae88a62c86ff")
	)
	(pad "4" thru_hole circle
		(at 1 -3.6)
		(size 0.6096 0.6096)
		(drill 0.3048)
		(layers "*.Cu" "*.Mask")
		(remove_unused_layers no)
		(uuid "f9b048b9-bec0-4d5e-a644-a8a51d3b699d")
	)
	(pad "4" thru_hole circle
		(at 1 -3)
		(size 0.6096 0.6096)
		(drill 0.3048)
		(layers "*.Cu" "*.Mask")
		(remove_unused_layers no)
		(uuid "467bc9ea-bc84-4248-ac92-ce79fcbf480f")
	)
	(pad "4" thru_hole circle
		(at 1 -2.4)
		(size 0.6096 0.6096)
		(drill 0.3048)
		(layers "*.Cu" "*.Mask")
		(remove_unused_layers no)
		(uuid "4a23d52a-e00c-4adc-b542-5763b29e05cc")
	)
	(pad "4" thru_hole circle
		(at 1 -1.8)
		(size 0.6096 0.6096)
		(drill 0.3048)
		(layers "*.Cu" "*.Mask")
		(remove_unused_layers no)
		(uuid "20ae52f4-ffab-4c03-b9e9-ce4cbcda9750")
	)
	(pad "4" thru_hole circle
		(at 1 -1.2)
		(size 0.6096 0.6096)
		(drill 0.3048)
		(layers "*.Cu" "*.Mask")
		(remove_unused_layers no)
		(uuid "15b1fa69-44c8-4be9-8886-94d06877f5ee")
	)
	(pad "4" thru_hole circle
		(at 1 -0.6)
		(size 0.6096 0.6096)
		(drill 0.3048)
		(layers "*.Cu" "*.Mask")
		(remove_unused_layers no)
		(uuid "90384369-b048-462f-8d44-501dd99fc35c")
	)
	(pad "4" thru_hole circle
		(at 1 0)
		(size 0.6096 0.6096)
		(drill 0.3048)
		(layers "*.Cu" "*.Mask")
		(remove_unused_layers no)
		(uuid "4837f7c7-46ce-4c2d-8675-d22e4c6f8735")
	)
	(pad "4" thru_hole circle
		(at 1 0.6)
		(size 0.6096 0.6096)
		(drill 0.3048)
		(layers "*.Cu" "*.Mask")
		(remove_unused_layers no)
		(uuid "fd888f77-06df-4290-8c96-b6e5ed21997c")
	)
	(pad "4" thru_hole circle
		(at 1 1.2)
		(size 0.6096 0.6096)
		(drill 0.3048)
		(layers "*.Cu" "*.Mask")
		(remove_unused_layers no)
		(uuid "b15a6317-6961-4195-a686-34b098282a05")
	)
	(pad "4" thru_hole circle
		(at 1 1.8)
		(size 0.6096 0.6096)
		(drill 0.3048)
		(layers "*.Cu" "*.Mask")
		(remove_unused_layers no)
		(uuid "cb9a3e11-214f-487e-962f-478b0d334e8f")
	)
	(pad "4" thru_hole circle
		(at 1 2.4)
		(size 0.6096 0.6096)
		(drill 0.3048)
		(layers "*.Cu" "*.Mask")
		(remove_unused_layers no)
		(uuid "2b5ade1d-a0a4-480b-a055-777816371996")
	)
	(pad "4" thru_hole circle
		(at 1.1 2.925)
		(size 0.6096 0.6096)
		(drill 0.3048)
		(layers "*.Cu" "*.Mask")
		(remove_unused_layers no)
		(uuid "6cd2994a-029c-44f0-b834-d76d675b3b12")
	)
	(pad "4" thru_hole circle
		(at 1.5 -4.5)
		(size 0.6096 0.6096)
		(drill 0.3048)
		(layers "*.Cu" "*.Mask")
		(remove_unused_layers no)
		(uuid "ffc48718-6eb4-4f79-9f69-fac9263aed0c")
	)
	(pad "4" thru_hole circle
		(at 1.5 -3.9)
		(size 0.6096 0.6096)
		(drill 0.3048)
		(layers "*.Cu" "*.Mask")
		(remove_unused_layers no)
		(uuid "cf9055e2-1998-4f8f-ae5e-b0e250e57e50")
	)
	(pad "4" thru_hole circle
		(at 1.5 -3.3)
		(size 0.6096 0.6096)
		(drill 0.3048)
		(layers "*.Cu" "*.Mask")
		(remove_unused_layers no)
		(uuid "2d2d01c2-8c6d-44a1-852d-5afe4822e897")
	)
	(pad "4" thru_hole circle
		(at 1.5 -2.7)
		(size 0.6096 0.6096)
		(drill 0.3048)
		(layers "*.Cu" "*.Mask")
		(remove_unused_layers no)
		(uuid "ef20667d-d8ac-447f-bcec-a892bce6e88e")
	)
	(pad "4" thru_hole circle
		(at 1.5 -2.1)
		(size 0.6096 0.6096)
		(drill 0.3048)
		(layers "*.Cu" "*.Mask")
		(remove_unused_layers no)
		(uuid "aa6efae0-8101-4e01-b62e-8777f86a56ee")
	)
	(pad "4" thru_hole circle
		(at 1.5 -1.5)
		(size 0.6096 0.6096)
		(drill 0.3048)
		(layers "*.Cu" "*.Mask")
		(remove_unused_layers no)
		(uuid "2fc2f7fe-c670-4281-a445-10810163cc73")
	)
	(pad "4" thru_hole circle
		(at 1.5 -0.9)
		(size 0.6096 0.6096)
		(drill 0.3048)
		(layers "*.Cu" "*.Mask")
		(remove_unused_layers no)
		(uuid "ca1f657e-0836-43e6-9d0c-4166fb04bb70")
	)
	(pad "4" thru_hole circle
		(at 1.5 -0.3)
		(size 0.6096 0.6096)
		(drill 0.3048)
		(layers "*.Cu" "*.Mask")
		(remove_unused_layers no)
		(uuid "8b67eba8-1395-42b0-a6df-f411edfd4736")
	)
	(pad "4" thru_hole circle
		(at 1.5 0.3)
		(size 0.6096 0.6096)
		(drill 0.3048)
		(layers "*.Cu" "*.Mask")
		(remove_unused_layers no)
		(uuid "eddbde01-45d0-4f36-933a-76765d203471")
	)
	(pad "4" thru_hole circle
		(at 1.5 0.9)
		(size 0.6096 0.6096)
		(drill 0.3048)
		(layers "*.Cu" "*.Mask")
		(remove_unused_layers no)
		(uuid "e8583fa2-678b-46d4-842b-cd10629ad96a")
	)
	(pad "4" thru_hole circle
		(at 1.5 1.5)
		(size 0.6096 0.6096)
		(drill 0.3048)
		(layers "*.Cu" "*.Mask")
		(remove_unused_layers no)
		(uuid "d69416ec-d237-49a5-a054-f18cf7953d46")
	)
	(pad "4" thru_hole circle
		(at 1.5 2.1)
		(size 0.6096 0.6096)
		(drill 0.3048)
		(layers "*.Cu" "*.Mask")
		(remove_unused_layers no)
		(uuid "6362f51f-bef4-4ec8-9f0a-d7082cdad1bf")
	)
	(pad "4" thru_hole circle
		(at 1.6 3.275)
		(size 0.6096 0.6096)
		(drill 0.3048)
		(layers "*.Cu" "*.Mask")
		(remove_unused_layers no)
		(uuid "2dd65ab5-b66b-41ca-9d19-7769682bca62")
	)
	(pad "4" thru_hole circle
		(at 2 -4.2)
		(size 0.6096 0.6096)
		(drill 0.3048)
		(layers "*.Cu" "*.Mask")
		(remove_unused_layers no)
		(uuid "6320cc26-51b5-47a8-81d0-d2cbf5841f60")
	)
	(pad "4" thru_hole circle
		(at 2 -2.4)
		(size 0.6096 0.6096)
		(drill 0.3048)
		(layers "*.Cu" "*.Mask")
		(remove_unused_layers no)
		(uuid "95d6df64-53a7-441a-8a6b-5ae051d8110a")
	)
	(pad "4" thru_hole circle
		(at 2 -0.6)
		(size 0.6096 0.6096)
		(drill 0.3048)
		(layers "*.Cu" "*.Mask")
		(remove_unused_layers no)
		(uuid "fa3077c7-5361-4115-b5da-e3ec4bf74fed")
	)
	(pad "4" thru_hole circle
		(at 2 0)
		(size 0.6096 0.6096)
		(drill 0.3048)
		(layers "*.Cu" "*.Mask")
		(remove_unused_layers no)
		(uuid "df7cee5b-5949-425c-9730-ed2449ff4b03")
	)
	(pad "4" thru_hole circle
		(at 2 0.6)
		(size 0.6096 0.6096)
		(drill 0.3048)
		(layers "*.Cu" "*.Mask")
		(remove_unused_layers no)
		(uuid "f5c057b7-915b-414b-9c75-b7b247285475")
	)
	(pad "4" thru_hole circle
		(at 2 1.2)
		(size 0.6096 0.6096)
		(drill 0.3048)
		(layers "*.Cu" "*.Mask")
		(remove_unused_layers no)
		(uuid "7ef4edb6-52f2-47d0-8ee8-8a5a47299412")
	)
	(pad "4" thru_hole circle
		(at 2 1.8)
		(size 0.6096 0.6096)
		(drill 0.3048)
		(layers "*.Cu" "*.Mask")
		(remove_unused_layers no)
		(uuid "4925f213-a26f-4289-98ab-63fae8df2ef5")
	)
	(pad "4" thru_hole circle
		(at 2 2.4)
		(size 0.6096 0.6096)
		(drill 0.3048)
		(layers "*.Cu" "*.Mask")
		(remove_unused_layers no)
		(uuid "ce352141-ff80-4dac-9d57-07ca57158c99")
	)
	(pad "4" thru_hole circle
		(at 2 3.75)
		(size 0.6096 0.6096)
		(drill 0.3048)
		(layers "*.Cu" "*.Mask")
		(remove_unused_layers no)
		(uuid "ddc825bd-cfe3-4eb7-9dfc-d26c1e9cb63f")
	)
	(pad "4" thru_hole circle
		(at 2.025 -3.025)
		(size 0.6096 0.6096)
		(drill 0.3048)
		(layers "*.Cu" "*.Mask")
		(remove_unused_layers no)
		(uuid "65643161-19bb-4cb4-91cb-118f9087ef39")
	)
	(pad "4" thru_hole circle
		(at 2.1 -1.8)
		(size 0.6096 0.6096)
		(drill 0.3048)
		(layers "*.Cu" "*.Mask")
		(remove_unused_layers no)
		(uuid "858ef8a9-e777-4c7e-bffb-3563c219d83d")
	)
	(pad "4" thru_hole circle
		(at 2.225 -3.6)
		(size 0.6096 0.6096)
		(drill 0.3048)
		(layers "*.Cu" "*.Mask")
		(remove_unused_layers no)
		(uuid "acc5b70f-8496-4cb6-a369-1fc7135e716f")
	)
	(pad "4" thru_hole circle
		(at 2.275 4.3)
		(size 0.6096 0.6096)
		(drill 0.3048)
		(layers "*.Cu" "*.Mask")
		(remove_unused_layers no)
		(uuid "49126be2-1a54-450d-9f82-234b8d0ce11b")
	)
	(pad "4" thru_hole circle
		(at 2.375 -1.25)
		(size 0.6096 0.6096)
		(drill 0.3048)
		(layers "*.Cu" "*.Mask")
		(remove_unused_layers no)
		(uuid "c42069eb-ff6f-4ad0-8052-cc4841c8f980")
	)
	(pad "4" thru_hole circle
		(at 2.5 -0.3)
		(size 0.6096 0.6096)
		(drill 0.3048)
		(layers "*.Cu" "*.Mask")
		(remove_unused_layers no)
		(uuid "2c31985a-c89d-4061-a0c6-6cb01dfeccc5")
	)
	(pad "4" thru_hole circle
		(at 2.5 0.3)
		(size 0.6096 0.6096)
		(drill 0.3048)
		(layers "*.Cu" "*.Mask")
		(remove_unused_layers no)
		(uuid "9e86e17a-4b82-42ee-b13d-9d827dd634db")
	)
	(pad "4" thru_hole circle
		(at 2.5 0.9)
		(size 0.6096 0.6096)
		(drill 0.3048)
		(layers "*.Cu" "*.Mask")
		(remove_unused_layers no)
		(uuid "227872a9-4358-4fb7-81f6-d3239632a999")
	)
	(pad "4" thru_hole circle
		(at 2.5 1.5)
		(size 0.6096 0.6096)
		(drill 0.3048)
		(layers "*.Cu" "*.Mask")
		(remove_unused_layers no)
		(uuid "46cda2b2-6680-40d2-9505-b46bd6971164")
	)
	(pad "4" thru_hole circle
		(at 2.5 2.1)
		(size 0.6096 0.6096)
		(drill 0.3048)
		(layers "*.Cu" "*.Mask")
		(remove_unused_layers no)
		(uuid "600cfd67-c23d-45ca-94ef-b304003deecb")
	)
	(pad "4" thru_hole circle
		(at 2.5 2.7)
		(size 0.6096 0.6096)
		(drill 0.3048)
		(layers "*.Cu" "*.Mask")
		(remove_unused_layers no)
		(uuid "0b763bdf-b8e8-4360-bff6-45d91b8bb9a6")
	)
	(pad "4" thru_hole circle
		(at 2.5 3.3)
		(size 0.6096 0.6096)
		(drill 0.3048)
		(layers "*.Cu" "*.Mask")
		(remove_unused_layers no)
		(uuid "bb3dcc07-885b-4ec4-95c0-bf735b69de19")
	)
	(pad "4" thru_hole circle
		(at 2.575 -4.125)
		(size 0.6096 0.6096)
		(drill 0.3048)
		(layers "*.Cu" "*.Mask")
		(remove_unused_layers no)
		(uuid "d13666ed-fc92-4999-ab26-43bb5d9c9912")
	)
	(pad "4" thru_hole circle
		(at 2.775 -0.775)
		(size 0.6096 0.6096)
		(drill 0.3048)
		(layers "*.Cu" "*.Mask")
		(remove_unused_layers no)
		(uuid "4d1b900a-29ff-444f-82b5-928d5b07bfc1")
	)
	(pad "4" thru_hole circle
		(at 3 0.6)
		(size 0.6096 0.6096)
		(drill 0.3048)
		(layers "*.Cu" "*.Mask")
		(remove_unused_layers no)
		(uuid "27ccc29f-d9d2-4f57-a039-10c86231dd0c")
	)
	(pad "4" thru_hole circle
		(at 3 1.2)
		(size 0.6096 0.6096)
		(drill 0.3048)
		(layers "*.Cu" "*.Mask")
		(remove_unused_layers no)
		(uuid "d5a1981f-b4eb-4b75-8cf9-846d777308b4")
	)
	(pad "4" thru_hole circle
		(at 3 1.8)
		(size 0.6096 0.6096)
		(drill 0.3048)
		(layers "*.Cu" "*.Mask")
		(remove_unused_layers no)
		(uuid "27799819-75f0-4b47-be87-5b888a786105")
	)
	(pad "4" thru_hole circle
		(at 3 2.4)
		(size 0.6096 0.6096)
		(drill 0.3048)
		(layers "*.Cu" "*.Mask")
		(remove_unused_layers no)
		(uuid "edc4e14c-716a-4ec7-bfee-96b9a4bb3877")
	)
	(pad "4" thru_hole circle
		(at 3 3)
		(size 0.6096 0.6096)
		(drill 0.3048)
		(layers "*.Cu" "*.Mask")
		(remove_unused_layers no)
		(uuid "e64708d6-a4db-4637-a216-31ce39c1cadf")
	)
	(pad "4" thru_hole circle
		(at 3 3.6)
		(size 0.6096 0.6096)
		(drill 0.3048)
		(layers "*.Cu" "*.Mask")
		(remove_unused_layers no)
		(uuid "3bc572ee-2842-4b7a-a15e-8176432f6303")
	)
	(pad "4" thru_hole circle
		(at 3.275 -0.4)
		(size 0.6096 0.6096)
		(drill 0.3048)
		(layers "*.Cu" "*.Mask")
		(remove_unused_layers no)
		(uuid "a796fad0-c566-42c8-a03e-6596998a7a80")
	)
	(pad "4" thru_hole circle
		(at 3.5 0.3)
		(size 0.6096 0.6096)
		(drill 0.3048)
		(layers "*.Cu" "*.Mask")
		(remove_unused_layers no)
		(uuid "6cf75aed-df69-423e-936a-b3a1fe0d4898")
	)
	(pad "4" thru_hole circle
		(at 3.5 0.9)
		(size 0.6096 0.6096)
		(drill 0.3048)
		(layers "*.Cu" "*.Mask")
		(remove_unused_layers no)
		(uuid "da7c51a8-4afc-4f24-803e-5efbdfc6ce0b")
	)
	(pad "4" thru_hole circle
		(at 3.5 1.5)
		(size 0.6096 0.6096)
		(drill 0.3048)
		(layers "*.Cu" "*.Mask")
		(remove_unused_layers no)
		(uuid "b6e2d042-58df-4c85-ae47-3c19d9ef1100")
	)
	(pad "4" thru_hole circle
		(at 3.5 2.1)
		(size 0.6096 0.6096)
		(drill 0.3048)
		(layers "*.Cu" "*.Mask")
		(remove_unused_layers no)
		(uuid "b0ec9179-29d6-4dc1-9e5c-f2badfc181a8")
	)
	(pad "4" thru_hole circle
		(at 3.5 2.7)
		(size 0.6096 0.6096)
		(drill 0.3048)
		(layers "*.Cu" "*.Mask")
		(remove_unused_layers no)
		(uuid "3b917701-4a95-47b7-8494-104ba1503fb3")
	)
	(pad "4" thru_hole circle
		(at 3.5 3.3)
		(size 0.6096 0.6096)
		(drill 0.3048)
		(layers "*.Cu" "*.Mask")
		(remove_unused_layers no)
		(uuid "5b3f4107-93a3-4f27-8672-46b139f88b97")
	)
	(pad "4" thru_hole circle
		(at 3.775 -0.2)
		(size 0.6096 0.6096)
		(drill 0.3048)
		(layers "*.Cu" "*.Mask")
		(remove_unused_layers no)
		(uuid "b00a607a-de5d-46cd-a37e-a1059f0134e5")
	)
	(pad "4" thru_hole circle
		(at 4 0.6)
		(size 0.6096 0.6096)
		(drill 0.3048)
		(layers "*.Cu" "*.Mask")
		(remove_unused_layers no)
		(uuid "353d4cbb-6871-42ce-8baa-c2ada7af9bff")
	)
	(pad "4" thru_hole circle
		(at 4 1.2)
		(size 0.6096 0.6096)
		(drill 0.3048)
		(layers "*.Cu" "*.Mask")
		(remove_unused_layers no)
		(uuid "e3937de0-6cc7-4ada-9422-9323e6a78dea")
	)
	(pad "4" thru_hole circle
		(at 4 1.8)
		(size 0.6096 0.6096)
		(drill 0.3048)
		(layers "*.Cu" "*.Mask")
		(remove_unused_layers no)
		(uuid "9df800f8-80f4-43c8-a40d-2314e550efa1")
	)
	(pad "4" thru_hole circle
		(at 4 2.4)
		(size 0.6096 0.6096)
		(drill 0.3048)
		(layers "*.Cu" "*.Mask")
		(remove_unused_layers no)
		(uuid "9282a6be-895f-47e9-a504-badd77f61857")
	)
	(pad "4" thru_hole circle
		(at 4.325 -0.125)
		(size 0.6096 0.6096)
		(drill 0.3048)
		(layers "*.Cu" "*.Mask")
		(remove_unused_layers no)
		(uuid "a2ea1caa-f479-49a1-91e2-05f1bd3e3957")
	)
	(pad "4" thru_hole circle
		(at 4.5 0.9)
		(size 0.6096 0.6096)
		(drill 0.3048)
		(layers "*.Cu" "*.Mask")
		(remove_unused_layers no)
		(uuid "9823ae61-3f0b-465a-a2ec-3196edea46f3")
	)
	(pad "4" thru_hole circle
		(at 4.5 1.5)
		(size 0.6096 0.6096)
		(drill 0.3048)
		(layers "*.Cu" "*.Mask")
		(remove_unused_layers no)
		(uuid "c2fdb5d8-83a4-4b4b-a209-e0f0cdf720cd")
	)
	(pad "4" thru_hole circle
		(at 4.875 -0.175)
		(size 0.6096 0.6096)
		(drill 0.3048)
		(layers "*.Cu" "*.Mask")
		(remove_unused_layers no)
		(uuid "560583e0-c4ff-4552-b7d3-f78e24f0ff0c")
	)
)
