(footprint "Jumper_Harwin_S1621-46R"
	(version 20240108)
	(generator "pcbnew")
	(generator_version "8.0")
	(layer "F.Cu")
	(property "Reference" "REF**"
		(at 0 -2 0)
		(unlocked yes)
		(layer "F.SilkS")
		(uuid "1324351e-0d7c-4026-baf6-d15c50c21647")
		(effects
			(font
				(size 1 1)
				(thickness 0.1)
			)
		)
	)
	(property "Value" "Jumper_Harwin_S1621-46R"
		(at 0 2 0)
		(unlocked yes)
		(layer "F.Fab")
		(uuid "66bc9219-06ca-4323-8f68-7d5689ede6a6")
		(effects
			(font
				(size 1 1)
				(thickness 0.15)
			)
		)
	)
	(property "Footprint" ""
		(at 0 0 0)
		(unlocked yes)
		(layer "F.Fab")
		(hide yes)
		(uuid "aa9d88b0-9942-4a47-8794-bcbdda389e7c")
		(effects
			(font
				(size 1 1)
				(thickness 0.15)
			)
		)
	)
	(property "Datasheet" ""
		(at 0 0 0)
		(unlocked yes)
		(layer "F.Fab")
		(hide yes)
		(uuid "fa1fe969-c9b1-40f6-9bae-6b4d0f4c65cd")
		(effects
			(font
				(size 1 1)
				(thickness 0.15)
			)
		)
	)
	(property "Description" ""
		(at 0 0 0)
		(unlocked yes)
		(layer "F.Fab")
		(hide yes)
		(uuid "f0c15d78-54c4-4def-8cdd-fab3fa5cb8df")
		(effects
			(font
				(size 1 1)
				(thickness 0.15)
			)
		)
	)
	(attr smd)
	(fp_line
		(start -6.75 -1.5)
		(end -4.15 -1.5)
		(stroke
			(width 0.1)
			(type default)
		)
		(layer "F.SilkS")
		(uuid "8cfd513e-c353-4aa9-ba9f-932a5b1b597e")
	)
	(fp_line
		(start -6.75 1.5)
		(end -6.75 -1.5)
		(stroke
			(width 0.1)
			(type default)
		)
		(layer "F.SilkS")
		(uuid "766bee9e-4e58-4866-b21c-613f6b594abb")
	)
	(fp_line
		(start -4.15 -1.5)
		(end -4.15 1.5)
		(stroke
			(width 0.1)
			(type default)
		)
		(layer "F.SilkS")
		(uuid "a14da914-377b-4dba-956d-901ea92afdf2")
	)
	(fp_line
		(start -4.15 1.5)
		(end -6.75 1.5)
		(stroke
			(width 0.1)
			(type default)
		)
		(layer "F.SilkS")
		(uuid "8bfa0508-c747-4413-92bd-94f49dbfedcd")
	)
	(fp_rect
		(start 4.15 -1.5)
		(end 6.75 1.5)
		(stroke
			(width 0.1)
			(type default)
		)
		(fill none)
		(layer "F.SilkS")
		(uuid "49875741-42f9-49f7-9cf7-96932b2b5e92")
	)
	(fp_rect
		(start -6.9 -1.65)
		(end -4 1.65)
		(stroke
			(width 0.05)
			(type default)
		)
		(fill none)
		(layer "F.CrtYd")
		(uuid "b6bbdfab-29f1-4ff9-b74f-a1635b97d3cd")
	)
	(fp_rect
		(start 4 -1.65)
		(end 6.9 1.65)
		(stroke
			(width 0.05)
			(type default)
		)
		(fill none)
		(layer "F.CrtYd")
		(uuid "41a7e142-7dbc-4c16-96bd-e676c13ea99c")
	)
	(fp_rect
		(start -6.15 -0.9)
		(end -3.81 0.9)
		(stroke
			(width 0.1)
			(type default)
		)
		(fill none)
		(layer "F.Fab")
		(uuid "c178b33a-055a-4f31-9047-a22301c2e87c")
	)
	(fp_rect
		(start -3.81 -1.15)
		(end 3.81 1.15)
		(stroke
			(width 0.1)
			(type default)
		)
		(fill none)
		(layer "F.Fab")
		(uuid "3a8510b9-d723-44a2-9d31-a7fadb6e8ba3")
	)
	(fp_rect
		(start 3.81 -0.9)
		(end 6.15 0.9)
		(stroke
			(width 0.1)
			(type default)
		)
		(fill none)
		(layer "F.Fab")
		(uuid "28a06f47-65df-4df3-9757-c37dcb7a41f1")
	)
	(fp_text user "1.3mm Clearance"
		(at 0 0 0)
		(unlocked yes)
		(layer "F.Fab")
		(uuid "4efc6d2b-60fb-40d1-b880-b1a95c81af8e")
		(effects
			(font
				(size 0.6 0.6)
				(thickness 0.15)
			)
		)
	)
	(fp_text user "${REFERENCE}"
		(at 0 3.5 0)
		(unlocked yes)
		(layer "F.Fab")
		(uuid "7617b817-e035-4a43-922e-99f17dd28802")
		(effects
			(font
				(size 1 1)
				(thickness 0.15)
			)
		)
	)
	(pad "1" smd roundrect
		(at -5.45 0)
		(size 2.4 2.8)
		(layers "F.Cu" "F.Paste" "F.Mask")
		(roundrect_rratio 0.25)
		(thermal_bridge_angle 45)
		(uuid "76b721d5-1940-4034-91d2-403ab046b28d")
	)
	(pad "2" smd roundrect
		(at 5.45 0)
		(size 2.4 2.8)
		(layers "F.Cu" "F.Paste" "F.Mask")
		(roundrect_rratio 0.25)
		(thermal_bridge_angle 45)
		(uuid "5c7118ac-bda5-4256-928f-2ffd1225746d")
	)
	(model "${POWDER_KICAD_LIBRARY}/models/POWDER_Misc/s1621-46r.stp"
		(offset
			(xyz 0 0 0)
		)
		(scale
			(xyz 1 1 1)
		)
		(rotate
			(xyz -90 0 0)
		)
	)
)
