{
    "layout": {
        "type": "grid",
        "rows": 5,
        "cols": 6,
        "space": "2.5mm",
        "rotation": "0deg",
        "alternation": "none",
        "renamenet": "Board_{n}-{orig}",
        "renameref": "{orig}",
        "vbackbone": "2.5mm",
        "hbackbone": "2.5mm"
    },
    "source": {
        "type": "auto",
        "tolerance": "5mm"
    },
    "tabs": {
        "type": "plugin",
        "code": "plugin_test.py.TabPlugin",
        "arg": "asdf"
    },
    "cuts": {
        "type": "plugin",
        "code": "plugin_test.py.MouseBitesPlugin",
        "drill": "0.45mm",
        "spacing": "0.80mm",
        "offset": "0.0mm",
        "prolong_tab": "0.2mm",
        "arg": ""
    },
    "framing": {
        "type": "frame",
        "width": "6mm",
        "space": "2.5mm"
    },
    "tooling": {
        "type": "4hole",
        "hoffset": "3mm",
        "voffset": "3mm",
        "size": "3.2mm",
        "paste": true
    },
    "post": {
        "type": "auto",
        "millradius": "0.7mm",
        "copperfill": false
    },
    "page": {
        "type": "A2"
    }
}
