(kicad_sch (version 20211123) (generator eeschema)

  (uuid 87802c09-8e3f-4496-9fa3-d64a3450019e)

  (paper "A4")

  (lib_symbols
    (symbol "000_PreferredParts:C_10pF" (pin_numbers hide) (pin_names (offset 0.254)) (in_bom yes) (on_board yes)
      (property "Reference" "C" (id 0) (at 0.635 2.54 0)
        (effects (font (size 1.27 1.27)) (justify left))
      )
      (property "Value" "C_10pF" (id 1) (at 0.635 -2.54 0)
        (effects (font (size 1.27 1.27)) (justify left))
      )
      (property "Footprint" "Capacitor_SMD:C_0402_1005Metric" (id 2) (at 0.9652 -3.81 0)
        (effects (font (size 1.27 1.27)) hide)
      )
      (property "Datasheet" "~" (id 3) (at 0 0 0)
        (effects (font (size 1.27 1.27)) hide)
      )
      (property "PartSpecification" "3000-0000000582" (id 4) (at 0 0 0)
        (effects (font (size 1.27 1.27)) hide)
      )
      (property "ki_keywords" "cap capacitor" (id 5) (at 0 0 0)
        (effects (font (size 1.27 1.27)) hide)
      )
      (property "ki_description" "Unpolarized capacitor" (id 6) (at 0 0 0)
        (effects (font (size 1.27 1.27)) hide)
      )
      (property "ki_fp_filters" "C_*" (id 7) (at 0 0 0)
        (effects (font (size 1.27 1.27)) hide)
      )
      (symbol "C_10pF_0_1"
        (polyline
          (pts
            (xy -2.032 -0.762)
            (xy 2.032 -0.762)
          )
          (stroke (width 0.508) (type default) (color 0 0 0 0))
          (fill (type none))
        )
        (polyline
          (pts
            (xy -2.032 0.762)
            (xy 2.032 0.762)
          )
          (stroke (width 0.508) (type default) (color 0 0 0 0))
          (fill (type none))
        )
      )
      (symbol "C_10pF_1_1"
        (pin passive line (at 0 3.81 270) (length 2.794)
          (name "~" (effects (font (size 1.27 1.27))))
          (number "1" (effects (font (size 1.27 1.27))))
        )
        (pin passive line (at 0 -3.81 90) (length 2.794)
          (name "~" (effects (font (size 1.27 1.27))))
          (number "2" (effects (font (size 1.27 1.27))))
        )
      )
    )
    (symbol "000_PreferredParts:C_10uF_0603" (pin_numbers hide) (pin_names (offset 0.254)) (in_bom yes) (on_board yes)
      (property "Reference" "C" (id 0) (at 0.635 2.54 0)
        (effects (font (size 1.27 1.27)) (justify left))
      )
      (property "Value" "C_10uF_0603" (id 1) (at 0.635 -2.54 0)
        (effects (font (size 1.27 1.27)) (justify left) hide)
      )
      (property "Footprint" "Capacitor_SMD:C_0603_1608Metric" (id 2) (at 0.9652 -3.81 0)
        (effects (font (size 1.27 1.27)) hide)
      )
      (property "Datasheet" "~" (id 3) (at 0 0 0)
        (effects (font (size 1.27 1.27)) hide)
      )
      (property "DisplayValue" "10uF" (id 4) (at 3.81 -2.54 0)
        (effects (font (size 1.27 1.27)))
      )
      (property "DisplayFootprint" "0603" (id 5) (at 3.81 -5.08 0)
        (effects (font (size 1.27 1.27)))
      )
      (property "PartSpecification" "3000-0000000135" (id 6) (at 0 0 0)
        (effects (font (size 1.27 1.27)) hide)
      )
      (property "ki_keywords" "cap capacitor" (id 7) (at 0 0 0)
        (effects (font (size 1.27 1.27)) hide)
      )
      (property "ki_description" "Unpolarized capacitor" (id 8) (at 0 0 0)
        (effects (font (size 1.27 1.27)) hide)
      )
      (property "ki_fp_filters" "C_*" (id 9) (at 0 0 0)
        (effects (font (size 1.27 1.27)) hide)
      )
      (symbol "C_10uF_0603_0_1"
        (polyline
          (pts
            (xy -2.032 -0.762)
            (xy 2.032 -0.762)
          )
          (stroke (width 0.508) (type default) (color 0 0 0 0))
          (fill (type none))
        )
        (polyline
          (pts
            (xy -2.032 0.762)
            (xy 2.032 0.762)
          )
          (stroke (width 0.508) (type default) (color 0 0 0 0))
          (fill (type none))
        )
      )
      (symbol "C_10uF_0603_1_1"
        (pin passive line (at 0 3.81 270) (length 2.794)
          (name "~" (effects (font (size 1.27 1.27))))
          (number "1" (effects (font (size 1.27 1.27))))
        )
        (pin passive line (at 0 -3.81 90) (length 2.794)
          (name "~" (effects (font (size 1.27 1.27))))
          (number "2" (effects (font (size 1.27 1.27))))
        )
      )
    )
    (symbol "000_PreferredParts:C_1nF" (pin_numbers hide) (pin_names (offset 0.254)) (in_bom yes) (on_board yes)
      (property "Reference" "C" (id 0) (at 0.635 2.54 0)
        (effects (font (size 1.27 1.27)) (justify left))
      )
      (property "Value" "C_1nF" (id 1) (at 0.635 -2.54 0)
        (effects (font (size 1.27 1.27)) (justify left))
      )
      (property "Footprint" "Capacitor_SMD:C_0402_1005Metric" (id 2) (at 0.9652 -3.81 0)
        (effects (font (size 1.27 1.27)) hide)
      )
      (property "Datasheet" "~" (id 3) (at 0 0 0)
        (effects (font (size 1.27 1.27)) hide)
      )
      (property "PartSpecification" "3000-0000000128" (id 4) (at 0 0 0)
        (effects (font (size 1.27 1.27)) hide)
      )
      (property "ki_keywords" "cap capacitor" (id 5) (at 0 0 0)
        (effects (font (size 1.27 1.27)) hide)
      )
      (property "ki_description" "Unpolarized capacitor" (id 6) (at 0 0 0)
        (effects (font (size 1.27 1.27)) hide)
      )
      (property "ki_fp_filters" "C_*" (id 7) (at 0 0 0)
        (effects (font (size 1.27 1.27)) hide)
      )
      (symbol "C_1nF_0_1"
        (polyline
          (pts
            (xy -2.032 -0.762)
            (xy 2.032 -0.762)
          )
          (stroke (width 0.508) (type default) (color 0 0 0 0))
          (fill (type none))
        )
        (polyline
          (pts
            (xy -2.032 0.762)
            (xy 2.032 0.762)
          )
          (stroke (width 0.508) (type default) (color 0 0 0 0))
          (fill (type none))
        )
      )
      (symbol "C_1nF_1_1"
        (pin passive line (at 0 3.81 270) (length 2.794)
          (name "~" (effects (font (size 1.27 1.27))))
          (number "1" (effects (font (size 1.27 1.27))))
        )
        (pin passive line (at 0 -3.81 90) (length 2.794)
          (name "~" (effects (font (size 1.27 1.27))))
          (number "2" (effects (font (size 1.27 1.27))))
        )
      )
    )
    (symbol "000_PreferredParts:C_1uF" (pin_numbers hide) (pin_names (offset 0.254)) (in_bom yes) (on_board yes)
      (property "Reference" "C" (id 0) (at 0.635 2.54 0)
        (effects (font (size 1.27 1.27)) (justify left))
      )
      (property "Value" "C_1uF" (id 1) (at 0.635 -2.54 0)
        (effects (font (size 1.27 1.27)) (justify left))
      )
      (property "Footprint" "Capacitor_SMD:C_0603_1608Metric" (id 2) (at 0.9652 -3.81 0)
        (effects (font (size 1.27 1.27)) hide)
      )
      (property "Datasheet" "~" (id 3) (at 0 0 0)
        (effects (font (size 1.27 1.27)) hide)
      )
      (property "PartSpecification" "3000-0000000136" (id 4) (at 0 0 0)
        (effects (font (size 1.27 1.27)) hide)
      )
      (property "ki_keywords" "cap capacitor" (id 5) (at 0 0 0)
        (effects (font (size 1.27 1.27)) hide)
      )
      (property "ki_description" "Unpolarized capacitor" (id 6) (at 0 0 0)
        (effects (font (size 1.27 1.27)) hide)
      )
      (property "ki_fp_filters" "C_*" (id 7) (at 0 0 0)
        (effects (font (size 1.27 1.27)) hide)
      )
      (symbol "C_1uF_0_1"
        (polyline
          (pts
            (xy -2.032 -0.762)
            (xy 2.032 -0.762)
          )
          (stroke (width 0.508) (type default) (color 0 0 0 0))
          (fill (type none))
        )
        (polyline
          (pts
            (xy -2.032 0.762)
            (xy 2.032 0.762)
          )
          (stroke (width 0.508) (type default) (color 0 0 0 0))
          (fill (type none))
        )
      )
      (symbol "C_1uF_1_1"
        (pin passive line (at 0 3.81 270) (length 2.794)
          (name "~" (effects (font (size 1.27 1.27))))
          (number "1" (effects (font (size 1.27 1.27))))
        )
        (pin passive line (at 0 -3.81 90) (length 2.794)
          (name "~" (effects (font (size 1.27 1.27))))
          (number "2" (effects (font (size 1.27 1.27))))
        )
      )
    )
    (symbol "Device:FerriteBead" (pin_numbers hide) (pin_names (offset 0)) (in_bom yes) (on_board yes)
      (property "Reference" "FB" (id 0) (at -3.81 0.635 90)
        (effects (font (size 1.27 1.27)))
      )
      (property "Value" "FerriteBead" (id 1) (at 3.81 0 90)
        (effects (font (size 1.27 1.27)))
      )
      (property "Footprint" "" (id 2) (at -1.778 0 90)
        (effects (font (size 1.27 1.27)) hide)
      )
      (property "Datasheet" "~" (id 3) (at 0 0 0)
        (effects (font (size 1.27 1.27)) hide)
      )
      (property "ki_keywords" "L ferrite bead inductor filter" (id 4) (at 0 0 0)
        (effects (font (size 1.27 1.27)) hide)
      )
      (property "ki_description" "Ferrite bead" (id 5) (at 0 0 0)
        (effects (font (size 1.27 1.27)) hide)
      )
      (property "ki_fp_filters" "Inductor_* L_* *Ferrite*" (id 6) (at 0 0 0)
        (effects (font (size 1.27 1.27)) hide)
      )
      (symbol "FerriteBead_0_1"
        (polyline
          (pts
            (xy 0 -1.27)
            (xy 0 -1.2192)
          )
          (stroke (width 0) (type default) (color 0 0 0 0))
          (fill (type none))
        )
        (polyline
          (pts
            (xy 0 1.27)
            (xy 0 1.2954)
          )
          (stroke (width 0) (type default) (color 0 0 0 0))
          (fill (type none))
        )
        (polyline
          (pts
            (xy -2.7686 0.4064)
            (xy -1.7018 2.2606)
            (xy 2.7686 -0.3048)
            (xy 1.6764 -2.159)
            (xy -2.7686 0.4064)
          )
          (stroke (width 0) (type default) (color 0 0 0 0))
          (fill (type none))
        )
      )
      (symbol "FerriteBead_1_1"
        (pin passive line (at 0 3.81 270) (length 2.54)
          (name "~" (effects (font (size 1.27 1.27))))
          (number "1" (effects (font (size 1.27 1.27))))
        )
        (pin passive line (at 0 -3.81 90) (length 2.54)
          (name "~" (effects (font (size 1.27 1.27))))
          (number "2" (effects (font (size 1.27 1.27))))
        )
      )
    )
    (symbol "Device:Q_NMOS_GSD" (pin_names (offset 0) hide) (in_bom yes) (on_board yes)
      (property "Reference" "Q" (id 0) (at 5.08 1.27 0)
        (effects (font (size 1.27 1.27)) (justify left))
      )
      (property "Value" "Q_NMOS_GSD" (id 1) (at 5.08 -1.27 0)
        (effects (font (size 1.27 1.27)) (justify left))
      )
      (property "Footprint" "" (id 2) (at 5.08 2.54 0)
        (effects (font (size 1.27 1.27)) hide)
      )
      (property "Datasheet" "~" (id 3) (at 0 0 0)
        (effects (font (size 1.27 1.27)) hide)
      )
      (property "ki_keywords" "transistor NMOS N-MOS N-MOSFET" (id 4) (at 0 0 0)
        (effects (font (size 1.27 1.27)) hide)
      )
      (property "ki_description" "N-MOSFET transistor, gate/source/drain" (id 5) (at 0 0 0)
        (effects (font (size 1.27 1.27)) hide)
      )
      (symbol "Q_NMOS_GSD_0_1"
        (polyline
          (pts
            (xy 0.254 0)
            (xy -2.54 0)
          )
          (stroke (width 0) (type default) (color 0 0 0 0))
          (fill (type none))
        )
        (polyline
          (pts
            (xy 0.254 1.905)
            (xy 0.254 -1.905)
          )
          (stroke (width 0.254) (type default) (color 0 0 0 0))
          (fill (type none))
        )
        (polyline
          (pts
            (xy 0.762 -1.27)
            (xy 0.762 -2.286)
          )
          (stroke (width 0.254) (type default) (color 0 0 0 0))
          (fill (type none))
        )
        (polyline
          (pts
            (xy 0.762 0.508)
            (xy 0.762 -0.508)
          )
          (stroke (width 0.254) (type default) (color 0 0 0 0))
          (fill (type none))
        )
        (polyline
          (pts
            (xy 0.762 2.286)
            (xy 0.762 1.27)
          )
          (stroke (width 0.254) (type default) (color 0 0 0 0))
          (fill (type none))
        )
        (polyline
          (pts
            (xy 2.54 2.54)
            (xy 2.54 1.778)
          )
          (stroke (width 0) (type default) (color 0 0 0 0))
          (fill (type none))
        )
        (polyline
          (pts
            (xy 2.54 -2.54)
            (xy 2.54 0)
            (xy 0.762 0)
          )
          (stroke (width 0) (type default) (color 0 0 0 0))
          (fill (type none))
        )
        (polyline
          (pts
            (xy 0.762 -1.778)
            (xy 3.302 -1.778)
            (xy 3.302 1.778)
            (xy 0.762 1.778)
          )
          (stroke (width 0) (type default) (color 0 0 0 0))
          (fill (type none))
        )
        (polyline
          (pts
            (xy 1.016 0)
            (xy 2.032 0.381)
            (xy 2.032 -0.381)
            (xy 1.016 0)
          )
          (stroke (width 0) (type default) (color 0 0 0 0))
          (fill (type outline))
        )
        (polyline
          (pts
            (xy 2.794 0.508)
            (xy 2.921 0.381)
            (xy 3.683 0.381)
            (xy 3.81 0.254)
          )
          (stroke (width 0) (type default) (color 0 0 0 0))
          (fill (type none))
        )
        (polyline
          (pts
            (xy 3.302 0.381)
            (xy 2.921 -0.254)
            (xy 3.683 -0.254)
            (xy 3.302 0.381)
          )
          (stroke (width 0) (type default) (color 0 0 0 0))
          (fill (type none))
        )
        (circle (center 1.651 0) (radius 2.794)
          (stroke (width 0.254) (type default) (color 0 0 0 0))
          (fill (type none))
        )
        (circle (center 2.54 -1.778) (radius 0.254)
          (stroke (width 0) (type default) (color 0 0 0 0))
          (fill (type outline))
        )
        (circle (center 2.54 1.778) (radius 0.254)
          (stroke (width 0) (type default) (color 0 0 0 0))
          (fill (type outline))
        )
      )
      (symbol "Q_NMOS_GSD_1_1"
        (pin input line (at -5.08 0 0) (length 2.54)
          (name "G" (effects (font (size 1.27 1.27))))
          (number "1" (effects (font (size 1.27 1.27))))
        )
        (pin passive line (at 2.54 -5.08 90) (length 2.54)
          (name "S" (effects (font (size 1.27 1.27))))
          (number "2" (effects (font (size 1.27 1.27))))
        )
        (pin passive line (at 2.54 5.08 270) (length 2.54)
          (name "D" (effects (font (size 1.27 1.27))))
          (number "3" (effects (font (size 1.27 1.27))))
        )
      )
    )
    (symbol "Device:R" (pin_numbers hide) (pin_names (offset 0)) (in_bom yes) (on_board yes)
      (property "Reference" "R" (id 0) (at 2.032 0 90)
        (effects (font (size 1.27 1.27)))
      )
      (property "Value" "R" (id 1) (at 0 0 90)
        (effects (font (size 1.27 1.27)))
      )
      (property "Footprint" "" (id 2) (at -1.778 0 90)
        (effects (font (size 1.27 1.27)) hide)
      )
      (property "Datasheet" "~" (id 3) (at 0 0 0)
        (effects (font (size 1.27 1.27)) hide)
      )
      (property "ki_keywords" "R res resistor" (id 4) (at 0 0 0)
        (effects (font (size 1.27 1.27)) hide)
      )
      (property "ki_description" "Resistor" (id 5) (at 0 0 0)
        (effects (font (size 1.27 1.27)) hide)
      )
      (property "ki_fp_filters" "R_*" (id 6) (at 0 0 0)
        (effects (font (size 1.27 1.27)) hide)
      )
      (symbol "R_0_1"
        (rectangle (start -1.016 -2.54) (end 1.016 2.54)
          (stroke (width 0.254) (type default) (color 0 0 0 0))
          (fill (type none))
        )
      )
      (symbol "R_1_1"
        (pin passive line (at 0 3.81 270) (length 1.27)
          (name "~" (effects (font (size 1.27 1.27))))
          (number "1" (effects (font (size 1.27 1.27))))
        )
        (pin passive line (at 0 -3.81 90) (length 1.27)
          (name "~" (effects (font (size 1.27 1.27))))
          (number "2" (effects (font (size 1.27 1.27))))
        )
      )
    )
    (symbol "POWDER_Power:TPS79901YZU" (in_bom yes) (on_board yes)
      (property "Reference" "U" (id 0) (at 5.08 -7.62 0)
        (effects (font (size 1.27 1.27)))
      )
      (property "Value" "TPS79901YZU" (id 1) (at 0 7.62 0)
        (effects (font (size 1.27 1.27)))
      )
      (property "Footprint" "POWDER_Power:DSBGA_5_P0.5" (id 2) (at 0 10.16 0)
        (effects (font (size 1.27 1.27)) hide)
      )
      (property "Datasheet" "" (id 3) (at 0 15.24 0)
        (effects (font (size 1.27 1.27)) hide)
      )
      (symbol "TPS79901YZU_0_1"
        (rectangle (start -6.35 -6.35) (end 6.35 6.35)
          (stroke (width 0) (type default) (color 0 0 0 0))
          (fill (type background))
        )
      )
      (symbol "TPS79901YZU_1_1"
        (pin input line (at -8.89 -3.81 0) (length 2.54)
          (name "EN" (effects (font (size 1.27 1.27))))
          (number "A1" (effects (font (size 1.27 1.27))))
        )
        (pin input line (at 8.89 -3.81 180) (length 2.54)
          (name "FB" (effects (font (size 1.27 1.27))))
          (number "A3" (effects (font (size 1.27 1.27))))
        )
        (pin power_in line (at 0 -8.89 90) (length 2.54)
          (name "GND" (effects (font (size 1.27 1.27))))
          (number "B2" (effects (font (size 1.27 1.27))))
        )
        (pin power_out line (at 8.89 3.81 180) (length 2.54)
          (name "OUT" (effects (font (size 1.27 1.27))))
          (number "C1" (effects (font (size 1.27 1.27))))
        )
        (pin power_in line (at -8.89 3.81 0) (length 2.54)
          (name "IN" (effects (font (size 1.27 1.27))))
          (number "C3" (effects (font (size 1.27 1.27))))
        )
      )
    )
    (symbol "power:GND" (power) (pin_names (offset 0)) (in_bom yes) (on_board yes)
      (property "Reference" "#PWR" (id 0) (at 0 -6.35 0)
        (effects (font (size 1.27 1.27)) hide)
      )
      (property "Value" "GND" (id 1) (at 0 -3.81 0)
        (effects (font (size 1.27 1.27)))
      )
      (property "Footprint" "" (id 2) (at 0 0 0)
        (effects (font (size 1.27 1.27)) hide)
      )
      (property "Datasheet" "" (id 3) (at 0 0 0)
        (effects (font (size 1.27 1.27)) hide)
      )
      (property "ki_keywords" "power-flag" (id 4) (at 0 0 0)
        (effects (font (size 1.27 1.27)) hide)
      )
      (property "ki_description" "Power symbol creates a global label with name \"GND\" , ground" (id 5) (at 0 0 0)
        (effects (font (size 1.27 1.27)) hide)
      )
      (symbol "GND_0_1"
        (polyline
          (pts
            (xy 0 0)
            (xy 0 -1.27)
            (xy 1.27 -1.27)
            (xy 0 -2.54)
            (xy -1.27 -1.27)
            (xy 0 -1.27)
          )
          (stroke (width 0) (type default) (color 0 0 0 0))
          (fill (type none))
        )
      )
      (symbol "GND_1_1"
        (pin power_in line (at 0 0 270) (length 0) hide
          (name "GND" (effects (font (size 1.27 1.27))))
          (number "1" (effects (font (size 1.27 1.27))))
        )
      )
    )
  )

  (junction (at 165.1 76.2) (diameter 0) (color 0 0 0 0)
    (uuid 010c0bb5-6cb3-48b8-8091-114fd3ccd76f)
  )
  (junction (at 228.6 76.2) (diameter 0) (color 0 0 0 0)
    (uuid 0691116a-2de4-4162-9df8-8f3a342115de)
  )
  (junction (at 190.5 76.2) (diameter 0) (color 0 0 0 0)
    (uuid 088a10e2-68c8-493c-9c26-15fe208d796b)
  )
  (junction (at 114.3 83.82) (diameter 0) (color 0 0 0 0)
    (uuid 15088e40-6d85-4583-aba6-4fa863c55f2f)
  )
  (junction (at 25.4 76.2) (diameter 0) (color 0 0 0 0)
    (uuid 2e69dec2-7eb2-4701-8a49-64af73859810)
  )
  (junction (at 76.2 76.2) (diameter 0) (color 0 0 0 0)
    (uuid 31529c1f-1f5c-4ac6-a7f5-bef2f8a5451d)
  )
  (junction (at 114.3 76.2) (diameter 0) (color 0 0 0 0)
    (uuid 4f77a2ce-2ccb-44b7-920c-dd165ea2a2dc)
  )
  (junction (at 177.8 76.2) (diameter 0) (color 0 0 0 0)
    (uuid 686e772d-8528-4fcb-abd4-4141f198a276)
  )
  (junction (at 254 76.2) (diameter 0) (color 0 0 0 0)
    (uuid 74409791-9b77-480a-ac6d-2a8dee1a4d10)
  )
  (junction (at 241.3 76.2) (diameter 0) (color 0 0 0 0)
    (uuid 76e0d926-50c2-4612-9d80-c546cda7c5b3)
  )
  (junction (at 152.4 76.2) (diameter 0) (color 0 0 0 0)
    (uuid 7920e9a7-a0e6-447a-bd3b-36d0d9ee3f31)
  )
  (junction (at 38.1 76.2) (diameter 0) (color 0 0 0 0)
    (uuid 8ed81a04-44fb-4977-b1c1-fce2e08de744)
  )
  (junction (at 50.8 76.2) (diameter 0) (color 0 0 0 0)
    (uuid 9a3665b4-5839-4a79-bc01-930f70f19097)
  )
  (junction (at 76.2 88.9) (diameter 0) (color 0 0 0 0)
    (uuid b317d386-a7ac-4fe0-bd4e-325733c50de5)
  )
  (junction (at 66.04 82.55) (diameter 0) (color 0 0 0 0)
    (uuid b45a27ea-368a-496c-bf02-6b93ad85c2e6)
  )
  (junction (at 139.7 76.2) (diameter 0) (color 0 0 0 0)
    (uuid b9969cd1-0031-47da-8686-2066ba5caf4d)
  )
  (junction (at 215.9 76.2) (diameter 0) (color 0 0 0 0)
    (uuid da93d317-169c-4427-973c-7557f91aa2d2)
  )
  (junction (at 127 76.2) (diameter 0) (color 0 0 0 0)
    (uuid efb20f68-be11-4a52-80c0-6cf5246b6a8b)
  )

  (wire (pts (xy 76.2 88.9) (xy 76.2 91.44))
    (stroke (width 0) (type default) (color 0 0 0 0))
    (uuid 00f2bbda-d261-471b-aec7-436cf68a3762)
  )
  (wire (pts (xy 38.1 76.2) (xy 38.1 78.74))
    (stroke (width 0) (type default) (color 0 0 0 0))
    (uuid 05c1f8a3-35b6-4e2d-928a-aff7ff5263a6)
  )
  (wire (pts (xy 228.6 76.2) (xy 241.3 76.2))
    (stroke (width 0) (type default) (color 0 0 0 0))
    (uuid 0af7ff23-a6e6-4b0d-8133-406ad082dc62)
  )
  (wire (pts (xy 114.3 83.82) (xy 114.3 86.36))
    (stroke (width 0) (type default) (color 0 0 0 0))
    (uuid 0ff5cf67-a6fb-4103-863c-9271c2099608)
  )
  (wire (pts (xy 50.8 86.36) (xy 50.8 88.9))
    (stroke (width 0) (type default) (color 0 0 0 0))
    (uuid 11b676a6-51c4-48b2-a0bb-1c25d864514d)
  )
  (wire (pts (xy 92.71 88.9) (xy 92.71 83.82))
    (stroke (width 0) (type default) (color 0 0 0 0))
    (uuid 12d0d2f1-5b47-40e8-8c29-f00094736d62)
  )
  (wire (pts (xy 38.1 86.36) (xy 38.1 88.9))
    (stroke (width 0) (type default) (color 0 0 0 0))
    (uuid 168dccd9-f2c0-40f9-bc0c-81848370943a)
  )
  (wire (pts (xy 139.7 76.2) (xy 152.4 76.2))
    (stroke (width 0) (type default) (color 0 0 0 0))
    (uuid 1881c2bd-b87e-4c38-871f-0e5324378487)
  )
  (wire (pts (xy 190.5 76.2) (xy 190.5 78.74))
    (stroke (width 0) (type default) (color 0 0 0 0))
    (uuid 1997f7d5-3422-45c5-a7b1-afd12f3fc852)
  )
  (wire (pts (xy 127 76.2) (xy 139.7 76.2))
    (stroke (width 0) (type default) (color 0 0 0 0))
    (uuid 1a1afdaf-c77c-4f24-b9c8-4e32fb6f9e7e)
  )
  (wire (pts (xy 66.04 82.55) (xy 63.5 82.55))
    (stroke (width 0) (type default) (color 0 0 0 0))
    (uuid 1e3f26f1-e3a9-42fa-95a4-14f86255a676)
  )
  (wire (pts (xy 76.2 76.2) (xy 76.2 77.47))
    (stroke (width 0) (type default) (color 0 0 0 0))
    (uuid 1f9537a8-f863-416c-94d2-22e56ebf5c3f)
  )
  (wire (pts (xy 228.6 86.36) (xy 228.6 88.9))
    (stroke (width 0) (type default) (color 0 0 0 0))
    (uuid 2ef1103f-aaf9-48b6-8fa4-f9e21e7199eb)
  )
  (wire (pts (xy 76.2 76.2) (xy 50.8 76.2))
    (stroke (width 0) (type default) (color 0 0 0 0))
    (uuid 3070d30e-7343-4960-bf18-502e682673b1)
  )
  (wire (pts (xy 207.01 76.2) (xy 215.9 76.2))
    (stroke (width 0) (type default) (color 0 0 0 0))
    (uuid 393aa457-c34c-48ce-ae70-b49ebc0ec1fa)
  )
  (wire (pts (xy 38.1 76.2) (xy 25.4 76.2))
    (stroke (width 0) (type default) (color 0 0 0 0))
    (uuid 419c0dad-23c6-4281-8657-781dcb1fe513)
  )
  (wire (pts (xy 241.3 76.2) (xy 241.3 78.74))
    (stroke (width 0) (type default) (color 0 0 0 0))
    (uuid 454fc3db-bfe2-4bba-9451-bb4ff2cc29fc)
  )
  (wire (pts (xy 102.87 88.9) (xy 102.87 96.52))
    (stroke (width 0) (type default) (color 0 0 0 0))
    (uuid 48a07b37-e7eb-4ca1-8c1e-cbd9ddacb2e7)
  )
  (wire (pts (xy 50.8 76.2) (xy 38.1 76.2))
    (stroke (width 0) (type default) (color 0 0 0 0))
    (uuid 4dc90181-9cd1-46fb-80b6-58373e4e453d)
  )
  (wire (pts (xy 66.04 82.55) (xy 68.58 82.55))
    (stroke (width 0) (type default) (color 0 0 0 0))
    (uuid 4e4dd405-bd0d-48fc-a3f1-e463368a6e79)
  )
  (wire (pts (xy 66.04 91.44) (xy 66.04 82.55))
    (stroke (width 0) (type default) (color 0 0 0 0))
    (uuid 521a443a-f777-4266-bafb-1578cce9b34b)
  )
  (wire (pts (xy 152.4 76.2) (xy 165.1 76.2))
    (stroke (width 0) (type default) (color 0 0 0 0))
    (uuid 5241c05f-ebef-4e8a-9a5d-1a2e7b4679b5)
  )
  (wire (pts (xy 139.7 86.36) (xy 139.7 88.9))
    (stroke (width 0) (type default) (color 0 0 0 0))
    (uuid 5493b52e-1592-4d7a-9c29-a2212d164477)
  )
  (wire (pts (xy 165.1 86.36) (xy 165.1 88.9))
    (stroke (width 0) (type default) (color 0 0 0 0))
    (uuid 5695bd97-c9b4-45e8-93b9-c65577d65421)
  )
  (wire (pts (xy 76.2 88.9) (xy 92.71 88.9))
    (stroke (width 0) (type default) (color 0 0 0 0))
    (uuid 58b5d4d4-2b54-44b1-901b-7848ed7d2ab3)
  )
  (wire (pts (xy 25.4 86.36) (xy 25.4 88.9))
    (stroke (width 0) (type default) (color 0 0 0 0))
    (uuid 59c9aa29-a6b3-4643-8b29-8ee66180ae49)
  )
  (wire (pts (xy 114.3 93.98) (xy 114.3 96.52))
    (stroke (width 0) (type default) (color 0 0 0 0))
    (uuid 5b5ede9f-090b-46c3-8aec-54975d483407)
  )
  (wire (pts (xy 92.71 83.82) (xy 93.98 83.82))
    (stroke (width 0) (type default) (color 0 0 0 0))
    (uuid 61e269d1-dbea-47e2-8c0a-3c523a03bf18)
  )
  (wire (pts (xy 241.3 76.2) (xy 254 76.2))
    (stroke (width 0) (type default) (color 0 0 0 0))
    (uuid 6bd4c8d5-b929-46a7-ba2e-78f4478cb8d0)
  )
  (wire (pts (xy 139.7 76.2) (xy 139.7 78.74))
    (stroke (width 0) (type default) (color 0 0 0 0))
    (uuid 6deab61a-2996-4514-bf46-b022fe81a3b8)
  )
  (wire (pts (xy 177.8 76.2) (xy 190.5 76.2))
    (stroke (width 0) (type default) (color 0 0 0 0))
    (uuid 74bfdbb8-ea50-4652-a57d-7d4654880226)
  )
  (wire (pts (xy 25.4 76.2) (xy 25.4 78.74))
    (stroke (width 0) (type default) (color 0 0 0 0))
    (uuid 771d75e8-f10d-4a5d-9275-4153c3f2faae)
  )
  (wire (pts (xy 254 76.2) (xy 266.7 76.2))
    (stroke (width 0) (type default) (color 0 0 0 0))
    (uuid 778026bc-e6e1-481d-b064-79de2613a31f)
  )
  (wire (pts (xy 19.05 76.2) (xy 25.4 76.2))
    (stroke (width 0) (type default) (color 0 0 0 0))
    (uuid 7b7434e5-f4dd-40ad-8979-5f968bc2abf9)
  )
  (wire (pts (xy 114.3 76.2) (xy 127 76.2))
    (stroke (width 0) (type default) (color 0 0 0 0))
    (uuid 87787c1a-b5ad-4f9f-974d-977ec673fa3b)
  )
  (wire (pts (xy 165.1 76.2) (xy 177.8 76.2))
    (stroke (width 0) (type default) (color 0 0 0 0))
    (uuid 8a23a8a1-c4e6-433b-9dda-ddb1ff2f6415)
  )
  (wire (pts (xy 190.5 76.2) (xy 199.39 76.2))
    (stroke (width 0) (type default) (color 0 0 0 0))
    (uuid 8cfcd141-e5a6-4e09-832c-9c312fd061f7)
  )
  (wire (pts (xy 66.04 99.06) (xy 66.04 101.6))
    (stroke (width 0) (type default) (color 0 0 0 0))
    (uuid 90c7dc47-bf1c-4943-a678-1238dcf2ce6e)
  )
  (wire (pts (xy 190.5 86.36) (xy 190.5 88.9))
    (stroke (width 0) (type default) (color 0 0 0 0))
    (uuid 92ae0cb1-b690-430d-af7c-f56fa6e2ad15)
  )
  (wire (pts (xy 254 76.2) (xy 254 78.74))
    (stroke (width 0) (type default) (color 0 0 0 0))
    (uuid a9ca7f1b-df28-4c83-b419-822f35fe75e8)
  )
  (wire (pts (xy 93.98 76.2) (xy 76.2 76.2))
    (stroke (width 0) (type default) (color 0 0 0 0))
    (uuid aa3663f3-4d1a-45ea-92c6-b261f7e02431)
  )
  (wire (pts (xy 111.76 76.2) (xy 114.3 76.2))
    (stroke (width 0) (type default) (color 0 0 0 0))
    (uuid aef797a5-fba4-42c2-a835-ff72a591d286)
  )
  (wire (pts (xy 215.9 78.74) (xy 215.9 76.2))
    (stroke (width 0) (type default) (color 0 0 0 0))
    (uuid b26358f5-9423-4cba-81b1-119baa3b42f1)
  )
  (wire (pts (xy 50.8 76.2) (xy 50.8 78.74))
    (stroke (width 0) (type default) (color 0 0 0 0))
    (uuid b50369c1-bdb8-466f-9231-5a2a3e619ce4)
  )
  (wire (pts (xy 215.9 76.2) (xy 228.6 76.2))
    (stroke (width 0) (type default) (color 0 0 0 0))
    (uuid bd7fdd7e-53bc-4021-b19a-aec2a443c5b6)
  )
  (wire (pts (xy 215.9 86.36) (xy 215.9 88.9))
    (stroke (width 0) (type default) (color 0 0 0 0))
    (uuid c37b77d3-9ca6-404b-a7c0-0dfbbfdbde18)
  )
  (wire (pts (xy 228.6 78.74) (xy 228.6 76.2))
    (stroke (width 0) (type default) (color 0 0 0 0))
    (uuid c48e0a95-d56e-4c35-a3e5-b7b9a8838fcb)
  )
  (wire (pts (xy 177.8 76.2) (xy 177.8 78.74))
    (stroke (width 0) (type default) (color 0 0 0 0))
    (uuid c79d8288-8902-4a0e-9dc6-039b6d88e251)
  )
  (wire (pts (xy 241.3 86.36) (xy 241.3 88.9))
    (stroke (width 0) (type default) (color 0 0 0 0))
    (uuid d96cace3-735d-4953-8ebb-8d1c1dd6d9fb)
  )
  (wire (pts (xy 254 86.36) (xy 254 88.9))
    (stroke (width 0) (type default) (color 0 0 0 0))
    (uuid deb4b77d-a341-4169-8ed2-62aead09bb9f)
  )
  (wire (pts (xy 152.4 86.36) (xy 152.4 88.9))
    (stroke (width 0) (type default) (color 0 0 0 0))
    (uuid e2429306-41b1-4012-849b-f977f031bd92)
  )
  (wire (pts (xy 111.76 83.82) (xy 114.3 83.82))
    (stroke (width 0) (type default) (color 0 0 0 0))
    (uuid e2caeee4-6602-4c59-b6e3-88854de3f52b)
  )
  (wire (pts (xy 76.2 99.06) (xy 76.2 101.6))
    (stroke (width 0) (type default) (color 0 0 0 0))
    (uuid e34644dc-6e50-4332-a9e4-ea2b36d2b124)
  )
  (wire (pts (xy 152.4 78.74) (xy 152.4 76.2))
    (stroke (width 0) (type default) (color 0 0 0 0))
    (uuid e42efded-783a-4938-b79a-c7e3be51bf7d)
  )
  (wire (pts (xy 114.3 83.82) (xy 127 83.82))
    (stroke (width 0) (type default) (color 0 0 0 0))
    (uuid ea37700c-d4b5-47b3-8c03-5647493dc916)
  )
  (wire (pts (xy 76.2 87.63) (xy 76.2 88.9))
    (stroke (width 0) (type default) (color 0 0 0 0))
    (uuid f4344321-4cbe-4ef0-af2a-7adae7b24020)
  )
  (wire (pts (xy 165.1 78.74) (xy 165.1 76.2))
    (stroke (width 0) (type default) (color 0 0 0 0))
    (uuid f7dd0646-85ce-40ac-9012-e29a50e75d9a)
  )
  (wire (pts (xy 177.8 86.36) (xy 177.8 88.9))
    (stroke (width 0) (type default) (color 0 0 0 0))
    (uuid fc4636fe-f3dc-40c9-9569-105f37d1b05b)
  )

  (text "Load resistor\nin case we\nneed something\nfor minimum load."
    (at 139.7 72.39 0)
    (effects (font (size 1.27 1.27)) (justify left bottom))
    (uuid 3ad2c711-b206-4a30-9ffc-74dae8928229)
  )
  (text "Feedback capacitor\nrequired according\nto datasheet."
    (at 113.03 72.39 0)
    (effects (font (size 1.27 1.27)) (justify left bottom))
    (uuid 677c5c8e-3904-4018-bc83-4132ef5c4e8f)
  )

  (label "FB" (at 123.19 83.82 0)
    (effects (font (size 1.27 1.27)) (justify left bottom))
    (uuid 5d320891-3890-4c5e-85b4-f8ec0df9b264)
  )
  (label "V4_0_PREFILT" (at 165.1 76.2 0)
    (effects (font (size 1.27 1.27)) (justify left bottom))
    (uuid e2c5896f-257e-435f-bed6-e0a9c7e5dc77)
  )
  (label "EN_PROT" (at 82.55 88.9 0)
    (effects (font (size 1.27 1.27)) (justify left bottom))
    (uuid fce2a3fe-f797-4372-8fa1-f3dba12e8f17)
  )

  (hierarchical_label "IN" (shape input) (at 19.05 76.2 180)
    (effects (font (size 1.27 1.27)) (justify right))
    (uuid 2b06b323-5c11-4ec8-9452-278f8b46ae45)
  )
  (hierarchical_label "OUT" (shape output) (at 266.7 76.2 0)
    (effects (font (size 1.27 1.27)) (justify left))
    (uuid 3a64ba5c-7c9f-498c-becb-4a950e2db972)
  )
  (hierarchical_label "EN" (shape input) (at 63.5 82.55 180)
    (effects (font (size 1.27 1.27)) (justify right))
    (uuid bab7c03f-f7ea-4f8c-b1d5-0f8cf9c4a2ad)
  )

  (symbol (lib_id "000_PreferredParts:C_10pF") (at 215.9 82.55 0) (unit 1)
    (in_bom yes) (on_board yes)
    (uuid 072e3fc3-8b1d-459a-8a35-a35d9d676add)
    (property "Reference" "C509" (id 0) (at 219.71 81.28 0)
      (effects (font (size 1.27 1.27)) (justify left))
    )
    (property "Value" "C_10pF" (id 1) (at 218.44 83.8201 0)
      (effects (font (size 1.27 1.27)) (justify left))
    )
    (property "Footprint" "Capacitor_SMD:C_0402_1005Metric" (id 2) (at 216.8652 86.36 0)
      (effects (font (size 1.27 1.27)) hide)
    )
    (property "Datasheet" "~" (id 3) (at 215.9 82.55 0)
      (effects (font (size 1.27 1.27)) hide)
    )
    (property "PartSpecification" "3000-0000000582" (id 4) (at 215.9 82.55 0)
      (effects (font (size 1.27 1.27)) hide)
    )
    (pin "1" (uuid fcd55abc-9113-4785-8d1e-f3d3c685c44b))
    (pin "2" (uuid d4d5885d-6672-4cdc-a0da-964554133cf9))
  )

  (symbol (lib_id "000_PreferredParts:C_1uF") (at 25.4 82.55 0) (unit 1)
    (in_bom yes) (on_board yes) (fields_autoplaced)
    (uuid 0dd4d1f8-d438-4a09-bcb5-45a9ddf51df5)
    (property "Reference" "C501" (id 0) (at 29.21 81.2799 0)
      (effects (font (size 1.27 1.27)) (justify left))
    )
    (property "Value" "C_1uF" (id 1) (at 29.21 83.8199 0)
      (effects (font (size 1.27 1.27)) (justify left))
    )
    (property "Footprint" "Capacitor_SMD:C_0603_1608Metric" (id 2) (at 26.3652 86.36 0)
      (effects (font (size 1.27 1.27)) hide)
    )
    (property "Datasheet" "~" (id 3) (at 25.4 82.55 0)
      (effects (font (size 1.27 1.27)) hide)
    )
    (property "PartSpecification" "3000-0000000136" (id 4) (at 25.4 82.55 0)
      (effects (font (size 1.27 1.27)) hide)
    )
    (pin "1" (uuid 6a369812-55e4-43cc-b1ef-e98bc880120c))
    (pin "2" (uuid d2e287a1-4b94-456e-a618-51fee532521f))
  )

  (symbol (lib_id "power:GND") (at 254 88.9 0) (unit 1)
    (in_bom yes) (on_board yes) (fields_autoplaced)
    (uuid 0ea3c196-ca53-47a5-bf9a-91c83cc89178)
    (property "Reference" "#PWR0196" (id 0) (at 254 95.25 0)
      (effects (font (size 1.27 1.27)) hide)
    )
    (property "Value" "GND" (id 1) (at 254 93.98 0))
    (property "Footprint" "" (id 2) (at 254 88.9 0)
      (effects (font (size 1.27 1.27)) hide)
    )
    (property "Datasheet" "" (id 3) (at 254 88.9 0)
      (effects (font (size 1.27 1.27)) hide)
    )
    (pin "1" (uuid da5d4c09-07e5-4e60-8eba-43282818e904))
  )

  (symbol (lib_id "Device:R") (at 66.04 95.25 0) (unit 1)
    (in_bom yes) (on_board yes) (fields_autoplaced)
    (uuid 14221a6e-a8e8-43ab-a16c-d11c8aed0117)
    (property "Reference" "R501" (id 0) (at 68.58 93.9799 0)
      (effects (font (size 1.27 1.27)) (justify left))
    )
    (property "Value" "10k" (id 1) (at 68.58 96.5199 0)
      (effects (font (size 1.27 1.27)) (justify left))
    )
    (property "Footprint" "Resistor_SMD:R_0402_1005Metric" (id 2) (at 64.262 95.25 90)
      (effects (font (size 1.27 1.27)) hide)
    )
    (property "Datasheet" "~" (id 3) (at 66.04 95.25 0)
      (effects (font (size 1.27 1.27)) hide)
    )
    (property "PartSpecification" "3000-0000000131" (id 4) (at 66.04 95.25 0)
      (effects (font (size 1.27 1.27)) hide)
    )
    (pin "1" (uuid e7772d70-c36f-4e02-93a2-1877d8c2de24))
    (pin "2" (uuid f416317d-af6d-4e39-97a7-abaeb8f5cded))
  )

  (symbol (lib_id "power:GND") (at 25.4 88.9 0) (unit 1)
    (in_bom yes) (on_board yes) (fields_autoplaced)
    (uuid 2ee8fec1-c61b-4382-bd4e-3d803a4a34f9)
    (property "Reference" "#PWR0203" (id 0) (at 25.4 95.25 0)
      (effects (font (size 1.27 1.27)) hide)
    )
    (property "Value" "GND" (id 1) (at 25.4 93.98 0))
    (property "Footprint" "" (id 2) (at 25.4 88.9 0)
      (effects (font (size 1.27 1.27)) hide)
    )
    (property "Datasheet" "" (id 3) (at 25.4 88.9 0)
      (effects (font (size 1.27 1.27)) hide)
    )
    (pin "1" (uuid 6810e82e-bd4e-42d1-a262-22fd882ca45f))
  )

  (symbol (lib_id "000_PreferredParts:C_10pF") (at 152.4 82.55 0) (unit 1)
    (in_bom yes) (on_board yes)
    (uuid 369e4a49-a4f5-473b-bbe3-f931dd8ba9be)
    (property "Reference" "C505" (id 0) (at 156.21 81.2799 0)
      (effects (font (size 1.27 1.27)) (justify left))
    )
    (property "Value" "C_10pF" (id 1) (at 154.94 83.82 0)
      (effects (font (size 1.27 1.27)) (justify left))
    )
    (property "Footprint" "Capacitor_SMD:C_0402_1005Metric" (id 2) (at 153.3652 86.36 0)
      (effects (font (size 1.27 1.27)) hide)
    )
    (property "Datasheet" "~" (id 3) (at 152.4 82.55 0)
      (effects (font (size 1.27 1.27)) hide)
    )
    (property "PartSpecification" "3000-0000000582" (id 4) (at 152.4 82.55 0)
      (effects (font (size 1.27 1.27)) hide)
    )
    (pin "1" (uuid ec797547-3d58-4e52-8970-a3b845a506f5))
    (pin "2" (uuid 7ab73bc1-e7ff-43c3-9f15-7963ebb0a775))
  )

  (symbol (lib_id "000_PreferredParts:C_10uF_0603") (at 254 82.55 0) (unit 1)
    (in_bom yes) (on_board yes) (fields_autoplaced)
    (uuid 3b07a6dd-b384-470e-bd0e-718f4bf27edc)
    (property "Reference" "C512" (id 0) (at 257.81 80.0099 0)
      (effects (font (size 1.27 1.27)) (justify left))
    )
    (property "Value" "C_10uF_0603" (id 1) (at 254.635 85.09 0)
      (effects (font (size 1.27 1.27)) (justify left) hide)
    )
    (property "Footprint" "Capacitor_SMD:C_0603_1608Metric" (id 2) (at 254.9652 86.36 0)
      (effects (font (size 1.27 1.27)) hide)
    )
    (property "Datasheet" "~" (id 3) (at 254 82.55 0)
      (effects (font (size 1.27 1.27)) hide)
    )
    (property "DisplayValue" "10uF" (id 4) (at 257.81 82.5499 0)
      (effects (font (size 1.27 1.27)) (justify left))
    )
    (property "DisplayFootprint" "0603" (id 5) (at 257.81 85.0899 0)
      (effects (font (size 1.27 1.27)) (justify left))
    )
    (property "PartSpecification" "3000-0000000135" (id 6) (at 254 82.55 0)
      (effects (font (size 1.27 1.27)) hide)
    )
    (pin "1" (uuid d7f30c7a-b961-4bb5-9857-462dfcb15bab))
    (pin "2" (uuid ec9e3425-ccb0-4514-a7bb-f47b2672bd22))
  )

  (symbol (lib_id "power:GND") (at 165.1 88.9 0) (unit 1)
    (in_bom yes) (on_board yes) (fields_autoplaced)
    (uuid 3cf308a4-cf48-410c-8fe6-ca4cb9cf0787)
    (property "Reference" "#PWR0205" (id 0) (at 165.1 95.25 0)
      (effects (font (size 1.27 1.27)) hide)
    )
    (property "Value" "GND" (id 1) (at 165.1 93.98 0))
    (property "Footprint" "" (id 2) (at 165.1 88.9 0)
      (effects (font (size 1.27 1.27)) hide)
    )
    (property "Datasheet" "" (id 3) (at 165.1 88.9 0)
      (effects (font (size 1.27 1.27)) hide)
    )
    (pin "1" (uuid 7c525ed0-e4c2-467d-bda7-c5f8dd48faa3))
  )

  (symbol (lib_id "Device:FerriteBead") (at 203.2 76.2 270) (unit 1)
    (in_bom yes) (on_board yes) (fields_autoplaced)
    (uuid 47efb725-ecc3-43e2-9658-79602b04e470)
    (property "Reference" "FB501" (id 0) (at 203.2508 68.58 90))
    (property "Value" "FerriteBead" (id 1) (at 203.2508 71.12 90))
    (property "Footprint" "Inductor_SMD:L_0402_1005Metric" (id 2) (at 203.2 74.422 90)
      (effects (font (size 1.27 1.27)) hide)
    )
    (property "Datasheet" "~" (id 3) (at 203.2 76.2 0)
      (effects (font (size 1.27 1.27)) hide)
    )
    (property "PartSpecification" "3000-0000001678" (id 4) (at 203.2 76.2 0)
      (effects (font (size 1.27 1.27)) hide)
    )
    (pin "1" (uuid 1fd3b0b7-c3f2-4efc-ad8d-3dca7ed206a9))
    (pin "2" (uuid 300f498c-8fd9-417d-b829-806814027789))
  )

  (symbol (lib_id "000_PreferredParts:C_10uF_0603") (at 190.5 82.55 0) (unit 1)
    (in_bom yes) (on_board yes) (fields_autoplaced)
    (uuid 484270a3-0c05-476a-bd32-1122fc2167db)
    (property "Reference" "C508" (id 0) (at 194.31 80.0099 0)
      (effects (font (size 1.27 1.27)) (justify left))
    )
    (property "Value" "C_10uF_0603" (id 1) (at 191.135 85.09 0)
      (effects (font (size 1.27 1.27)) (justify left) hide)
    )
    (property "Footprint" "Capacitor_SMD:C_0603_1608Metric" (id 2) (at 191.4652 86.36 0)
      (effects (font (size 1.27 1.27)) hide)
    )
    (property "Datasheet" "~" (id 3) (at 190.5 82.55 0)
      (effects (font (size 1.27 1.27)) hide)
    )
    (property "DisplayValue" "10uF" (id 4) (at 194.31 82.5499 0)
      (effects (font (size 1.27 1.27)) (justify left))
    )
    (property "DisplayFootprint" "0603" (id 5) (at 194.31 85.0899 0)
      (effects (font (size 1.27 1.27)) (justify left))
    )
    (property "PartSpecification" "3000-0000000135" (id 6) (at 190.5 82.55 0)
      (effects (font (size 1.27 1.27)) hide)
    )
    (pin "1" (uuid e6d306ca-d136-4229-94f9-3f0998fd4f4f))
    (pin "2" (uuid 41d15ba5-cc87-407a-98b7-54cd7ce10621))
  )

  (symbol (lib_id "power:GND") (at 66.04 101.6 0) (unit 1)
    (in_bom yes) (on_board yes) (fields_autoplaced)
    (uuid 51b73079-0787-4811-9a2e-b3fe01eca3fe)
    (property "Reference" "#PWR0501" (id 0) (at 66.04 107.95 0)
      (effects (font (size 1.27 1.27)) hide)
    )
    (property "Value" "GND" (id 1) (at 66.04 106.68 0))
    (property "Footprint" "" (id 2) (at 66.04 101.6 0)
      (effects (font (size 1.27 1.27)) hide)
    )
    (property "Datasheet" "" (id 3) (at 66.04 101.6 0)
      (effects (font (size 1.27 1.27)) hide)
    )
    (pin "1" (uuid cfa71fe3-c81d-497e-adf5-93506c80f8c0))
  )

  (symbol (lib_id "Device:Q_NMOS_GSD") (at 73.66 82.55 0) (unit 1)
    (in_bom yes) (on_board yes) (fields_autoplaced)
    (uuid 55068722-f029-4185-919d-244284d807a0)
    (property "Reference" "Q501" (id 0) (at 80.01 81.2799 0)
      (effects (font (size 1.27 1.27)) (justify left))
    )
    (property "Value" "Q_NMOS_GSD" (id 1) (at 80.01 83.8199 0)
      (effects (font (size 1.27 1.27)) (justify left))
    )
    (property "Footprint" "Package_TO_SOT_SMD:SOT-23" (id 2) (at 78.74 80.01 0)
      (effects (font (size 1.27 1.27)) hide)
    )
    (property "Datasheet" "~" (id 3) (at 73.66 82.55 0)
      (effects (font (size 1.27 1.27)) hide)
    )
    (property "PartSpecification" "3000-0000001501" (id 4) (at 73.66 82.55 0)
      (effects (font (size 1.27 1.27)) hide)
    )
    (pin "1" (uuid 8c8352b3-df87-4384-9ae4-b126d0d4b2f3))
    (pin "2" (uuid 82ba8dd1-0816-4ade-acbe-447570bafe6d))
    (pin "3" (uuid 6cfa4215-1b7d-4dca-ac26-262d4ba71b87))
  )

  (symbol (lib_id "power:GND") (at 76.2 101.6 0) (unit 1)
    (in_bom yes) (on_board yes) (fields_autoplaced)
    (uuid 79713acb-dfba-4e1d-9499-550076575291)
    (property "Reference" "#PWR0502" (id 0) (at 76.2 107.95 0)
      (effects (font (size 1.27 1.27)) hide)
    )
    (property "Value" "GND" (id 1) (at 76.2 106.68 0))
    (property "Footprint" "" (id 2) (at 76.2 101.6 0)
      (effects (font (size 1.27 1.27)) hide)
    )
    (property "Datasheet" "" (id 3) (at 76.2 101.6 0)
      (effects (font (size 1.27 1.27)) hide)
    )
    (pin "1" (uuid e7a1d9af-f9e4-4efa-bbc7-a35fbc2e6b0d))
  )

  (symbol (lib_id "power:GND") (at 102.87 96.52 0) (unit 1)
    (in_bom yes) (on_board yes) (fields_autoplaced)
    (uuid 82920c28-459d-4a17-933f-29fbb4f62f97)
    (property "Reference" "#PWR0199" (id 0) (at 102.87 102.87 0)
      (effects (font (size 1.27 1.27)) hide)
    )
    (property "Value" "GND" (id 1) (at 102.87 101.6 0))
    (property "Footprint" "" (id 2) (at 102.87 96.52 0)
      (effects (font (size 1.27 1.27)) hide)
    )
    (property "Datasheet" "" (id 3) (at 102.87 96.52 0)
      (effects (font (size 1.27 1.27)) hide)
    )
    (pin "1" (uuid d9ae84b3-34a2-4df0-a810-7f291150fbf3))
  )

  (symbol (lib_id "power:GND") (at 215.9 88.9 0) (unit 1)
    (in_bom yes) (on_board yes) (fields_autoplaced)
    (uuid 8ea5d496-4f40-48ed-8f76-63a963ab2604)
    (property "Reference" "#PWR0198" (id 0) (at 215.9 95.25 0)
      (effects (font (size 1.27 1.27)) hide)
    )
    (property "Value" "GND" (id 1) (at 215.9 93.98 0))
    (property "Footprint" "" (id 2) (at 215.9 88.9 0)
      (effects (font (size 1.27 1.27)) hide)
    )
    (property "Datasheet" "" (id 3) (at 215.9 88.9 0)
      (effects (font (size 1.27 1.27)) hide)
    )
    (pin "1" (uuid 70ba25b0-7f4a-4af4-aa7f-cd9d7c3e7202))
  )

  (symbol (lib_id "Device:R") (at 139.7 82.55 0) (unit 1)
    (in_bom yes) (on_board yes) (fields_autoplaced)
    (uuid 8f47cc60-e6e3-4e94-9f63-dfd864b230a7)
    (property "Reference" "R504" (id 0) (at 142.24 81.2799 0)
      (effects (font (size 1.27 1.27)) (justify left))
    )
    (property "Value" "DNP" (id 1) (at 142.24 83.8199 0)
      (effects (font (size 1.27 1.27)) (justify left))
    )
    (property "Footprint" "Resistor_SMD:R_0402_1005Metric" (id 2) (at 137.922 82.55 90)
      (effects (font (size 1.27 1.27)) hide)
    )
    (property "Datasheet" "~" (id 3) (at 139.7 82.55 0)
      (effects (font (size 1.27 1.27)) hide)
    )
    (property "PartSpecification" "DNP" (id 4) (at 139.7 82.55 0)
      (effects (font (size 1.27 1.27)) hide)
    )
    (pin "1" (uuid 19ecc094-66e8-4c7d-927a-590665ece317))
    (pin "2" (uuid a46418f2-8424-4a6a-8c69-0dae91b9a3f5))
  )

  (symbol (lib_id "power:GND") (at 228.6 88.9 0) (unit 1)
    (in_bom yes) (on_board yes) (fields_autoplaced)
    (uuid 9010b90c-814a-4c5d-be8d-eca16d092e84)
    (property "Reference" "#PWR0197" (id 0) (at 228.6 95.25 0)
      (effects (font (size 1.27 1.27)) hide)
    )
    (property "Value" "GND" (id 1) (at 228.6 93.98 0))
    (property "Footprint" "" (id 2) (at 228.6 88.9 0)
      (effects (font (size 1.27 1.27)) hide)
    )
    (property "Datasheet" "" (id 3) (at 228.6 88.9 0)
      (effects (font (size 1.27 1.27)) hide)
    )
    (pin "1" (uuid c77ff5f3-2d45-409a-8bbe-aa6deddacbdb))
  )

  (symbol (lib_id "000_PreferredParts:C_10pF") (at 50.8 82.55 0) (unit 1)
    (in_bom yes) (on_board yes) (fields_autoplaced)
    (uuid 90837889-c68b-4129-9b05-f67b4f8774a3)
    (property "Reference" "C503" (id 0) (at 54.61 81.2799 0)
      (effects (font (size 1.27 1.27)) (justify left))
    )
    (property "Value" "C_10pF" (id 1) (at 54.61 83.8199 0)
      (effects (font (size 1.27 1.27)) (justify left))
    )
    (property "Footprint" "Capacitor_SMD:C_0402_1005Metric" (id 2) (at 51.7652 86.36 0)
      (effects (font (size 1.27 1.27)) hide)
    )
    (property "Datasheet" "~" (id 3) (at 50.8 82.55 0)
      (effects (font (size 1.27 1.27)) hide)
    )
    (property "PartSpecification" "3000-0000000582" (id 4) (at 50.8 82.55 0)
      (effects (font (size 1.27 1.27)) hide)
    )
    (pin "1" (uuid 0cb9cadb-9675-4c4b-9a32-7410fcd7969b))
    (pin "2" (uuid f3f80302-6d69-4009-8ee1-a2d3958bad0a))
  )

  (symbol (lib_id "power:GND") (at 114.3 96.52 0) (unit 1)
    (in_bom yes) (on_board yes) (fields_autoplaced)
    (uuid 9a760659-f736-437f-9c7b-98f107fd7610)
    (property "Reference" "#PWR0200" (id 0) (at 114.3 102.87 0)
      (effects (font (size 1.27 1.27)) hide)
    )
    (property "Value" "GND" (id 1) (at 114.3 101.6 0))
    (property "Footprint" "" (id 2) (at 114.3 96.52 0)
      (effects (font (size 1.27 1.27)) hide)
    )
    (property "Datasheet" "" (id 3) (at 114.3 96.52 0)
      (effects (font (size 1.27 1.27)) hide)
    )
    (pin "1" (uuid 1aaf89fe-ffa7-4ebe-ab39-cc4a7fcbef77))
  )

  (symbol (lib_id "power:GND") (at 38.1 88.9 0) (unit 1)
    (in_bom yes) (on_board yes) (fields_autoplaced)
    (uuid 9d862164-4f5a-4ecf-b4ca-2e885330ab62)
    (property "Reference" "#PWR0202" (id 0) (at 38.1 95.25 0)
      (effects (font (size 1.27 1.27)) hide)
    )
    (property "Value" "GND" (id 1) (at 38.1 93.98 0))
    (property "Footprint" "" (id 2) (at 38.1 88.9 0)
      (effects (font (size 1.27 1.27)) hide)
    )
    (property "Datasheet" "" (id 3) (at 38.1 88.9 0)
      (effects (font (size 1.27 1.27)) hide)
    )
    (pin "1" (uuid cb012528-987e-4484-aaf1-bc6931248e8f))
  )

  (symbol (lib_id "000_PreferredParts:C_1nF") (at 127 80.01 0) (unit 1)
    (in_bom yes) (on_board yes) (fields_autoplaced)
    (uuid a623b49c-02d4-4512-b090-a4257135d576)
    (property "Reference" "C504" (id 0) (at 130.81 78.7399 0)
      (effects (font (size 1.27 1.27)) (justify left))
    )
    (property "Value" "C_1nF" (id 1) (at 130.81 81.2799 0)
      (effects (font (size 1.27 1.27)) (justify left))
    )
    (property "Footprint" "Capacitor_SMD:C_0402_1005Metric" (id 2) (at 127.9652 83.82 0)
      (effects (font (size 1.27 1.27)) hide)
    )
    (property "Datasheet" "~" (id 3) (at 127 80.01 0)
      (effects (font (size 1.27 1.27)) hide)
    )
    (property "PartSpecification" "3000-0000000128" (id 4) (at 127 80.01 0)
      (effects (font (size 1.27 1.27)) hide)
    )
    (pin "1" (uuid 4bd6662a-0ac4-4fa5-b4e3-486c732c9d45))
    (pin "2" (uuid 266a5697-e839-458f-8cb3-f6378000d29d))
  )

  (symbol (lib_id "power:GND") (at 50.8 88.9 0) (unit 1)
    (in_bom yes) (on_board yes) (fields_autoplaced)
    (uuid a9ba904e-5cc2-413e-9bd1-46edcba0b936)
    (property "Reference" "#PWR0201" (id 0) (at 50.8 95.25 0)
      (effects (font (size 1.27 1.27)) hide)
    )
    (property "Value" "GND" (id 1) (at 50.8 93.98 0))
    (property "Footprint" "" (id 2) (at 50.8 88.9 0)
      (effects (font (size 1.27 1.27)) hide)
    )
    (property "Datasheet" "" (id 3) (at 50.8 88.9 0)
      (effects (font (size 1.27 1.27)) hide)
    )
    (pin "1" (uuid a17b2747-3789-4d75-bdbe-67027ffc06f2))
  )

  (symbol (lib_id "Device:R") (at 114.3 80.01 0) (unit 1)
    (in_bom yes) (on_board yes) (fields_autoplaced)
    (uuid ac0653c8-23cd-4ae4-924f-ce3682ff9553)
    (property "Reference" "R502" (id 0) (at 116.84 78.7399 0)
      (effects (font (size 1.27 1.27)) (justify left))
    )
    (property "Value" "23.7k" (id 1) (at 116.84 81.2799 0)
      (effects (font (size 1.27 1.27)) (justify left))
    )
    (property "Footprint" "Resistor_SMD:R_0402_1005Metric" (id 2) (at 112.522 80.01 90)
      (effects (font (size 1.27 1.27)) hide)
    )
    (property "Datasheet" "~" (id 3) (at 114.3 80.01 0)
      (effects (font (size 1.27 1.27)) hide)
    )
    (property "PartSpecification" "3000-0000001675" (id 4) (at 114.3 80.01 0)
      (effects (font (size 1.27 1.27)) hide)
    )
    (pin "1" (uuid b3e0e1de-2c80-4df7-a099-c1a3baf3aeec))
    (pin "2" (uuid 25f33444-add3-4add-b1be-af5cf8e5b284))
  )

  (symbol (lib_id "000_PreferredParts:C_1nF") (at 228.6 82.55 0) (unit 1)
    (in_bom yes) (on_board yes) (fields_autoplaced)
    (uuid ae2cb60e-1ac8-4972-9f8d-faf023ca50cd)
    (property "Reference" "C510" (id 0) (at 232.41 81.2799 0)
      (effects (font (size 1.27 1.27)) (justify left))
    )
    (property "Value" "C_1nF" (id 1) (at 232.41 83.8199 0)
      (effects (font (size 1.27 1.27)) (justify left))
    )
    (property "Footprint" "Capacitor_SMD:C_0402_1005Metric" (id 2) (at 229.5652 86.36 0)
      (effects (font (size 1.27 1.27)) hide)
    )
    (property "Datasheet" "~" (id 3) (at 228.6 82.55 0)
      (effects (font (size 1.27 1.27)) hide)
    )
    (property "PartSpecification" "3000-0000000128" (id 4) (at 228.6 82.55 0)
      (effects (font (size 1.27 1.27)) hide)
    )
    (pin "1" (uuid cba3a59f-52fb-4cde-a92e-f174f90ef9d7))
    (pin "2" (uuid ce27d7a5-fc56-4bfe-b54d-585acbae0b3f))
  )

  (symbol (lib_id "power:GND") (at 177.8 88.9 0) (unit 1)
    (in_bom yes) (on_board yes) (fields_autoplaced)
    (uuid b990cf35-b693-4c19-9555-fb9d72cb7f34)
    (property "Reference" "#PWR0207" (id 0) (at 177.8 95.25 0)
      (effects (font (size 1.27 1.27)) hide)
    )
    (property "Value" "GND" (id 1) (at 177.8 93.98 0))
    (property "Footprint" "" (id 2) (at 177.8 88.9 0)
      (effects (font (size 1.27 1.27)) hide)
    )
    (property "Datasheet" "" (id 3) (at 177.8 88.9 0)
      (effects (font (size 1.27 1.27)) hide)
    )
    (pin "1" (uuid e74e7e45-d3f3-4ea5-93f7-79a2231e7781))
  )

  (symbol (lib_id "000_PreferredParts:C_1nF") (at 38.1 82.55 0) (unit 1)
    (in_bom yes) (on_board yes) (fields_autoplaced)
    (uuid bafa971e-4e08-42fa-a511-4f5f3fbd3eac)
    (property "Reference" "C502" (id 0) (at 41.91 81.2799 0)
      (effects (font (size 1.27 1.27)) (justify left))
    )
    (property "Value" "C_1nF" (id 1) (at 41.91 83.8199 0)
      (effects (font (size 1.27 1.27)) (justify left))
    )
    (property "Footprint" "Capacitor_SMD:C_0402_1005Metric" (id 2) (at 39.0652 86.36 0)
      (effects (font (size 1.27 1.27)) hide)
    )
    (property "Datasheet" "~" (id 3) (at 38.1 82.55 0)
      (effects (font (size 1.27 1.27)) hide)
    )
    (property "PartSpecification" "3000-0000000128" (id 4) (at 38.1 82.55 0)
      (effects (font (size 1.27 1.27)) hide)
    )
    (pin "1" (uuid 660d2e90-d1a8-466e-aa3d-e28229101fe2))
    (pin "2" (uuid 5285a7a0-8429-493e-9ac5-d9ce9fb8a6f9))
  )

  (symbol (lib_id "POWDER_Power:TPS79901YZU") (at 102.87 80.01 0) (unit 1)
    (in_bom yes) (on_board yes) (fields_autoplaced)
    (uuid be071817-c895-4d5a-9bfb-b416e6e45baf)
    (property "Reference" "U501" (id 0) (at 102.87 68.58 0))
    (property "Value" "TPS79901YZU" (id 1) (at 102.87 71.12 0))
    (property "Footprint" "POWDER_Power:DSBGA_5_P0.5_TI_YZU0005" (id 2) (at 102.87 69.85 0)
      (effects (font (size 1.27 1.27)) hide)
    )
    (property "Datasheet" "" (id 3) (at 102.87 64.77 0)
      (effects (font (size 1.27 1.27)) hide)
    )
    (property "PartSpecification" "3000-0000001404" (id 4) (at 102.87 80.01 0)
      (effects (font (size 1.27 1.27)) hide)
    )
    (pin "A1" (uuid c8698415-8a81-4a8b-a62c-fd2fc75d4a5b))
    (pin "A3" (uuid 3a10fb8c-95c0-4155-b98c-c17fe61e8c20))
    (pin "B2" (uuid da6938a1-2397-4428-a19e-41168e47147c))
    (pin "C1" (uuid 831a7881-2f21-48e5-aa8f-2994086d0bb2))
    (pin "C3" (uuid 338d1ba5-ca41-4514-aab9-947d6dd22331))
  )

  (symbol (lib_id "000_PreferredParts:C_1uF") (at 241.3 82.55 0) (unit 1)
    (in_bom yes) (on_board yes) (fields_autoplaced)
    (uuid bebf1d76-2145-470e-bb96-23e049dce6ee)
    (property "Reference" "C511" (id 0) (at 245.11 81.2799 0)
      (effects (font (size 1.27 1.27)) (justify left))
    )
    (property "Value" "C_1uF" (id 1) (at 245.11 83.8199 0)
      (effects (font (size 1.27 1.27)) (justify left))
    )
    (property "Footprint" "Capacitor_SMD:C_0603_1608Metric" (id 2) (at 242.2652 86.36 0)
      (effects (font (size 1.27 1.27)) hide)
    )
    (property "Datasheet" "~" (id 3) (at 241.3 82.55 0)
      (effects (font (size 1.27 1.27)) hide)
    )
    (property "PartSpecification" "3000-0000000136" (id 4) (at 241.3 82.55 0)
      (effects (font (size 1.27 1.27)) hide)
    )
    (pin "1" (uuid 8c321b40-d13b-422b-8975-2ef280a4afab))
    (pin "2" (uuid aef06cee-5847-4f61-a674-60c11f88a6a2))
  )

  (symbol (lib_id "power:GND") (at 190.5 88.9 0) (unit 1)
    (in_bom yes) (on_board yes) (fields_autoplaced)
    (uuid d038d2ee-d1a1-4d4e-828b-cf21ec7e2dc4)
    (property "Reference" "#PWR0206" (id 0) (at 190.5 95.25 0)
      (effects (font (size 1.27 1.27)) hide)
    )
    (property "Value" "GND" (id 1) (at 190.5 93.98 0))
    (property "Footprint" "" (id 2) (at 190.5 88.9 0)
      (effects (font (size 1.27 1.27)) hide)
    )
    (property "Datasheet" "" (id 3) (at 190.5 88.9 0)
      (effects (font (size 1.27 1.27)) hide)
    )
    (pin "1" (uuid 3b2721c4-1454-44d6-b9d0-794c2859b0a0))
  )

  (symbol (lib_id "Device:R") (at 76.2 95.25 0) (unit 1)
    (in_bom yes) (on_board yes) (fields_autoplaced)
    (uuid d0a156e4-05ef-4dd1-8446-9c2d391ef88f)
    (property "Reference" "R505" (id 0) (at 78.74 93.9799 0)
      (effects (font (size 1.27 1.27)) (justify left))
    )
    (property "Value" "10k" (id 1) (at 78.74 96.5199 0)
      (effects (font (size 1.27 1.27)) (justify left))
    )
    (property "Footprint" "Resistor_SMD:R_0402_1005Metric" (id 2) (at 74.422 95.25 90)
      (effects (font (size 1.27 1.27)) hide)
    )
    (property "Datasheet" "~" (id 3) (at 76.2 95.25 0)
      (effects (font (size 1.27 1.27)) hide)
    )
    (property "PartSpecification" "3000-0000000131" (id 4) (at 76.2 95.25 0)
      (effects (font (size 1.27 1.27)) hide)
    )
    (pin "1" (uuid 3b1097e8-6579-487e-ae3d-f5b9cea00318))
    (pin "2" (uuid 28310f67-d95a-4a8e-8e55-d9bf029eabe4))
  )

  (symbol (lib_id "Device:R") (at 114.3 90.17 0) (unit 1)
    (in_bom yes) (on_board yes) (fields_autoplaced)
    (uuid d3a269af-8f17-49d8-abd3-ba55cb14a1d4)
    (property "Reference" "R503" (id 0) (at 116.84 88.8999 0)
      (effects (font (size 1.27 1.27)) (justify left))
    )
    (property "Value" "10k" (id 1) (at 116.84 91.4399 0)
      (effects (font (size 1.27 1.27)) (justify left))
    )
    (property "Footprint" "Resistor_SMD:R_0402_1005Metric" (id 2) (at 112.522 90.17 90)
      (effects (font (size 1.27 1.27)) hide)
    )
    (property "Datasheet" "~" (id 3) (at 114.3 90.17 0)
      (effects (font (size 1.27 1.27)) hide)
    )
    (property "PartSpecification" "3000-0000000131" (id 4) (at 114.3 90.17 0)
      (effects (font (size 1.27 1.27)) hide)
    )
    (pin "1" (uuid a5181090-d82b-4611-9cc8-0d4b9b19e4bd))
    (pin "2" (uuid 7d22279e-2fda-49e3-ad0d-ad86cccd6cff))
  )

  (symbol (lib_id "power:GND") (at 241.3 88.9 0) (unit 1)
    (in_bom yes) (on_board yes) (fields_autoplaced)
    (uuid df602b2f-ad7a-4724-b9cf-e91315fa6a80)
    (property "Reference" "#PWR0195" (id 0) (at 241.3 95.25 0)
      (effects (font (size 1.27 1.27)) hide)
    )
    (property "Value" "GND" (id 1) (at 241.3 93.98 0))
    (property "Footprint" "" (id 2) (at 241.3 88.9 0)
      (effects (font (size 1.27 1.27)) hide)
    )
    (property "Datasheet" "" (id 3) (at 241.3 88.9 0)
      (effects (font (size 1.27 1.27)) hide)
    )
    (pin "1" (uuid ca188d81-6399-4668-aba3-8eeeabb48816))
  )

  (symbol (lib_id "000_PreferredParts:C_1uF") (at 177.8 82.55 0) (unit 1)
    (in_bom yes) (on_board yes) (fields_autoplaced)
    (uuid e15a1803-b4b9-497d-94f5-79e0d9d08e80)
    (property "Reference" "C507" (id 0) (at 181.61 81.2799 0)
      (effects (font (size 1.27 1.27)) (justify left))
    )
    (property "Value" "C_1uF" (id 1) (at 181.61 83.8199 0)
      (effects (font (size 1.27 1.27)) (justify left))
    )
    (property "Footprint" "Capacitor_SMD:C_0603_1608Metric" (id 2) (at 178.7652 86.36 0)
      (effects (font (size 1.27 1.27)) hide)
    )
    (property "Datasheet" "~" (id 3) (at 177.8 82.55 0)
      (effects (font (size 1.27 1.27)) hide)
    )
    (property "PartSpecification" "3000-0000000136" (id 4) (at 177.8 82.55 0)
      (effects (font (size 1.27 1.27)) hide)
    )
    (pin "1" (uuid e6c3b2f2-1804-4498-9b20-3fdf09e005f5))
    (pin "2" (uuid abd497fe-9666-4f13-a0ac-3e99ec67650f))
  )

  (symbol (lib_id "power:GND") (at 152.4 88.9 0) (unit 1)
    (in_bom yes) (on_board yes) (fields_autoplaced)
    (uuid e3c6a1ea-00be-47c9-86c1-0ef9cc4d2fc4)
    (property "Reference" "#PWR0204" (id 0) (at 152.4 95.25 0)
      (effects (font (size 1.27 1.27)) hide)
    )
    (property "Value" "GND" (id 1) (at 152.4 93.98 0))
    (property "Footprint" "" (id 2) (at 152.4 88.9 0)
      (effects (font (size 1.27 1.27)) hide)
    )
    (property "Datasheet" "" (id 3) (at 152.4 88.9 0)
      (effects (font (size 1.27 1.27)) hide)
    )
    (pin "1" (uuid 57563ba8-2a93-4305-8c9b-9d451cc50f02))
  )

  (symbol (lib_id "power:GND") (at 139.7 88.9 0) (unit 1)
    (in_bom yes) (on_board yes) (fields_autoplaced)
    (uuid ef2f7476-4438-4d5d-add9-a5a3f45dcd7f)
    (property "Reference" "#PWR0208" (id 0) (at 139.7 95.25 0)
      (effects (font (size 1.27 1.27)) hide)
    )
    (property "Value" "GND" (id 1) (at 139.7 93.98 0))
    (property "Footprint" "" (id 2) (at 139.7 88.9 0)
      (effects (font (size 1.27 1.27)) hide)
    )
    (property "Datasheet" "" (id 3) (at 139.7 88.9 0)
      (effects (font (size 1.27 1.27)) hide)
    )
    (pin "1" (uuid 1aa979a0-7b5c-4c5f-a8cf-270c792c05e4))
  )

  (symbol (lib_id "000_PreferredParts:C_1nF") (at 165.1 82.55 0) (unit 1)
    (in_bom yes) (on_board yes) (fields_autoplaced)
    (uuid f6c74315-f26f-48e4-9b25-61d74d1036ea)
    (property "Reference" "C506" (id 0) (at 168.91 81.2799 0)
      (effects (font (size 1.27 1.27)) (justify left))
    )
    (property "Value" "C_1nF" (id 1) (at 168.91 83.8199 0)
      (effects (font (size 1.27 1.27)) (justify left))
    )
    (property "Footprint" "Capacitor_SMD:C_0402_1005Metric" (id 2) (at 166.0652 86.36 0)
      (effects (font (size 1.27 1.27)) hide)
    )
    (property "Datasheet" "~" (id 3) (at 165.1 82.55 0)
      (effects (font (size 1.27 1.27)) hide)
    )
    (property "PartSpecification" "3000-0000000128" (id 4) (at 165.1 82.55 0)
      (effects (font (size 1.27 1.27)) hide)
    )
    (pin "1" (uuid a06bb833-475f-425a-a28e-bb693c074525))
    (pin "2" (uuid ed2ada41-6ce3-45ba-91d4-a61b0d988160))
  )
)
