(kicad_sch (version 20211123) (generator eeschema)

  (uuid e94817df-7d70-47d0-862c-8c59dfc32761)

  (paper "A4")

  (lib_symbols
    (symbol "000_PreferredParts:C_100nF" (pin_numbers hide) (pin_names (offset 0.254)) (in_bom yes) (on_board yes)
      (property "Reference" "C" (id 0) (at 0.635 2.54 0)
        (effects (font (size 1.27 1.27)) (justify left))
      )
      (property "Value" "C_100nF" (id 1) (at 0.635 -2.54 0)
        (effects (font (size 1.27 1.27)) (justify left) hide)
      )
      (property "Footprint" "Capacitor_SMD:C_0402_1005Metric" (id 2) (at 0.9652 -3.81 0)
        (effects (font (size 1.27 1.27)) hide)
      )
      (property "Datasheet" "~" (id 3) (at 0 0 0)
        (effects (font (size 1.27 1.27)) hide)
      )
      (property "DisplayValue" "100nF" (id 4) (at 3.81 -2.54 0)
        (effects (font (size 1.27 1.27)))
      )
      (property "PartSpecification" "3000-0000000125" (id 5) (at 0 0 0)
        (effects (font (size 1.27 1.27)) hide)
      )
      (property "ki_keywords" "cap capacitor" (id 6) (at 0 0 0)
        (effects (font (size 1.27 1.27)) hide)
      )
      (property "ki_description" "Unpolarized capacitor" (id 7) (at 0 0 0)
        (effects (font (size 1.27 1.27)) hide)
      )
      (property "ki_fp_filters" "C_*" (id 8) (at 0 0 0)
        (effects (font (size 1.27 1.27)) hide)
      )
      (symbol "C_100nF_0_1"
        (polyline
          (pts
            (xy -2.032 -0.762)
            (xy 2.032 -0.762)
          )
          (stroke (width 0.508) (type default) (color 0 0 0 0))
          (fill (type none))
        )
        (polyline
          (pts
            (xy -2.032 0.762)
            (xy 2.032 0.762)
          )
          (stroke (width 0.508) (type default) (color 0 0 0 0))
          (fill (type none))
        )
      )
      (symbol "C_100nF_1_1"
        (pin passive line (at 0 3.81 270) (length 2.794)
          (name "~" (effects (font (size 1.27 1.27))))
          (number "1" (effects (font (size 1.27 1.27))))
        )
        (pin passive line (at 0 -3.81 90) (length 2.794)
          (name "~" (effects (font (size 1.27 1.27))))
          (number "2" (effects (font (size 1.27 1.27))))
        )
      )
    )
    (symbol "000_PreferredParts:C_10pF" (pin_numbers hide) (pin_names (offset 0.254)) (in_bom yes) (on_board yes)
      (property "Reference" "C" (id 0) (at 0.635 2.54 0)
        (effects (font (size 1.27 1.27)) (justify left))
      )
      (property "Value" "C_10pF" (id 1) (at 0.635 -2.54 0)
        (effects (font (size 1.27 1.27)) (justify left))
      )
      (property "Footprint" "Capacitor_SMD:C_0402_1005Metric" (id 2) (at 0.9652 -3.81 0)
        (effects (font (size 1.27 1.27)) hide)
      )
      (property "Datasheet" "~" (id 3) (at 0 0 0)
        (effects (font (size 1.27 1.27)) hide)
      )
      (property "PartSpecification" "3000-0000000582" (id 4) (at 0 0 0)
        (effects (font (size 1.27 1.27)) hide)
      )
      (property "ki_keywords" "cap capacitor" (id 5) (at 0 0 0)
        (effects (font (size 1.27 1.27)) hide)
      )
      (property "ki_description" "Unpolarized capacitor" (id 6) (at 0 0 0)
        (effects (font (size 1.27 1.27)) hide)
      )
      (property "ki_fp_filters" "C_*" (id 7) (at 0 0 0)
        (effects (font (size 1.27 1.27)) hide)
      )
      (symbol "C_10pF_0_1"
        (polyline
          (pts
            (xy -2.032 -0.762)
            (xy 2.032 -0.762)
          )
          (stroke (width 0.508) (type default) (color 0 0 0 0))
          (fill (type none))
        )
        (polyline
          (pts
            (xy -2.032 0.762)
            (xy 2.032 0.762)
          )
          (stroke (width 0.508) (type default) (color 0 0 0 0))
          (fill (type none))
        )
      )
      (symbol "C_10pF_1_1"
        (pin passive line (at 0 3.81 270) (length 2.794)
          (name "~" (effects (font (size 1.27 1.27))))
          (number "1" (effects (font (size 1.27 1.27))))
        )
        (pin passive line (at 0 -3.81 90) (length 2.794)
          (name "~" (effects (font (size 1.27 1.27))))
          (number "2" (effects (font (size 1.27 1.27))))
        )
      )
    )
    (symbol "000_PreferredParts:C_1nF" (pin_numbers hide) (pin_names (offset 0.254)) (in_bom yes) (on_board yes)
      (property "Reference" "C" (id 0) (at 0.635 2.54 0)
        (effects (font (size 1.27 1.27)) (justify left))
      )
      (property "Value" "C_1nF" (id 1) (at 0.635 -2.54 0)
        (effects (font (size 1.27 1.27)) (justify left))
      )
      (property "Footprint" "Capacitor_SMD:C_0402_1005Metric" (id 2) (at 0.9652 -3.81 0)
        (effects (font (size 1.27 1.27)) hide)
      )
      (property "Datasheet" "~" (id 3) (at 0 0 0)
        (effects (font (size 1.27 1.27)) hide)
      )
      (property "PartSpecification" "3000-0000000128" (id 4) (at 0 0 0)
        (effects (font (size 1.27 1.27)) hide)
      )
      (property "ki_keywords" "cap capacitor" (id 5) (at 0 0 0)
        (effects (font (size 1.27 1.27)) hide)
      )
      (property "ki_description" "Unpolarized capacitor" (id 6) (at 0 0 0)
        (effects (font (size 1.27 1.27)) hide)
      )
      (property "ki_fp_filters" "C_*" (id 7) (at 0 0 0)
        (effects (font (size 1.27 1.27)) hide)
      )
      (symbol "C_1nF_0_1"
        (polyline
          (pts
            (xy -2.032 -0.762)
            (xy 2.032 -0.762)
          )
          (stroke (width 0.508) (type default) (color 0 0 0 0))
          (fill (type none))
        )
        (polyline
          (pts
            (xy -2.032 0.762)
            (xy 2.032 0.762)
          )
          (stroke (width 0.508) (type default) (color 0 0 0 0))
          (fill (type none))
        )
      )
      (symbol "C_1nF_1_1"
        (pin passive line (at 0 3.81 270) (length 2.794)
          (name "~" (effects (font (size 1.27 1.27))))
          (number "1" (effects (font (size 1.27 1.27))))
        )
        (pin passive line (at 0 -3.81 90) (length 2.794)
          (name "~" (effects (font (size 1.27 1.27))))
          (number "2" (effects (font (size 1.27 1.27))))
        )
      )
    )
    (symbol "Connector:TestPoint" (pin_numbers hide) (pin_names (offset 0.762) hide) (in_bom yes) (on_board yes)
      (property "Reference" "TP" (id 0) (at 0 6.858 0)
        (effects (font (size 1.27 1.27)))
      )
      (property "Value" "TestPoint" (id 1) (at 0 5.08 0)
        (effects (font (size 1.27 1.27)))
      )
      (property "Footprint" "" (id 2) (at 5.08 0 0)
        (effects (font (size 1.27 1.27)) hide)
      )
      (property "Datasheet" "~" (id 3) (at 5.08 0 0)
        (effects (font (size 1.27 1.27)) hide)
      )
      (property "ki_keywords" "test point tp" (id 4) (at 0 0 0)
        (effects (font (size 1.27 1.27)) hide)
      )
      (property "ki_description" "test point" (id 5) (at 0 0 0)
        (effects (font (size 1.27 1.27)) hide)
      )
      (property "ki_fp_filters" "Pin* Test*" (id 6) (at 0 0 0)
        (effects (font (size 1.27 1.27)) hide)
      )
      (symbol "TestPoint_0_1"
        (circle (center 0 3.302) (radius 0.762)
          (stroke (width 0) (type default) (color 0 0 0 0))
          (fill (type none))
        )
      )
      (symbol "TestPoint_1_1"
        (pin passive line (at 0 0 90) (length 2.54)
          (name "1" (effects (font (size 1.27 1.27))))
          (number "1" (effects (font (size 1.27 1.27))))
        )
      )
    )
    (symbol "Device:L" (pin_numbers hide) (pin_names (offset 1.016) hide) (in_bom yes) (on_board yes)
      (property "Reference" "L" (id 0) (at -1.27 0 90)
        (effects (font (size 1.27 1.27)))
      )
      (property "Value" "L" (id 1) (at 1.905 0 90)
        (effects (font (size 1.27 1.27)))
      )
      (property "Footprint" "" (id 2) (at 0 0 0)
        (effects (font (size 1.27 1.27)) hide)
      )
      (property "Datasheet" "~" (id 3) (at 0 0 0)
        (effects (font (size 1.27 1.27)) hide)
      )
      (property "ki_keywords" "inductor choke coil reactor magnetic" (id 4) (at 0 0 0)
        (effects (font (size 1.27 1.27)) hide)
      )
      (property "ki_description" "Inductor" (id 5) (at 0 0 0)
        (effects (font (size 1.27 1.27)) hide)
      )
      (property "ki_fp_filters" "Choke_* *Coil* Inductor_* L_*" (id 6) (at 0 0 0)
        (effects (font (size 1.27 1.27)) hide)
      )
      (symbol "L_0_1"
        (arc (start 0 -2.54) (mid 0.635 -1.905) (end 0 -1.27)
          (stroke (width 0) (type default) (color 0 0 0 0))
          (fill (type none))
        )
        (arc (start 0 -1.27) (mid 0.635 -0.635) (end 0 0)
          (stroke (width 0) (type default) (color 0 0 0 0))
          (fill (type none))
        )
        (arc (start 0 0) (mid 0.635 0.635) (end 0 1.27)
          (stroke (width 0) (type default) (color 0 0 0 0))
          (fill (type none))
        )
        (arc (start 0 1.27) (mid 0.635 1.905) (end 0 2.54)
          (stroke (width 0) (type default) (color 0 0 0 0))
          (fill (type none))
        )
      )
      (symbol "L_1_1"
        (pin passive line (at 0 3.81 270) (length 1.27)
          (name "1" (effects (font (size 1.27 1.27))))
          (number "1" (effects (font (size 1.27 1.27))))
        )
        (pin passive line (at 0 -3.81 90) (length 1.27)
          (name "2" (effects (font (size 1.27 1.27))))
          (number "2" (effects (font (size 1.27 1.27))))
        )
      )
    )
    (symbol "Device:R" (pin_numbers hide) (pin_names (offset 0)) (in_bom yes) (on_board yes)
      (property "Reference" "R" (id 0) (at 2.032 0 90)
        (effects (font (size 1.27 1.27)))
      )
      (property "Value" "R" (id 1) (at 0 0 90)
        (effects (font (size 1.27 1.27)))
      )
      (property "Footprint" "" (id 2) (at -1.778 0 90)
        (effects (font (size 1.27 1.27)) hide)
      )
      (property "Datasheet" "~" (id 3) (at 0 0 0)
        (effects (font (size 1.27 1.27)) hide)
      )
      (property "ki_keywords" "R res resistor" (id 4) (at 0 0 0)
        (effects (font (size 1.27 1.27)) hide)
      )
      (property "ki_description" "Resistor" (id 5) (at 0 0 0)
        (effects (font (size 1.27 1.27)) hide)
      )
      (property "ki_fp_filters" "R_*" (id 6) (at 0 0 0)
        (effects (font (size 1.27 1.27)) hide)
      )
      (symbol "R_0_1"
        (rectangle (start -1.016 -2.54) (end 1.016 2.54)
          (stroke (width 0.254) (type default) (color 0 0 0 0))
          (fill (type none))
        )
      )
      (symbol "R_1_1"
        (pin passive line (at 0 3.81 270) (length 1.27)
          (name "~" (effects (font (size 1.27 1.27))))
          (number "1" (effects (font (size 1.27 1.27))))
        )
        (pin passive line (at 0 -3.81 90) (length 1.27)
          (name "~" (effects (font (size 1.27 1.27))))
          (number "2" (effects (font (size 1.27 1.27))))
        )
      )
    )
    (symbol "POWDER_PowerGlobals:+3.3VDIGRF" (power) (pin_names (offset 0)) (in_bom yes) (on_board yes)
      (property "Reference" "#PWR" (id 0) (at 0 -3.81 0)
        (effects (font (size 1.27 1.27)) hide)
      )
      (property "Value" "+3.3VDIGRF" (id 1) (at 0 3.556 0)
        (effects (font (size 1.27 1.27)))
      )
      (property "Footprint" "" (id 2) (at 0 0 0)
        (effects (font (size 1.27 1.27)) hide)
      )
      (property "Datasheet" "" (id 3) (at 0 0 0)
        (effects (font (size 1.27 1.27)) hide)
      )
      (property "ki_keywords" "power-flag" (id 4) (at 0 0 0)
        (effects (font (size 1.27 1.27)) hide)
      )
      (property "ki_description" "Power symbol creates a global label with name \"+3.3VRFDIGRF\"" (id 5) (at 0 0 0)
        (effects (font (size 1.27 1.27)) hide)
      )
      (symbol "+3.3VDIGRF_0_1"
        (polyline
          (pts
            (xy -0.762 1.27)
            (xy 0 2.54)
          )
          (stroke (width 0) (type default) (color 0 0 0 0))
          (fill (type none))
        )
        (polyline
          (pts
            (xy 0 0)
            (xy 0 2.54)
          )
          (stroke (width 0) (type default) (color 0 0 0 0))
          (fill (type none))
        )
        (polyline
          (pts
            (xy 0 2.54)
            (xy 0.762 1.27)
          )
          (stroke (width 0) (type default) (color 0 0 0 0))
          (fill (type none))
        )
      )
      (symbol "+3.3VDIGRF_1_1"
        (pin power_in line (at 0 0 90) (length 0) hide
          (name "+3V3DIGRF" (effects (font (size 1.27 1.27))))
          (number "1" (effects (font (size 1.27 1.27))))
        )
      )
    )
    (symbol "POWDER_RF:PE43712" (pin_names (offset 1.016)) (in_bom yes) (on_board yes)
      (property "Reference" "U" (id 0) (at 21.59 12.7 0)
        (effects (font (size 1.27 1.27)))
      )
      (property "Value" "PE43712" (id 1) (at 0 0 0)
        (effects (font (size 1.27 1.27)))
      )
      (property "Footprint" "Package_DFN_QFN:QFN-32-1EP_5x5mm_P0.5mm_EP3.1x3.1mm" (id 2) (at 29.21 -33.02 0)
        (effects (font (size 1.27 1.27)) hide)
      )
      (property "Datasheet" "" (id 3) (at 21.59 12.7 0)
        (effects (font (size 1.27 1.27)) hide)
      )
      (property "ki_description" "9kHz - 6GHz 31.75 dB 0.25 dB step Parallel/Serial load with address" (id 4) (at 0 0 0)
        (effects (font (size 1.27 1.27)) hide)
      )
      (symbol "PE43712_0_1"
        (rectangle (start -21.59 -11.43) (end 21.59 11.43)
          (stroke (width 0) (type default) (color 0 0 0 0))
          (fill (type background))
        )
      )
      (symbol "PE43712_1_1"
        (pin power_in line (at -19.05 -13.97 90) (length 2.54)
          (name "GND" (effects (font (size 1.27 1.27))))
          (number "1" (effects (font (size 1.27 1.27))))
        )
        (pin power_in line (at -6.35 -13.97 90) (length 2.54)
          (name "GND" (effects (font (size 1.27 1.27))))
          (number "10" (effects (font (size 1.27 1.27))))
        )
        (pin power_in line (at -3.81 -13.97 90) (length 2.54)
          (name "GND" (effects (font (size 1.27 1.27))))
          (number "11" (effects (font (size 1.27 1.27))))
        )
        (pin power_in line (at -1.27 -13.97 90) (length 2.54)
          (name "GND" (effects (font (size 1.27 1.27))))
          (number "12" (effects (font (size 1.27 1.27))))
        )
        (pin power_in line (at 1.27 -13.97 90) (length 2.54)
          (name "GND" (effects (font (size 1.27 1.27))))
          (number "13" (effects (font (size 1.27 1.27))))
        )
        (pin power_in line (at 3.81 -13.97 90) (length 2.54)
          (name "GND" (effects (font (size 1.27 1.27))))
          (number "14" (effects (font (size 1.27 1.27))))
        )
        (pin power_in line (at 6.35 -13.97 90) (length 2.54)
          (name "GND" (effects (font (size 1.27 1.27))))
          (number "15" (effects (font (size 1.27 1.27))))
        )
        (pin power_in line (at 8.89 -13.97 90) (length 2.54)
          (name "GND" (effects (font (size 1.27 1.27))))
          (number "16" (effects (font (size 1.27 1.27))))
        )
        (pin power_in line (at 11.43 -13.97 90) (length 2.54)
          (name "GND" (effects (font (size 1.27 1.27))))
          (number "17" (effects (font (size 1.27 1.27))))
        )
        (pin bidirectional line (at 24.13 0 180) (length 2.54)
          (name "RF_OUT" (effects (font (size 1.27 1.27))))
          (number "18" (effects (font (size 1.27 1.27))))
        )
        (pin power_in line (at 13.97 -13.97 90) (length 2.54)
          (name "GND" (effects (font (size 1.27 1.27))))
          (number "19" (effects (font (size 1.27 1.27))))
        )
        (pin power_in line (at -19.05 13.97 270) (length 2.54)
          (name "VDD" (effects (font (size 1.27 1.27))))
          (number "2" (effects (font (size 1.27 1.27))))
        )
        (pin power_in line (at 16.51 -13.97 90) (length 2.54)
          (name "GND" (effects (font (size 1.27 1.27))))
          (number "20" (effects (font (size 1.27 1.27))))
        )
        (pin input line (at 13.97 13.97 270) (length 2.54)
          (name "A2" (effects (font (size 1.27 1.27))))
          (number "21" (effects (font (size 1.27 1.27))))
        )
        (pin input line (at 11.43 13.97 270) (length 2.54)
          (name "A1" (effects (font (size 1.27 1.27))))
          (number "22" (effects (font (size 1.27 1.27))))
        )
        (pin input line (at 8.89 13.97 270) (length 2.54)
          (name "LE" (effects (font (size 1.27 1.27))))
          (number "23" (effects (font (size 1.27 1.27))))
        )
        (pin input line (at 6.35 13.97 270) (length 2.54)
          (name "CLK" (effects (font (size 1.27 1.27))))
          (number "24" (effects (font (size 1.27 1.27))))
        )
        (pin input line (at 3.81 13.97 270) (length 2.54)
          (name "SI" (effects (font (size 1.27 1.27))))
          (number "25" (effects (font (size 1.27 1.27))))
        )
        (pin input line (at 1.27 13.97 270) (length 2.54)
          (name "D6" (effects (font (size 1.27 1.27))))
          (number "26" (effects (font (size 1.27 1.27))))
        )
        (pin input line (at -1.27 13.97 270) (length 2.54)
          (name "D5" (effects (font (size 1.27 1.27))))
          (number "27" (effects (font (size 1.27 1.27))))
        )
        (pin input line (at -3.81 13.97 270) (length 2.54)
          (name "D4" (effects (font (size 1.27 1.27))))
          (number "28" (effects (font (size 1.27 1.27))))
        )
        (pin input line (at -6.35 13.97 270) (length 2.54)
          (name "D3" (effects (font (size 1.27 1.27))))
          (number "29" (effects (font (size 1.27 1.27))))
        )
        (pin input line (at 19.05 13.97 270) (length 2.54)
          (name "~{P}_S" (effects (font (size 1.27 1.27))))
          (number "3" (effects (font (size 1.27 1.27))))
        )
        (pin input line (at -8.89 13.97 270) (length 2.54)
          (name "D2" (effects (font (size 1.27 1.27))))
          (number "30" (effects (font (size 1.27 1.27))))
        )
        (pin input line (at -11.43 13.97 270) (length 2.54)
          (name "D1" (effects (font (size 1.27 1.27))))
          (number "31" (effects (font (size 1.27 1.27))))
        )
        (pin input line (at -13.97 13.97 270) (length 2.54)
          (name "D0" (effects (font (size 1.27 1.27))))
          (number "32" (effects (font (size 1.27 1.27))))
        )
        (pin power_in line (at 19.05 -13.97 90) (length 2.54)
          (name "GND" (effects (font (size 1.27 1.27))))
          (number "33" (effects (font (size 1.27 1.27))))
        )
        (pin input line (at 16.51 13.97 270) (length 2.54)
          (name "A0" (effects (font (size 1.27 1.27))))
          (number "4" (effects (font (size 1.27 1.27))))
        )
        (pin power_in line (at -16.51 -13.97 90) (length 2.54)
          (name "GND" (effects (font (size 1.27 1.27))))
          (number "5" (effects (font (size 1.27 1.27))))
        )
        (pin power_in line (at -13.97 -13.97 90) (length 2.54)
          (name "GND" (effects (font (size 1.27 1.27))))
          (number "6" (effects (font (size 1.27 1.27))))
        )
        (pin bidirectional line (at -24.13 0 0) (length 2.54)
          (name "RF_IN" (effects (font (size 1.27 1.27))))
          (number "7" (effects (font (size 1.27 1.27))))
        )
        (pin power_in line (at -11.43 -13.97 90) (length 2.54)
          (name "GND" (effects (font (size 1.27 1.27))))
          (number "8" (effects (font (size 1.27 1.27))))
        )
        (pin power_in line (at -8.89 -13.97 90) (length 2.54)
          (name "GND" (effects (font (size 1.27 1.27))))
          (number "9" (effects (font (size 1.27 1.27))))
        )
      )
    )
    (symbol "power:GND" (power) (pin_names (offset 0)) (in_bom yes) (on_board yes)
      (property "Reference" "#PWR" (id 0) (at 0 -6.35 0)
        (effects (font (size 1.27 1.27)) hide)
      )
      (property "Value" "GND" (id 1) (at 0 -3.81 0)
        (effects (font (size 1.27 1.27)))
      )
      (property "Footprint" "" (id 2) (at 0 0 0)
        (effects (font (size 1.27 1.27)) hide)
      )
      (property "Datasheet" "" (id 3) (at 0 0 0)
        (effects (font (size 1.27 1.27)) hide)
      )
      (property "ki_keywords" "power-flag" (id 4) (at 0 0 0)
        (effects (font (size 1.27 1.27)) hide)
      )
      (property "ki_description" "Power symbol creates a global label with name \"GND\" , ground" (id 5) (at 0 0 0)
        (effects (font (size 1.27 1.27)) hide)
      )
      (symbol "GND_0_1"
        (polyline
          (pts
            (xy 0 0)
            (xy 0 -1.27)
            (xy 1.27 -1.27)
            (xy 0 -2.54)
            (xy -1.27 -1.27)
            (xy 0 -1.27)
          )
          (stroke (width 0) (type default) (color 0 0 0 0))
          (fill (type none))
        )
      )
      (symbol "GND_1_1"
        (pin power_in line (at 0 0 270) (length 0) hide
          (name "GND" (effects (font (size 1.27 1.27))))
          (number "1" (effects (font (size 1.27 1.27))))
        )
      )
    )
    (symbol "power:PWR_FLAG" (power) (pin_numbers hide) (pin_names (offset 0) hide) (in_bom yes) (on_board yes)
      (property "Reference" "#FLG" (id 0) (at 0 1.905 0)
        (effects (font (size 1.27 1.27)) hide)
      )
      (property "Value" "PWR_FLAG" (id 1) (at 0 3.81 0)
        (effects (font (size 1.27 1.27)))
      )
      (property "Footprint" "" (id 2) (at 0 0 0)
        (effects (font (size 1.27 1.27)) hide)
      )
      (property "Datasheet" "~" (id 3) (at 0 0 0)
        (effects (font (size 1.27 1.27)) hide)
      )
      (property "ki_keywords" "power-flag" (id 4) (at 0 0 0)
        (effects (font (size 1.27 1.27)) hide)
      )
      (property "ki_description" "Special symbol for telling ERC where power comes from" (id 5) (at 0 0 0)
        (effects (font (size 1.27 1.27)) hide)
      )
      (symbol "PWR_FLAG_0_0"
        (pin power_out line (at 0 0 90) (length 0)
          (name "pwr" (effects (font (size 1.27 1.27))))
          (number "1" (effects (font (size 1.27 1.27))))
        )
      )
      (symbol "PWR_FLAG_0_1"
        (polyline
          (pts
            (xy 0 0)
            (xy 0 1.27)
            (xy -1.016 1.905)
            (xy 0 2.54)
            (xy 1.016 1.905)
            (xy 0 1.27)
          )
          (stroke (width 0) (type default) (color 0 0 0 0))
          (fill (type none))
        )
      )
    )
  )

  (junction (at 142.24 26.67) (diameter 0) (color 0 0 0 0)
    (uuid 15290291-2549-4336-a949-1259936bbab2)
  )
  (junction (at 170.18 80.01) (diameter 0) (color 0 0 0 0)
    (uuid 1b734947-4591-44d6-ba02-cd89adc71133)
  )
  (junction (at 132.08 77.47) (diameter 0) (color 0 0 0 0)
    (uuid 2d145cb5-1be0-477e-992b-b0e3ad13d954)
  )
  (junction (at 129.54 26.67) (diameter 0) (color 0 0 0 0)
    (uuid 4281a0c9-fcd8-4a3a-b34c-1c027443b7aa)
  )
  (junction (at 121.92 99.06) (diameter 0) (color 0 0 0 0)
    (uuid 446a51c2-8d8e-4def-a3ce-32c952a01f96)
  )
  (junction (at 170.18 86.36) (diameter 0) (color 0 0 0 0)
    (uuid 4b0c9818-eda9-4067-a06b-8fdf47377aa6)
  )
  (junction (at 134.62 67.31) (diameter 0) (color 0 0 0 0)
    (uuid 4bcc5ae1-145e-46d7-92d5-d611a1d6baf6)
  )
  (junction (at 170.18 73.66) (diameter 0) (color 0 0 0 0)
    (uuid 6c9a076d-21ce-48cc-a4d7-55822e95fa95)
  )
  (junction (at 104.14 111.76) (diameter 0) (color 0 0 0 0)
    (uuid 778baa15-bbc4-490a-bc83-22c45515365a)
  )
  (junction (at 127 86.36) (diameter 0) (color 0 0 0 0)
    (uuid 7c3d73da-34fb-4fca-9cd8-57a55c78d834)
  )
  (junction (at 124.46 92.71) (diameter 0) (color 0 0 0 0)
    (uuid 8b05e9fa-9931-4d5e-b6ef-45efb4e85719)
  )
  (junction (at 116.84 26.67) (diameter 0) (color 0 0 0 0)
    (uuid 911fd620-7ff6-49eb-a186-1c1f790b84ba)
  )
  (junction (at 170.18 92.71) (diameter 0) (color 0 0 0 0)
    (uuid 913e21aa-576c-4523-842c-40d14eb733db)
  )
  (junction (at 170.18 60.96) (diameter 0) (color 0 0 0 0)
    (uuid 9f29fe8b-aeb2-4a87-ac21-421acd3d0294)
  )
  (junction (at 81.28 63.5) (diameter 0) (color 0 0 0 0)
    (uuid c254d62d-da71-4878-93ec-01c9a953e41b)
  )
  (junction (at 86.36 76.2) (diameter 0) (color 0 0 0 0)
    (uuid c904cd6a-2876-43ea-86ff-647dba742e1e)
  )
  (junction (at 129.54 80.01) (diameter 0) (color 0 0 0 0)
    (uuid d80a4652-e7ed-4566-92f6-76a18cabb7d6)
  )
  (junction (at 113.03 26.67) (diameter 0) (color 0 0 0 0)
    (uuid e0370586-5fae-4618-b437-023e37e782f8)
  )
  (junction (at 137.16 60.96) (diameter 0) (color 0 0 0 0)
    (uuid e7929458-8a46-427f-993b-013f276b81fb)
  )
  (junction (at 170.18 67.31) (diameter 0) (color 0 0 0 0)
    (uuid f772600e-0a79-4334-9a2c-f939adb9f123)
  )

  (wire (pts (xy 129.54 26.67) (xy 142.24 26.67))
    (stroke (width 0) (type default) (color 0 0 0 0))
    (uuid 0155977b-38c6-4d03-80d0-f61b117e1f83)
  )
  (wire (pts (xy 134.62 113.03) (xy 134.62 67.31))
    (stroke (width 0) (type default) (color 0 0 0 0))
    (uuid 036dd091-0a60-40ff-8218-c638574b3a93)
  )
  (wire (pts (xy 137.16 143.51) (xy 137.16 140.97))
    (stroke (width 0) (type default) (color 0 0 0 0))
    (uuid 04f71f88-c408-42ae-942c-16f1259a30c6)
  )
  (wire (pts (xy 170.18 80.01) (xy 170.18 86.36))
    (stroke (width 0) (type default) (color 0 0 0 0))
    (uuid 08af2bdd-3ae2-44a1-bf78-f2c6d296d24f)
  )
  (wire (pts (xy 104.14 143.51) (xy 104.14 140.97))
    (stroke (width 0) (type default) (color 0 0 0 0))
    (uuid 0a860a1e-3d9f-455b-8d3f-05b606ae1e8c)
  )
  (wire (pts (xy 127 113.03) (xy 127 86.36))
    (stroke (width 0) (type default) (color 0 0 0 0))
    (uuid 100d2a3a-3563-41d1-8d8a-ddb39323c253)
  )
  (wire (pts (xy 121.92 113.03) (xy 121.92 99.06))
    (stroke (width 0) (type default) (color 0 0 0 0))
    (uuid 103a284d-ee0f-4a43-aeda-897caf2e8367)
  )
  (wire (pts (xy 111.76 143.51) (xy 111.76 140.97))
    (stroke (width 0) (type default) (color 0 0 0 0))
    (uuid 183e4140-50cb-43bd-878f-a70d15c721ec)
  )
  (wire (pts (xy 129.54 80.01) (xy 129.54 73.66))
    (stroke (width 0) (type default) (color 0 0 0 0))
    (uuid 19a29561-aa28-44a9-9cbf-bd6cdb80856d)
  )
  (wire (pts (xy 81.28 63.5) (xy 92.71 63.5))
    (stroke (width 0) (type default) (color 0 0 0 0))
    (uuid 1b15444f-374f-4d35-b787-da86cdf65834)
  )
  (wire (pts (xy 116.84 39.37) (xy 116.84 36.83))
    (stroke (width 0) (type default) (color 0 0 0 0))
    (uuid 2382424b-0905-467b-a458-dad739d3178b)
  )
  (wire (pts (xy 170.18 73.66) (xy 170.18 80.01))
    (stroke (width 0) (type default) (color 0 0 0 0))
    (uuid 247aefbe-08fc-456d-8e00-246e541d8cde)
  )
  (wire (pts (xy 81.28 66.04) (xy 81.28 63.5))
    (stroke (width 0) (type default) (color 0 0 0 0))
    (uuid 274d2a99-638b-4480-8249-4d8062bac439)
  )
  (wire (pts (xy 129.54 143.51) (xy 129.54 140.97))
    (stroke (width 0) (type default) (color 0 0 0 0))
    (uuid 2c24684c-5454-4207-bc3f-b66e8c50caf8)
  )
  (wire (pts (xy 86.36 97.79) (xy 92.71 97.79))
    (stroke (width 0) (type default) (color 0 0 0 0))
    (uuid 2f60dc17-fd35-4d05-8750-dcc87a16d2e4)
  )
  (wire (pts (xy 86.36 76.2) (xy 86.36 97.79))
    (stroke (width 0) (type default) (color 0 0 0 0))
    (uuid 2fd41904-d28e-46e7-ad9d-acd50c604b0d)
  )
  (wire (pts (xy 129.54 29.21) (xy 129.54 26.67))
    (stroke (width 0) (type default) (color 0 0 0 0))
    (uuid 3212c425-c411-4011-a581-8baffa4d28e1)
  )
  (wire (pts (xy 92.71 55.88) (xy 81.28 55.88))
    (stroke (width 0) (type default) (color 0 0 0 0))
    (uuid 32b35f4f-7372-43c0-aa0a-53e046214b2f)
  )
  (wire (pts (xy 109.22 63.5) (xy 100.33 63.5))
    (stroke (width 0) (type default) (color 0 0 0 0))
    (uuid 330cbf5e-b44e-4df4-8ff2-49a768395398)
  )
  (wire (pts (xy 154.94 39.37) (xy 154.94 36.83))
    (stroke (width 0) (type default) (color 0 0 0 0))
    (uuid 34a0342d-5b36-4996-8214-c168ae166910)
  )
  (wire (pts (xy 124.46 143.51) (xy 124.46 140.97))
    (stroke (width 0) (type default) (color 0 0 0 0))
    (uuid 39ae8a6c-32c6-4a1b-baa6-b2fc7e555427)
  )
  (wire (pts (xy 100.33 97.79) (xy 104.14 97.79))
    (stroke (width 0) (type default) (color 0 0 0 0))
    (uuid 3db281d0-633f-41f4-982f-919710c49533)
  )
  (wire (pts (xy 116.84 50.8) (xy 111.76 50.8))
    (stroke (width 0) (type default) (color 0 0 0 0))
    (uuid 3dcbf7e5-a780-40f8-9400-d5022a84b1cf)
  )
  (wire (pts (xy 153.67 73.66) (xy 170.18 73.66))
    (stroke (width 0) (type default) (color 0 0 0 0))
    (uuid 3ea45e28-aa10-4b97-8d16-c3155f0b65ec)
  )
  (wire (pts (xy 114.3 143.51) (xy 114.3 140.97))
    (stroke (width 0) (type default) (color 0 0 0 0))
    (uuid 41b76f64-7406-47a5-b12d-dbe23acaa84f)
  )
  (wire (pts (xy 109.22 63.5) (xy 109.22 113.03))
    (stroke (width 0) (type default) (color 0 0 0 0))
    (uuid 43910604-d34f-4088-a770-412fdaa9ce5e)
  )
  (wire (pts (xy 116.84 26.67) (xy 129.54 26.67))
    (stroke (width 0) (type default) (color 0 0 0 0))
    (uuid 4725caf9-fd3b-453d-bc25-8fa970919cfc)
  )
  (wire (pts (xy 170.18 67.31) (xy 170.18 73.66))
    (stroke (width 0) (type default) (color 0 0 0 0))
    (uuid 472cb6ff-48c2-4588-8c2d-8e77084082c0)
  )
  (wire (pts (xy 104.14 26.67) (xy 99.06 26.67))
    (stroke (width 0) (type default) (color 0 0 0 0))
    (uuid 4946c7fa-370b-450f-a712-0a10ad14f18e)
  )
  (wire (pts (xy 170.18 60.96) (xy 170.18 67.31))
    (stroke (width 0) (type default) (color 0 0 0 0))
    (uuid 4c948936-5cf5-4724-8bae-d406483597f4)
  )
  (wire (pts (xy 116.84 143.51) (xy 116.84 140.97))
    (stroke (width 0) (type default) (color 0 0 0 0))
    (uuid 4e86629b-51d8-4101-88b3-0fb8b38590cb)
  )
  (wire (pts (xy 132.08 143.51) (xy 132.08 140.97))
    (stroke (width 0) (type default) (color 0 0 0 0))
    (uuid 5536691c-6c8c-4639-845d-8cf854e48c9d)
  )
  (wire (pts (xy 137.16 60.96) (xy 137.16 57.15))
    (stroke (width 0) (type default) (color 0 0 0 0))
    (uuid 57b66c7e-962a-49b2-96fa-a27415f5cd50)
  )
  (wire (pts (xy 113.03 20.32) (xy 113.03 26.67))
    (stroke (width 0) (type default) (color 0 0 0 0))
    (uuid 585973da-78da-4a59-b329-47a7ee730e8a)
  )
  (wire (pts (xy 160.02 67.31) (xy 170.18 67.31))
    (stroke (width 0) (type default) (color 0 0 0 0))
    (uuid 5ae271cd-7abf-4ad6-993d-4d1f5e5d7551)
  )
  (wire (pts (xy 152.4 80.01) (xy 129.54 80.01))
    (stroke (width 0) (type default) (color 0 0 0 0))
    (uuid 6077349d-2d98-4fcc-8a53-a4281a78c9e1)
  )
  (wire (pts (xy 119.38 143.51) (xy 119.38 140.97))
    (stroke (width 0) (type default) (color 0 0 0 0))
    (uuid 64918e7a-0abb-4f6f-9852-97bcf130e83b)
  )
  (wire (pts (xy 121.92 99.06) (xy 121.92 62.23))
    (stroke (width 0) (type default) (color 0 0 0 0))
    (uuid 65c23a04-03db-4f69-9442-95427f076201)
  )
  (wire (pts (xy 160.02 80.01) (xy 170.18 80.01))
    (stroke (width 0) (type default) (color 0 0 0 0))
    (uuid 71d31ec0-d498-4944-9a49-db7a46d50c19)
  )
  (wire (pts (xy 134.62 67.31) (xy 134.62 62.23))
    (stroke (width 0) (type default) (color 0 0 0 0))
    (uuid 71e75191-94a2-41e8-bc5e-18c7e819cc86)
  )
  (wire (pts (xy 109.22 143.51) (xy 109.22 140.97))
    (stroke (width 0) (type default) (color 0 0 0 0))
    (uuid 7249d4f5-71d5-4d98-8bda-f893ed029d9e)
  )
  (wire (pts (xy 170.18 58.42) (xy 170.18 60.96))
    (stroke (width 0) (type default) (color 0 0 0 0))
    (uuid 74431cdb-becf-4371-bc33-f12440bb6a8f)
  )
  (wire (pts (xy 111.76 55.88) (xy 111.76 113.03))
    (stroke (width 0) (type default) (color 0 0 0 0))
    (uuid 7fca1c7a-2410-41c4-b271-6f914d4c6ac9)
  )
  (wire (pts (xy 129.54 39.37) (xy 129.54 36.83))
    (stroke (width 0) (type default) (color 0 0 0 0))
    (uuid 84c2ef8b-e7c5-4b1d-b4b8-a2afa75822dd)
  )
  (wire (pts (xy 170.18 86.36) (xy 170.18 92.71))
    (stroke (width 0) (type default) (color 0 0 0 0))
    (uuid 86fd4569-f291-4aa0-8e46-c41dae14a203)
  )
  (wire (pts (xy 116.84 50.8) (xy 116.84 113.03))
    (stroke (width 0) (type default) (color 0 0 0 0))
    (uuid 8d903c52-75f4-4ac9-baf0-065753b8eb4b)
  )
  (wire (pts (xy 153.67 86.36) (xy 170.18 86.36))
    (stroke (width 0) (type default) (color 0 0 0 0))
    (uuid 8fa7f583-bdf9-41f1-bccf-e829f12287c2)
  )
  (wire (pts (xy 113.03 26.67) (xy 116.84 26.67))
    (stroke (width 0) (type default) (color 0 0 0 0))
    (uuid 90a8919c-94ff-4a26-902b-2c6d28e60394)
  )
  (wire (pts (xy 142.24 26.67) (xy 154.94 26.67))
    (stroke (width 0) (type default) (color 0 0 0 0))
    (uuid 911e458a-c00a-4d73-b032-b38b455659b8)
  )
  (wire (pts (xy 146.05 86.36) (xy 127 86.36))
    (stroke (width 0) (type default) (color 0 0 0 0))
    (uuid 93d2545f-b6ce-4ba9-82ed-acc320bd3e21)
  )
  (wire (pts (xy 132.08 113.03) (xy 132.08 77.47))
    (stroke (width 0) (type default) (color 0 0 0 0))
    (uuid 948e1184-b471-4360-b397-3ae58e62c790)
  )
  (wire (pts (xy 121.92 143.51) (xy 121.92 140.97))
    (stroke (width 0) (type default) (color 0 0 0 0))
    (uuid 955e0c96-b70c-4c38-a7d6-08ba4e2c2d5d)
  )
  (wire (pts (xy 134.62 143.51) (xy 134.62 140.97))
    (stroke (width 0) (type default) (color 0 0 0 0))
    (uuid 9b2e1633-ec94-413d-9fda-19a27acb1251)
  )
  (wire (pts (xy 152.4 92.71) (xy 124.46 92.71))
    (stroke (width 0) (type default) (color 0 0 0 0))
    (uuid 9b532d94-5adf-40a9-aa2f-bc58284f6753)
  )
  (wire (pts (xy 170.18 92.71) (xy 170.18 99.06))
    (stroke (width 0) (type default) (color 0 0 0 0))
    (uuid 9c0e35d0-a7a3-469d-8a35-5ddf96d09b03)
  )
  (wire (pts (xy 85.09 127) (xy 99.06 127))
    (stroke (width 0) (type default) (color 0 0 0 0))
    (uuid 9cf62153-2e7b-4838-ba92-d00a36e9a345)
  )
  (wire (pts (xy 137.16 113.03) (xy 137.16 60.96))
    (stroke (width 0) (type default) (color 0 0 0 0))
    (uuid 9eb65f38-749a-4f1c-ab54-5a72dbfee0c6)
  )
  (wire (pts (xy 146.05 60.96) (xy 137.16 60.96))
    (stroke (width 0) (type default) (color 0 0 0 0))
    (uuid a07361ae-4e0e-4833-b918-e1627e691016)
  )
  (wire (pts (xy 100.33 76.2) (xy 106.68 76.2))
    (stroke (width 0) (type default) (color 0 0 0 0))
    (uuid a3fab5e1-6a3d-45a5-9032-bdd0dfff7b90)
  )
  (wire (pts (xy 146.05 99.06) (xy 121.92 99.06))
    (stroke (width 0) (type default) (color 0 0 0 0))
    (uuid a456bd40-b2fd-424c-b931-b7b320bd8eee)
  )
  (wire (pts (xy 160.02 92.71) (xy 170.18 92.71))
    (stroke (width 0) (type default) (color 0 0 0 0))
    (uuid a485a506-d404-4163-8966-e823be70f215)
  )
  (wire (pts (xy 146.05 73.66) (xy 146.05 77.47))
    (stroke (width 0) (type default) (color 0 0 0 0))
    (uuid a54c65d7-c047-4608-b791-196726bc760e)
  )
  (wire (pts (xy 106.68 143.51) (xy 106.68 140.97))
    (stroke (width 0) (type default) (color 0 0 0 0))
    (uuid a5fc058c-609d-4053-be9e-ebf2d0ada16e)
  )
  (wire (pts (xy 127 143.51) (xy 127 140.97))
    (stroke (width 0) (type default) (color 0 0 0 0))
    (uuid a78be91f-2d56-45cb-8fb5-7dca095b31e3)
  )
  (wire (pts (xy 139.7 143.51) (xy 139.7 140.97))
    (stroke (width 0) (type default) (color 0 0 0 0))
    (uuid afa39b9f-bfd4-4298-8d4d-f20a8db9d0fd)
  )
  (wire (pts (xy 114.3 53.34) (xy 111.76 53.34))
    (stroke (width 0) (type default) (color 0 0 0 0))
    (uuid b5253622-275c-488c-850c-108e624348e3)
  )
  (wire (pts (xy 116.84 29.21) (xy 116.84 26.67))
    (stroke (width 0) (type default) (color 0 0 0 0))
    (uuid b8790514-1424-44a6-b36e-2e7680815de1)
  )
  (wire (pts (xy 153.67 60.96) (xy 170.18 60.96))
    (stroke (width 0) (type default) (color 0 0 0 0))
    (uuid ba3a3e4f-d4a5-47f8-af26-edcfc7202ede)
  )
  (wire (pts (xy 104.14 111.76) (xy 104.14 113.03))
    (stroke (width 0) (type default) (color 0 0 0 0))
    (uuid bc663e7e-08a9-4a6b-8220-6d0f3194a366)
  )
  (wire (pts (xy 106.68 76.2) (xy 106.68 113.03))
    (stroke (width 0) (type default) (color 0 0 0 0))
    (uuid c08070a8-8b4e-4a80-aa2b-80a2140160d7)
  )
  (wire (pts (xy 152.4 67.31) (xy 134.62 67.31))
    (stroke (width 0) (type default) (color 0 0 0 0))
    (uuid c081bcf0-3d52-428a-9f65-fc0388f04ed2)
  )
  (wire (pts (xy 146.05 77.47) (xy 132.08 77.47))
    (stroke (width 0) (type default) (color 0 0 0 0))
    (uuid c08db16e-bbb7-4f02-9681-9df69e1be7d2)
  )
  (wire (pts (xy 129.54 113.03) (xy 129.54 80.01))
    (stroke (width 0) (type default) (color 0 0 0 0))
    (uuid c348a482-59e1-4a04-9d23-870f8d01839e)
  )
  (wire (pts (xy 97.79 111.76) (xy 104.14 111.76))
    (stroke (width 0) (type default) (color 0 0 0 0))
    (uuid c355a4c7-073f-4151-a5d4-acca8f042afe)
  )
  (wire (pts (xy 124.46 113.03) (xy 124.46 92.71))
    (stroke (width 0) (type default) (color 0 0 0 0))
    (uuid c777dca5-0273-48fd-8f55-44cabe71c35d)
  )
  (wire (pts (xy 92.71 76.2) (xy 86.36 76.2))
    (stroke (width 0) (type default) (color 0 0 0 0))
    (uuid cb42b511-5680-48c9-9ed5-a830eaedeaa5)
  )
  (wire (pts (xy 100.33 55.88) (xy 111.76 55.88))
    (stroke (width 0) (type default) (color 0 0 0 0))
    (uuid cd2a5567-61bf-4be0-b396-cb139d497398)
  )
  (wire (pts (xy 81.28 55.88) (xy 81.28 63.5))
    (stroke (width 0) (type default) (color 0 0 0 0))
    (uuid d41e8515-b53e-4ac4-a931-677a307cb6bb)
  )
  (wire (pts (xy 142.24 26.67) (xy 142.24 113.03))
    (stroke (width 0) (type default) (color 0 0 0 0))
    (uuid d72f7690-5b05-4a6d-ae03-e5d77c1057f7)
  )
  (wire (pts (xy 127 86.36) (xy 127 69.85))
    (stroke (width 0) (type default) (color 0 0 0 0))
    (uuid d77abb4e-9728-498d-9f77-c50ed71d858d)
  )
  (wire (pts (xy 119.38 48.26) (xy 119.38 113.03))
    (stroke (width 0) (type default) (color 0 0 0 0))
    (uuid dd35d172-0648-415f-bb65-0e84e0f8c560)
  )
  (wire (pts (xy 147.32 127) (xy 161.29 127))
    (stroke (width 0) (type default) (color 0 0 0 0))
    (uuid df04c78d-6b15-483f-bce7-12d3ba3f502e)
  )
  (wire (pts (xy 142.24 143.51) (xy 142.24 140.97))
    (stroke (width 0) (type default) (color 0 0 0 0))
    (uuid dfea10a7-1cbe-4c44-a951-08c8c82414b9)
  )
  (wire (pts (xy 114.3 53.34) (xy 114.3 113.03))
    (stroke (width 0) (type default) (color 0 0 0 0))
    (uuid ec2f4bc2-ba51-4d42-bbd9-5c401abc9629)
  )
  (wire (pts (xy 154.94 29.21) (xy 154.94 26.67))
    (stroke (width 0) (type default) (color 0 0 0 0))
    (uuid ef09d57d-37d2-489c-a5f7-0b0e4daf4614)
  )
  (wire (pts (xy 119.38 48.26) (xy 111.76 48.26))
    (stroke (width 0) (type default) (color 0 0 0 0))
    (uuid f248b6d2-2118-4767-85b6-d07965d159e9)
  )
  (wire (pts (xy 124.46 92.71) (xy 124.46 66.04))
    (stroke (width 0) (type default) (color 0 0 0 0))
    (uuid f31cbe1f-a0c2-4b31-9201-0bf1f9088e78)
  )
  (wire (pts (xy 170.18 99.06) (xy 153.67 99.06))
    (stroke (width 0) (type default) (color 0 0 0 0))
    (uuid f3344bad-768f-4031-b296-63d7840125e5)
  )
  (wire (pts (xy 86.36 73.66) (xy 86.36 76.2))
    (stroke (width 0) (type default) (color 0 0 0 0))
    (uuid fd073802-4dd7-4e04-9b9f-2340f5c8c06c)
  )
  (wire (pts (xy 104.14 97.79) (xy 104.14 111.76))
    (stroke (width 0) (type default) (color 0 0 0 0))
    (uuid fdb45f06-8432-4b6f-aa66-6ccbb4707674)
  )
  (wire (pts (xy 111.76 26.67) (xy 113.03 26.67))
    (stroke (width 0) (type default) (color 0 0 0 0))
    (uuid feb3a40b-c867-4f50-a75a-52cae9820081)
  )

  (label "RX_ATT_D3" (at 129.54 110.49 90)
    (effects (font (size 1.27 1.27)) (justify left bottom))
    (uuid 1009eeb8-4be8-49ff-871d-1e30079ffe54)
  )
  (label "RX_ATT_A2" (at 109.22 110.49 90)
    (effects (font (size 1.27 1.27)) (justify left bottom))
    (uuid 12a205b4-9f3b-4d1c-b80b-efc9c8e625b6)
  )
  (label "ATT_SI" (at 119.38 69.85 90)
    (effects (font (size 1.27 1.27)) (justify left bottom))
    (uuid 17abc7b7-41a6-42d1-bc7b-f475b0345b01)
  )
  (label "RX_ATT_S_P" (at 104.14 110.49 90)
    (effects (font (size 1.27 1.27)) (justify left bottom))
    (uuid 1926b233-986e-4869-a442-b5e3ca8b3bbc)
  )
  (label "ATT_LE" (at 114.3 69.85 90)
    (effects (font (size 1.27 1.27)) (justify left bottom))
    (uuid 2c2c8d09-d28a-4c9d-abde-31c75b2fa5e0)
  )
  (label "RX_ATT_A0" (at 106.68 110.49 90)
    (effects (font (size 1.27 1.27)) (justify left bottom))
    (uuid 5315e07f-06e6-4bd9-82b6-8e946a9e154e)
  )
  (label "RX_ATT_D4" (at 127 110.49 90)
    (effects (font (size 1.27 1.27)) (justify left bottom))
    (uuid 638117ff-a73c-4a76-976b-ab6ab724fb0a)
  )
  (label "RX_ATT_D0" (at 137.16 110.49 90)
    (effects (font (size 1.27 1.27)) (justify left bottom))
    (uuid 690e79b8-5ecd-4dd3-b312-07b8fa4f78de)
  )
  (label "RX_ATT_D1" (at 134.62 110.49 90)
    (effects (font (size 1.27 1.27)) (justify left bottom))
    (uuid 6fa6a77c-bf93-4738-9c5e-49cf50118ae0)
  )
  (label "RX_ATT_D5" (at 124.46 110.49 90)
    (effects (font (size 1.27 1.27)) (justify left bottom))
    (uuid 781602e4-fe25-4da3-a788-0c3d20aafcb7)
  )
  (label "RX_ATT_A1" (at 111.76 110.49 90)
    (effects (font (size 1.27 1.27)) (justify left bottom))
    (uuid a12ccdb6-3679-4846-a6aa-1c003e3aea6b)
  )
  (label "RX_ATT_D6" (at 121.92 110.49 90)
    (effects (font (size 1.27 1.27)) (justify left bottom))
    (uuid a39bff73-ba40-4b6f-b0a8-69b4aafc2399)
  )
  (label "RX_ATT_D2" (at 132.08 110.49 90)
    (effects (font (size 1.27 1.27)) (justify left bottom))
    (uuid c35a9928-3453-4c10-b581-c909a87ff023)
  )
  (label "ATT_CLK" (at 116.84 69.85 90)
    (effects (font (size 1.27 1.27)) (justify left bottom))
    (uuid ddffe3de-ff82-462e-846a-d76b238948c4)
  )
  (label "RX_att_VDD" (at 147.32 26.67 0)
    (effects (font (size 1.27 1.27)) (justify left bottom))
    (uuid e43d7ba6-ce06-49a7-8634-0d7dc803e69f)
  )

  (hierarchical_label "VDD" (shape input) (at 99.06 26.67 180)
    (effects (font (size 1.27 1.27)) (justify right))
    (uuid 01573dcd-40ec-4fc4-830b-2ffcb4206300)
  )
  (hierarchical_label "SI" (shape input) (at 111.76 48.26 180)
    (effects (font (size 1.27 1.27)) (justify right))
    (uuid 3f439680-07dc-4cbc-b9f9-c9e67e0b80ea)
  )
  (hierarchical_label "LE" (shape input) (at 111.76 53.34 180)
    (effects (font (size 1.27 1.27)) (justify right))
    (uuid 46da584b-17e7-4565-bc9f-8b592fa475aa)
  )
  (hierarchical_label "CLK" (shape input) (at 111.76 50.8 180)
    (effects (font (size 1.27 1.27)) (justify right))
    (uuid 76a45538-7d08-4c91-a8b1-e99187824be3)
  )
  (hierarchical_label "RF_IN" (shape input) (at 161.29 127 0)
    (effects (font (size 1.27 1.27)) (justify left))
    (uuid 8e904686-ce34-474a-ab32-7bf99fa061c1)
  )
  (hierarchical_label "RF_OUT" (shape output) (at 85.09 127 180)
    (effects (font (size 1.27 1.27)) (justify right))
    (uuid a9db8465-75c2-4c46-8b0a-edba51926ccf)
  )

  (symbol (lib_id "POWDER_RF:PE43712") (at 123.19 127 0) (mirror y) (unit 1)
    (in_bom yes) (on_board yes)
    (uuid 029ead16-1b5d-4d69-b121-040580eb7903)
    (property "Reference" "U301" (id 0) (at 101.6 114.3 0))
    (property "Value" "PE43712" (id 1) (at 123.19 127 0))
    (property "Footprint" "Package_DFN_QFN:QFN-32-1EP_5x5mm_P0.5mm_EP3.1x3.1mm" (id 2) (at 93.98 160.02 0)
      (effects (font (size 1.27 1.27)) hide)
    )
    (property "Datasheet" "" (id 3) (at 101.6 114.3 0)
      (effects (font (size 1.27 1.27)) hide)
    )
    (property "PartSpecification" "3000-0000000187" (id 4) (at 123.19 127 0)
      (effects (font (size 1.27 1.27)) hide)
    )
    (pin "1" (uuid bd993be6-e950-4c8c-bc13-9f7bd7350d53))
    (pin "10" (uuid 88b375d0-e9df-4721-ad33-6ced829fb5e6))
    (pin "11" (uuid 9c8f6723-988d-4334-b02d-7a249c1d662c))
    (pin "12" (uuid a420acdf-58d6-47ac-b02a-494ff973f47f))
    (pin "13" (uuid b9b5cc2b-d81b-47cf-89ba-52d752e8463c))
    (pin "14" (uuid 52909277-346a-474b-a081-0f8946fe0d3f))
    (pin "15" (uuid 06d97afc-8151-49dc-8ac2-8a1c100d662e))
    (pin "16" (uuid c8d218a3-2239-4278-b146-932161325deb))
    (pin "17" (uuid 1b340de7-7930-4457-8235-56ebe4956894))
    (pin "18" (uuid a196238e-b9ec-4604-992b-a953d9be554d))
    (pin "19" (uuid 95e2bee9-10bb-4d24-b6a1-186f5c2b8e81))
    (pin "2" (uuid eece88c8-fee6-4f67-aaf9-653b6065a6cb))
    (pin "20" (uuid 617f513f-16c9-4ee5-8499-a80fee4befb0))
    (pin "21" (uuid 9248dd88-a994-4c4c-9b3c-b67c437e97cb))
    (pin "22" (uuid 967ecbcc-e1cc-4801-8709-5cad6a233770))
    (pin "23" (uuid 317697b2-fb0b-4182-89fa-175bf3f6f69b))
    (pin "24" (uuid 60033a8e-68ff-4cd5-bc80-f08755e1e045))
    (pin "25" (uuid 01585b62-cbf0-4c2d-8cfa-51c035179590))
    (pin "26" (uuid 0a8809ae-7336-4294-bc07-52974f256810))
    (pin "27" (uuid 296f5c12-e39a-42fe-8c23-75264dca3e4b))
    (pin "28" (uuid 8b474652-6fe3-4886-93ed-86dfe4e98b7d))
    (pin "29" (uuid 6cfd33ca-7547-4308-8bef-64ac88e86b9d))
    (pin "3" (uuid 2fa07366-3ff6-4968-9529-29f4f60962af))
    (pin "30" (uuid cc6237da-4455-4dac-b7c0-9663306cbd80))
    (pin "31" (uuid f23834ae-1bfd-46c0-8f89-9f77823ae89b))
    (pin "32" (uuid a9749d26-c91b-4ea4-9546-8b3dcfb86483))
    (pin "33" (uuid e1dcdc37-257c-4153-accd-fe9415992ff6))
    (pin "4" (uuid 6812bd52-ddf4-4828-93d8-c806430280e0))
    (pin "5" (uuid c8d8639a-bd7c-4817-8362-dc8bf230119c))
    (pin "6" (uuid 0853099b-f4f4-4426-be1e-a87c35a3a3de))
    (pin "7" (uuid dbbb2dff-87d4-4c86-9fcc-614f9e73e6e1))
    (pin "8" (uuid 4a608145-1cdc-4487-80e1-84343103ad68))
    (pin "9" (uuid d91a4fdc-cb6c-480e-b8d8-dd206df07e25))
  )

  (symbol (lib_id "Connector:TestPoint") (at 127 69.85 0) (mirror y) (unit 1)
    (in_bom yes) (on_board yes)
    (uuid 044e45e2-f803-40b6-b5d9-b9f533436af3)
    (property "Reference" "TP304" (id 0) (at 125.5268 66.8528 0)
      (effects (font (size 1.27 1.27)) (justify left))
    )
    (property "Value" "TestPoint" (id 1) (at 125.5268 69.1642 0)
      (effects (font (size 1.27 1.27)) (justify left) hide)
    )
    (property "Footprint" "TestPoint:TestPoint_Pad_D1.0mm" (id 2) (at 121.92 69.85 0)
      (effects (font (size 1.27 1.27)) hide)
    )
    (property "Datasheet" "~" (id 3) (at 121.92 69.85 0)
      (effects (font (size 1.27 1.27)) hide)
    )
    (property "PartSpecification" "NA" (id 4) (at 127 69.85 0)
      (effects (font (size 1.27 1.27)) hide)
    )
    (pin "1" (uuid c9a98194-44eb-4d5a-adbb-1183204fb91d))
  )

  (symbol (lib_id "Connector:TestPoint") (at 134.62 62.23 0) (mirror y) (unit 1)
    (in_bom yes) (on_board yes)
    (uuid 04716587-a44e-418d-ba57-60afa7c0605e)
    (property "Reference" "TP307" (id 0) (at 133.1468 59.2328 0)
      (effects (font (size 1.27 1.27)) (justify left))
    )
    (property "Value" "TestPoint" (id 1) (at 133.1468 61.5442 0)
      (effects (font (size 1.27 1.27)) (justify left) hide)
    )
    (property "Footprint" "TestPoint:TestPoint_Pad_D1.0mm" (id 2) (at 129.54 62.23 0)
      (effects (font (size 1.27 1.27)) hide)
    )
    (property "Datasheet" "~" (id 3) (at 129.54 62.23 0)
      (effects (font (size 1.27 1.27)) hide)
    )
    (property "PartSpecification" "NA" (id 4) (at 134.62 62.23 0)
      (effects (font (size 1.27 1.27)) hide)
    )
    (pin "1" (uuid 76160d84-5901-4339-b303-3b1762fa2db1))
  )

  (symbol (lib_id "power:GND") (at 111.76 143.51 0) (unit 1)
    (in_bom yes) (on_board yes)
    (uuid 0941803c-d5b2-4438-84ba-e5326d4322e3)
    (property "Reference" "#PWR?" (id 0) (at 111.76 149.86 0)
      (effects (font (size 1.27 1.27)) hide)
    )
    (property "Value" "GND" (id 1) (at 111.887 147.9042 0))
    (property "Footprint" "" (id 2) (at 111.76 143.51 0)
      (effects (font (size 1.27 1.27)) hide)
    )
    (property "Datasheet" "" (id 3) (at 111.76 143.51 0)
      (effects (font (size 1.27 1.27)) hide)
    )
    (pin "1" (uuid 57600a83-0962-4987-b14e-a3a3cdf395cd))
  )

  (symbol (lib_id "Connector:TestPoint") (at 97.79 111.76 0) (mirror y) (unit 1)
    (in_bom yes) (on_board yes)
    (uuid 0a60f224-96f1-48cc-87e1-1f5589c8c90a)
    (property "Reference" "TP301" (id 0) (at 96.3168 108.7628 0)
      (effects (font (size 1.27 1.27)) (justify left))
    )
    (property "Value" "TestPoint" (id 1) (at 96.3168 111.0742 0)
      (effects (font (size 1.27 1.27)) (justify left))
    )
    (property "Footprint" "TestPoint:TestPoint_Pad_D1.0mm" (id 2) (at 92.71 111.76 0)
      (effects (font (size 1.27 1.27)) hide)
    )
    (property "Datasheet" "~" (id 3) (at 92.71 111.76 0)
      (effects (font (size 1.27 1.27)) hide)
    )
    (property "PartSpecification" "NA" (id 4) (at 97.79 111.76 0)
      (effects (font (size 1.27 1.27)) hide)
    )
    (pin "1" (uuid 4e442247-4e45-436e-9dfd-35f89851cc0e))
  )

  (symbol (lib_id "power:GND") (at 106.68 143.51 0) (unit 1)
    (in_bom yes) (on_board yes)
    (uuid 0ae5e10d-74e5-4682-9392-20ca639ebf2d)
    (property "Reference" "#PWR?" (id 0) (at 106.68 149.86 0)
      (effects (font (size 1.27 1.27)) hide)
    )
    (property "Value" "GND" (id 1) (at 106.807 147.9042 0))
    (property "Footprint" "" (id 2) (at 106.68 143.51 0)
      (effects (font (size 1.27 1.27)) hide)
    )
    (property "Datasheet" "" (id 3) (at 106.68 143.51 0)
      (effects (font (size 1.27 1.27)) hide)
    )
    (pin "1" (uuid 20d48b2f-0d97-4554-a2d3-cb57ff629c58))
  )

  (symbol (lib_id "power:GND") (at 109.22 143.51 0) (unit 1)
    (in_bom yes) (on_board yes)
    (uuid 0bc5272f-685b-41d7-a93c-0b3f0a1269bf)
    (property "Reference" "#PWR?" (id 0) (at 109.22 149.86 0)
      (effects (font (size 1.27 1.27)) hide)
    )
    (property "Value" "GND" (id 1) (at 109.347 147.9042 0))
    (property "Footprint" "" (id 2) (at 109.22 143.51 0)
      (effects (font (size 1.27 1.27)) hide)
    )
    (property "Datasheet" "" (id 3) (at 109.22 143.51 0)
      (effects (font (size 1.27 1.27)) hide)
    )
    (pin "1" (uuid 0a4084df-f615-44f7-be27-d26e27fea378))
  )

  (symbol (lib_id "Device:R") (at 149.86 86.36 270) (unit 1)
    (in_bom yes) (on_board yes)
    (uuid 12e14c89-b5b0-49fa-8e97-1611fc97e092)
    (property "Reference" "R307" (id 0) (at 151.0284 88.138 0)
      (effects (font (size 1.27 1.27)) (justify left))
    )
    (property "Value" "10k" (id 1) (at 148.717 88.138 0)
      (effects (font (size 1.27 1.27)) (justify left))
    )
    (property "Footprint" "Resistor_SMD:R_0402_1005Metric" (id 2) (at 149.86 84.582 90)
      (effects (font (size 1.27 1.27)) hide)
    )
    (property "Datasheet" "~" (id 3) (at 149.86 86.36 0)
      (effects (font (size 1.27 1.27)) hide)
    )
    (property "Manufacturer" "Delta Electronics/Cyntec" (id 4) (at 149.86 86.36 0)
      (effects (font (size 1.27 1.27)) hide)
    )
    (property "PartNumber" "PFR05S-103-FNH" (id 5) (at 149.86 86.36 0)
      (effects (font (size 1.27 1.27)) hide)
    )
    (property "PartSpecification" "3000-0000000131" (id 6) (at 149.86 86.36 0)
      (effects (font (size 1.27 1.27)) hide)
    )
    (pin "1" (uuid 9c497e2c-fb11-4a31-9789-3f114eb5df67))
    (pin "2" (uuid f88362d2-4cb0-4f5f-872f-1848d7137873))
  )

  (symbol (lib_id "power:GND") (at 139.7 143.51 0) (unit 1)
    (in_bom yes) (on_board yes)
    (uuid 1576052f-7341-4649-961a-6fa44acd4add)
    (property "Reference" "#PWR?" (id 0) (at 139.7 149.86 0)
      (effects (font (size 1.27 1.27)) hide)
    )
    (property "Value" "GND" (id 1) (at 139.827 147.9042 0))
    (property "Footprint" "" (id 2) (at 139.7 143.51 0)
      (effects (font (size 1.27 1.27)) hide)
    )
    (property "Datasheet" "" (id 3) (at 139.7 143.51 0)
      (effects (font (size 1.27 1.27)) hide)
    )
    (pin "1" (uuid 84a50a70-20ac-4a40-a02c-eeabb69230c6))
  )

  (symbol (lib_id "power:GND") (at 127 143.51 0) (unit 1)
    (in_bom yes) (on_board yes)
    (uuid 1d1fe625-377a-4403-bea7-6d33040af7e5)
    (property "Reference" "#PWR?" (id 0) (at 127 149.86 0)
      (effects (font (size 1.27 1.27)) hide)
    )
    (property "Value" "GND" (id 1) (at 127.127 147.9042 0))
    (property "Footprint" "" (id 2) (at 127 143.51 0)
      (effects (font (size 1.27 1.27)) hide)
    )
    (property "Datasheet" "" (id 3) (at 127 143.51 0)
      (effects (font (size 1.27 1.27)) hide)
    )
    (pin "1" (uuid 826c7860-4cac-4db6-96a5-2455a9e42e9a))
  )

  (symbol (lib_id "power:GND") (at 129.54 143.51 0) (unit 1)
    (in_bom yes) (on_board yes)
    (uuid 2a7d1635-108c-40c1-89aa-55aadf899ab6)
    (property "Reference" "#PWR?" (id 0) (at 129.54 149.86 0)
      (effects (font (size 1.27 1.27)) hide)
    )
    (property "Value" "GND" (id 1) (at 129.667 147.9042 0))
    (property "Footprint" "" (id 2) (at 129.54 143.51 0)
      (effects (font (size 1.27 1.27)) hide)
    )
    (property "Datasheet" "" (id 3) (at 129.54 143.51 0)
      (effects (font (size 1.27 1.27)) hide)
    )
    (pin "1" (uuid 28c30af4-df51-43a0-bc62-d3691a335bc3))
  )

  (symbol (lib_id "power:GND") (at 129.54 39.37 0) (unit 1)
    (in_bom yes) (on_board yes)
    (uuid 2cf9c3f1-0d50-48cb-ab20-2dde6aa507ea)
    (property "Reference" "#PWR?" (id 0) (at 129.54 45.72 0)
      (effects (font (size 1.27 1.27)) hide)
    )
    (property "Value" "GND" (id 1) (at 129.667 43.7642 0))
    (property "Footprint" "" (id 2) (at 129.54 39.37 0)
      (effects (font (size 1.27 1.27)) hide)
    )
    (property "Datasheet" "" (id 3) (at 129.54 39.37 0)
      (effects (font (size 1.27 1.27)) hide)
    )
    (pin "1" (uuid de4015a2-9976-423c-a677-778e53a0caa0))
  )

  (symbol (lib_id "000_PreferredParts:C_10pF") (at 116.84 33.02 0) (unit 1)
    (in_bom yes) (on_board yes)
    (uuid 2d911663-0d4a-4001-a82d-07da47674458)
    (property "Reference" "C301" (id 0) (at 117.475 30.48 0)
      (effects (font (size 1.27 1.27)) (justify left))
    )
    (property "Value" "C_10pF" (id 1) (at 117.475 35.56 0)
      (effects (font (size 1.27 1.27)) (justify left))
    )
    (property "Footprint" "Capacitor_SMD:C_0402_1005Metric" (id 2) (at 117.8052 36.83 0)
      (effects (font (size 1.27 1.27)) hide)
    )
    (property "Datasheet" "~" (id 3) (at 116.84 33.02 0)
      (effects (font (size 1.27 1.27)) hide)
    )
    (property "PartSpecification" "3000-0000000582" (id 4) (at -5.08 74.93 0)
      (effects (font (size 1.27 1.27)) hide)
    )
    (pin "1" (uuid 4683f672-4d05-4749-8404-1ed4b1e7061b))
    (pin "2" (uuid bf36e9d5-29fc-4979-9020-81e493e3b1c6))
  )

  (symbol (lib_id "Device:R") (at 149.86 60.96 270) (unit 1)
    (in_bom yes) (on_board yes)
    (uuid 457414fa-b593-4517-bade-fcce1e588e6f)
    (property "Reference" "R305" (id 0) (at 151.0284 62.738 0)
      (effects (font (size 1.27 1.27)) (justify left))
    )
    (property "Value" "10k" (id 1) (at 148.717 62.738 0)
      (effects (font (size 1.27 1.27)) (justify left))
    )
    (property "Footprint" "Resistor_SMD:R_0402_1005Metric" (id 2) (at 149.86 59.182 90)
      (effects (font (size 1.27 1.27)) hide)
    )
    (property "Datasheet" "~" (id 3) (at 149.86 60.96 0)
      (effects (font (size 1.27 1.27)) hide)
    )
    (property "Manufacturer" "Delta Electronics/Cyntec" (id 4) (at 149.86 60.96 0)
      (effects (font (size 1.27 1.27)) hide)
    )
    (property "PartNumber" "PFR05S-103-FNH" (id 5) (at 149.86 60.96 0)
      (effects (font (size 1.27 1.27)) hide)
    )
    (property "PartSpecification" "3000-0000000131" (id 6) (at 149.86 60.96 0)
      (effects (font (size 1.27 1.27)) hide)
    )
    (pin "1" (uuid a0e0bdf7-70d2-4bef-9b11-d7704083a099))
    (pin "2" (uuid c8d034b3-e9a8-4bbe-b03a-f39b66159afa))
  )

  (symbol (lib_id "Connector:TestPoint") (at 137.16 57.15 0) (mirror y) (unit 1)
    (in_bom yes) (on_board yes)
    (uuid 47531507-ee9d-4c3f-8806-390d7f3631d2)
    (property "Reference" "TP308" (id 0) (at 135.6868 54.1528 0)
      (effects (font (size 1.27 1.27)) (justify left))
    )
    (property "Value" "TestPoint" (id 1) (at 135.6868 56.4642 0)
      (effects (font (size 1.27 1.27)) (justify left) hide)
    )
    (property "Footprint" "TestPoint:TestPoint_Pad_D1.0mm" (id 2) (at 132.08 57.15 0)
      (effects (font (size 1.27 1.27)) hide)
    )
    (property "Datasheet" "~" (id 3) (at 132.08 57.15 0)
      (effects (font (size 1.27 1.27)) hide)
    )
    (property "PartSpecification" "NA" (id 4) (at 137.16 57.15 0)
      (effects (font (size 1.27 1.27)) hide)
    )
    (pin "1" (uuid ff68f064-b003-4c2a-b55f-e7f826c08a14))
  )

  (symbol (lib_id "power:GND") (at 132.08 143.51 0) (unit 1)
    (in_bom yes) (on_board yes)
    (uuid 4ba59d19-3c4b-4311-9719-d0edc899051e)
    (property "Reference" "#PWR?" (id 0) (at 132.08 149.86 0)
      (effects (font (size 1.27 1.27)) hide)
    )
    (property "Value" "GND" (id 1) (at 132.207 147.9042 0))
    (property "Footprint" "" (id 2) (at 132.08 143.51 0)
      (effects (font (size 1.27 1.27)) hide)
    )
    (property "Datasheet" "" (id 3) (at 132.08 143.51 0)
      (effects (font (size 1.27 1.27)) hide)
    )
    (pin "1" (uuid c30ad939-a420-4443-a62a-fbd331126ca4))
  )

  (symbol (lib_id "Device:R") (at 96.52 97.79 270) (unit 1)
    (in_bom yes) (on_board yes)
    (uuid 5210cf7b-1003-4eb3-b3c0-33660c4be3db)
    (property "Reference" "R304" (id 0) (at 97.6884 99.568 0)
      (effects (font (size 1.27 1.27)) (justify left))
    )
    (property "Value" "10k" (id 1) (at 95.377 99.568 0)
      (effects (font (size 1.27 1.27)) (justify left))
    )
    (property "Footprint" "Resistor_SMD:R_0402_1005Metric" (id 2) (at 96.52 96.012 90)
      (effects (font (size 1.27 1.27)) hide)
    )
    (property "Datasheet" "~" (id 3) (at 96.52 97.79 0)
      (effects (font (size 1.27 1.27)) hide)
    )
    (property "Manufacturer" "Delta Electronics/Cyntec" (id 4) (at 96.52 97.79 0)
      (effects (font (size 1.27 1.27)) hide)
    )
    (property "PartNumber" "PFR05S-103-FNH" (id 5) (at 96.52 97.79 0)
      (effects (font (size 1.27 1.27)) hide)
    )
    (property "PartSpecification" "3000-0000000131" (id 6) (at 96.52 97.79 0)
      (effects (font (size 1.27 1.27)) hide)
    )
    (pin "1" (uuid b3f1ef60-8ff0-4809-86be-088204b229cd))
    (pin "2" (uuid 59ad86c4-360f-4221-ac97-0763c14b063a))
  )

  (symbol (lib_id "000_PreferredParts:C_100nF") (at 154.94 33.02 0) (unit 1)
    (in_bom yes) (on_board yes)
    (uuid 527cb22a-7e33-4cab-9561-11aa15db26ff)
    (property "Reference" "C303" (id 0) (at 155.575 30.48 0)
      (effects (font (size 1.27 1.27)) (justify left))
    )
    (property "Value" "C_100nF" (id 1) (at 155.575 35.56 0)
      (effects (font (size 1.27 1.27)) (justify left) hide)
    )
    (property "Footprint" "Capacitor_SMD:C_0402_1005Metric" (id 2) (at 155.9052 36.83 0)
      (effects (font (size 1.27 1.27)) hide)
    )
    (property "Datasheet" "~" (id 3) (at 154.94 33.02 0)
      (effects (font (size 1.27 1.27)) hide)
    )
    (property "DisplayValue" "100nF" (id 4) (at 158.75 35.56 0))
    (property "PartSpecification" "3000-0000000125" (id 5) (at -5.08 74.93 0)
      (effects (font (size 1.27 1.27)) hide)
    )
    (pin "1" (uuid e034c255-51be-46d1-b38d-6383afcd4315))
    (pin "2" (uuid 4e250076-83f9-4186-a431-38a97a5f0cd6))
  )

  (symbol (lib_id "Connector:TestPoint") (at 132.08 77.47 0) (mirror y) (unit 1)
    (in_bom yes) (on_board yes)
    (uuid 61bc208e-a0ed-4e87-bfe3-9763d7fed041)
    (property "Reference" "TP306" (id 0) (at 130.6068 74.4728 0)
      (effects (font (size 1.27 1.27)) (justify left))
    )
    (property "Value" "TestPoint" (id 1) (at 130.6068 76.7842 0)
      (effects (font (size 1.27 1.27)) (justify left) hide)
    )
    (property "Footprint" "TestPoint:TestPoint_Pad_D1.0mm" (id 2) (at 127 77.47 0)
      (effects (font (size 1.27 1.27)) hide)
    )
    (property "Datasheet" "~" (id 3) (at 127 77.47 0)
      (effects (font (size 1.27 1.27)) hide)
    )
    (property "PartSpecification" "NA" (id 4) (at 132.08 77.47 0)
      (effects (font (size 1.27 1.27)) hide)
    )
    (pin "1" (uuid 748990b4-ff7f-4d8b-b243-60c7a7b87743))
  )

  (symbol (lib_id "power:GND") (at 121.92 143.51 0) (unit 1)
    (in_bom yes) (on_board yes)
    (uuid 6b08f18d-ebc4-485c-b201-b0a3da017cc7)
    (property "Reference" "#PWR?" (id 0) (at 121.92 149.86 0)
      (effects (font (size 1.27 1.27)) hide)
    )
    (property "Value" "GND" (id 1) (at 122.047 147.9042 0))
    (property "Footprint" "" (id 2) (at 121.92 143.51 0)
      (effects (font (size 1.27 1.27)) hide)
    )
    (property "Datasheet" "" (id 3) (at 121.92 143.51 0)
      (effects (font (size 1.27 1.27)) hide)
    )
    (pin "1" (uuid 36eff4c0-1976-49d5-b59b-797378c32509))
  )

  (symbol (lib_id "power:GND") (at 119.38 143.51 0) (unit 1)
    (in_bom yes) (on_board yes)
    (uuid 6ede61a1-ed6a-4986-997c-8d9262285651)
    (property "Reference" "#PWR?" (id 0) (at 119.38 149.86 0)
      (effects (font (size 1.27 1.27)) hide)
    )
    (property "Value" "GND" (id 1) (at 119.507 147.9042 0))
    (property "Footprint" "" (id 2) (at 119.38 143.51 0)
      (effects (font (size 1.27 1.27)) hide)
    )
    (property "Datasheet" "" (id 3) (at 119.38 143.51 0)
      (effects (font (size 1.27 1.27)) hide)
    )
    (pin "1" (uuid fadd3f75-5bda-44bf-8311-4271cce212b7))
  )

  (symbol (lib_id "power:GND") (at 142.24 143.51 0) (unit 1)
    (in_bom yes) (on_board yes)
    (uuid 70872a3b-1fee-4f28-a71a-2236ba86a073)
    (property "Reference" "#PWR?" (id 0) (at 142.24 149.86 0)
      (effects (font (size 1.27 1.27)) hide)
    )
    (property "Value" "GND" (id 1) (at 142.367 147.9042 0))
    (property "Footprint" "" (id 2) (at 142.24 143.51 0)
      (effects (font (size 1.27 1.27)) hide)
    )
    (property "Datasheet" "" (id 3) (at 142.24 143.51 0)
      (effects (font (size 1.27 1.27)) hide)
    )
    (pin "1" (uuid 74075434-8744-4dbf-abdf-b3b3c2f10cd1))
  )

  (symbol (lib_id "power:GND") (at 116.84 39.37 0) (unit 1)
    (in_bom yes) (on_board yes)
    (uuid 71325b6b-d379-4e71-8141-87a630c26595)
    (property "Reference" "#PWR?" (id 0) (at 116.84 45.72 0)
      (effects (font (size 1.27 1.27)) hide)
    )
    (property "Value" "GND" (id 1) (at 116.967 43.7642 0))
    (property "Footprint" "" (id 2) (at 116.84 39.37 0)
      (effects (font (size 1.27 1.27)) hide)
    )
    (property "Datasheet" "" (id 3) (at 116.84 39.37 0)
      (effects (font (size 1.27 1.27)) hide)
    )
    (pin "1" (uuid 45e3a90b-d22e-4e72-a1c6-03596189a34c))
  )

  (symbol (lib_id "power:GND") (at 124.46 143.51 0) (unit 1)
    (in_bom yes) (on_board yes)
    (uuid 75825f50-70b2-445a-90be-0311b87c7e5c)
    (property "Reference" "#PWR?" (id 0) (at 124.46 149.86 0)
      (effects (font (size 1.27 1.27)) hide)
    )
    (property "Value" "GND" (id 1) (at 124.587 147.9042 0))
    (property "Footprint" "" (id 2) (at 124.46 143.51 0)
      (effects (font (size 1.27 1.27)) hide)
    )
    (property "Datasheet" "" (id 3) (at 124.46 143.51 0)
      (effects (font (size 1.27 1.27)) hide)
    )
    (pin "1" (uuid d096363e-612f-40ef-bd85-189b3adc14c1))
  )

  (symbol (lib_id "POWDER_PowerGlobals:+3.3VDIGRF") (at 86.36 73.66 0) (unit 1)
    (in_bom yes) (on_board yes) (fields_autoplaced)
    (uuid 76746491-abdb-40ce-99c5-3dbc8558d9da)
    (property "Reference" "#PWR?" (id 0) (at 86.36 77.47 0)
      (effects (font (size 1.27 1.27)) hide)
    )
    (property "Value" "+3.3VDIGRF" (id 1) (at 86.36 68.58 0))
    (property "Footprint" "" (id 2) (at 86.36 73.66 0)
      (effects (font (size 1.27 1.27)) hide)
    )
    (property "Datasheet" "" (id 3) (at 86.36 73.66 0)
      (effects (font (size 1.27 1.27)) hide)
    )
    (pin "1" (uuid 34c1c68e-2d38-41b8-9b0b-eeb5cf13feb6))
  )

  (symbol (lib_id "POWDER_PowerGlobals:+3.3VDIGRF") (at 170.18 58.42 0) (unit 1)
    (in_bom yes) (on_board yes) (fields_autoplaced)
    (uuid 797b82b2-e013-4769-8bfc-29f807afd977)
    (property "Reference" "#PWR?" (id 0) (at 170.18 62.23 0)
      (effects (font (size 1.27 1.27)) hide)
    )
    (property "Value" "+3.3VDIGRF" (id 1) (at 170.18 53.34 0))
    (property "Footprint" "" (id 2) (at 170.18 58.42 0)
      (effects (font (size 1.27 1.27)) hide)
    )
    (property "Datasheet" "" (id 3) (at 170.18 58.42 0)
      (effects (font (size 1.27 1.27)) hide)
    )
    (pin "1" (uuid f85da079-20ba-4d27-a044-a40cf9736a98))
  )

  (symbol (lib_id "Device:R") (at 156.21 80.01 270) (unit 1)
    (in_bom yes) (on_board yes)
    (uuid 870f2d65-523e-4f16-bf6a-2290580317d0)
    (property "Reference" "R310" (id 0) (at 157.3784 81.788 0)
      (effects (font (size 1.27 1.27)) (justify left))
    )
    (property "Value" "10k" (id 1) (at 155.067 81.788 0)
      (effects (font (size 1.27 1.27)) (justify left))
    )
    (property "Footprint" "Resistor_SMD:R_0402_1005Metric" (id 2) (at 156.21 78.232 90)
      (effects (font (size 1.27 1.27)) hide)
    )
    (property "Datasheet" "~" (id 3) (at 156.21 80.01 0)
      (effects (font (size 1.27 1.27)) hide)
    )
    (property "Manufacturer" "Delta Electronics/Cyntec" (id 4) (at 156.21 80.01 0)
      (effects (font (size 1.27 1.27)) hide)
    )
    (property "PartNumber" "PFR05S-103-FNH" (id 5) (at 156.21 80.01 0)
      (effects (font (size 1.27 1.27)) hide)
    )
    (property "PartSpecification" "3000-0000000131" (id 6) (at 156.21 80.01 0)
      (effects (font (size 1.27 1.27)) hide)
    )
    (pin "1" (uuid 1bc35a90-2e1e-44d4-9386-2d78925a343d))
    (pin "2" (uuid 3a4d8d71-1541-411a-be31-9a337eec5f34))
  )

  (symbol (lib_id "Connector:TestPoint") (at 121.92 62.23 0) (mirror y) (unit 1)
    (in_bom yes) (on_board yes)
    (uuid 8774f0a1-1469-43a9-96cb-2dc2471a56a4)
    (property "Reference" "TP302" (id 0) (at 120.4468 59.2328 0)
      (effects (font (size 1.27 1.27)) (justify left))
    )
    (property "Value" "TestPoint" (id 1) (at 120.4468 61.5442 0)
      (effects (font (size 1.27 1.27)) (justify left) hide)
    )
    (property "Footprint" "TestPoint:TestPoint_Pad_D1.0mm" (id 2) (at 116.84 62.23 0)
      (effects (font (size 1.27 1.27)) hide)
    )
    (property "Datasheet" "~" (id 3) (at 116.84 62.23 0)
      (effects (font (size 1.27 1.27)) hide)
    )
    (property "PartSpecification" "NA" (id 4) (at 121.92 62.23 0)
      (effects (font (size 1.27 1.27)) hide)
    )
    (pin "1" (uuid 0b82b3a4-6708-4675-a509-00beb9c1db50))
  )

  (symbol (lib_id "Device:R") (at 96.52 63.5 270) (unit 1)
    (in_bom yes) (on_board yes)
    (uuid 89f7c65d-e5df-4954-84b6-f3373c71155d)
    (property "Reference" "R302" (id 0) (at 97.6884 65.278 0)
      (effects (font (size 1.27 1.27)) (justify left))
    )
    (property "Value" "10k" (id 1) (at 95.377 65.278 0)
      (effects (font (size 1.27 1.27)) (justify left))
    )
    (property "Footprint" "Resistor_SMD:R_0402_1005Metric" (id 2) (at 96.52 61.722 90)
      (effects (font (size 1.27 1.27)) hide)
    )
    (property "Datasheet" "~" (id 3) (at 96.52 63.5 0)
      (effects (font (size 1.27 1.27)) hide)
    )
    (property "Manufacturer" "Delta Electronics/Cyntec" (id 4) (at 96.52 63.5 0)
      (effects (font (size 1.27 1.27)) hide)
    )
    (property "PartNumber" "PFR05S-103-FNH" (id 5) (at 96.52 63.5 0)
      (effects (font (size 1.27 1.27)) hide)
    )
    (property "PartSpecification" "3000-0000000131" (id 6) (at 96.52 63.5 0)
      (effects (font (size 1.27 1.27)) hide)
    )
    (pin "1" (uuid 95d8dce2-6278-42a7-ab18-d765b7724f9a))
    (pin "2" (uuid b2f76424-e2ce-4dfc-ade5-e1d0162b6e23))
  )

  (symbol (lib_id "power:GND") (at 137.16 143.51 0) (unit 1)
    (in_bom yes) (on_board yes)
    (uuid 986ae3bb-6137-4fef-b331-4941a7206d18)
    (property "Reference" "#PWR?" (id 0) (at 137.16 149.86 0)
      (effects (font (size 1.27 1.27)) hide)
    )
    (property "Value" "GND" (id 1) (at 137.287 147.9042 0))
    (property "Footprint" "" (id 2) (at 137.16 143.51 0)
      (effects (font (size 1.27 1.27)) hide)
    )
    (property "Datasheet" "" (id 3) (at 137.16 143.51 0)
      (effects (font (size 1.27 1.27)) hide)
    )
    (pin "1" (uuid f13cbe29-31f0-4268-8924-bb402ccc38da))
  )

  (symbol (lib_id "Connector:TestPoint") (at 124.46 66.04 0) (mirror y) (unit 1)
    (in_bom yes) (on_board yes)
    (uuid a179d7fa-c961-4242-a060-754a50ffd1ea)
    (property "Reference" "TP303" (id 0) (at 122.9868 63.0428 0)
      (effects (font (size 1.27 1.27)) (justify left))
    )
    (property "Value" "TestPoint" (id 1) (at 122.9868 65.3542 0)
      (effects (font (size 1.27 1.27)) (justify left) hide)
    )
    (property "Footprint" "TestPoint:TestPoint_Pad_D1.0mm" (id 2) (at 119.38 66.04 0)
      (effects (font (size 1.27 1.27)) hide)
    )
    (property "Datasheet" "~" (id 3) (at 119.38 66.04 0)
      (effects (font (size 1.27 1.27)) hide)
    )
    (property "PartSpecification" "NA" (id 4) (at 124.46 66.04 0)
      (effects (font (size 1.27 1.27)) hide)
    )
    (pin "1" (uuid 97207351-f8d4-4db3-9d58-7a9819e97ecc))
  )

  (symbol (lib_id "power:GND") (at 116.84 143.51 0) (unit 1)
    (in_bom yes) (on_board yes)
    (uuid a54b186a-8d17-4a21-884a-5b526af7b72c)
    (property "Reference" "#PWR?" (id 0) (at 116.84 149.86 0)
      (effects (font (size 1.27 1.27)) hide)
    )
    (property "Value" "GND" (id 1) (at 116.967 147.9042 0))
    (property "Footprint" "" (id 2) (at 116.84 143.51 0)
      (effects (font (size 1.27 1.27)) hide)
    )
    (property "Datasheet" "" (id 3) (at 116.84 143.51 0)
      (effects (font (size 1.27 1.27)) hide)
    )
    (pin "1" (uuid 48e774e8-9979-4515-a692-27f3ab686f23))
  )

  (symbol (lib_id "power:GND") (at 81.28 66.04 0) (unit 1)
    (in_bom yes) (on_board yes)
    (uuid a88ca92e-51b6-42c1-9553-54d7f23c5ea1)
    (property "Reference" "#PWR?" (id 0) (at 81.28 72.39 0)
      (effects (font (size 1.27 1.27)) hide)
    )
    (property "Value" "GND" (id 1) (at 81.407 70.4342 0))
    (property "Footprint" "" (id 2) (at 81.28 66.04 0)
      (effects (font (size 1.27 1.27)) hide)
    )
    (property "Datasheet" "" (id 3) (at 81.28 66.04 0)
      (effects (font (size 1.27 1.27)) hide)
    )
    (pin "1" (uuid 3133fd3e-2297-44d6-aa52-6c177ccece16))
  )

  (symbol (lib_id "Device:R") (at 149.86 73.66 270) (unit 1)
    (in_bom yes) (on_board yes)
    (uuid a950fff4-067a-4a8f-8821-e47ecb1f81bf)
    (property "Reference" "R306" (id 0) (at 151.0284 75.438 0)
      (effects (font (size 1.27 1.27)) (justify left))
    )
    (property "Value" "10k" (id 1) (at 148.717 75.438 0)
      (effects (font (size 1.27 1.27)) (justify left))
    )
    (property "Footprint" "Resistor_SMD:R_0402_1005Metric" (id 2) (at 149.86 71.882 90)
      (effects (font (size 1.27 1.27)) hide)
    )
    (property "Datasheet" "~" (id 3) (at 149.86 73.66 0)
      (effects (font (size 1.27 1.27)) hide)
    )
    (property "Manufacturer" "Delta Electronics/Cyntec" (id 4) (at 149.86 73.66 0)
      (effects (font (size 1.27 1.27)) hide)
    )
    (property "PartNumber" "PFR05S-103-FNH" (id 5) (at 149.86 73.66 0)
      (effects (font (size 1.27 1.27)) hide)
    )
    (property "PartSpecification" "3000-0000000131" (id 6) (at 149.86 73.66 0)
      (effects (font (size 1.27 1.27)) hide)
    )
    (pin "1" (uuid 11fc00d8-cf83-45e9-a23a-528b6a55bf23))
    (pin "2" (uuid 462d169a-9ddd-46c3-b556-917180b3c53d))
  )

  (symbol (lib_id "Device:R") (at 156.21 92.71 270) (unit 1)
    (in_bom yes) (on_board yes)
    (uuid af541b7f-47e2-4338-86d3-64a72b5b7aba)
    (property "Reference" "R311" (id 0) (at 157.3784 94.488 0)
      (effects (font (size 1.27 1.27)) (justify left))
    )
    (property "Value" "10k" (id 1) (at 155.067 94.488 0)
      (effects (font (size 1.27 1.27)) (justify left))
    )
    (property "Footprint" "Resistor_SMD:R_0402_1005Metric" (id 2) (at 156.21 90.932 90)
      (effects (font (size 1.27 1.27)) hide)
    )
    (property "Datasheet" "~" (id 3) (at 156.21 92.71 0)
      (effects (font (size 1.27 1.27)) hide)
    )
    (property "Manufacturer" "Delta Electronics/Cyntec" (id 4) (at 156.21 92.71 0)
      (effects (font (size 1.27 1.27)) hide)
    )
    (property "PartNumber" "PFR05S-103-FNH" (id 5) (at 156.21 92.71 0)
      (effects (font (size 1.27 1.27)) hide)
    )
    (property "PartSpecification" "3000-0000000131" (id 6) (at 156.21 92.71 0)
      (effects (font (size 1.27 1.27)) hide)
    )
    (pin "1" (uuid f8db0788-75ad-42bb-8a8f-72f43869f52c))
    (pin "2" (uuid 1ea221b6-b18b-4925-93b3-4fd978d05d5e))
  )

  (symbol (lib_id "Device:L") (at 107.95 26.67 90) (unit 1)
    (in_bom yes) (on_board yes)
    (uuid b91188b5-8fc5-4c73-b77f-e64c2593c5ac)
    (property "Reference" "L301" (id 0) (at 107.95 21.844 90))
    (property "Value" "BEAD" (id 1) (at 107.95 24.1554 90))
    (property "Footprint" "Inductor_SMD:L_0603_1608Metric" (id 2) (at 107.95 26.67 0)
      (effects (font (size 1.27 1.27)) hide)
    )
    (property "Datasheet" "~" (id 3) (at 107.95 26.67 0)
      (effects (font (size 1.27 1.27)) hide)
    )
    (property "PartNumber" "BLM18EG221SZ1" (id 4) (at 107.95 26.67 90)
      (effects (font (size 1.27 1.27)) hide)
    )
    (property "Manufacturer" "Murata Electronics" (id 5) (at 107.95 26.67 0)
      (effects (font (size 1.27 1.27)) hide)
    )
    (property "PartSpecification" "3000-0000000091" (id 6) (at 107.95 26.67 0)
      (effects (font (size 1.27 1.27)) hide)
    )
    (pin "1" (uuid befd6b19-7e70-4952-9928-d359e6b0cbf0))
    (pin "2" (uuid f45039dd-4bdc-4dd9-a9c9-5ee154cf7ec4))
  )

  (symbol (lib_id "Device:R") (at 96.52 55.88 270) (unit 1)
    (in_bom yes) (on_board yes)
    (uuid bc4163e4-d633-4a2e-a19b-47235133df19)
    (property "Reference" "R301" (id 0) (at 97.6884 57.658 0)
      (effects (font (size 1.27 1.27)) (justify left))
    )
    (property "Value" "10k" (id 1) (at 95.377 57.658 0)
      (effects (font (size 1.27 1.27)) (justify left))
    )
    (property "Footprint" "Resistor_SMD:R_0402_1005Metric" (id 2) (at 96.52 54.102 90)
      (effects (font (size 1.27 1.27)) hide)
    )
    (property "Datasheet" "~" (id 3) (at 96.52 55.88 0)
      (effects (font (size 1.27 1.27)) hide)
    )
    (property "Manufacturer" "Delta Electronics/Cyntec" (id 4) (at 96.52 55.88 0)
      (effects (font (size 1.27 1.27)) hide)
    )
    (property "PartNumber" "PFR05S-103-FNH" (id 5) (at 96.52 55.88 0)
      (effects (font (size 1.27 1.27)) hide)
    )
    (property "PartSpecification" "3000-0000000131" (id 6) (at 96.52 55.88 0)
      (effects (font (size 1.27 1.27)) hide)
    )
    (pin "1" (uuid e83330c6-9165-48d9-a496-564eca93ebc4))
    (pin "2" (uuid 16d45733-181d-4e84-890c-996ba99a2a5b))
  )

  (symbol (lib_id "power:GND") (at 114.3 143.51 0) (unit 1)
    (in_bom yes) (on_board yes)
    (uuid cc023c8a-63d6-4080-a172-6e49d6627fb3)
    (property "Reference" "#PWR?" (id 0) (at 114.3 149.86 0)
      (effects (font (size 1.27 1.27)) hide)
    )
    (property "Value" "GND" (id 1) (at 114.427 147.9042 0))
    (property "Footprint" "" (id 2) (at 114.3 143.51 0)
      (effects (font (size 1.27 1.27)) hide)
    )
    (property "Datasheet" "" (id 3) (at 114.3 143.51 0)
      (effects (font (size 1.27 1.27)) hide)
    )
    (pin "1" (uuid c07420ae-3624-4b80-aeae-2e6812ee46ca))
  )

  (symbol (lib_id "Device:R") (at 149.86 99.06 270) (unit 1)
    (in_bom yes) (on_board yes)
    (uuid ce8e88d7-f820-4969-922b-021b53795352)
    (property "Reference" "R308" (id 0) (at 151.0284 100.838 0)
      (effects (font (size 1.27 1.27)) (justify left))
    )
    (property "Value" "10k" (id 1) (at 148.717 100.838 0)
      (effects (font (size 1.27 1.27)) (justify left))
    )
    (property "Footprint" "Resistor_SMD:R_0402_1005Metric" (id 2) (at 149.86 97.282 90)
      (effects (font (size 1.27 1.27)) hide)
    )
    (property "Datasheet" "~" (id 3) (at 149.86 99.06 0)
      (effects (font (size 1.27 1.27)) hide)
    )
    (property "Manufacturer" "Delta Electronics/Cyntec" (id 4) (at 149.86 99.06 0)
      (effects (font (size 1.27 1.27)) hide)
    )
    (property "PartNumber" "PFR05S-103-FNH" (id 5) (at 149.86 99.06 0)
      (effects (font (size 1.27 1.27)) hide)
    )
    (property "PartSpecification" "3000-0000000131" (id 6) (at 149.86 99.06 0)
      (effects (font (size 1.27 1.27)) hide)
    )
    (pin "1" (uuid 7fdb7495-883d-4f65-8d5c-ea6abbcf2fa7))
    (pin "2" (uuid 624d2f49-55a9-4026-926e-56da40049d01))
  )

  (symbol (lib_id "000_PreferredParts:C_1nF") (at 129.54 33.02 0) (unit 1)
    (in_bom yes) (on_board yes)
    (uuid d2a51ab8-87f6-45a5-af73-2506f338456e)
    (property "Reference" "C302" (id 0) (at 130.175 30.48 0)
      (effects (font (size 1.27 1.27)) (justify left))
    )
    (property "Value" "C_1nF" (id 1) (at 130.175 35.56 0)
      (effects (font (size 1.27 1.27)) (justify left))
    )
    (property "Footprint" "Capacitor_SMD:C_0402_1005Metric" (id 2) (at 130.5052 36.83 0)
      (effects (font (size 1.27 1.27)) hide)
    )
    (property "Datasheet" "~" (id 3) (at 129.54 33.02 0)
      (effects (font (size 1.27 1.27)) hide)
    )
    (property "PartSpecification" "3000-0000000128" (id 4) (at -5.08 74.93 0)
      (effects (font (size 1.27 1.27)) hide)
    )
    (pin "1" (uuid a3d0b657-8288-4493-8b1a-0f7c5cf670c8))
    (pin "2" (uuid d3b1c7fb-5b6a-4d1a-ae00-258881737cf3))
  )

  (symbol (lib_id "power:PWR_FLAG") (at 113.03 20.32 0) (unit 1)
    (in_bom yes) (on_board yes)
    (uuid d4a6d9e3-4c66-466c-ae8c-cc40eb1c2551)
    (property "Reference" "#FLG?" (id 0) (at 113.03 18.415 0)
      (effects (font (size 1.27 1.27)) hide)
    )
    (property "Value" "PWR_FLAG" (id 1) (at 113.03 15.9258 0))
    (property "Footprint" "" (id 2) (at 113.03 20.32 0)
      (effects (font (size 1.27 1.27)) hide)
    )
    (property "Datasheet" "~" (id 3) (at 113.03 20.32 0)
      (effects (font (size 1.27 1.27)) hide)
    )
    (pin "1" (uuid 02e78ad8-09a4-439d-95ee-3e2015414491))
  )

  (symbol (lib_id "Device:R") (at 96.52 76.2 270) (unit 1)
    (in_bom yes) (on_board yes)
    (uuid dcafe74d-0bf3-494e-91f4-367502f8f654)
    (property "Reference" "R303" (id 0) (at 97.6884 77.978 0)
      (effects (font (size 1.27 1.27)) (justify left))
    )
    (property "Value" "10k" (id 1) (at 95.377 77.978 0)
      (effects (font (size 1.27 1.27)) (justify left))
    )
    (property "Footprint" "Resistor_SMD:R_0402_1005Metric" (id 2) (at 96.52 74.422 90)
      (effects (font (size 1.27 1.27)) hide)
    )
    (property "Datasheet" "~" (id 3) (at 96.52 76.2 0)
      (effects (font (size 1.27 1.27)) hide)
    )
    (property "Manufacturer" "Delta Electronics/Cyntec" (id 4) (at 96.52 76.2 0)
      (effects (font (size 1.27 1.27)) hide)
    )
    (property "PartNumber" "PFR05S-103-FNH" (id 5) (at 96.52 76.2 0)
      (effects (font (size 1.27 1.27)) hide)
    )
    (property "PartSpecification" "3000-0000000131" (id 6) (at 96.52 76.2 0)
      (effects (font (size 1.27 1.27)) hide)
    )
    (pin "1" (uuid abc3558b-cd90-40eb-bf81-c96c6c3a35f5))
    (pin "2" (uuid a3178939-5806-4853-8ab0-3b5b0e2adea2))
  )

  (symbol (lib_id "power:GND") (at 154.94 39.37 0) (unit 1)
    (in_bom yes) (on_board yes)
    (uuid e0b17557-2793-40b8-938c-3b41d9c8973a)
    (property "Reference" "#PWR?" (id 0) (at 154.94 45.72 0)
      (effects (font (size 1.27 1.27)) hide)
    )
    (property "Value" "GND" (id 1) (at 155.067 43.7642 0))
    (property "Footprint" "" (id 2) (at 154.94 39.37 0)
      (effects (font (size 1.27 1.27)) hide)
    )
    (property "Datasheet" "" (id 3) (at 154.94 39.37 0)
      (effects (font (size 1.27 1.27)) hide)
    )
    (pin "1" (uuid 64110ddc-ff1e-47ec-ab85-a28e7bae22d6))
  )

  (symbol (lib_id "Device:R") (at 156.21 67.31 270) (unit 1)
    (in_bom yes) (on_board yes)
    (uuid e7140918-d0ed-41d4-9081-8d59896fbbd3)
    (property "Reference" "R309" (id 0) (at 157.3784 69.088 0)
      (effects (font (size 1.27 1.27)) (justify left))
    )
    (property "Value" "10k" (id 1) (at 155.067 69.088 0)
      (effects (font (size 1.27 1.27)) (justify left))
    )
    (property "Footprint" "Resistor_SMD:R_0402_1005Metric" (id 2) (at 156.21 65.532 90)
      (effects (font (size 1.27 1.27)) hide)
    )
    (property "Datasheet" "~" (id 3) (at 156.21 67.31 0)
      (effects (font (size 1.27 1.27)) hide)
    )
    (property "Manufacturer" "Delta Electronics/Cyntec" (id 4) (at 156.21 67.31 0)
      (effects (font (size 1.27 1.27)) hide)
    )
    (property "PartNumber" "PFR05S-103-FNH" (id 5) (at 156.21 67.31 0)
      (effects (font (size 1.27 1.27)) hide)
    )
    (property "PartSpecification" "3000-0000000131" (id 6) (at 156.21 67.31 0)
      (effects (font (size 1.27 1.27)) hide)
    )
    (pin "1" (uuid 9a277587-fc3e-4985-ae54-0efe8405d6aa))
    (pin "2" (uuid 4b2e091b-2077-4c21-b359-6ba1aed8b5a6))
  )

  (symbol (lib_id "power:GND") (at 104.14 143.51 0) (unit 1)
    (in_bom yes) (on_board yes)
    (uuid ea931a4d-76d2-4bcf-b528-246a5eba39cd)
    (property "Reference" "#PWR?" (id 0) (at 104.14 149.86 0)
      (effects (font (size 1.27 1.27)) hide)
    )
    (property "Value" "GND" (id 1) (at 104.267 147.9042 0))
    (property "Footprint" "" (id 2) (at 104.14 143.51 0)
      (effects (font (size 1.27 1.27)) hide)
    )
    (property "Datasheet" "" (id 3) (at 104.14 143.51 0)
      (effects (font (size 1.27 1.27)) hide)
    )
    (pin "1" (uuid 631167f5-11a2-46cd-80e9-ce323cd1eec7))
  )

  (symbol (lib_id "power:GND") (at 134.62 143.51 0) (unit 1)
    (in_bom yes) (on_board yes)
    (uuid fdf57f9c-3726-41e6-8494-25e23fc2c7ba)
    (property "Reference" "#PWR?" (id 0) (at 134.62 149.86 0)
      (effects (font (size 1.27 1.27)) hide)
    )
    (property "Value" "GND" (id 1) (at 134.747 147.9042 0))
    (property "Footprint" "" (id 2) (at 134.62 143.51 0)
      (effects (font (size 1.27 1.27)) hide)
    )
    (property "Datasheet" "" (id 3) (at 134.62 143.51 0)
      (effects (font (size 1.27 1.27)) hide)
    )
    (pin "1" (uuid 673aa352-82b3-4e80-a3a7-4b39dde48c96))
  )

  (symbol (lib_id "Connector:TestPoint") (at 129.54 73.66 0) (mirror y) (unit 1)
    (in_bom yes) (on_board yes)
    (uuid ff70535e-deed-4fe7-a3d7-58f6274cbdb0)
    (property "Reference" "TP305" (id 0) (at 128.0668 70.6628 0)
      (effects (font (size 1.27 1.27)) (justify left))
    )
    (property "Value" "TestPoint" (id 1) (at 128.0668 72.9742 0)
      (effects (font (size 1.27 1.27)) (justify left) hide)
    )
    (property "Footprint" "TestPoint:TestPoint_Pad_D1.0mm" (id 2) (at 124.46 73.66 0)
      (effects (font (size 1.27 1.27)) hide)
    )
    (property "Datasheet" "~" (id 3) (at 124.46 73.66 0)
      (effects (font (size 1.27 1.27)) hide)
    )
    (property "PartSpecification" "NA" (id 4) (at 129.54 73.66 0)
      (effects (font (size 1.27 1.27)) hide)
    )
    (pin "1" (uuid 96040761-b0e5-47a9-8ba7-7d9622476861))
  )
)
