(kicad_sch (version 20211123) (generator eeschema)

  (uuid c0ba6632-4501-4d46-a566-6d0ff96b2e5d)

  (paper "A4")

  (lib_symbols
    (symbol "000_PreferredParts:C_0_1uF" (pin_numbers hide) (pin_names (offset 0.254)) (in_bom yes) (on_board yes)
      (property "Reference" "C" (id 0) (at 0.635 2.54 0)
        (effects (font (size 1.27 1.27)) (justify left))
      )
      (property "Value" "C_0_1uF" (id 1) (at 0.635 -2.54 0)
        (effects (font (size 1.27 1.27)) (justify left) hide)
      )
      (property "Footprint" "Capacitor_SMD:C_0402_1005Metric" (id 2) (at 0.9652 -3.81 0)
        (effects (font (size 1.27 1.27)) hide)
      )
      (property "Datasheet" "~" (id 3) (at 0 0 0)
        (effects (font (size 1.27 1.27)) hide)
      )
      (property "DisplayValue" "0.1uF" (id 4) (at 3.81 -2.54 0)
        (effects (font (size 1.27 1.27)))
      )
      (property "PartSpecification" "3000-0000000125" (id 5) (at 0 0 0)
        (effects (font (size 1.27 1.27)) hide)
      )
      (property "Voltage" "100V" (id 6) (at 0 0 0)
        (effects (font (size 1.27 1.27)) hide)
      )
      (property "ki_keywords" "cap capacitor" (id 7) (at 0 0 0)
        (effects (font (size 1.27 1.27)) hide)
      )
      (property "ki_description" "Unpolarized capacitor" (id 8) (at 0 0 0)
        (effects (font (size 1.27 1.27)) hide)
      )
      (property "ki_fp_filters" "C_*" (id 9) (at 0 0 0)
        (effects (font (size 1.27 1.27)) hide)
      )
      (symbol "C_0_1uF_0_1"
        (polyline
          (pts
            (xy -2.032 -0.762)
            (xy 2.032 -0.762)
          )
          (stroke (width 0.508) (type default) (color 0 0 0 0))
          (fill (type none))
        )
        (polyline
          (pts
            (xy -2.032 0.762)
            (xy 2.032 0.762)
          )
          (stroke (width 0.508) (type default) (color 0 0 0 0))
          (fill (type none))
        )
      )
      (symbol "C_0_1uF_1_1"
        (pin passive line (at 0 3.81 270) (length 2.794)
          (name "~" (effects (font (size 1.27 1.27))))
          (number "1" (effects (font (size 1.27 1.27))))
        )
        (pin passive line (at 0 -3.81 90) (length 2.794)
          (name "~" (effects (font (size 1.27 1.27))))
          (number "2" (effects (font (size 1.27 1.27))))
        )
      )
    )
    (symbol "000_PreferredParts:C_10pF" (pin_numbers hide) (pin_names (offset 0.254)) (in_bom yes) (on_board yes)
      (property "Reference" "C" (id 0) (at 0.635 2.54 0)
        (effects (font (size 1.27 1.27)) (justify left))
      )
      (property "Value" "C_10pF" (id 1) (at 0.635 -2.54 0)
        (effects (font (size 1.27 1.27)) (justify left))
      )
      (property "Footprint" "Capacitor_SMD:C_0402_1005Metric" (id 2) (at 0.9652 -3.81 0)
        (effects (font (size 1.27 1.27)) hide)
      )
      (property "Datasheet" "~" (id 3) (at 0 0 0)
        (effects (font (size 1.27 1.27)) hide)
      )
      (property "PartSpecification" "3000-0000000582" (id 4) (at 0 0 0)
        (effects (font (size 1.27 1.27)) hide)
      )
      (property "ki_keywords" "cap capacitor" (id 5) (at 0 0 0)
        (effects (font (size 1.27 1.27)) hide)
      )
      (property "ki_description" "Unpolarized capacitor" (id 6) (at 0 0 0)
        (effects (font (size 1.27 1.27)) hide)
      )
      (property "ki_fp_filters" "C_*" (id 7) (at 0 0 0)
        (effects (font (size 1.27 1.27)) hide)
      )
      (symbol "C_10pF_0_1"
        (polyline
          (pts
            (xy -2.032 -0.762)
            (xy 2.032 -0.762)
          )
          (stroke (width 0.508) (type default) (color 0 0 0 0))
          (fill (type none))
        )
        (polyline
          (pts
            (xy -2.032 0.762)
            (xy 2.032 0.762)
          )
          (stroke (width 0.508) (type default) (color 0 0 0 0))
          (fill (type none))
        )
      )
      (symbol "C_10pF_1_1"
        (pin passive line (at 0 3.81 270) (length 2.794)
          (name "~" (effects (font (size 1.27 1.27))))
          (number "1" (effects (font (size 1.27 1.27))))
        )
        (pin passive line (at 0 -3.81 90) (length 2.794)
          (name "~" (effects (font (size 1.27 1.27))))
          (number "2" (effects (font (size 1.27 1.27))))
        )
      )
    )
    (symbol "000_PreferredParts:C_1nF" (pin_numbers hide) (pin_names (offset 0.254)) (in_bom yes) (on_board yes)
      (property "Reference" "C" (id 0) (at 0.635 2.54 0)
        (effects (font (size 1.27 1.27)) (justify left))
      )
      (property "Value" "C_1nF" (id 1) (at 0.635 -2.54 0)
        (effects (font (size 1.27 1.27)) (justify left))
      )
      (property "Footprint" "Capacitor_SMD:C_0402_1005Metric" (id 2) (at 0.9652 -3.81 0)
        (effects (font (size 1.27 1.27)) hide)
      )
      (property "Datasheet" "~" (id 3) (at 0 0 0)
        (effects (font (size 1.27 1.27)) hide)
      )
      (property "PartSpecification" "3000-0000000128" (id 4) (at 0 0 0)
        (effects (font (size 1.27 1.27)) hide)
      )
      (property "ki_keywords" "cap capacitor" (id 5) (at 0 0 0)
        (effects (font (size 1.27 1.27)) hide)
      )
      (property "ki_description" "Unpolarized capacitor" (id 6) (at 0 0 0)
        (effects (font (size 1.27 1.27)) hide)
      )
      (property "ki_fp_filters" "C_*" (id 7) (at 0 0 0)
        (effects (font (size 1.27 1.27)) hide)
      )
      (symbol "C_1nF_0_1"
        (polyline
          (pts
            (xy -2.032 -0.762)
            (xy 2.032 -0.762)
          )
          (stroke (width 0.508) (type default) (color 0 0 0 0))
          (fill (type none))
        )
        (polyline
          (pts
            (xy -2.032 0.762)
            (xy 2.032 0.762)
          )
          (stroke (width 0.508) (type default) (color 0 0 0 0))
          (fill (type none))
        )
      )
      (symbol "C_1nF_1_1"
        (pin passive line (at 0 3.81 270) (length 2.794)
          (name "~" (effects (font (size 1.27 1.27))))
          (number "1" (effects (font (size 1.27 1.27))))
        )
        (pin passive line (at 0 -3.81 90) (length 2.794)
          (name "~" (effects (font (size 1.27 1.27))))
          (number "2" (effects (font (size 1.27 1.27))))
        )
      )
    )
    (symbol "000_PreferredParts:C_1uF" (pin_numbers hide) (pin_names (offset 0.254)) (in_bom yes) (on_board yes)
      (property "Reference" "C" (id 0) (at 0.635 2.54 0)
        (effects (font (size 1.27 1.27)) (justify left))
      )
      (property "Value" "C_1uF" (id 1) (at 0.635 -2.54 0)
        (effects (font (size 1.27 1.27)) (justify left))
      )
      (property "Footprint" "Capacitor_SMD:C_0603_1608Metric" (id 2) (at 0.9652 -3.81 0)
        (effects (font (size 1.27 1.27)) hide)
      )
      (property "Datasheet" "~" (id 3) (at 0 0 0)
        (effects (font (size 1.27 1.27)) hide)
      )
      (property "PartSpecification" "3000-0000000136" (id 4) (at 0 0 0)
        (effects (font (size 1.27 1.27)) hide)
      )
      (property "ki_keywords" "cap capacitor" (id 5) (at 0 0 0)
        (effects (font (size 1.27 1.27)) hide)
      )
      (property "ki_description" "Unpolarized capacitor" (id 6) (at 0 0 0)
        (effects (font (size 1.27 1.27)) hide)
      )
      (property "ki_fp_filters" "C_*" (id 7) (at 0 0 0)
        (effects (font (size 1.27 1.27)) hide)
      )
      (symbol "C_1uF_0_1"
        (polyline
          (pts
            (xy -2.032 -0.762)
            (xy 2.032 -0.762)
          )
          (stroke (width 0.508) (type default) (color 0 0 0 0))
          (fill (type none))
        )
        (polyline
          (pts
            (xy -2.032 0.762)
            (xy 2.032 0.762)
          )
          (stroke (width 0.508) (type default) (color 0 0 0 0))
          (fill (type none))
        )
      )
      (symbol "C_1uF_1_1"
        (pin passive line (at 0 3.81 270) (length 2.794)
          (name "~" (effects (font (size 1.27 1.27))))
          (number "1" (effects (font (size 1.27 1.27))))
        )
        (pin passive line (at 0 -3.81 90) (length 2.794)
          (name "~" (effects (font (size 1.27 1.27))))
          (number "2" (effects (font (size 1.27 1.27))))
        )
      )
    )
    (symbol "Device:L" (pin_numbers hide) (pin_names (offset 1.016) hide) (in_bom yes) (on_board yes)
      (property "Reference" "L" (id 0) (at -1.27 0 90)
        (effects (font (size 1.27 1.27)))
      )
      (property "Value" "L" (id 1) (at 1.905 0 90)
        (effects (font (size 1.27 1.27)))
      )
      (property "Footprint" "" (id 2) (at 0 0 0)
        (effects (font (size 1.27 1.27)) hide)
      )
      (property "Datasheet" "~" (id 3) (at 0 0 0)
        (effects (font (size 1.27 1.27)) hide)
      )
      (property "ki_keywords" "inductor choke coil reactor magnetic" (id 4) (at 0 0 0)
        (effects (font (size 1.27 1.27)) hide)
      )
      (property "ki_description" "Inductor" (id 5) (at 0 0 0)
        (effects (font (size 1.27 1.27)) hide)
      )
      (property "ki_fp_filters" "Choke_* *Coil* Inductor_* L_*" (id 6) (at 0 0 0)
        (effects (font (size 1.27 1.27)) hide)
      )
      (symbol "L_0_1"
        (arc (start 0 -2.54) (mid 0.635 -1.905) (end 0 -1.27)
          (stroke (width 0) (type default) (color 0 0 0 0))
          (fill (type none))
        )
        (arc (start 0 -1.27) (mid 0.635 -0.635) (end 0 0)
          (stroke (width 0) (type default) (color 0 0 0 0))
          (fill (type none))
        )
        (arc (start 0 0) (mid 0.635 0.635) (end 0 1.27)
          (stroke (width 0) (type default) (color 0 0 0 0))
          (fill (type none))
        )
        (arc (start 0 1.27) (mid 0.635 1.905) (end 0 2.54)
          (stroke (width 0) (type default) (color 0 0 0 0))
          (fill (type none))
        )
      )
      (symbol "L_1_1"
        (pin passive line (at 0 3.81 270) (length 1.27)
          (name "1" (effects (font (size 1.27 1.27))))
          (number "1" (effects (font (size 1.27 1.27))))
        )
        (pin passive line (at 0 -3.81 90) (length 1.27)
          (name "2" (effects (font (size 1.27 1.27))))
          (number "2" (effects (font (size 1.27 1.27))))
        )
      )
    )
    (symbol "Device:R" (pin_numbers hide) (pin_names (offset 0)) (in_bom yes) (on_board yes)
      (property "Reference" "R" (id 0) (at 2.032 0 90)
        (effects (font (size 1.27 1.27)))
      )
      (property "Value" "R" (id 1) (at 0 0 90)
        (effects (font (size 1.27 1.27)))
      )
      (property "Footprint" "" (id 2) (at -1.778 0 90)
        (effects (font (size 1.27 1.27)) hide)
      )
      (property "Datasheet" "~" (id 3) (at 0 0 0)
        (effects (font (size 1.27 1.27)) hide)
      )
      (property "ki_keywords" "R res resistor" (id 4) (at 0 0 0)
        (effects (font (size 1.27 1.27)) hide)
      )
      (property "ki_description" "Resistor" (id 5) (at 0 0 0)
        (effects (font (size 1.27 1.27)) hide)
      )
      (property "ki_fp_filters" "R_*" (id 6) (at 0 0 0)
        (effects (font (size 1.27 1.27)) hide)
      )
      (symbol "R_0_1"
        (rectangle (start -1.016 -2.54) (end 1.016 2.54)
          (stroke (width 0.254) (type default) (color 0 0 0 0))
          (fill (type none))
        )
      )
      (symbol "R_1_1"
        (pin passive line (at 0 3.81 270) (length 1.27)
          (name "~" (effects (font (size 1.27 1.27))))
          (number "1" (effects (font (size 1.27 1.27))))
        )
        (pin passive line (at 0 -3.81 90) (length 1.27)
          (name "~" (effects (font (size 1.27 1.27))))
          (number "2" (effects (font (size 1.27 1.27))))
        )
      )
    )
    (symbol "POWDER_Digital:SN74AC04" (in_bom yes) (on_board yes)
      (property "Reference" "U" (id 0) (at 7.62 13.97 0)
        (effects (font (size 1.27 1.27)))
      )
      (property "Value" "SN74AC04" (id 1) (at 0 5.08 0)
        (effects (font (size 1.27 1.27)))
      )
      (property "Footprint" "" (id 2) (at 7.62 13.97 0)
        (effects (font (size 1.27 1.27)) hide)
      )
      (property "Datasheet" "" (id 3) (at 7.62 13.97 0)
        (effects (font (size 1.27 1.27)) hide)
      )
      (symbol "SN74AC04_0_0"
        (pin input line (at -15.24 6.35 0) (length 2.54)
          (name "1A" (effects (font (size 1.27 1.27))))
          (number "1" (effects (font (size 1.27 1.27))))
        )
        (pin output line (at 16.51 -3.81 180) (length 2.54)
          (name "5Y" (effects (font (size 1.27 1.27))))
          (number "10" (effects (font (size 1.27 1.27))))
        )
        (pin input line (at -15.24 -3.81 0) (length 2.54)
          (name "5A" (effects (font (size 1.27 1.27))))
          (number "11" (effects (font (size 1.27 1.27))))
        )
        (pin output line (at 16.51 -6.35 180) (length 2.54)
          (name "6Y" (effects (font (size 1.27 1.27))))
          (number "12" (effects (font (size 1.27 1.27))))
        )
        (pin input line (at -15.24 -6.35 0) (length 2.54)
          (name "6A" (effects (font (size 1.27 1.27))))
          (number "13" (effects (font (size 1.27 1.27))))
        )
        (pin power_in line (at 0 15.24 270) (length 2.54)
          (name "VCC" (effects (font (size 1.27 1.27))))
          (number "14" (effects (font (size 1.27 1.27))))
        )
        (pin output line (at 16.51 6.35 180) (length 2.54)
          (name "1Y" (effects (font (size 1.27 1.27))))
          (number "2" (effects (font (size 1.27 1.27))))
        )
        (pin input line (at -15.24 3.81 0) (length 2.54)
          (name "2A" (effects (font (size 1.27 1.27))))
          (number "3" (effects (font (size 1.27 1.27))))
        )
        (pin output line (at 16.51 3.81 180) (length 2.54)
          (name "2Y" (effects (font (size 1.27 1.27))))
          (number "4" (effects (font (size 1.27 1.27))))
        )
        (pin input line (at -15.24 1.27 0) (length 2.54)
          (name "3A" (effects (font (size 1.27 1.27))))
          (number "5" (effects (font (size 1.27 1.27))))
        )
        (pin output line (at 16.51 1.27 180) (length 2.54)
          (name "3Y" (effects (font (size 1.27 1.27))))
          (number "6" (effects (font (size 1.27 1.27))))
        )
        (pin power_in line (at 0 -15.24 90) (length 2.54)
          (name "GND" (effects (font (size 1.27 1.27))))
          (number "7" (effects (font (size 1.27 1.27))))
        )
        (pin output line (at 16.51 -1.27 180) (length 2.54)
          (name "4Y" (effects (font (size 1.27 1.27))))
          (number "8" (effects (font (size 1.27 1.27))))
        )
        (pin input line (at -15.24 -1.27 0) (length 2.54)
          (name "4A" (effects (font (size 1.27 1.27))))
          (number "9" (effects (font (size 1.27 1.27))))
        )
      )
      (symbol "SN74AC04_0_1"
        (rectangle (start -12.7 12.7) (end 13.97 -12.7)
          (stroke (width 0) (type default) (color 0 0 0 0))
          (fill (type background))
        )
        (polyline
          (pts
            (xy 3.81 0)
            (xy 5.08 0)
          )
          (stroke (width 0) (type default) (color 0 0 0 0))
          (fill (type none))
        )
        (polyline
          (pts
            (xy -5.08 0)
            (xy -2.54 0)
            (xy -2.54 2.54)
            (xy 2.54 0)
            (xy -2.54 -2.54)
            (xy -2.54 0)
          )
          (stroke (width 0) (type default) (color 0 0 0 0))
          (fill (type none))
        )
        (circle (center 3.175 0) (radius 0.635)
          (stroke (width 0) (type default) (color 0 0 0 0))
          (fill (type none))
        )
      )
    )
    (symbol "POWDER_Digital:TXU0104PW" (in_bom yes) (on_board yes)
      (property "Reference" "U" (id 0) (at 0 13.97 0)
        (effects (font (size 1.27 1.27)))
      )
      (property "Value" "TXU0104PW" (id 1) (at 0 5.08 0)
        (effects (font (size 1.27 1.27)))
      )
      (property "Footprint" "Package_SO:TSSOP-14_4.4x5mm_P0.65mm" (id 2) (at 0 -25.4 0)
        (effects (font (size 1.27 1.27)) hide)
      )
      (property "Datasheet" "" (id 3) (at -15.24 3.81 0)
        (effects (font (size 1.27 1.27)) hide)
      )
      (property "ki_description" "4-Bit Fixed Direction Voltage-Level Translator with Schmitt-Trigger Inputs and 3-State Outputs" (id 4) (at 0 0 0)
        (effects (font (size 1.27 1.27)) hide)
      )
      (symbol "TXU0104PW_0_0"
        (pin power_in line (at -6.35 15.24 270) (length 2.54)
          (name "VCCA" (effects (font (size 1.27 1.27))))
          (number "1" (effects (font (size 1.27 1.27))))
        )
        (pin output line (at 15.24 -3.81 180) (length 2.54)
          (name "B4Y" (effects (font (size 1.27 1.27))))
          (number "10" (effects (font (size 1.27 1.27))))
        )
        (pin output line (at 15.24 -1.27 180) (length 2.54)
          (name "B3Y" (effects (font (size 1.27 1.27))))
          (number "11" (effects (font (size 1.27 1.27))))
        )
        (pin output line (at 15.24 1.27 180) (length 2.54)
          (name "B2Y" (effects (font (size 1.27 1.27))))
          (number "12" (effects (font (size 1.27 1.27))))
        )
        (pin output line (at 15.24 3.81 180) (length 2.54)
          (name "B1Y" (effects (font (size 1.27 1.27))))
          (number "13" (effects (font (size 1.27 1.27))))
        )
        (pin power_in line (at 6.35 15.24 270) (length 2.54)
          (name "VCCB" (effects (font (size 1.27 1.27))))
          (number "14" (effects (font (size 1.27 1.27))))
        )
        (pin input line (at -15.24 3.81 0) (length 2.54)
          (name "A1" (effects (font (size 1.27 1.27))))
          (number "2" (effects (font (size 1.27 1.27))))
        )
        (pin input line (at -15.24 1.27 0) (length 2.54)
          (name "A2" (effects (font (size 1.27 1.27))))
          (number "3" (effects (font (size 1.27 1.27))))
        )
        (pin input line (at -15.24 -1.27 0) (length 2.54)
          (name "A3" (effects (font (size 1.27 1.27))))
          (number "4" (effects (font (size 1.27 1.27))))
        )
        (pin input line (at -15.24 -3.81 0) (length 2.54)
          (name "A4" (effects (font (size 1.27 1.27))))
          (number "5" (effects (font (size 1.27 1.27))))
        )
        (pin no_connect line (at -15.24 -8.89 0) (length 2.54) hide
          (name "" (effects (font (size 1.27 1.27))))
          (number "6" (effects (font (size 1.27 1.27))))
        )
        (pin power_in line (at 0 -15.24 90) (length 2.54)
          (name "GND" (effects (font (size 1.27 1.27))))
          (number "7" (effects (font (size 1.27 1.27))))
        )
        (pin input line (at -15.24 8.89 0) (length 2.54)
          (name "OE" (effects (font (size 1.27 1.27))))
          (number "8" (effects (font (size 1.27 1.27))))
        )
        (pin no_connect line (at -15.24 -11.43 0) (length 2.54) hide
          (name "" (effects (font (size 1.27 1.27))))
          (number "9" (effects (font (size 1.27 1.27))))
        )
      )
      (symbol "TXU0104PW_0_1"
        (rectangle (start -12.7 12.7) (end 12.7 -12.7)
          (stroke (width 0) (type default) (color 0 0 0 0))
          (fill (type background))
        )
        (polyline
          (pts
            (xy 2.54 0)
            (xy 5.08 0)
          )
          (stroke (width 0) (type default) (color 0 0 0 0))
          (fill (type none))
        )
        (polyline
          (pts
            (xy -5.08 0)
            (xy -2.54 0)
            (xy -2.54 2.54)
            (xy 2.54 0)
            (xy -2.54 -2.54)
            (xy -2.54 0)
          )
          (stroke (width 0) (type default) (color 0 0 0 0))
          (fill (type none))
        )
      )
    )
    (symbol "POWDER_PowerGlobals:+2.5VDIGRF" (power) (pin_names (offset 0)) (in_bom yes) (on_board yes)
      (property "Reference" "#PWR" (id 0) (at 0 -3.81 0)
        (effects (font (size 1.27 1.27)) hide)
      )
      (property "Value" "+2.5VDIGRF" (id 1) (at 0 3.556 0)
        (effects (font (size 1.27 1.27)))
      )
      (property "Footprint" "" (id 2) (at 0 0 0)
        (effects (font (size 1.27 1.27)) hide)
      )
      (property "Datasheet" "" (id 3) (at 0 0 0)
        (effects (font (size 1.27 1.27)) hide)
      )
      (property "ki_keywords" "power-flag" (id 4) (at 0 0 0)
        (effects (font (size 1.27 1.27)) hide)
      )
      (property "ki_description" "Power symbol creates a global label with name \"+2.5VRFDIGRF\"" (id 5) (at 0 0 0)
        (effects (font (size 1.27 1.27)) hide)
      )
      (symbol "+2.5VDIGRF_0_1"
        (polyline
          (pts
            (xy -0.762 1.27)
            (xy 0 2.54)
          )
          (stroke (width 0) (type default) (color 0 0 0 0))
          (fill (type none))
        )
        (polyline
          (pts
            (xy 0 0)
            (xy 0 2.54)
          )
          (stroke (width 0) (type default) (color 0 0 0 0))
          (fill (type none))
        )
        (polyline
          (pts
            (xy 0 2.54)
            (xy 0.762 1.27)
          )
          (stroke (width 0) (type default) (color 0 0 0 0))
          (fill (type none))
        )
      )
      (symbol "+2.5VDIGRF_1_1"
        (pin power_in line (at 0 0 90) (length 0) hide
          (name "+2V5DIGRF" (effects (font (size 1.27 1.27))))
          (number "1" (effects (font (size 1.27 1.27))))
        )
      )
    )
    (symbol "POWDER_PowerGlobals:V_LNA" (power) (pin_names (offset 0)) (in_bom yes) (on_board yes)
      (property "Reference" "#PWR" (id 0) (at 0 -3.81 0)
        (effects (font (size 1.27 1.27)) hide)
      )
      (property "Value" "V_LNA" (id 1) (at 0 3.556 0)
        (effects (font (size 1.27 1.27)))
      )
      (property "Footprint" "" (id 2) (at 0 0 0)
        (effects (font (size 1.27 1.27)) hide)
      )
      (property "Datasheet" "" (id 3) (at 0 0 0)
        (effects (font (size 1.27 1.27)) hide)
      )
      (property "ki_keywords" "power-flag" (id 4) (at 0 0 0)
        (effects (font (size 1.27 1.27)) hide)
      )
      (property "ki_description" "Power symbol creates a global label with name \"V_LNA\"" (id 5) (at 0 0 0)
        (effects (font (size 1.27 1.27)) hide)
      )
      (symbol "V_LNA_0_1"
        (polyline
          (pts
            (xy -0.762 1.27)
            (xy 0 2.54)
          )
          (stroke (width 0) (type default) (color 0 0 0 0))
          (fill (type none))
        )
        (polyline
          (pts
            (xy 0 0)
            (xy 0 2.54)
          )
          (stroke (width 0) (type default) (color 0 0 0 0))
          (fill (type none))
        )
        (polyline
          (pts
            (xy 0 2.54)
            (xy 0.762 1.27)
          )
          (stroke (width 0) (type default) (color 0 0 0 0))
          (fill (type none))
        )
      )
      (symbol "V_LNA_1_1"
        (pin power_in line (at 0 0 90) (length 0) hide
          (name "V_LNA" (effects (font (size 1.27 1.27))))
          (number "1" (effects (font (size 1.27 1.27))))
        )
      )
    )
    (symbol "power:GND" (power) (pin_names (offset 0)) (in_bom yes) (on_board yes)
      (property "Reference" "#PWR" (id 0) (at 0 -6.35 0)
        (effects (font (size 1.27 1.27)) hide)
      )
      (property "Value" "GND" (id 1) (at 0 -3.81 0)
        (effects (font (size 1.27 1.27)))
      )
      (property "Footprint" "" (id 2) (at 0 0 0)
        (effects (font (size 1.27 1.27)) hide)
      )
      (property "Datasheet" "" (id 3) (at 0 0 0)
        (effects (font (size 1.27 1.27)) hide)
      )
      (property "ki_keywords" "power-flag" (id 4) (at 0 0 0)
        (effects (font (size 1.27 1.27)) hide)
      )
      (property "ki_description" "Power symbol creates a global label with name \"GND\" , ground" (id 5) (at 0 0 0)
        (effects (font (size 1.27 1.27)) hide)
      )
      (symbol "GND_0_1"
        (polyline
          (pts
            (xy 0 0)
            (xy 0 -1.27)
            (xy 1.27 -1.27)
            (xy 0 -2.54)
            (xy -1.27 -1.27)
            (xy 0 -1.27)
          )
          (stroke (width 0) (type default) (color 0 0 0 0))
          (fill (type none))
        )
      )
      (symbol "GND_1_1"
        (pin power_in line (at 0 0 270) (length 0) hide
          (name "GND" (effects (font (size 1.27 1.27))))
          (number "1" (effects (font (size 1.27 1.27))))
        )
      )
    )
    (symbol "power:PWR_FLAG" (power) (pin_numbers hide) (pin_names (offset 0) hide) (in_bom yes) (on_board yes)
      (property "Reference" "#FLG" (id 0) (at 0 1.905 0)
        (effects (font (size 1.27 1.27)) hide)
      )
      (property "Value" "PWR_FLAG" (id 1) (at 0 3.81 0)
        (effects (font (size 1.27 1.27)))
      )
      (property "Footprint" "" (id 2) (at 0 0 0)
        (effects (font (size 1.27 1.27)) hide)
      )
      (property "Datasheet" "~" (id 3) (at 0 0 0)
        (effects (font (size 1.27 1.27)) hide)
      )
      (property "ki_keywords" "power-flag" (id 4) (at 0 0 0)
        (effects (font (size 1.27 1.27)) hide)
      )
      (property "ki_description" "Special symbol for telling ERC where power comes from" (id 5) (at 0 0 0)
        (effects (font (size 1.27 1.27)) hide)
      )
      (symbol "PWR_FLAG_0_0"
        (pin power_out line (at 0 0 90) (length 0)
          (name "pwr" (effects (font (size 1.27 1.27))))
          (number "1" (effects (font (size 1.27 1.27))))
        )
      )
      (symbol "PWR_FLAG_0_1"
        (polyline
          (pts
            (xy 0 0)
            (xy 0 1.27)
            (xy -1.016 1.905)
            (xy 0 2.54)
            (xy 1.016 1.905)
            (xy 0 1.27)
          )
          (stroke (width 0) (type default) (color 0 0 0 0))
          (fill (type none))
        )
      )
    )
  )

  (junction (at 139.7 44.45) (diameter 0) (color 0 0 0 0)
    (uuid 1e8f4714-c597-4fce-ba2d-ff6db4d012b6)
  )
  (junction (at 63.5 31.75) (diameter 0) (color 0 0 0 0)
    (uuid 5d9c8dd2-162c-462c-8d11-8595c300cca1)
  )
  (junction (at 228.6 69.85) (diameter 0) (color 0 0 0 0)
    (uuid 744f781b-f9df-42b5-98db-694e99e4eaad)
  )
  (junction (at 76.2 31.75) (diameter 0) (color 0 0 0 0)
    (uuid 7aa89797-1f0c-4555-b79f-3a5a7427b84d)
  )
  (junction (at 177.8 44.45) (diameter 0) (color 0 0 0 0)
    (uuid 7ad861b0-6186-4b28-83c8-321086ac22b3)
  )
  (junction (at 228.6 82.55) (diameter 0) (color 0 0 0 0)
    (uuid 8b480811-b452-4de8-bf2d-7b8db3397cdf)
  )
  (junction (at 196.85 38.1) (diameter 0) (color 0 0 0 0)
    (uuid 98a803dd-252a-4bb1-b4c6-1bf74aa33e02)
  )
  (junction (at 88.9 53.34) (diameter 0) (color 0 0 0 0)
    (uuid ac79f987-4332-4b07-9742-a01727344362)
  )
  (junction (at 187.96 107.95) (diameter 0) (color 0 0 0 0)
    (uuid b3b3c191-2d15-44c1-be9f-175df4869dcc)
  )
  (junction (at 127 44.45) (diameter 0) (color 0 0 0 0)
    (uuid c2dcb960-fde7-42fb-af23-9caacecf2a2b)
  )
  (junction (at 228.6 95.25) (diameter 0) (color 0 0 0 0)
    (uuid c730dd7e-267f-4cc0-abe2-e1b957ac1a6e)
  )
  (junction (at 260.35 76.2) (diameter 0) (color 0 0 0 0)
    (uuid cdbb99cc-2344-4a29-9f4b-a436519e60bd)
  )
  (junction (at 177.8 38.1) (diameter 0) (color 0 0 0 0)
    (uuid d48b24aa-6d0a-4881-a11d-f35fafbbe0b5)
  )
  (junction (at 260.35 63.5) (diameter 0) (color 0 0 0 0)
    (uuid e49161dc-efda-4bae-8e92-34163ba33403)
  )
  (junction (at 241.3 63.5) (diameter 0) (color 0 0 0 0)
    (uuid f0699019-d662-481c-8a7a-69f6e7d9a754)
  )
  (junction (at 50.8 31.75) (diameter 0) (color 0 0 0 0)
    (uuid f273fc96-ce77-46c0-87ae-917f7e0fa002)
  )
  (junction (at 200.66 107.95) (diameter 0) (color 0 0 0 0)
    (uuid f5740fac-72fb-4c89-8ba3-a3007302bc43)
  )
  (junction (at 184.15 38.1) (diameter 0) (color 0 0 0 0)
    (uuid f857edd3-f30a-4602-9d15-7a79650f2b7a)
  )
  (junction (at 165.1 44.45) (diameter 0) (color 0 0 0 0)
    (uuid fb041955-5a33-4c09-a328-a834a89e545b)
  )

  (no_connect (at 168.91 82.55) (uuid 82de63dd-ea1d-4ccc-98bf-981591de3aab))
  (no_connect (at 168.91 80.01) (uuid 82de63dd-ea1d-4ccc-98bf-981591de3aac))

  (bus_entry (at 57.15 72.39) (size 2.54 2.54)
    (stroke (width 0) (type default) (color 0 0 0 0))
    (uuid 00d9e1fc-6bc3-4f75-bc74-4c8c1cdbd819)
  )
  (bus_entry (at 57.15 69.85) (size 2.54 2.54)
    (stroke (width 0) (type default) (color 0 0 0 0))
    (uuid 04b74f23-1e84-4765-b7fb-e5c2ab48db94)
  )
  (bus_entry (at 57.15 74.93) (size 2.54 2.54)
    (stroke (width 0) (type default) (color 0 0 0 0))
    (uuid 5a3a7061-7418-431d-b9db-45a24b2e35d6)
  )
  (bus_entry (at 57.15 77.47) (size 2.54 2.54)
    (stroke (width 0) (type default) (color 0 0 0 0))
    (uuid 90ddedf4-e8b8-4266-bf32-de4357aba15b)
  )

  (bus (pts (xy 57.15 72.39) (xy 57.15 74.93))
    (stroke (width 0) (type default) (color 0 0 0 0))
    (uuid 00916a3d-ac9e-42dc-89ec-239812825754)
  )

  (wire (pts (xy 152.4 44.45) (xy 152.4 60.96))
    (stroke (width 0) (type default) (color 0 0 0 0))
    (uuid 0124821f-1141-426b-99f4-9405dbd36ba1)
  )
  (wire (pts (xy 130.81 81.28) (xy 130.81 97.79))
    (stroke (width 0) (type default) (color 0 0 0 0))
    (uuid 02070043-4a5a-4f20-b5fd-48d602828508)
  )
  (wire (pts (xy 173.99 77.47) (xy 173.99 107.95))
    (stroke (width 0) (type default) (color 0 0 0 0))
    (uuid 031f53f1-6171-4bdc-80cb-10f00321d512)
  )
  (wire (pts (xy 110.49 77.47) (xy 132.08 77.47))
    (stroke (width 0) (type default) (color 0 0 0 0))
    (uuid 06b23520-263e-437a-8cf5-a442614ed9a0)
  )
  (wire (pts (xy 127 72.39) (xy 127 69.85))
    (stroke (width 0) (type default) (color 0 0 0 0))
    (uuid 0c131a85-1b80-45a2-b63b-10684def3ba1)
  )
  (wire (pts (xy 59.69 80.01) (xy 80.01 80.01))
    (stroke (width 0) (type default) (color 0 0 0 0))
    (uuid 0c9f2b3d-41a3-46be-93b3-f3c60aae3ecf)
  )
  (wire (pts (xy 134.62 80.01) (xy 134.62 77.47))
    (stroke (width 0) (type default) (color 0 0 0 0))
    (uuid 0f629cc1-e83d-4dd5-abc9-a9305479c9ad)
  )
  (wire (pts (xy 129.54 74.93) (xy 129.54 72.39))
    (stroke (width 0) (type default) (color 0 0 0 0))
    (uuid 163deea9-b239-4072-9952-eb0f18500f81)
  )
  (wire (pts (xy 139.7 44.45) (xy 139.7 46.99))
    (stroke (width 0) (type default) (color 0 0 0 0))
    (uuid 17c34188-0be7-478a-aa7b-816d424f1c2f)
  )
  (wire (pts (xy 139.7 57.15) (xy 139.7 54.61))
    (stroke (width 0) (type default) (color 0 0 0 0))
    (uuid 190aca93-5632-4782-8e88-5bf227b53a32)
  )
  (wire (pts (xy 260.35 77.47) (xy 260.35 76.2))
    (stroke (width 0) (type default) (color 0 0 0 0))
    (uuid 1ba66038-b331-4d95-a4ae-09071c4ad1ff)
  )
  (wire (pts (xy 135.89 82.55) (xy 135.89 91.44))
    (stroke (width 0) (type default) (color 0 0 0 0))
    (uuid 1d643342-29ce-4e50-acdb-16966963aeb3)
  )
  (wire (pts (xy 168.91 69.85) (xy 176.53 69.85))
    (stroke (width 0) (type default) (color 0 0 0 0))
    (uuid 1ddc4c80-4bc6-4fea-8286-6bdff6878332)
  )
  (wire (pts (xy 208.28 95.25) (xy 228.6 95.25))
    (stroke (width 0) (type default) (color 0 0 0 0))
    (uuid 1e68edcb-1f3e-4f15-8877-11fa32648693)
  )
  (wire (pts (xy 194.31 69.85) (xy 196.85 69.85))
    (stroke (width 0) (type default) (color 0 0 0 0))
    (uuid 200c06d1-fe44-420d-95e5-0bf4f510abc7)
  )
  (wire (pts (xy 184.15 69.85) (xy 186.69 69.85))
    (stroke (width 0) (type default) (color 0 0 0 0))
    (uuid 20aa832d-f7ec-4c6e-ab0c-4e63e6768c02)
  )
  (wire (pts (xy 139.7 38.1) (xy 139.7 44.45))
    (stroke (width 0) (type default) (color 0 0 0 0))
    (uuid 23b91950-b6b2-4371-a837-1a8d342de363)
  )
  (wire (pts (xy 63.5 34.29) (xy 63.5 31.75))
    (stroke (width 0) (type default) (color 0 0 0 0))
    (uuid 26ec17cf-9da7-4a20-bba4-e3626a9eef9c)
  )
  (wire (pts (xy 173.99 107.95) (xy 187.96 107.95))
    (stroke (width 0) (type default) (color 0 0 0 0))
    (uuid 28346316-568d-4d09-a0fc-b0d7830cec78)
  )
  (wire (pts (xy 135.89 91.44) (xy 138.43 91.44))
    (stroke (width 0) (type default) (color 0 0 0 0))
    (uuid 28ca3437-021f-431c-8e56-1d9b2c46ab38)
  )
  (wire (pts (xy 184.15 25.4) (xy 184.15 27.94))
    (stroke (width 0) (type default) (color 0 0 0 0))
    (uuid 292f0535-296f-420a-8a77-3c9fb8ce6b4e)
  )
  (wire (pts (xy 203.2 82.55) (xy 205.74 82.55))
    (stroke (width 0) (type default) (color 0 0 0 0))
    (uuid 29de1144-6fee-42e0-aa35-fac4cb319a4d)
  )
  (wire (pts (xy 196.85 38.1) (xy 209.55 38.1))
    (stroke (width 0) (type default) (color 0 0 0 0))
    (uuid 2cba876a-8301-4c0f-b97c-a39938579cf7)
  )
  (wire (pts (xy 63.5 41.91) (xy 63.5 44.45))
    (stroke (width 0) (type default) (color 0 0 0 0))
    (uuid 30238f6a-98b7-46c3-9d36-ea00d3af018c)
  )
  (wire (pts (xy 110.49 80.01) (xy 134.62 80.01))
    (stroke (width 0) (type default) (color 0 0 0 0))
    (uuid 3792158f-ac5f-4575-b8e1-b7f38cf05170)
  )
  (wire (pts (xy 228.6 63.5) (xy 241.3 63.5))
    (stroke (width 0) (type default) (color 0 0 0 0))
    (uuid 38752a6f-5797-45f7-ad7c-7f3be8789fca)
  )
  (wire (pts (xy 152.4 91.44) (xy 152.4 93.98))
    (stroke (width 0) (type default) (color 0 0 0 0))
    (uuid 3886c840-284c-4a52-a726-885a948309b1)
  )
  (wire (pts (xy 137.16 80.01) (xy 135.89 80.01))
    (stroke (width 0) (type default) (color 0 0 0 0))
    (uuid 3b743b79-7f9c-4058-b13a-9a329497d47d)
  )
  (wire (pts (xy 200.66 107.95) (xy 200.66 120.65))
    (stroke (width 0) (type default) (color 0 0 0 0))
    (uuid 3d0dd74b-94dd-49dd-8283-cabde6cb7f8c)
  )
  (wire (pts (xy 63.5 31.75) (xy 76.2 31.75))
    (stroke (width 0) (type default) (color 0 0 0 0))
    (uuid 3ea6e843-3d67-46d5-b9d8-9375e79f2c3a)
  )
  (wire (pts (xy 132.08 74.93) (xy 137.16 74.93))
    (stroke (width 0) (type default) (color 0 0 0 0))
    (uuid 42e531c9-8fac-4b8f-8d89-d402abd1f810)
  )
  (wire (pts (xy 38.1 34.29) (xy 38.1 31.75))
    (stroke (width 0) (type default) (color 0 0 0 0))
    (uuid 45cb5d70-6263-46d4-9ae8-3cc80e27e9c3)
  )
  (wire (pts (xy 138.43 91.44) (xy 138.43 97.79))
    (stroke (width 0) (type default) (color 0 0 0 0))
    (uuid 48010fac-4d21-4f7a-87b1-a331f5633c35)
  )
  (bus (pts (xy 57.15 50.8) (xy 57.15 69.85))
    (stroke (width 0) (type default) (color 0 0 0 0))
    (uuid 4890b6cd-b37a-46d6-88bb-40c1ab91aab1)
  )

  (wire (pts (xy 228.6 82.55) (xy 228.6 69.85))
    (stroke (width 0) (type default) (color 0 0 0 0))
    (uuid 4f65ad9c-d662-4621-8dfd-9a52c299d016)
  )
  (wire (pts (xy 76.2 41.91) (xy 76.2 44.45))
    (stroke (width 0) (type default) (color 0 0 0 0))
    (uuid 4fe6348b-6b59-4045-ab32-76a07903faa5)
  )
  (wire (pts (xy 209.55 50.8) (xy 209.55 48.26))
    (stroke (width 0) (type default) (color 0 0 0 0))
    (uuid 56857431-cbe3-4165-bd6b-6c222e8417c4)
  )
  (bus (pts (xy 57.15 50.8) (xy 31.75 50.8))
    (stroke (width 0) (type default) (color 0 0 0 0))
    (uuid 57a5dc79-0bab-4785-a24d-df8290cb4f70)
  )

  (wire (pts (xy 59.69 77.47) (xy 80.01 77.47))
    (stroke (width 0) (type default) (color 0 0 0 0))
    (uuid 581d0a1e-31be-4541-8c24-25d8e9037e14)
  )
  (wire (pts (xy 127 69.85) (xy 137.16 69.85))
    (stroke (width 0) (type default) (color 0 0 0 0))
    (uuid 5ecf0db0-e8d3-4e97-beed-89af4a8f978f)
  )
  (wire (pts (xy 177.8 46.99) (xy 177.8 44.45))
    (stroke (width 0) (type default) (color 0 0 0 0))
    (uuid 5edc8484-6f37-4ebb-867c-dd0c8671357f)
  )
  (wire (pts (xy 209.55 38.1) (xy 209.55 40.64))
    (stroke (width 0) (type default) (color 0 0 0 0))
    (uuid 64175629-86e9-401d-a71e-ee7881531eb9)
  )
  (wire (pts (xy 134.62 77.47) (xy 137.16 77.47))
    (stroke (width 0) (type default) (color 0 0 0 0))
    (uuid 689ae71e-005b-4ba2-9997-57560d14a1f2)
  )
  (wire (pts (xy 198.12 107.95) (xy 200.66 107.95))
    (stroke (width 0) (type default) (color 0 0 0 0))
    (uuid 6e644b55-c9bb-44b8-a4da-70d04b53b149)
  )
  (wire (pts (xy 129.54 72.39) (xy 137.16 72.39))
    (stroke (width 0) (type default) (color 0 0 0 0))
    (uuid 70b43717-21d8-4261-b0ba-4674d48be1e1)
  )
  (wire (pts (xy 135.89 80.01) (xy 135.89 81.28))
    (stroke (width 0) (type default) (color 0 0 0 0))
    (uuid 7108af15-c663-4e86-b621-17e36357b816)
  )
  (wire (pts (xy 137.16 82.55) (xy 135.89 82.55))
    (stroke (width 0) (type default) (color 0 0 0 0))
    (uuid 7421e9e3-b1e6-4bfc-a42e-88b5d1f09bfb)
  )
  (wire (pts (xy 135.89 81.28) (xy 130.81 81.28))
    (stroke (width 0) (type default) (color 0 0 0 0))
    (uuid 771a131e-6ea9-4d33-9d26-7bb81ab312f4)
  )
  (wire (pts (xy 177.8 44.45) (xy 165.1 44.45))
    (stroke (width 0) (type default) (color 0 0 0 0))
    (uuid 78bd591d-fb2f-4a7b-808c-ed730a997a4c)
  )
  (wire (pts (xy 196.85 48.26) (xy 196.85 50.8))
    (stroke (width 0) (type default) (color 0 0 0 0))
    (uuid 7abf2eee-0ae1-4bee-9d5d-bcc43439c3a9)
  )
  (wire (pts (xy 177.8 57.15) (xy 177.8 54.61))
    (stroke (width 0) (type default) (color 0 0 0 0))
    (uuid 7bfd9790-f5f9-4fbd-a3fc-bc5fd8fc614f)
  )
  (wire (pts (xy 207.01 69.85) (xy 204.47 69.85))
    (stroke (width 0) (type default) (color 0 0 0 0))
    (uuid 7f06a6f4-4b8c-4eef-9cd7-3b57d8060de9)
  )
  (wire (pts (xy 187.96 107.95) (xy 187.96 120.65))
    (stroke (width 0) (type default) (color 0 0 0 0))
    (uuid 7f9dc05b-448d-4f30-b2fa-c54c71f4572f)
  )
  (wire (pts (xy 76.2 67.31) (xy 80.01 67.31))
    (stroke (width 0) (type default) (color 0 0 0 0))
    (uuid 7fee5f67-e09a-4d77-b23d-43a972ee6196)
  )
  (wire (pts (xy 165.1 44.45) (xy 152.4 44.45))
    (stroke (width 0) (type default) (color 0 0 0 0))
    (uuid 8291b016-201f-409e-9a8a-e466ebbb9b6e)
  )
  (wire (pts (xy 228.6 82.55) (xy 228.6 95.25))
    (stroke (width 0) (type default) (color 0 0 0 0))
    (uuid 8296dad9-085b-445c-856a-e4eb7101b1f1)
  )
  (wire (pts (xy 50.8 31.75) (xy 63.5 31.75))
    (stroke (width 0) (type default) (color 0 0 0 0))
    (uuid 843ebfdd-e904-4de3-b7a5-f12c24c44de1)
  )
  (wire (pts (xy 175.26 95.25) (xy 200.66 95.25))
    (stroke (width 0) (type default) (color 0 0 0 0))
    (uuid 8b048c66-8a00-413e-900c-a5dda0691147)
  )
  (wire (pts (xy 177.8 38.1) (xy 184.15 38.1))
    (stroke (width 0) (type default) (color 0 0 0 0))
    (uuid 9242f6da-5339-4690-81cd-00b617512f15)
  )
  (wire (pts (xy 241.3 63.5) (xy 241.3 66.04))
    (stroke (width 0) (type default) (color 0 0 0 0))
    (uuid 9247987c-d7ca-495f-8628-02b23339e092)
  )
  (wire (pts (xy 50.8 41.91) (xy 50.8 44.45))
    (stroke (width 0) (type default) (color 0 0 0 0))
    (uuid 94cdb4b7-7724-4953-a4b0-776ea2af7a73)
  )
  (wire (pts (xy 76.2 25.4) (xy 76.2 31.75))
    (stroke (width 0) (type default) (color 0 0 0 0))
    (uuid 94f4f710-4b55-4782-a6d9-9f7dd25572ec)
  )
  (wire (pts (xy 127 44.45) (xy 127 46.99))
    (stroke (width 0) (type default) (color 0 0 0 0))
    (uuid 97325f53-dcf9-42d1-a150-e78e948211d8)
  )
  (wire (pts (xy 184.15 35.56) (xy 184.15 38.1))
    (stroke (width 0) (type default) (color 0 0 0 0))
    (uuid 97f1031a-9460-4272-947a-a3852b7ebe2e)
  )
  (wire (pts (xy 88.9 60.96) (xy 88.9 53.34))
    (stroke (width 0) (type default) (color 0 0 0 0))
    (uuid 9a1e1c09-5dbe-4220-b327-c29e79d221d4)
  )
  (wire (pts (xy 184.15 38.1) (xy 196.85 38.1))
    (stroke (width 0) (type default) (color 0 0 0 0))
    (uuid 9c0af16b-f4c8-4386-9327-ff63574e87ff)
  )
  (wire (pts (xy 50.8 34.29) (xy 50.8 31.75))
    (stroke (width 0) (type default) (color 0 0 0 0))
    (uuid 9dcfa1d1-6a4e-4484-a58e-2a140b1f76e2)
  )
  (wire (pts (xy 187.96 107.95) (xy 190.5 107.95))
    (stroke (width 0) (type default) (color 0 0 0 0))
    (uuid 9f7c8037-f363-4f60-99ec-ab7d2323bc42)
  )
  (wire (pts (xy 214.63 69.85) (xy 228.6 69.85))
    (stroke (width 0) (type default) (color 0 0 0 0))
    (uuid a0427b51-de07-4bb0-a7a3-1e365c0dee99)
  )
  (wire (pts (xy 260.35 76.2) (xy 266.7 76.2))
    (stroke (width 0) (type default) (color 0 0 0 0))
    (uuid a0bf0ea4-9a69-4357-9481-bee730a883ad)
  )
  (bus (pts (xy 57.15 74.93) (xy 57.15 77.47))
    (stroke (width 0) (type default) (color 0 0 0 0))
    (uuid a0c2fc42-848a-47f0-aebd-b86448d52ad7)
  )

  (wire (pts (xy 260.35 85.09) (xy 260.35 88.9))
    (stroke (width 0) (type default) (color 0 0 0 0))
    (uuid a29dde6d-be16-486e-9d09-82812fcc4eb8)
  )
  (wire (pts (xy 139.7 38.1) (xy 177.8 38.1))
    (stroke (width 0) (type default) (color 0 0 0 0))
    (uuid a2c0334a-d9df-4bed-8543-a1670b37c9c5)
  )
  (wire (pts (xy 76.2 53.34) (xy 88.9 53.34))
    (stroke (width 0) (type default) (color 0 0 0 0))
    (uuid a4073a7a-a0e0-4dfe-9563-988ac2deed34)
  )
  (wire (pts (xy 127 54.61) (xy 127 57.15))
    (stroke (width 0) (type default) (color 0 0 0 0))
    (uuid a586172c-56a9-45d2-954d-e285e20297de)
  )
  (wire (pts (xy 260.35 76.2) (xy 260.35 74.93))
    (stroke (width 0) (type default) (color 0 0 0 0))
    (uuid a59b3d6e-9f19-44d5-921d-8cf9f37a1420)
  )
  (wire (pts (xy 165.1 54.61) (xy 165.1 57.15))
    (stroke (width 0) (type default) (color 0 0 0 0))
    (uuid a5d689e8-fbea-451f-8af3-22dd2b75ad9f)
  )
  (wire (pts (xy 196.85 40.64) (xy 196.85 38.1))
    (stroke (width 0) (type default) (color 0 0 0 0))
    (uuid a69e1420-cc47-4c61-b065-f614949f1746)
  )
  (wire (pts (xy 175.26 95.25) (xy 175.26 74.93))
    (stroke (width 0) (type default) (color 0 0 0 0))
    (uuid a806ffdc-3974-458b-9dd2-e4042528d816)
  )
  (wire (pts (xy 110.49 74.93) (xy 129.54 74.93))
    (stroke (width 0) (type default) (color 0 0 0 0))
    (uuid a993fb95-5d22-4a01-9031-04190d6670bb)
  )
  (wire (pts (xy 76.2 31.75) (xy 76.2 34.29))
    (stroke (width 0) (type default) (color 0 0 0 0))
    (uuid a9c9a5be-1413-4b86-8662-301da76a1522)
  )
  (wire (pts (xy 38.1 41.91) (xy 38.1 44.45))
    (stroke (width 0) (type default) (color 0 0 0 0))
    (uuid a9d5a461-1e04-4e2c-a615-0cfdc645f6c3)
  )
  (wire (pts (xy 76.2 55.88) (xy 76.2 53.34))
    (stroke (width 0) (type default) (color 0 0 0 0))
    (uuid aac6433f-f6a7-4fbc-be45-b4c3af9d4262)
  )
  (wire (pts (xy 176.53 72.39) (xy 176.53 82.55))
    (stroke (width 0) (type default) (color 0 0 0 0))
    (uuid aae8fbbe-1302-48e7-97c5-5176db67c78f)
  )
  (wire (pts (xy 241.3 73.66) (xy 241.3 76.2))
    (stroke (width 0) (type default) (color 0 0 0 0))
    (uuid b19e404e-b635-4792-af04-3bdc4ff69d9f)
  )
  (wire (pts (xy 200.66 107.95) (xy 228.6 107.95))
    (stroke (width 0) (type default) (color 0 0 0 0))
    (uuid bb076bf5-001a-4719-b587-af21a89ea492)
  )
  (wire (pts (xy 130.81 105.41) (xy 130.81 107.95))
    (stroke (width 0) (type default) (color 0 0 0 0))
    (uuid bb9f2cca-e33f-4552-8673-d8c59002f335)
  )
  (wire (pts (xy 138.43 105.41) (xy 138.43 107.95))
    (stroke (width 0) (type default) (color 0 0 0 0))
    (uuid bbb29742-90d4-4f92-a925-2b26e84f618a)
  )
  (wire (pts (xy 198.12 120.65) (xy 200.66 120.65))
    (stroke (width 0) (type default) (color 0 0 0 0))
    (uuid bf2af2cd-0596-4a77-b577-f274da8243c2)
  )
  (wire (pts (xy 59.69 72.39) (xy 80.01 72.39))
    (stroke (width 0) (type default) (color 0 0 0 0))
    (uuid bf4f2ed1-12b5-4a33-ac3f-aa30cf47330b)
  )
  (wire (pts (xy 176.53 82.55) (xy 195.58 82.55))
    (stroke (width 0) (type default) (color 0 0 0 0))
    (uuid c224f043-5314-4844-9019-e2d707edce83)
  )
  (wire (pts (xy 175.26 74.93) (xy 168.91 74.93))
    (stroke (width 0) (type default) (color 0 0 0 0))
    (uuid c3101250-469b-4bce-a2a9-7c91a0debc4a)
  )
  (wire (pts (xy 213.36 82.55) (xy 228.6 82.55))
    (stroke (width 0) (type default) (color 0 0 0 0))
    (uuid c5187787-579f-4e6d-a580-3837d87316b7)
  )
  (wire (pts (xy 95.25 91.44) (xy 95.25 93.98))
    (stroke (width 0) (type default) (color 0 0 0 0))
    (uuid c561b233-3022-4063-b8b2-f14e493cacc5)
  )
  (wire (pts (xy 127 44.45) (xy 139.7 44.45))
    (stroke (width 0) (type default) (color 0 0 0 0))
    (uuid c5bfa2ba-30f6-461d-9426-6044929faa3f)
  )
  (wire (pts (xy 110.49 72.39) (xy 127 72.39))
    (stroke (width 0) (type default) (color 0 0 0 0))
    (uuid c82c44bd-c4df-48ee-8437-c500a3892d71)
  )
  (wire (pts (xy 177.8 35.56) (xy 177.8 38.1))
    (stroke (width 0) (type default) (color 0 0 0 0))
    (uuid caa7d029-6ee4-48df-a654-3b8f7bbe1a22)
  )
  (wire (pts (xy 88.9 53.34) (xy 88.9 31.75))
    (stroke (width 0) (type default) (color 0 0 0 0))
    (uuid cde690ca-40cc-450d-a976-bf427e19358a)
  )
  (wire (pts (xy 260.35 63.5) (xy 260.35 67.31))
    (stroke (width 0) (type default) (color 0 0 0 0))
    (uuid ce1c526b-294c-4a7e-8c6c-324ab7752f54)
  )
  (wire (pts (xy 241.3 63.5) (xy 260.35 63.5))
    (stroke (width 0) (type default) (color 0 0 0 0))
    (uuid d0226fc4-dff1-4bd6-9901-1d15f51ab091)
  )
  (wire (pts (xy 260.35 63.5) (xy 266.7 63.5))
    (stroke (width 0) (type default) (color 0 0 0 0))
    (uuid d2ccf856-3c28-4639-9904-f5b5a5deee30)
  )
  (wire (pts (xy 132.08 77.47) (xy 132.08 74.93))
    (stroke (width 0) (type default) (color 0 0 0 0))
    (uuid d60bead8-f769-49f9-b8c7-5c29b763e5b2)
  )
  (bus (pts (xy 57.15 69.85) (xy 57.15 72.39))
    (stroke (width 0) (type default) (color 0 0 0 0))
    (uuid e01a27d8-9686-483c-a0e8-872611e4e9f7)
  )

  (wire (pts (xy 165.1 44.45) (xy 165.1 46.99))
    (stroke (width 0) (type default) (color 0 0 0 0))
    (uuid e04449fa-714b-40f0-a5b8-1a304bf410f0)
  )
  (wire (pts (xy 59.69 74.93) (xy 80.01 74.93))
    (stroke (width 0) (type default) (color 0 0 0 0))
    (uuid e10fbedd-3a8a-420c-a7e9-c16490b6105c)
  )
  (wire (pts (xy 228.6 95.25) (xy 228.6 107.95))
    (stroke (width 0) (type default) (color 0 0 0 0))
    (uuid e35c3f57-f966-473d-9e30-8b4105667d05)
  )
  (wire (pts (xy 76.2 63.5) (xy 76.2 67.31))
    (stroke (width 0) (type default) (color 0 0 0 0))
    (uuid e3a19d3a-92ed-467b-9036-9077bcd2efcf)
  )
  (wire (pts (xy 101.6 60.96) (xy 101.6 44.45))
    (stroke (width 0) (type default) (color 0 0 0 0))
    (uuid ed7e7648-53e7-471b-9efe-d5e629c7485c)
  )
  (wire (pts (xy 168.91 72.39) (xy 176.53 72.39))
    (stroke (width 0) (type default) (color 0 0 0 0))
    (uuid edcce251-e20d-4739-8834-ff8ab7f30fe8)
  )
  (wire (pts (xy 228.6 69.85) (xy 228.6 63.5))
    (stroke (width 0) (type default) (color 0 0 0 0))
    (uuid f03b3308-dc9c-4648-8fd0-9f72cf552434)
  )
  (wire (pts (xy 168.91 77.47) (xy 173.99 77.47))
    (stroke (width 0) (type default) (color 0 0 0 0))
    (uuid f18a5fd2-df63-41e1-b3db-4d2e8de146a8)
  )
  (wire (pts (xy 101.6 44.45) (xy 127 44.45))
    (stroke (width 0) (type default) (color 0 0 0 0))
    (uuid f1b880c4-28fb-44ac-98c7-bbe444ead6df)
  )
  (wire (pts (xy 190.5 120.65) (xy 187.96 120.65))
    (stroke (width 0) (type default) (color 0 0 0 0))
    (uuid f4643f0a-5527-46d1-90c8-57f52b4cac44)
  )
  (wire (pts (xy 88.9 31.75) (xy 76.2 31.75))
    (stroke (width 0) (type default) (color 0 0 0 0))
    (uuid f6f7df81-93aa-4c1e-9371-cd8fb707432f)
  )
  (wire (pts (xy 177.8 38.1) (xy 177.8 44.45))
    (stroke (width 0) (type default) (color 0 0 0 0))
    (uuid f7a824a4-d694-43ce-84dc-6b2b1e8e7afb)
  )
  (wire (pts (xy 38.1 31.75) (xy 50.8 31.75))
    (stroke (width 0) (type default) (color 0 0 0 0))
    (uuid f8801611-2615-45c0-ac97-a2441f983e4d)
  )

  (label "lna_b0" (at 171.45 69.85 0)
    (effects (font (size 1.27 1.27)) (justify left bottom))
    (uuid 09e0774a-f8db-4de2-9617-b0f49e1a5485)
  )
  (label "LNA_BIAS_IN3" (at 60.96 80.01 0)
    (effects (font (size 1.27 1.27)) (justify left bottom))
    (uuid 10ee0fef-0cc2-4192-b937-83c013a56d32)
  )
  (label "lba_b0_2" (at 195.58 69.85 270)
    (effects (font (size 1.27 1.27)) (justify right bottom))
    (uuid 18fe16dd-10f6-4efd-9c1b-88477368c1c4)
  )
  (label "BM0" (at 114.3 72.39 0)
    (effects (font (size 1.27 1.27)) (justify left bottom))
    (uuid 1c4939bb-a77b-435f-a26d-f76202ef4fd5)
  )
  (label "UC2" (at 138.43 93.98 0)
    (effects (font (size 1.27 1.27)) (justify left bottom))
    (uuid 3c385bae-6be9-4890-a9ea-46593b71adf7)
  )
  (label "LNA_BIAS_IN0" (at 60.96 72.39 0)
    (effects (font (size 1.27 1.27)) (justify left bottom))
    (uuid 5bca75ab-3def-4ff1-a4d8-472528ddfeca)
  )
  (label "lba_b0_3" (at 205.74 69.85 270)
    (effects (font (size 1.27 1.27)) (justify right bottom))
    (uuid 644d1b0c-2b9f-4b2f-85da-5398814dc055)
  )
  (label "LNA_BIAS_IN2" (at 60.96 77.47 0)
    (effects (font (size 1.27 1.27)) (justify left bottom))
    (uuid 6d235369-598c-4623-8d45-f89d68d5736f)
  )
  (label "lba_b0_1" (at 185.42 69.85 270)
    (effects (font (size 1.27 1.27)) (justify right bottom))
    (uuid 7eb41dc9-f892-4458-9277-e88efd2963ea)
  )
  (label "BM2" (at 114.3 77.47 0)
    (effects (font (size 1.27 1.27)) (justify left bottom))
    (uuid 83332a23-aac1-405b-bc97-97f164ab48e3)
  )
  (label "V_F_BIAS" (at 189.23 38.1 0)
    (effects (font (size 1.27 1.27)) (justify left bottom))
    (uuid 88f2b625-b94d-456a-a8b1-758a399554d5)
  )
  (label "UC1" (at 130.81 88.9 0)
    (effects (font (size 1.27 1.27)) (justify left bottom))
    (uuid bae65f42-34b5-4b5b-927c-03d65369c16d)
  )
  (label "LNA_BIAS_IN1" (at 60.96 74.93 0)
    (effects (font (size 1.27 1.27)) (justify left bottom))
    (uuid c14b2f40-2396-4489-ad89-63b4f18f79b0)
  )
  (label "BM1" (at 114.3 74.93 0)
    (effects (font (size 1.27 1.27)) (justify left bottom))
    (uuid c2740474-7596-4145-88ea-de22431a12c1)
  )
  (label "BM3" (at 114.3 80.01 0)
    (effects (font (size 1.27 1.27)) (justify left bottom))
    (uuid d420d0c6-5c8c-4b26-ab92-9c8da010f19f)
  )
  (label "lba_b1_1" (at 204.47 82.55 270)
    (effects (font (size 1.27 1.27)) (justify right bottom))
    (uuid d4f3f206-94e3-41f9-ad77-2bca1d009e43)
  )
  (label "lna_b3" (at 181.61 107.95 0)
    (effects (font (size 1.27 1.27)) (justify left bottom))
    (uuid dcb37195-cb62-433a-94ca-43ce6a7a579d)
  )
  (label "lna_b1" (at 181.61 82.55 0)
    (effects (font (size 1.27 1.27)) (justify left bottom))
    (uuid e3f85e92-ba16-4c8e-8a76-f77fa20aed7d)
  )
  (label "lna_b2" (at 181.61 95.25 0)
    (effects (font (size 1.27 1.27)) (justify left bottom))
    (uuid ed01b202-b2ae-41be-9130-ead8f002e294)
  )

  (hierarchical_label "VSENSE_OUT" (shape output) (at 266.7 76.2 0)
    (effects (font (size 1.27 1.27)) (justify left))
    (uuid 7787d88b-19a1-47ac-9310-b2013c463e45)
  )
  (hierarchical_label "LNA_BIAS_IN[0..3]" (shape input) (at 31.75 50.8 180)
    (effects (font (size 1.27 1.27)) (justify right))
    (uuid 7e52c059-f8d8-44a6-b783-193f7d0cea94)
  )
  (hierarchical_label "LNA_BIAS_OUT" (shape output) (at 266.7 63.5 0)
    (effects (font (size 1.27 1.27)) (justify left))
    (uuid df7795f3-4fc6-4728-9b0c-654097f3ceea)
  )

  (symbol (lib_id "000_PreferredParts:C_10pF") (at 76.2 38.1 0) (unit 1)
    (in_bom yes) (on_board yes)
    (uuid 05ef1606-96a0-4700-a6a1-a3b5d5ddebb9)
    (property "Reference" "C811" (id 0) (at 79.121 36.9316 0)
      (effects (font (size 1.27 1.27)) (justify left))
    )
    (property "Value" "C_10pF" (id 1) (at 79.121 39.243 0)
      (effects (font (size 1.27 1.27)) (justify left))
    )
    (property "Footprint" "Capacitor_SMD:C_0402_1005Metric" (id 2) (at 77.1652 41.91 0)
      (effects (font (size 1.27 1.27)) hide)
    )
    (property "Datasheet" "~" (id 3) (at 76.2 38.1 0)
      (effects (font (size 1.27 1.27)) hide)
    )
    (property "PartSpecification" "3000-0000000582" (id 4) (at 76.2 38.1 0)
      (effects (font (size 1.27 1.27)) hide)
    )
    (pin "1" (uuid 2f975b96-c483-4a97-ac75-b1abcce50395))
    (pin "2" (uuid 1c403f03-f943-4348-9045-fbacde8788d5))
  )

  (symbol (lib_id "000_PreferredParts:C_1uF") (at 196.85 44.45 0) (unit 1)
    (in_bom yes) (on_board yes)
    (uuid 0b7f3a5d-efb1-4f6c-9427-3fdc87643b2e)
    (property "Reference" "C809" (id 0) (at 199.771 43.2816 0)
      (effects (font (size 1.27 1.27)) (justify left))
    )
    (property "Value" "C_1uF" (id 1) (at 199.771 45.593 0)
      (effects (font (size 1.27 1.27)) (justify left))
    )
    (property "Footprint" "Capacitor_SMD:C_0603_1608Metric" (id 2) (at 197.8152 48.26 0)
      (effects (font (size 1.27 1.27)) hide)
    )
    (property "Datasheet" "~" (id 3) (at 196.85 44.45 0)
      (effects (font (size 1.27 1.27)) hide)
    )
    (property "PartSpecification" "3000-0000000136" (id 4) (at 196.85 44.45 0)
      (effects (font (size 1.27 1.27)) hide)
    )
    (pin "1" (uuid 7569496a-e045-4d37-a297-754d13d4e2b4))
    (pin "2" (uuid 71c61016-fd03-46d8-b0fa-863809a1c071))
  )

  (symbol (lib_id "power:GND") (at 127 57.15 0) (unit 1)
    (in_bom yes) (on_board yes)
    (uuid 0eb94dae-82e1-4c29-ac17-2a586b9b79cd)
    (property "Reference" "#PWR0239" (id 0) (at 127 63.5 0)
      (effects (font (size 1.27 1.27)) hide)
    )
    (property "Value" "GND" (id 1) (at 127.127 61.5442 0))
    (property "Footprint" "" (id 2) (at 127 57.15 0)
      (effects (font (size 1.27 1.27)) hide)
    )
    (property "Datasheet" "" (id 3) (at 127 57.15 0)
      (effects (font (size 1.27 1.27)) hide)
    )
    (pin "1" (uuid 3903ea20-3f4c-455e-ad0d-1418c4debaa1))
  )

  (symbol (lib_id "Device:R") (at 200.66 69.85 270) (unit 1)
    (in_bom yes) (on_board yes)
    (uuid 12061c86-0454-4132-9d51-3b07c1693382)
    (property "Reference" "R808" (id 0) (at 201.8284 71.628 0)
      (effects (font (size 1.27 1.27)) (justify left))
    )
    (property "Value" "806" (id 1) (at 199.517 71.628 0)
      (effects (font (size 1.27 1.27)) (justify left))
    )
    (property "Footprint" "Resistor_SMD:R_0402_1005Metric" (id 2) (at 200.66 68.072 90)
      (effects (font (size 1.27 1.27)) hide)
    )
    (property "Datasheet" "~" (id 3) (at 200.66 69.85 0)
      (effects (font (size 1.27 1.27)) hide)
    )
    (property "Manufacturer" "Stackpole Electronics Inc" (id 4) (at 200.66 69.85 0)
      (effects (font (size 1.27 1.27)) hide)
    )
    (property "PartNumber" "" (id 5) (at 200.66 69.85 0)
      (effects (font (size 1.27 1.27)) hide)
    )
    (property "PartSpecification" "3000-0000001242" (id 6) (at 200.66 69.85 0)
      (effects (font (size 1.27 1.27)) hide)
    )
    (pin "1" (uuid 4f6af9d6-9aa2-4446-ba98-d0d6897b0fd3))
    (pin "2" (uuid 0e548827-e2b2-4c90-bc32-e122e12a1d3d))
  )

  (symbol (lib_id "Device:R") (at 209.55 82.55 270) (unit 1)
    (in_bom yes) (on_board yes)
    (uuid 1469c91c-7e7c-4156-be7c-0ac62f6c0266)
    (property "Reference" "R810" (id 0) (at 210.7184 84.328 0)
      (effects (font (size 1.27 1.27)) (justify left))
    )
    (property "Value" "806" (id 1) (at 208.407 84.328 0)
      (effects (font (size 1.27 1.27)) (justify left))
    )
    (property "Footprint" "Resistor_SMD:R_0402_1005Metric" (id 2) (at 209.55 80.772 90)
      (effects (font (size 1.27 1.27)) hide)
    )
    (property "Datasheet" "~" (id 3) (at 209.55 82.55 0)
      (effects (font (size 1.27 1.27)) hide)
    )
    (property "Manufacturer" "Stackpole Electronics Inc" (id 4) (at 209.55 82.55 0)
      (effects (font (size 1.27 1.27)) hide)
    )
    (property "PartNumber" "" (id 5) (at 209.55 82.55 0)
      (effects (font (size 1.27 1.27)) hide)
    )
    (property "PartSpecification" "3000-0000001242" (id 6) (at 209.55 82.55 0)
      (effects (font (size 1.27 1.27)) hide)
    )
    (pin "1" (uuid e54ff437-0e45-4e71-90aa-2e6aebb5f4ba))
    (pin "2" (uuid 7ce6a97c-993e-451c-8a6a-017841f7e16d))
  )

  (symbol (lib_id "000_PreferredParts:C_1uF") (at 38.1 38.1 0) (unit 1)
    (in_bom yes) (on_board yes)
    (uuid 1567a1e3-e37a-47bf-a1ac-f5b35f4ced2d)
    (property "Reference" "C804" (id 0) (at 41.021 36.9316 0)
      (effects (font (size 1.27 1.27)) (justify left))
    )
    (property "Value" "C_1uF" (id 1) (at 41.021 39.243 0)
      (effects (font (size 1.27 1.27)) (justify left))
    )
    (property "Footprint" "Capacitor_SMD:C_0603_1608Metric" (id 2) (at 39.0652 41.91 0)
      (effects (font (size 1.27 1.27)) hide)
    )
    (property "Datasheet" "~" (id 3) (at 38.1 38.1 0)
      (effects (font (size 1.27 1.27)) hide)
    )
    (property "PartSpecification" "3000-0000000136" (id 4) (at 38.1 38.1 0)
      (effects (font (size 1.27 1.27)) hide)
    )
    (pin "1" (uuid 5925ed8f-3adf-416c-a60e-d9a922f959a1))
    (pin "2" (uuid 57657671-ba41-4e23-8505-96e4c671d675))
  )

  (symbol (lib_id "power:GND") (at 95.25 93.98 0) (unit 1)
    (in_bom yes) (on_board yes)
    (uuid 1592651c-4f7b-4afd-9805-fd2ac1e25315)
    (property "Reference" "#PWR0226" (id 0) (at 95.25 100.33 0)
      (effects (font (size 1.27 1.27)) hide)
    )
    (property "Value" "GND" (id 1) (at 95.377 98.3742 0))
    (property "Footprint" "" (id 2) (at 95.25 93.98 0)
      (effects (font (size 1.27 1.27)) hide)
    )
    (property "Datasheet" "" (id 3) (at 95.25 93.98 0)
      (effects (font (size 1.27 1.27)) hide)
    )
    (pin "1" (uuid a24eb5c9-5b1d-4505-9b8d-a2977136d6e5))
  )

  (symbol (lib_id "Device:R") (at 190.5 69.85 270) (unit 1)
    (in_bom yes) (on_board yes)
    (uuid 185c1f81-a86e-4405-9524-ac9cc875d8c8)
    (property "Reference" "R804" (id 0) (at 191.6684 71.628 0)
      (effects (font (size 1.27 1.27)) (justify left))
    )
    (property "Value" "806" (id 1) (at 189.357 71.628 0)
      (effects (font (size 1.27 1.27)) (justify left))
    )
    (property "Footprint" "Resistor_SMD:R_0402_1005Metric" (id 2) (at 190.5 68.072 90)
      (effects (font (size 1.27 1.27)) hide)
    )
    (property "Datasheet" "~" (id 3) (at 190.5 69.85 0)
      (effects (font (size 1.27 1.27)) hide)
    )
    (property "Manufacturer" "Stackpole Electronics Inc" (id 4) (at 190.5 69.85 0)
      (effects (font (size 1.27 1.27)) hide)
    )
    (property "PartNumber" "" (id 5) (at 190.5 69.85 0)
      (effects (font (size 1.27 1.27)) hide)
    )
    (property "PartSpecification" "3000-0000001242" (id 6) (at 190.5 69.85 0)
      (effects (font (size 1.27 1.27)) hide)
    )
    (pin "1" (uuid fc090541-7d10-48e4-931f-ca81ce170a94))
    (pin "2" (uuid e6078d33-59e2-42f5-b90d-f1ab060ab460))
  )

  (symbol (lib_id "000_PreferredParts:C_1nF") (at 139.7 50.8 0) (unit 1)
    (in_bom yes) (on_board yes)
    (uuid 1b43cbd2-58ae-4d18-813a-399a077f9444)
    (property "Reference" "C806" (id 0) (at 142.621 49.6316 0)
      (effects (font (size 1.27 1.27)) (justify left))
    )
    (property "Value" "C_1nF" (id 1) (at 142.621 51.943 0)
      (effects (font (size 1.27 1.27)) (justify left))
    )
    (property "Footprint" "Capacitor_SMD:C_0402_1005Metric" (id 2) (at 140.6652 54.61 0)
      (effects (font (size 1.27 1.27)) hide)
    )
    (property "Datasheet" "~" (id 3) (at 139.7 50.8 0)
      (effects (font (size 1.27 1.27)) hide)
    )
    (property "PartSpecification" "3000-0000000128" (id 4) (at 139.7 50.8 0)
      (effects (font (size 1.27 1.27)) hide)
    )
    (pin "1" (uuid aebb7188-519e-49c8-bf8d-b3c5ca292cfd))
    (pin "2" (uuid 54207247-b3ca-4321-b478-375112bcfe90))
  )

  (symbol (lib_id "Device:R") (at 194.31 107.95 270) (unit 1)
    (in_bom yes) (on_board yes)
    (uuid 1eb0160a-ad56-48d6-bc85-62ff53c58e51)
    (property "Reference" "R805" (id 0) (at 195.4784 109.728 0)
      (effects (font (size 1.27 1.27)) (justify left))
    )
    (property "Value" "806" (id 1) (at 193.167 109.728 0)
      (effects (font (size 1.27 1.27)) (justify left))
    )
    (property "Footprint" "Resistor_SMD:R_0402_1005Metric" (id 2) (at 194.31 106.172 90)
      (effects (font (size 1.27 1.27)) hide)
    )
    (property "Datasheet" "~" (id 3) (at 194.31 107.95 0)
      (effects (font (size 1.27 1.27)) hide)
    )
    (property "Manufacturer" "Stackpole Electronics Inc" (id 4) (at 194.31 107.95 0)
      (effects (font (size 1.27 1.27)) hide)
    )
    (property "PartNumber" "" (id 5) (at 194.31 107.95 0)
      (effects (font (size 1.27 1.27)) hide)
    )
    (property "PartSpecification" "3000-0000001242" (id 6) (at 194.31 107.95 0)
      (effects (font (size 1.27 1.27)) hide)
    )
    (pin "1" (uuid e137ce29-3bb5-4f3a-b432-ab8cb41ba74e))
    (pin "2" (uuid 80ea1672-3b6f-457a-85b1-8162e4cfadb3))
  )

  (symbol (lib_id "power:GND") (at 241.3 76.2 0) (unit 1)
    (in_bom yes) (on_board yes)
    (uuid 2b503048-4ad8-4a90-9e21-a328e1b2a637)
    (property "Reference" "#PWR0242" (id 0) (at 241.3 82.55 0)
      (effects (font (size 1.27 1.27)) hide)
    )
    (property "Value" "GND" (id 1) (at 241.427 80.5942 0))
    (property "Footprint" "" (id 2) (at 241.3 76.2 0)
      (effects (font (size 1.27 1.27)) hide)
    )
    (property "Datasheet" "" (id 3) (at 241.3 76.2 0)
      (effects (font (size 1.27 1.27)) hide)
    )
    (pin "1" (uuid 5354fd09-e94a-4c84-ae10-beb35bd2373c))
  )

  (symbol (lib_id "power:GND") (at 165.1 57.15 0) (unit 1)
    (in_bom yes) (on_board yes)
    (uuid 31d81099-d7dd-4808-8381-5661ee2db680)
    (property "Reference" "#PWR0235" (id 0) (at 165.1 63.5 0)
      (effects (font (size 1.27 1.27)) hide)
    )
    (property "Value" "GND" (id 1) (at 165.227 61.5442 0))
    (property "Footprint" "" (id 2) (at 165.1 57.15 0)
      (effects (font (size 1.27 1.27)) hide)
    )
    (property "Datasheet" "" (id 3) (at 165.1 57.15 0)
      (effects (font (size 1.27 1.27)) hide)
    )
    (pin "1" (uuid 7cb47cec-4f6e-46e1-99da-b4ca0f8f4ded))
  )

  (symbol (lib_id "power:GND") (at 38.1 44.45 0) (unit 1)
    (in_bom yes) (on_board yes)
    (uuid 333b8249-9352-4dbd-a4a1-a4f6d1b41bb2)
    (property "Reference" "#PWR0229" (id 0) (at 38.1 50.8 0)
      (effects (font (size 1.27 1.27)) hide)
    )
    (property "Value" "GND" (id 1) (at 38.227 48.8442 0))
    (property "Footprint" "" (id 2) (at 38.1 44.45 0)
      (effects (font (size 1.27 1.27)) hide)
    )
    (property "Datasheet" "" (id 3) (at 38.1 44.45 0)
      (effects (font (size 1.27 1.27)) hide)
    )
    (pin "1" (uuid 911dcac7-7313-4902-a304-551b9cfe5827))
  )

  (symbol (lib_id "power:PWR_FLAG") (at 177.8 35.56 0) (unit 1)
    (in_bom yes) (on_board yes)
    (uuid 335165e8-d5ba-4890-9b28-6b8b992c0761)
    (property "Reference" "#FLG0106" (id 0) (at 177.8 33.655 0)
      (effects (font (size 1.27 1.27)) hide)
    )
    (property "Value" "PWR_FLAG" (id 1) (at 177.8 31.1658 0))
    (property "Footprint" "" (id 2) (at 177.8 35.56 0)
      (effects (font (size 1.27 1.27)) hide)
    )
    (property "Datasheet" "~" (id 3) (at 177.8 35.56 0)
      (effects (font (size 1.27 1.27)) hide)
    )
    (pin "1" (uuid c4f1c234-c653-4ef5-9dcd-dedb8567e488))
  )

  (symbol (lib_id "000_PreferredParts:C_1nF") (at 177.8 50.8 0) (unit 1)
    (in_bom yes) (on_board yes)
    (uuid 3c308d62-03a5-4395-9995-a0c8179c63bd)
    (property "Reference" "C805" (id 0) (at 180.721 49.6316 0)
      (effects (font (size 1.27 1.27)) (justify left))
    )
    (property "Value" "C_1nF" (id 1) (at 180.721 51.943 0)
      (effects (font (size 1.27 1.27)) (justify left))
    )
    (property "Footprint" "Capacitor_SMD:C_0402_1005Metric" (id 2) (at 178.7652 54.61 0)
      (effects (font (size 1.27 1.27)) hide)
    )
    (property "Datasheet" "~" (id 3) (at 177.8 50.8 0)
      (effects (font (size 1.27 1.27)) hide)
    )
    (property "PartSpecification" "3000-0000000128" (id 4) (at 177.8 50.8 0)
      (effects (font (size 1.27 1.27)) hide)
    )
    (pin "1" (uuid 5027f361-b870-428b-90f7-23bed63e573c))
    (pin "2" (uuid e7243b5f-a9bb-4d8f-b2b3-97abfbc6abb0))
  )

  (symbol (lib_id "Device:R") (at 138.43 101.6 0) (unit 1)
    (in_bom yes) (on_board yes)
    (uuid 4129a693-f7e8-428b-bd71-0f38bab79a18)
    (property "Reference" "R802" (id 0) (at 140.208 100.4316 0)
      (effects (font (size 1.27 1.27)) (justify left))
    )
    (property "Value" "806" (id 1) (at 140.208 102.743 0)
      (effects (font (size 1.27 1.27)) (justify left))
    )
    (property "Footprint" "Resistor_SMD:R_0402_1005Metric" (id 2) (at 136.652 101.6 90)
      (effects (font (size 1.27 1.27)) hide)
    )
    (property "Datasheet" "~" (id 3) (at 138.43 101.6 0)
      (effects (font (size 1.27 1.27)) hide)
    )
    (property "Manufacturer" "Stackpole Electronics Inc" (id 4) (at 138.43 101.6 0)
      (effects (font (size 1.27 1.27)) hide)
    )
    (property "PartNumber" "" (id 5) (at 138.43 101.6 0)
      (effects (font (size 1.27 1.27)) hide)
    )
    (property "PartSpecification" "3000-0000001242" (id 6) (at 138.43 101.6 0)
      (effects (font (size 1.27 1.27)) hide)
    )
    (pin "1" (uuid 21c9d9e0-067a-4f25-bfe1-e68b52e9c261))
    (pin "2" (uuid ee1afea8-d003-4d3a-9795-18ce588d28a5))
  )

  (symbol (lib_id "POWDER_Digital:SN74AC04") (at 152.4 76.2 0) (unit 1)
    (in_bom yes) (on_board yes) (fields_autoplaced)
    (uuid 4bc4f008-9e17-4dd7-aeb8-07627c7aff10)
    (property "Reference" "U802" (id 0) (at 160.02 62.23 0))
    (property "Value" "SN74AC04" (id 1) (at 152.4 71.12 0))
    (property "Footprint" "Package_SO:TSSOP-14_4.4x5mm_P0.65mm" (id 2) (at 160.02 62.23 0)
      (effects (font (size 1.27 1.27)) hide)
    )
    (property "Datasheet" "" (id 3) (at 160.02 62.23 0)
      (effects (font (size 1.27 1.27)) hide)
    )
    (property "PartSpecification" "3000-0000001665" (id 4) (at 152.4 76.2 0)
      (effects (font (size 1.27 1.27)) hide)
    )
    (pin "1" (uuid 691f3c1c-3e57-4836-96da-8dd2420420a0))
    (pin "10" (uuid 861ddf3f-f6b6-49da-9559-eab017a6e56e))
    (pin "11" (uuid f574fba3-9d27-424e-8ff4-791dad35d5bf))
    (pin "12" (uuid db4f2c8f-4cef-49fb-9978-479f186e4403))
    (pin "13" (uuid bf555d1e-37f6-43e2-9c08-30f3d3a31db2))
    (pin "14" (uuid 127d787a-1a25-43f1-87c5-83852b6ef927))
    (pin "2" (uuid 2dbd2a1d-4c3a-46ad-95b9-34b6b460da34))
    (pin "3" (uuid 86f9a272-d4a7-4473-a978-3d714343b8d7))
    (pin "4" (uuid 009680b0-f934-4e5f-9be5-55b575e1cb8f))
    (pin "5" (uuid f4061978-f3af-4736-b1e6-cb27b55f3f3e))
    (pin "6" (uuid d4ca0910-897e-431b-9651-a2d62d3e7005))
    (pin "7" (uuid 65f9083b-e123-403e-af28-ed10e9a62d5e))
    (pin "8" (uuid f439cda2-4a6a-40c1-be39-cd60a3642e2b))
    (pin "9" (uuid 2f7dda28-e76b-40be-9375-797a97a4064a))
  )

  (symbol (lib_id "power:GND") (at 260.35 88.9 0) (unit 1)
    (in_bom yes) (on_board yes)
    (uuid 4e1f045d-9799-4262-9cf6-330bb8e190ce)
    (property "Reference" "#PWR0243" (id 0) (at 260.35 95.25 0)
      (effects (font (size 1.27 1.27)) hide)
    )
    (property "Value" "GND" (id 1) (at 260.477 93.2942 0))
    (property "Footprint" "" (id 2) (at 260.35 88.9 0)
      (effects (font (size 1.27 1.27)) hide)
    )
    (property "Datasheet" "" (id 3) (at 260.35 88.9 0)
      (effects (font (size 1.27 1.27)) hide)
    )
    (pin "1" (uuid a43502fd-4dcd-4800-9de6-571a0ca6a29f))
  )

  (symbol (lib_id "power:GND") (at 76.2 44.45 0) (unit 1)
    (in_bom yes) (on_board yes)
    (uuid 5990a5cf-ac06-4442-9c77-657738e2053e)
    (property "Reference" "#PWR0240" (id 0) (at 76.2 50.8 0)
      (effects (font (size 1.27 1.27)) hide)
    )
    (property "Value" "GND" (id 1) (at 76.327 48.8442 0))
    (property "Footprint" "" (id 2) (at 76.2 44.45 0)
      (effects (font (size 1.27 1.27)) hide)
    )
    (property "Datasheet" "" (id 3) (at 76.2 44.45 0)
      (effects (font (size 1.27 1.27)) hide)
    )
    (pin "1" (uuid 7488bdcb-e9de-4765-a24f-75cc7a01d54b))
  )

  (symbol (lib_id "000_PreferredParts:C_1nF") (at 241.3 69.85 0) (unit 1)
    (in_bom yes) (on_board yes) (fields_autoplaced)
    (uuid 5cd808f1-ccdd-4c3a-801a-02b1d9b3bfc9)
    (property "Reference" "C803" (id 0) (at 245.11 68.5799 0)
      (effects (font (size 1.27 1.27)) (justify left))
    )
    (property "Value" "C_1nF" (id 1) (at 245.11 71.1199 0)
      (effects (font (size 1.27 1.27)) (justify left))
    )
    (property "Footprint" "Capacitor_SMD:C_0402_1005Metric" (id 2) (at 242.2652 73.66 0)
      (effects (font (size 1.27 1.27)) hide)
    )
    (property "Datasheet" "~" (id 3) (at 241.3 69.85 0)
      (effects (font (size 1.27 1.27)) hide)
    )
    (property "PartSpecification" "3000-0000000128" (id 4) (at 241.3 69.85 0)
      (effects (font (size 1.27 1.27)) hide)
    )
    (pin "1" (uuid 03db7469-1f34-4f5c-ba0b-152a9d6eb9a6))
    (pin "2" (uuid 50e1575a-467b-4cef-ade6-bfbbfa4f6f28))
  )

  (symbol (lib_id "Device:R") (at 204.47 95.25 270) (unit 1)
    (in_bom yes) (on_board yes)
    (uuid 5d14d564-4594-495c-91de-b32048e8845a)
    (property "Reference" "R809" (id 0) (at 205.6384 97.028 0)
      (effects (font (size 1.27 1.27)) (justify left))
    )
    (property "Value" "806" (id 1) (at 203.327 97.028 0)
      (effects (font (size 1.27 1.27)) (justify left))
    )
    (property "Footprint" "Resistor_SMD:R_0402_1005Metric" (id 2) (at 204.47 93.472 90)
      (effects (font (size 1.27 1.27)) hide)
    )
    (property "Datasheet" "~" (id 3) (at 204.47 95.25 0)
      (effects (font (size 1.27 1.27)) hide)
    )
    (property "Manufacturer" "Stackpole Electronics Inc" (id 4) (at 204.47 95.25 0)
      (effects (font (size 1.27 1.27)) hide)
    )
    (property "PartNumber" "" (id 5) (at 204.47 95.25 0)
      (effects (font (size 1.27 1.27)) hide)
    )
    (property "PartSpecification" "3000-0000001242" (id 6) (at 204.47 95.25 0)
      (effects (font (size 1.27 1.27)) hide)
    )
    (pin "1" (uuid 0fb00f1e-af51-45f3-911a-c8424b9e310b))
    (pin "2" (uuid a5d8f546-93aa-4f53-b21b-cfad787c6fe7))
  )

  (symbol (lib_id "POWDER_Digital:TXU0104PW") (at 95.25 76.2 0) (unit 1)
    (in_bom yes) (on_board yes) (fields_autoplaced)
    (uuid 60db02e9-d99b-4164-a865-dc945b3008d0)
    (property "Reference" "U801" (id 0) (at 95.25 62.23 0))
    (property "Value" "TXU0104PW" (id 1) (at 95.25 71.12 0))
    (property "Footprint" "Package_SO:TSSOP-14_4.4x5mm_P0.65mm" (id 2) (at 95.25 101.6 0)
      (effects (font (size 1.27 1.27)) hide)
    )
    (property "Datasheet" "" (id 3) (at 80.01 72.39 0)
      (effects (font (size 1.27 1.27)) hide)
    )
    (property "PartSpecification" "3000-0000001663" (id 4) (at 95.25 76.2 0)
      (effects (font (size 1.27 1.27)) hide)
    )
    (pin "1" (uuid 0fa85964-713b-4274-bb70-01482d40d0e2))
    (pin "10" (uuid 7be46005-7002-47dc-89f7-3d5f2d690c88))
    (pin "11" (uuid 5f7aaf6d-1380-4c1e-af61-a1d3ee6fa9f7))
    (pin "12" (uuid 666c6bbe-edde-431f-a6eb-ea005a87304f))
    (pin "13" (uuid c62caacd-bb59-4b0f-b56f-02b5d9668253))
    (pin "14" (uuid d03b3e54-c6fb-44e9-ad29-ea9b07b9b3c7))
    (pin "2" (uuid 09ef3582-95b9-4d83-82c5-d52817d699d1))
    (pin "3" (uuid d77caa8e-4a59-4bbf-84c7-01cb32cb6bb7))
    (pin "4" (uuid 6aa09cbe-e9c4-4a44-b8e1-6a489ef0f5d3))
    (pin "5" (uuid 57001143-48c7-486e-9af5-65477cb8f6e4))
    (pin "6" (uuid b6a159da-8ac1-4ed8-8cc2-caf2cb04cb2b))
    (pin "7" (uuid b5afd93b-64a6-41c8-8fbf-42698550048c))
    (pin "8" (uuid c90a0681-bcd1-489c-b47f-cf336c6d6b51))
    (pin "9" (uuid 3d871d15-7f16-4a41-90d8-8ad0aae3557a))
  )

  (symbol (lib_id "Device:R") (at 199.39 82.55 270) (unit 1)
    (in_bom yes) (on_board yes)
    (uuid 621ba651-0c37-4bb2-bd88-93e2ee76cd08)
    (property "Reference" "R807" (id 0) (at 200.5584 84.328 0)
      (effects (font (size 1.27 1.27)) (justify left))
    )
    (property "Value" "806" (id 1) (at 198.247 84.328 0)
      (effects (font (size 1.27 1.27)) (justify left))
    )
    (property "Footprint" "Resistor_SMD:R_0402_1005Metric" (id 2) (at 199.39 80.772 90)
      (effects (font (size 1.27 1.27)) hide)
    )
    (property "Datasheet" "~" (id 3) (at 199.39 82.55 0)
      (effects (font (size 1.27 1.27)) hide)
    )
    (property "Manufacturer" "Stackpole Electronics Inc" (id 4) (at 199.39 82.55 0)
      (effects (font (size 1.27 1.27)) hide)
    )
    (property "PartNumber" "" (id 5) (at 199.39 82.55 0)
      (effects (font (size 1.27 1.27)) hide)
    )
    (property "PartSpecification" "3000-0000001242" (id 6) (at 199.39 82.55 0)
      (effects (font (size 1.27 1.27)) hide)
    )
    (pin "1" (uuid 156ed6f4-856f-4bf1-a40d-bee4d5fc288c))
    (pin "2" (uuid 76c6d044-1e38-410e-a2c1-79c1eac62695))
  )

  (symbol (lib_id "POWDER_PowerGlobals:+2.5VDIGRF") (at 76.2 25.4 0) (unit 1)
    (in_bom yes) (on_board yes) (fields_autoplaced)
    (uuid 627efced-0296-41f4-bf1a-b64a5a5f9b3f)
    (property "Reference" "#PWR0241" (id 0) (at 76.2 29.21 0)
      (effects (font (size 1.27 1.27)) hide)
    )
    (property "Value" "+2.5VDIGRF" (id 1) (at 76.2 20.32 0))
    (property "Footprint" "" (id 2) (at 76.2 25.4 0)
      (effects (font (size 1.27 1.27)) hide)
    )
    (property "Datasheet" "" (id 3) (at 76.2 25.4 0)
      (effects (font (size 1.27 1.27)) hide)
    )
    (pin "1" (uuid ea28c7d3-cdb8-4e18-ae78-3e3155aa6405))
  )

  (symbol (lib_id "000_PreferredParts:C_0_1uF") (at 209.55 44.45 0) (unit 1)
    (in_bom yes) (on_board yes)
    (uuid 72654cee-9a5c-4022-95e8-e7ff8166556f)
    (property "Reference" "C810" (id 0) (at 212.471 43.2816 0)
      (effects (font (size 1.27 1.27)) (justify left))
    )
    (property "Value" "C_0_1uF" (id 1) (at 210.185 46.99 0)
      (effects (font (size 1.27 1.27)) (justify left) hide)
    )
    (property "Footprint" "Capacitor_SMD:C_0402_1005Metric" (id 2) (at 210.5152 48.26 0)
      (effects (font (size 1.27 1.27)) hide)
    )
    (property "Datasheet" "~" (id 3) (at 209.55 44.45 0)
      (effects (font (size 1.27 1.27)) hide)
    )
    (property "DisplayValue" "0.1uF" (id 4) (at 212.471 45.593 0)
      (effects (font (size 1.27 1.27)) (justify left))
    )
    (property "PartSpecification" "3000-0000000125" (id 5) (at 209.55 44.45 0)
      (effects (font (size 1.27 1.27)) hide)
    )
    (property "Voltage" "100V" (id 6) (at 209.55 44.45 0)
      (effects (font (size 1.27 1.27)) hide)
    )
    (pin "1" (uuid 5b4d076b-2d0f-47e7-b441-1ddb9f53c7ac))
    (pin "2" (uuid 2cffef2a-7dbc-4402-8c5d-8d37d7d23001))
  )

  (symbol (lib_id "000_PreferredParts:C_0_1uF") (at 50.8 38.1 0) (unit 1)
    (in_bom yes) (on_board yes)
    (uuid 76d1ed0e-40a8-45f0-af90-cd60d17fe000)
    (property "Reference" "C807" (id 0) (at 53.721 36.9316 0)
      (effects (font (size 1.27 1.27)) (justify left))
    )
    (property "Value" "C_0_1uF" (id 1) (at 51.435 40.64 0)
      (effects (font (size 1.27 1.27)) (justify left) hide)
    )
    (property "Footprint" "Capacitor_SMD:C_0402_1005Metric" (id 2) (at 51.7652 41.91 0)
      (effects (font (size 1.27 1.27)) hide)
    )
    (property "Datasheet" "~" (id 3) (at 50.8 38.1 0)
      (effects (font (size 1.27 1.27)) hide)
    )
    (property "DisplayValue" "0.1uF" (id 4) (at 53.721 39.243 0)
      (effects (font (size 1.27 1.27)) (justify left))
    )
    (property "PartSpecification" "3000-0000000125" (id 5) (at 50.8 38.1 0)
      (effects (font (size 1.27 1.27)) hide)
    )
    (property "Voltage" "100V" (id 6) (at 50.8 38.1 0)
      (effects (font (size 1.27 1.27)) hide)
    )
    (pin "1" (uuid 9b2474e4-ec8a-4962-affa-448e97fd4b37))
    (pin "2" (uuid f3b040a5-d8d1-42be-a6b9-a5f1de492c0b))
  )

  (symbol (lib_id "Device:R") (at 180.34 69.85 270) (unit 1)
    (in_bom yes) (on_board yes)
    (uuid 7f5debd3-217a-4658-b189-aceea39ef51a)
    (property "Reference" "R803" (id 0) (at 181.5084 71.628 0)
      (effects (font (size 1.27 1.27)) (justify left))
    )
    (property "Value" "806" (id 1) (at 179.197 71.628 0)
      (effects (font (size 1.27 1.27)) (justify left))
    )
    (property "Footprint" "Resistor_SMD:R_0402_1005Metric" (id 2) (at 180.34 68.072 90)
      (effects (font (size 1.27 1.27)) hide)
    )
    (property "Datasheet" "~" (id 3) (at 180.34 69.85 0)
      (effects (font (size 1.27 1.27)) hide)
    )
    (property "Manufacturer" "Stackpole Electronics Inc" (id 4) (at 180.34 69.85 0)
      (effects (font (size 1.27 1.27)) hide)
    )
    (property "PartNumber" "" (id 5) (at 180.34 69.85 0)
      (effects (font (size 1.27 1.27)) hide)
    )
    (property "PartSpecification" "3000-0000001242" (id 6) (at 180.34 69.85 0)
      (effects (font (size 1.27 1.27)) hide)
    )
    (pin "1" (uuid 8e6d4d06-53b5-4635-8660-f61a6c0a5539))
    (pin "2" (uuid ad160e98-6d78-410b-9a2e-a2a035b966c6))
  )

  (symbol (lib_id "Device:R") (at 76.2 59.69 0) (unit 1)
    (in_bom yes) (on_board yes)
    (uuid 82d6dc1d-810d-4ff6-95df-0974affa4b2d)
    (property "Reference" "R811" (id 0) (at 77.978 58.5216 0)
      (effects (font (size 1.27 1.27)) (justify left))
    )
    (property "Value" "806" (id 1) (at 77.978 60.833 0)
      (effects (font (size 1.27 1.27)) (justify left))
    )
    (property "Footprint" "Resistor_SMD:R_0402_1005Metric" (id 2) (at 74.422 59.69 90)
      (effects (font (size 1.27 1.27)) hide)
    )
    (property "Datasheet" "~" (id 3) (at 76.2 59.69 0)
      (effects (font (size 1.27 1.27)) hide)
    )
    (property "Manufacturer" "Stackpole Electronics Inc" (id 4) (at 76.2 59.69 0)
      (effects (font (size 1.27 1.27)) hide)
    )
    (property "PartNumber" "" (id 5) (at 76.2 59.69 0)
      (effects (font (size 1.27 1.27)) hide)
    )
    (property "PartSpecification" "3000-0000001242" (id 6) (at 76.2 59.69 0)
      (effects (font (size 1.27 1.27)) hide)
    )
    (pin "1" (uuid 2e9bb27f-65ac-4f58-a7c3-1fd5c2425bd4))
    (pin "2" (uuid 0ebfc400-9c00-44fa-9e5e-1db6346d0e2c))
  )

  (symbol (lib_id "power:GND") (at 50.8 44.45 0) (unit 1)
    (in_bom yes) (on_board yes)
    (uuid 89a40753-18ac-43dd-a15b-59e3f4d8d09e)
    (property "Reference" "#PWR0227" (id 0) (at 50.8 50.8 0)
      (effects (font (size 1.27 1.27)) hide)
    )
    (property "Value" "GND" (id 1) (at 50.927 48.8442 0))
    (property "Footprint" "" (id 2) (at 50.8 44.45 0)
      (effects (font (size 1.27 1.27)) hide)
    )
    (property "Datasheet" "" (id 3) (at 50.8 44.45 0)
      (effects (font (size 1.27 1.27)) hide)
    )
    (pin "1" (uuid 9d42e94f-e63f-4d99-9f3a-23db4e56082d))
  )

  (symbol (lib_id "power:GND") (at 152.4 93.98 0) (unit 1)
    (in_bom yes) (on_board yes)
    (uuid 946a466a-042c-4585-852d-906c96b7fe08)
    (property "Reference" "#PWR0230" (id 0) (at 152.4 100.33 0)
      (effects (font (size 1.27 1.27)) hide)
    )
    (property "Value" "GND" (id 1) (at 152.527 98.3742 0))
    (property "Footprint" "" (id 2) (at 152.4 93.98 0)
      (effects (font (size 1.27 1.27)) hide)
    )
    (property "Datasheet" "" (id 3) (at 152.4 93.98 0)
      (effects (font (size 1.27 1.27)) hide)
    )
    (pin "1" (uuid 222b134a-ad8a-400b-8d25-e80faea9da65))
  )

  (symbol (lib_id "power:GND") (at 138.43 107.95 0) (unit 1)
    (in_bom yes) (on_board yes)
    (uuid 9cc58c31-3053-45e3-9380-75166b626e4e)
    (property "Reference" "#PWR0231" (id 0) (at 138.43 114.3 0)
      (effects (font (size 1.27 1.27)) hide)
    )
    (property "Value" "GND" (id 1) (at 138.557 112.3442 0))
    (property "Footprint" "" (id 2) (at 138.43 107.95 0)
      (effects (font (size 1.27 1.27)) hide)
    )
    (property "Datasheet" "" (id 3) (at 138.43 107.95 0)
      (effects (font (size 1.27 1.27)) hide)
    )
    (pin "1" (uuid 86a3c0ac-a059-4c60-9a87-ddb8dcd5a672))
  )

  (symbol (lib_id "Device:R") (at 260.35 71.12 0) (unit 1)
    (in_bom yes) (on_board yes)
    (uuid a57f18c6-7cf9-4cdb-b6b7-7b26715b982f)
    (property "Reference" "R820" (id 0) (at 262.382 71.12 90))
    (property "Value" "100k" (id 1) (at 260.35 71.12 90))
    (property "Footprint" "Resistor_SMD:R_0402_1005Metric" (id 2) (at 258.572 71.12 90)
      (effects (font (size 1.27 1.27)) hide)
    )
    (property "Datasheet" "~" (id 3) (at 260.35 71.12 0)
      (effects (font (size 1.27 1.27)) hide)
    )
    (property "PartSpecification" "3000-0000000575" (id 4) (at 260.35 71.12 90)
      (effects (font (size 1.27 1.27)) hide)
    )
    (pin "1" (uuid d30278f2-d4d6-4ed8-bd7e-d559beea91c1))
    (pin "2" (uuid dfeb3097-b918-4929-9865-dbeaf3c028e4))
  )

  (symbol (lib_id "Device:R") (at 130.81 101.6 0) (unit 1)
    (in_bom yes) (on_board yes)
    (uuid a6ab8406-71f0-4ceb-a556-bb1bc3533887)
    (property "Reference" "R801" (id 0) (at 132.588 100.4316 0)
      (effects (font (size 1.27 1.27)) (justify left))
    )
    (property "Value" "806" (id 1) (at 132.588 102.743 0)
      (effects (font (size 1.27 1.27)) (justify left))
    )
    (property "Footprint" "Resistor_SMD:R_0402_1005Metric" (id 2) (at 129.032 101.6 90)
      (effects (font (size 1.27 1.27)) hide)
    )
    (property "Datasheet" "~" (id 3) (at 130.81 101.6 0)
      (effects (font (size 1.27 1.27)) hide)
    )
    (property "Manufacturer" "Stackpole Electronics Inc" (id 4) (at 130.81 101.6 0)
      (effects (font (size 1.27 1.27)) hide)
    )
    (property "PartNumber" "" (id 5) (at 130.81 101.6 0)
      (effects (font (size 1.27 1.27)) hide)
    )
    (property "PartSpecification" "3000-0000001242" (id 6) (at 130.81 101.6 0)
      (effects (font (size 1.27 1.27)) hide)
    )
    (pin "1" (uuid 8d92d66d-ba3c-4f4a-a73b-0f7fb98a7356))
    (pin "2" (uuid 15b61e2b-5cb2-4c5b-93eb-aa5c063ccf09))
  )

  (symbol (lib_id "000_PreferredParts:C_10pF") (at 165.1 50.8 0) (unit 1)
    (in_bom yes) (on_board yes)
    (uuid ad5a046c-52f3-4f01-a99f-1da65909dca8)
    (property "Reference" "C801" (id 0) (at 168.021 49.6316 0)
      (effects (font (size 1.27 1.27)) (justify left))
    )
    (property "Value" "C_10pF" (id 1) (at 168.021 51.943 0)
      (effects (font (size 1.27 1.27)) (justify left))
    )
    (property "Footprint" "Capacitor_SMD:C_0402_1005Metric" (id 2) (at 166.0652 54.61 0)
      (effects (font (size 1.27 1.27)) hide)
    )
    (property "Datasheet" "~" (id 3) (at 165.1 50.8 0)
      (effects (font (size 1.27 1.27)) hide)
    )
    (property "PartSpecification" "3000-0000000582" (id 4) (at 165.1 50.8 0)
      (effects (font (size 1.27 1.27)) hide)
    )
    (pin "1" (uuid 37f0a2e5-0acf-49ef-a512-c59f5d970f2b))
    (pin "2" (uuid 0733a976-131e-45a1-a832-bcf4b8db3272))
  )

  (symbol (lib_id "power:GND") (at 209.55 50.8 0) (unit 1)
    (in_bom yes) (on_board yes)
    (uuid b0232899-4108-4885-8e0a-b762c71de877)
    (property "Reference" "#PWR0233" (id 0) (at 209.55 57.15 0)
      (effects (font (size 1.27 1.27)) hide)
    )
    (property "Value" "GND" (id 1) (at 209.677 55.1942 0))
    (property "Footprint" "" (id 2) (at 209.55 50.8 0)
      (effects (font (size 1.27 1.27)) hide)
    )
    (property "Datasheet" "" (id 3) (at 209.55 50.8 0)
      (effects (font (size 1.27 1.27)) hide)
    )
    (pin "1" (uuid 92b58a99-f3a4-44e1-a06f-ae6d189ab51f))
  )

  (symbol (lib_id "power:GND") (at 63.5 44.45 0) (unit 1)
    (in_bom yes) (on_board yes)
    (uuid b1f6a745-da45-4110-8b0e-041dd5462283)
    (property "Reference" "#PWR0228" (id 0) (at 63.5 50.8 0)
      (effects (font (size 1.27 1.27)) hide)
    )
    (property "Value" "GND" (id 1) (at 63.627 48.8442 0))
    (property "Footprint" "" (id 2) (at 63.5 44.45 0)
      (effects (font (size 1.27 1.27)) hide)
    )
    (property "Datasheet" "" (id 3) (at 63.5 44.45 0)
      (effects (font (size 1.27 1.27)) hide)
    )
    (pin "1" (uuid d1b8a6ef-3f85-4cfe-83bd-21121a99d5ac))
  )

  (symbol (lib_id "Device:L") (at 184.15 31.75 0) (unit 1)
    (in_bom yes) (on_board yes)
    (uuid bbcdfa70-fd20-4efa-84b2-11b5603f6e54)
    (property "Reference" "L801" (id 0) (at 188.976 31.75 90))
    (property "Value" "BEAD" (id 1) (at 186.6646 31.75 90))
    (property "Footprint" "Inductor_SMD:L_0603_1608Metric" (id 2) (at 184.15 31.75 0)
      (effects (font (size 1.27 1.27)) hide)
    )
    (property "Datasheet" "~" (id 3) (at 184.15 31.75 0)
      (effects (font (size 1.27 1.27)) hide)
    )
    (property "PartNumber" "BLM18EG221SZ1" (id 4) (at 184.15 31.75 90)
      (effects (font (size 1.27 1.27)) hide)
    )
    (property "Manufacturer" "Murata Electronics" (id 5) (at 184.15 31.75 0)
      (effects (font (size 1.27 1.27)) hide)
    )
    (property "PartSpecification" "3000-0000000091" (id 6) (at 184.15 31.75 0)
      (effects (font (size 1.27 1.27)) hide)
    )
    (pin "1" (uuid 6a4235c4-40a6-472c-a8c3-cd8e74ab3bea))
    (pin "2" (uuid 9c4913fc-072f-4deb-a3ee-47464de95a81))
  )

  (symbol (lib_id "POWDER_PowerGlobals:V_LNA") (at 184.15 25.4 0) (unit 1)
    (in_bom yes) (on_board yes) (fields_autoplaced)
    (uuid c5f46ec2-7d7f-41b4-8be1-6e8d61432432)
    (property "Reference" "#PWR0234" (id 0) (at 184.15 29.21 0)
      (effects (font (size 1.27 1.27)) hide)
    )
    (property "Value" "V_LNA" (id 1) (at 184.15 20.32 0))
    (property "Footprint" "" (id 2) (at 184.15 25.4 0)
      (effects (font (size 1.27 1.27)) hide)
    )
    (property "Datasheet" "" (id 3) (at 184.15 25.4 0)
      (effects (font (size 1.27 1.27)) hide)
    )
    (pin "1" (uuid c46c3ee4-8f55-4115-8261-7c034a21fe85))
  )

  (symbol (lib_id "000_PreferredParts:C_10pF") (at 127 50.8 0) (unit 1)
    (in_bom yes) (on_board yes)
    (uuid c9e18040-70a9-4cd0-8695-deff6a83271e)
    (property "Reference" "C802" (id 0) (at 129.921 49.6316 0)
      (effects (font (size 1.27 1.27)) (justify left))
    )
    (property "Value" "C_10pF" (id 1) (at 129.921 51.943 0)
      (effects (font (size 1.27 1.27)) (justify left))
    )
    (property "Footprint" "Capacitor_SMD:C_0402_1005Metric" (id 2) (at 127.9652 54.61 0)
      (effects (font (size 1.27 1.27)) hide)
    )
    (property "Datasheet" "~" (id 3) (at 127 50.8 0)
      (effects (font (size 1.27 1.27)) hide)
    )
    (property "PartSpecification" "3000-0000000582" (id 4) (at 127 50.8 0)
      (effects (font (size 1.27 1.27)) hide)
    )
    (pin "1" (uuid ddc20dca-bee7-41ee-95ca-1718a7711c59))
    (pin "2" (uuid ea173be8-c68f-4fbe-ba48-e7389d16e415))
  )

  (symbol (lib_id "power:GND") (at 196.85 50.8 0) (unit 1)
    (in_bom yes) (on_board yes)
    (uuid ca5a1b99-fee4-4ac9-9dd0-a6cc7fd29091)
    (property "Reference" "#PWR0237" (id 0) (at 196.85 57.15 0)
      (effects (font (size 1.27 1.27)) hide)
    )
    (property "Value" "GND" (id 1) (at 196.977 55.1942 0))
    (property "Footprint" "" (id 2) (at 196.85 50.8 0)
      (effects (font (size 1.27 1.27)) hide)
    )
    (property "Datasheet" "" (id 3) (at 196.85 50.8 0)
      (effects (font (size 1.27 1.27)) hide)
    )
    (pin "1" (uuid 2b99ffdc-10ba-4068-8eff-b41d0e35918a))
  )

  (symbol (lib_id "power:GND") (at 139.7 57.15 0) (unit 1)
    (in_bom yes) (on_board yes)
    (uuid d3305f1c-1dfc-4c06-9342-2ee342eea292)
    (property "Reference" "#PWR0236" (id 0) (at 139.7 63.5 0)
      (effects (font (size 1.27 1.27)) hide)
    )
    (property "Value" "GND" (id 1) (at 139.827 61.5442 0))
    (property "Footprint" "" (id 2) (at 139.7 57.15 0)
      (effects (font (size 1.27 1.27)) hide)
    )
    (property "Datasheet" "" (id 3) (at 139.7 57.15 0)
      (effects (font (size 1.27 1.27)) hide)
    )
    (pin "1" (uuid a9057e0b-279b-43fc-996f-a2889cba57e3))
  )

  (symbol (lib_id "000_PreferredParts:C_1nF") (at 63.5 38.1 0) (unit 1)
    (in_bom yes) (on_board yes)
    (uuid e81e2c37-706d-4108-9978-eaa8e106687f)
    (property "Reference" "C808" (id 0) (at 66.421 36.9316 0)
      (effects (font (size 1.27 1.27)) (justify left))
    )
    (property "Value" "C_1nF" (id 1) (at 66.421 39.243 0)
      (effects (font (size 1.27 1.27)) (justify left))
    )
    (property "Footprint" "Capacitor_SMD:C_0402_1005Metric" (id 2) (at 64.4652 41.91 0)
      (effects (font (size 1.27 1.27)) hide)
    )
    (property "Datasheet" "~" (id 3) (at 63.5 38.1 0)
      (effects (font (size 1.27 1.27)) hide)
    )
    (property "PartSpecification" "3000-0000000128" (id 4) (at 63.5 38.1 0)
      (effects (font (size 1.27 1.27)) hide)
    )
    (pin "1" (uuid 531f2c34-5bcc-4a39-8b98-e730d7544a89))
    (pin "2" (uuid 59a360c8-c6c3-455f-89e1-01e0ddded996))
  )

  (symbol (lib_id "power:GND") (at 177.8 57.15 0) (unit 1)
    (in_bom yes) (on_board yes)
    (uuid ea240031-af91-436f-bae7-832ecdcd11e9)
    (property "Reference" "#PWR0238" (id 0) (at 177.8 63.5 0)
      (effects (font (size 1.27 1.27)) hide)
    )
    (property "Value" "GND" (id 1) (at 177.927 61.5442 0))
    (property "Footprint" "" (id 2) (at 177.8 57.15 0)
      (effects (font (size 1.27 1.27)) hide)
    )
    (property "Datasheet" "" (id 3) (at 177.8 57.15 0)
      (effects (font (size 1.27 1.27)) hide)
    )
    (pin "1" (uuid d3164fdd-cb6f-49ad-9078-ac855e1bd6eb))
  )

  (symbol (lib_id "power:GND") (at 130.81 107.95 0) (unit 1)
    (in_bom yes) (on_board yes)
    (uuid eef8b6bc-06db-4c19-aca0-76f114c966b9)
    (property "Reference" "#PWR0232" (id 0) (at 130.81 114.3 0)
      (effects (font (size 1.27 1.27)) hide)
    )
    (property "Value" "GND" (id 1) (at 130.937 112.3442 0))
    (property "Footprint" "" (id 2) (at 130.81 107.95 0)
      (effects (font (size 1.27 1.27)) hide)
    )
    (property "Datasheet" "" (id 3) (at 130.81 107.95 0)
      (effects (font (size 1.27 1.27)) hide)
    )
    (pin "1" (uuid 79eb949b-398e-48c4-a93f-d7c01c9b4c78))
  )

  (symbol (lib_id "Device:R") (at 210.82 69.85 270) (unit 1)
    (in_bom yes) (on_board yes)
    (uuid f0b26b23-18f0-4c39-bb4b-8b80247a007a)
    (property "Reference" "R813" (id 0) (at 211.9884 71.628 0)
      (effects (font (size 1.27 1.27)) (justify left))
    )
    (property "Value" "806" (id 1) (at 209.677 71.628 0)
      (effects (font (size 1.27 1.27)) (justify left))
    )
    (property "Footprint" "Resistor_SMD:R_0402_1005Metric" (id 2) (at 210.82 68.072 90)
      (effects (font (size 1.27 1.27)) hide)
    )
    (property "Datasheet" "~" (id 3) (at 210.82 69.85 0)
      (effects (font (size 1.27 1.27)) hide)
    )
    (property "Manufacturer" "Stackpole Electronics Inc" (id 4) (at 210.82 69.85 0)
      (effects (font (size 1.27 1.27)) hide)
    )
    (property "PartNumber" "" (id 5) (at 210.82 69.85 0)
      (effects (font (size 1.27 1.27)) hide)
    )
    (property "PartSpecification" "3000-0000001242" (id 6) (at 210.82 69.85 0)
      (effects (font (size 1.27 1.27)) hide)
    )
    (pin "1" (uuid 76844070-40ee-4d92-a828-b91eff94b30e))
    (pin "2" (uuid a05a8ecf-72b0-4ccc-bfd4-b7ddb4d9ca55))
  )

  (symbol (lib_id "Device:R") (at 260.35 81.28 0) (unit 1)
    (in_bom yes) (on_board yes)
    (uuid f52cdc48-358a-47d2-9ab9-d2e44ead2e7f)
    (property "Reference" "R821" (id 0) (at 262.382 81.28 90))
    (property "Value" "48.7k" (id 1) (at 260.35 81.28 90))
    (property "Footprint" "Resistor_SMD:R_0402_1005Metric" (id 2) (at 258.572 81.28 90)
      (effects (font (size 1.27 1.27)) hide)
    )
    (property "Datasheet" "~" (id 3) (at 260.35 81.28 0)
      (effects (font (size 1.27 1.27)) hide)
    )
    (property "PartSpecification" "3000-0000001629" (id 4) (at 260.35 81.28 90)
      (effects (font (size 1.27 1.27)) hide)
    )
    (pin "1" (uuid 4240061f-25ca-4e8d-b2f8-99713dcfae38))
    (pin "2" (uuid 8ed7bfa8-19b2-46c9-91fc-412787e7143c))
  )

  (symbol (lib_id "Device:R") (at 194.31 120.65 270) (unit 1)
    (in_bom yes) (on_board yes)
    (uuid fbe2173b-4c06-4c6d-96da-a703b4b048ff)
    (property "Reference" "R806" (id 0) (at 195.4784 122.428 0)
      (effects (font (size 1.27 1.27)) (justify left))
    )
    (property "Value" "806" (id 1) (at 193.167 122.428 0)
      (effects (font (size 1.27 1.27)) (justify left))
    )
    (property "Footprint" "Resistor_SMD:R_0402_1005Metric" (id 2) (at 194.31 118.872 90)
      (effects (font (size 1.27 1.27)) hide)
    )
    (property "Datasheet" "~" (id 3) (at 194.31 120.65 0)
      (effects (font (size 1.27 1.27)) hide)
    )
    (property "Manufacturer" "Stackpole Electronics Inc" (id 4) (at 194.31 120.65 0)
      (effects (font (size 1.27 1.27)) hide)
    )
    (property "PartNumber" "" (id 5) (at 194.31 120.65 0)
      (effects (font (size 1.27 1.27)) hide)
    )
    (property "PartSpecification" "3000-0000001242" (id 6) (at 194.31 120.65 0)
      (effects (font (size 1.27 1.27)) hide)
    )
    (pin "1" (uuid d9acc67b-d268-4009-8159-b3b43c8c9c6a))
    (pin "2" (uuid 12709da2-0a27-435a-8f2b-9f1a67f5d3bc))
  )
)
