(kicad_sch (version 20211123) (generator eeschema)

  (uuid 95112953-6815-456b-9ddb-62acdb84610d)

  (paper "A4")

  (lib_symbols
    (symbol "000_PreferredParts:C_10uF_0805" (pin_numbers hide) (pin_names (offset 0.254)) (in_bom yes) (on_board yes)
      (property "Reference" "C" (id 0) (at 0.635 2.54 0)
        (effects (font (size 1.27 1.27)) (justify left))
      )
      (property "Value" "C_10uF_0805" (id 1) (at 0.635 -2.54 0)
        (effects (font (size 1.27 1.27)) (justify left) hide)
      )
      (property "Footprint" "Capacitor_SMD:C_0805_2012Metric" (id 2) (at 0.9652 -3.81 0)
        (effects (font (size 1.27 1.27)) hide)
      )
      (property "Datasheet" "~" (id 3) (at 0 0 0)
        (effects (font (size 1.27 1.27)) hide)
      )
      (property "DisplayValue" "10uF" (id 4) (at 3.81 -2.54 0)
        (effects (font (size 1.27 1.27)))
      )
      (property "DisplayFootprint" "0805" (id 5) (at 3.81 -5.08 0)
        (effects (font (size 1.27 1.27)))
      )
      (property "PartSpecification" "3000-0000000134" (id 6) (at 0 0 0)
        (effects (font (size 1.27 1.27)) hide)
      )
      (property "ki_keywords" "cap capacitor" (id 7) (at 0 0 0)
        (effects (font (size 1.27 1.27)) hide)
      )
      (property "ki_description" "Unpolarized capacitor" (id 8) (at 0 0 0)
        (effects (font (size 1.27 1.27)) hide)
      )
      (property "ki_fp_filters" "C_*" (id 9) (at 0 0 0)
        (effects (font (size 1.27 1.27)) hide)
      )
      (symbol "C_10uF_0805_0_1"
        (polyline
          (pts
            (xy -2.032 -0.762)
            (xy 2.032 -0.762)
          )
          (stroke (width 0.508) (type default) (color 0 0 0 0))
          (fill (type none))
        )
        (polyline
          (pts
            (xy -2.032 0.762)
            (xy 2.032 0.762)
          )
          (stroke (width 0.508) (type default) (color 0 0 0 0))
          (fill (type none))
        )
      )
      (symbol "C_10uF_0805_1_1"
        (pin passive line (at 0 3.81 270) (length 2.794)
          (name "~" (effects (font (size 1.27 1.27))))
          (number "1" (effects (font (size 1.27 1.27))))
        )
        (pin passive line (at 0 -3.81 90) (length 2.794)
          (name "~" (effects (font (size 1.27 1.27))))
          (number "2" (effects (font (size 1.27 1.27))))
        )
      )
    )
    (symbol "Connector:Screw_Terminal_01x02" (pin_names (offset 1.016) hide) (in_bom yes) (on_board yes)
      (property "Reference" "J" (id 0) (at 0 2.54 0)
        (effects (font (size 1.27 1.27)))
      )
      (property "Value" "Screw_Terminal_01x02" (id 1) (at 0 -5.08 0)
        (effects (font (size 1.27 1.27)))
      )
      (property "Footprint" "" (id 2) (at 0 0 0)
        (effects (font (size 1.27 1.27)) hide)
      )
      (property "Datasheet" "~" (id 3) (at 0 0 0)
        (effects (font (size 1.27 1.27)) hide)
      )
      (property "ki_keywords" "screw terminal" (id 4) (at 0 0 0)
        (effects (font (size 1.27 1.27)) hide)
      )
      (property "ki_description" "Generic screw terminal, single row, 01x02, script generated (kicad-library-utils/schlib/autogen/connector/)" (id 5) (at 0 0 0)
        (effects (font (size 1.27 1.27)) hide)
      )
      (property "ki_fp_filters" "TerminalBlock*:*" (id 6) (at 0 0 0)
        (effects (font (size 1.27 1.27)) hide)
      )
      (symbol "Screw_Terminal_01x02_1_1"
        (rectangle (start -1.27 1.27) (end 1.27 -3.81)
          (stroke (width 0.254) (type default) (color 0 0 0 0))
          (fill (type background))
        )
        (circle (center 0 -2.54) (radius 0.635)
          (stroke (width 0.1524) (type default) (color 0 0 0 0))
          (fill (type none))
        )
        (polyline
          (pts
            (xy -0.5334 -2.2098)
            (xy 0.3302 -3.048)
          )
          (stroke (width 0.1524) (type default) (color 0 0 0 0))
          (fill (type none))
        )
        (polyline
          (pts
            (xy -0.5334 0.3302)
            (xy 0.3302 -0.508)
          )
          (stroke (width 0.1524) (type default) (color 0 0 0 0))
          (fill (type none))
        )
        (polyline
          (pts
            (xy -0.3556 -2.032)
            (xy 0.508 -2.8702)
          )
          (stroke (width 0.1524) (type default) (color 0 0 0 0))
          (fill (type none))
        )
        (polyline
          (pts
            (xy -0.3556 0.508)
            (xy 0.508 -0.3302)
          )
          (stroke (width 0.1524) (type default) (color 0 0 0 0))
          (fill (type none))
        )
        (circle (center 0 0) (radius 0.635)
          (stroke (width 0.1524) (type default) (color 0 0 0 0))
          (fill (type none))
        )
        (pin passive line (at -5.08 0 0) (length 3.81)
          (name "Pin_1" (effects (font (size 1.27 1.27))))
          (number "1" (effects (font (size 1.27 1.27))))
        )
        (pin passive line (at -5.08 -2.54 0) (length 3.81)
          (name "Pin_2" (effects (font (size 1.27 1.27))))
          (number "2" (effects (font (size 1.27 1.27))))
        )
      )
    )
    (symbol "Device:C_Polarized" (pin_numbers hide) (pin_names (offset 0.254)) (in_bom yes) (on_board yes)
      (property "Reference" "C" (id 0) (at 0.635 2.54 0)
        (effects (font (size 1.27 1.27)) (justify left))
      )
      (property "Value" "C_Polarized" (id 1) (at 0.635 -2.54 0)
        (effects (font (size 1.27 1.27)) (justify left))
      )
      (property "Footprint" "" (id 2) (at 0.9652 -3.81 0)
        (effects (font (size 1.27 1.27)) hide)
      )
      (property "Datasheet" "~" (id 3) (at 0 0 0)
        (effects (font (size 1.27 1.27)) hide)
      )
      (property "ki_keywords" "cap capacitor" (id 4) (at 0 0 0)
        (effects (font (size 1.27 1.27)) hide)
      )
      (property "ki_description" "Polarized capacitor" (id 5) (at 0 0 0)
        (effects (font (size 1.27 1.27)) hide)
      )
      (property "ki_fp_filters" "CP_*" (id 6) (at 0 0 0)
        (effects (font (size 1.27 1.27)) hide)
      )
      (symbol "C_Polarized_0_1"
        (rectangle (start -2.286 0.508) (end 2.286 1.016)
          (stroke (width 0) (type default) (color 0 0 0 0))
          (fill (type none))
        )
        (polyline
          (pts
            (xy -1.778 2.286)
            (xy -0.762 2.286)
          )
          (stroke (width 0) (type default) (color 0 0 0 0))
          (fill (type none))
        )
        (polyline
          (pts
            (xy -1.27 2.794)
            (xy -1.27 1.778)
          )
          (stroke (width 0) (type default) (color 0 0 0 0))
          (fill (type none))
        )
        (rectangle (start 2.286 -0.508) (end -2.286 -1.016)
          (stroke (width 0) (type default) (color 0 0 0 0))
          (fill (type outline))
        )
      )
      (symbol "C_Polarized_1_1"
        (pin passive line (at 0 3.81 270) (length 2.794)
          (name "~" (effects (font (size 1.27 1.27))))
          (number "1" (effects (font (size 1.27 1.27))))
        )
        (pin passive line (at 0 -3.81 90) (length 2.794)
          (name "~" (effects (font (size 1.27 1.27))))
          (number "2" (effects (font (size 1.27 1.27))))
        )
      )
    )
    (symbol "Device:FerriteBead" (pin_numbers hide) (pin_names (offset 0)) (in_bom yes) (on_board yes)
      (property "Reference" "FB" (id 0) (at -3.81 0.635 90)
        (effects (font (size 1.27 1.27)))
      )
      (property "Value" "FerriteBead" (id 1) (at 3.81 0 90)
        (effects (font (size 1.27 1.27)))
      )
      (property "Footprint" "" (id 2) (at -1.778 0 90)
        (effects (font (size 1.27 1.27)) hide)
      )
      (property "Datasheet" "~" (id 3) (at 0 0 0)
        (effects (font (size 1.27 1.27)) hide)
      )
      (property "ki_keywords" "L ferrite bead inductor filter" (id 4) (at 0 0 0)
        (effects (font (size 1.27 1.27)) hide)
      )
      (property "ki_description" "Ferrite bead" (id 5) (at 0 0 0)
        (effects (font (size 1.27 1.27)) hide)
      )
      (property "ki_fp_filters" "Inductor_* L_* *Ferrite*" (id 6) (at 0 0 0)
        (effects (font (size 1.27 1.27)) hide)
      )
      (symbol "FerriteBead_0_1"
        (polyline
          (pts
            (xy 0 -1.27)
            (xy 0 -1.2192)
          )
          (stroke (width 0) (type default) (color 0 0 0 0))
          (fill (type none))
        )
        (polyline
          (pts
            (xy 0 1.27)
            (xy 0 1.2954)
          )
          (stroke (width 0) (type default) (color 0 0 0 0))
          (fill (type none))
        )
        (polyline
          (pts
            (xy -2.7686 0.4064)
            (xy -1.7018 2.2606)
            (xy 2.7686 -0.3048)
            (xy 1.6764 -2.159)
            (xy -2.7686 0.4064)
          )
          (stroke (width 0) (type default) (color 0 0 0 0))
          (fill (type none))
        )
      )
      (symbol "FerriteBead_1_1"
        (pin passive line (at 0 3.81 270) (length 2.54)
          (name "~" (effects (font (size 1.27 1.27))))
          (number "1" (effects (font (size 1.27 1.27))))
        )
        (pin passive line (at 0 -3.81 90) (length 2.54)
          (name "~" (effects (font (size 1.27 1.27))))
          (number "2" (effects (font (size 1.27 1.27))))
        )
      )
    )
    (symbol "Device:R" (pin_numbers hide) (pin_names (offset 0)) (in_bom yes) (on_board yes)
      (property "Reference" "R" (id 0) (at 2.032 0 90)
        (effects (font (size 1.27 1.27)))
      )
      (property "Value" "R" (id 1) (at 0 0 90)
        (effects (font (size 1.27 1.27)))
      )
      (property "Footprint" "" (id 2) (at -1.778 0 90)
        (effects (font (size 1.27 1.27)) hide)
      )
      (property "Datasheet" "~" (id 3) (at 0 0 0)
        (effects (font (size 1.27 1.27)) hide)
      )
      (property "ki_keywords" "R res resistor" (id 4) (at 0 0 0)
        (effects (font (size 1.27 1.27)) hide)
      )
      (property "ki_description" "Resistor" (id 5) (at 0 0 0)
        (effects (font (size 1.27 1.27)) hide)
      )
      (property "ki_fp_filters" "R_*" (id 6) (at 0 0 0)
        (effects (font (size 1.27 1.27)) hide)
      )
      (symbol "R_0_1"
        (rectangle (start -1.016 -2.54) (end 1.016 2.54)
          (stroke (width 0.254) (type default) (color 0 0 0 0))
          (fill (type none))
        )
      )
      (symbol "R_1_1"
        (pin passive line (at 0 3.81 270) (length 1.27)
          (name "~" (effects (font (size 1.27 1.27))))
          (number "1" (effects (font (size 1.27 1.27))))
        )
        (pin passive line (at 0 -3.81 90) (length 1.27)
          (name "~" (effects (font (size 1.27 1.27))))
          (number "2" (effects (font (size 1.27 1.27))))
        )
      )
    )
    (symbol "POWDER_FPGA_Connectors:Bottom_Interface" (pin_names (offset 1.016)) (in_bom yes) (on_board yes)
      (property "Reference" "J" (id 0) (at 3.81 -53.34 0)
        (effects (font (size 1.27 1.27)))
      )
      (property "Value" "Bottom_Interface" (id 1) (at 0 50.8 0)
        (effects (font (size 1.27 1.27)))
      )
      (property "Footprint" "POWDER_Connector:CVILUX_CF20_1x40-1MP_P0.50mm_Horizontal" (id 2) (at -5.08 0 0)
        (effects (font (size 1.27 1.27)) hide)
      )
      (property "Datasheet" "~" (id 3) (at -5.08 0 0)
        (effects (font (size 1.27 1.27)) hide)
      )
      (property "ki_keywords" "connector" (id 4) (at 0 0 0)
        (effects (font (size 1.27 1.27)) hide)
      )
      (property "ki_description" "Generic shielded connector, single row, 01x40, script generated (kicad-library-utils/schlib/autogen/connector/)" (id 5) (at 0 0 0)
        (effects (font (size 1.27 1.27)) hide)
      )
      (property "ki_fp_filters" "Connector*:*_1x??-1SH*" (id 6) (at 0 0 0)
        (effects (font (size 1.27 1.27)) hide)
      )
      (symbol "Bottom_Interface_1_1"
        (rectangle (start -6.35 49.53) (end 6.35 -52.07)
          (stroke (width 0.1524) (type default) (color 0 0 0 0))
          (fill (type none))
        )
        (rectangle (start -6.096 -50.673) (end -4.826 -50.927)
          (stroke (width 0.1524) (type default) (color 0 0 0 0))
          (fill (type none))
        )
        (rectangle (start -6.096 -48.133) (end -4.826 -48.387)
          (stroke (width 0.1524) (type default) (color 0 0 0 0))
          (fill (type none))
        )
        (rectangle (start -6.096 -45.593) (end -4.826 -45.847)
          (stroke (width 0.1524) (type default) (color 0 0 0 0))
          (fill (type none))
        )
        (rectangle (start -6.096 -43.053) (end -4.826 -43.307)
          (stroke (width 0.1524) (type default) (color 0 0 0 0))
          (fill (type none))
        )
        (rectangle (start -6.096 -40.513) (end -4.826 -40.767)
          (stroke (width 0.1524) (type default) (color 0 0 0 0))
          (fill (type none))
        )
        (rectangle (start -6.096 -37.973) (end -4.826 -38.227)
          (stroke (width 0.1524) (type default) (color 0 0 0 0))
          (fill (type none))
        )
        (rectangle (start -6.096 -35.433) (end -4.826 -35.687)
          (stroke (width 0.1524) (type default) (color 0 0 0 0))
          (fill (type none))
        )
        (rectangle (start -6.096 -32.893) (end -4.826 -33.147)
          (stroke (width 0.1524) (type default) (color 0 0 0 0))
          (fill (type none))
        )
        (rectangle (start -6.096 -30.353) (end -4.826 -30.607)
          (stroke (width 0.1524) (type default) (color 0 0 0 0))
          (fill (type none))
        )
        (rectangle (start -6.096 -27.813) (end -4.826 -28.067)
          (stroke (width 0.1524) (type default) (color 0 0 0 0))
          (fill (type none))
        )
        (rectangle (start -6.096 -25.273) (end -4.826 -25.527)
          (stroke (width 0.1524) (type default) (color 0 0 0 0))
          (fill (type none))
        )
        (rectangle (start -6.096 -22.733) (end -4.826 -22.987)
          (stroke (width 0.1524) (type default) (color 0 0 0 0))
          (fill (type none))
        )
        (rectangle (start -6.096 -20.193) (end -4.826 -20.447)
          (stroke (width 0.1524) (type default) (color 0 0 0 0))
          (fill (type none))
        )
        (rectangle (start -6.096 -17.653) (end -4.826 -17.907)
          (stroke (width 0.1524) (type default) (color 0 0 0 0))
          (fill (type none))
        )
        (rectangle (start -6.096 -15.113) (end -4.826 -15.367)
          (stroke (width 0.1524) (type default) (color 0 0 0 0))
          (fill (type none))
        )
        (rectangle (start -6.096 -12.573) (end -4.826 -12.827)
          (stroke (width 0.1524) (type default) (color 0 0 0 0))
          (fill (type none))
        )
        (rectangle (start -6.096 -10.033) (end -4.826 -10.287)
          (stroke (width 0.1524) (type default) (color 0 0 0 0))
          (fill (type none))
        )
        (rectangle (start -6.096 -7.493) (end -4.826 -7.747)
          (stroke (width 0.1524) (type default) (color 0 0 0 0))
          (fill (type none))
        )
        (rectangle (start -6.096 -4.953) (end -4.826 -5.207)
          (stroke (width 0.1524) (type default) (color 0 0 0 0))
          (fill (type none))
        )
        (rectangle (start -6.096 -2.413) (end -4.826 -2.667)
          (stroke (width 0.1524) (type default) (color 0 0 0 0))
          (fill (type none))
        )
        (rectangle (start -6.096 0.127) (end -4.826 -0.127)
          (stroke (width 0.1524) (type default) (color 0 0 0 0))
          (fill (type none))
        )
        (rectangle (start -6.096 2.667) (end -4.826 2.413)
          (stroke (width 0.1524) (type default) (color 0 0 0 0))
          (fill (type none))
        )
        (rectangle (start -6.096 5.207) (end -4.826 4.953)
          (stroke (width 0.1524) (type default) (color 0 0 0 0))
          (fill (type none))
        )
        (rectangle (start -6.096 7.747) (end -4.826 7.493)
          (stroke (width 0.1524) (type default) (color 0 0 0 0))
          (fill (type none))
        )
        (rectangle (start -6.096 10.287) (end -4.826 10.033)
          (stroke (width 0.1524) (type default) (color 0 0 0 0))
          (fill (type none))
        )
        (rectangle (start -6.096 12.827) (end -4.826 12.573)
          (stroke (width 0.1524) (type default) (color 0 0 0 0))
          (fill (type none))
        )
        (rectangle (start -6.096 15.367) (end -4.826 15.113)
          (stroke (width 0.1524) (type default) (color 0 0 0 0))
          (fill (type none))
        )
        (rectangle (start -6.096 17.907) (end -4.826 17.653)
          (stroke (width 0.1524) (type default) (color 0 0 0 0))
          (fill (type none))
        )
        (rectangle (start -6.096 20.447) (end -4.826 20.193)
          (stroke (width 0.1524) (type default) (color 0 0 0 0))
          (fill (type none))
        )
        (rectangle (start -6.096 22.987) (end -4.826 22.733)
          (stroke (width 0.1524) (type default) (color 0 0 0 0))
          (fill (type none))
        )
        (rectangle (start -6.096 25.527) (end -4.826 25.273)
          (stroke (width 0.1524) (type default) (color 0 0 0 0))
          (fill (type none))
        )
        (rectangle (start -6.096 28.067) (end -4.826 27.813)
          (stroke (width 0.1524) (type default) (color 0 0 0 0))
          (fill (type none))
        )
        (rectangle (start -6.096 30.607) (end -4.826 30.353)
          (stroke (width 0.1524) (type default) (color 0 0 0 0))
          (fill (type none))
        )
        (rectangle (start -6.096 33.147) (end -4.826 32.893)
          (stroke (width 0.1524) (type default) (color 0 0 0 0))
          (fill (type none))
        )
        (rectangle (start -6.096 35.687) (end -4.826 35.433)
          (stroke (width 0.1524) (type default) (color 0 0 0 0))
          (fill (type none))
        )
        (rectangle (start -6.096 38.227) (end -4.826 37.973)
          (stroke (width 0.1524) (type default) (color 0 0 0 0))
          (fill (type none))
        )
        (rectangle (start -6.096 40.767) (end -4.826 40.513)
          (stroke (width 0.1524) (type default) (color 0 0 0 0))
          (fill (type none))
        )
        (rectangle (start -6.096 43.307) (end -4.826 43.053)
          (stroke (width 0.1524) (type default) (color 0 0 0 0))
          (fill (type none))
        )
        (rectangle (start -6.096 45.847) (end -4.826 45.593)
          (stroke (width 0.1524) (type default) (color 0 0 0 0))
          (fill (type none))
        )
        (rectangle (start -6.096 48.387) (end -4.826 48.133)
          (stroke (width 0.1524) (type default) (color 0 0 0 0))
          (fill (type none))
        )
        (rectangle (start -6.096 49.276) (end 6.096 -51.816)
          (stroke (width 0.254) (type default) (color 0 0 0 0))
          (fill (type background))
        )
        (pin passive line (at -10.16 48.26 0) (length 4.064)
          (name "V_P" (effects (font (size 1.27 1.27))))
          (number "1" (effects (font (size 1.27 1.27))))
        )
        (pin passive line (at -10.16 25.4 0) (length 4.064)
          (name "GPIO_1_P" (effects (font (size 1.27 1.27))))
          (number "10" (effects (font (size 1.27 1.27))))
        )
        (pin passive line (at -10.16 22.86 0) (length 4.064)
          (name "GPIO_1_N" (effects (font (size 1.27 1.27))))
          (number "11" (effects (font (size 1.27 1.27))))
        )
        (pin passive line (at -10.16 20.32 0) (length 4.064)
          (name "GND" (effects (font (size 1.27 1.27))))
          (number "12" (effects (font (size 1.27 1.27))))
        )
        (pin passive line (at -10.16 17.78 0) (length 4.064)
          (name "GPIO_2_P" (effects (font (size 1.27 1.27))))
          (number "13" (effects (font (size 1.27 1.27))))
        )
        (pin passive line (at -10.16 15.24 0) (length 4.064)
          (name "GPIO_2_N" (effects (font (size 1.27 1.27))))
          (number "14" (effects (font (size 1.27 1.27))))
        )
        (pin passive line (at -10.16 12.7 0) (length 4.064)
          (name "GND" (effects (font (size 1.27 1.27))))
          (number "15" (effects (font (size 1.27 1.27))))
        )
        (pin passive line (at -10.16 10.16 0) (length 4.064)
          (name "GPIO_3_P" (effects (font (size 1.27 1.27))))
          (number "16" (effects (font (size 1.27 1.27))))
        )
        (pin passive line (at -10.16 7.62 0) (length 4.064)
          (name "GPIO_3_N" (effects (font (size 1.27 1.27))))
          (number "17" (effects (font (size 1.27 1.27))))
        )
        (pin passive line (at -10.16 5.08 0) (length 4.064)
          (name "GND" (effects (font (size 1.27 1.27))))
          (number "18" (effects (font (size 1.27 1.27))))
        )
        (pin passive line (at -10.16 2.54 0) (length 4.064)
          (name "GPIO_4_P" (effects (font (size 1.27 1.27))))
          (number "19" (effects (font (size 1.27 1.27))))
        )
        (pin passive line (at -10.16 45.72 0) (length 4.064)
          (name "V_P" (effects (font (size 1.27 1.27))))
          (number "2" (effects (font (size 1.27 1.27))))
        )
        (pin passive line (at -10.16 0 0) (length 4.064)
          (name "GPIO_4_N" (effects (font (size 1.27 1.27))))
          (number "20" (effects (font (size 1.27 1.27))))
        )
        (pin passive line (at -10.16 -2.54 0) (length 4.064)
          (name "GND" (effects (font (size 1.27 1.27))))
          (number "21" (effects (font (size 1.27 1.27))))
        )
        (pin passive line (at -10.16 -5.08 0) (length 4.064)
          (name "GPIO_5_P" (effects (font (size 1.27 1.27))))
          (number "22" (effects (font (size 1.27 1.27))))
        )
        (pin passive line (at -10.16 -7.62 0) (length 4.064)
          (name "GPIO_5_N" (effects (font (size 1.27 1.27))))
          (number "23" (effects (font (size 1.27 1.27))))
        )
        (pin passive line (at -10.16 -10.16 0) (length 4.064)
          (name "GND" (effects (font (size 1.27 1.27))))
          (number "24" (effects (font (size 1.27 1.27))))
        )
        (pin passive line (at -10.16 -12.7 0) (length 4.064)
          (name "GPIO_6_P" (effects (font (size 1.27 1.27))))
          (number "25" (effects (font (size 1.27 1.27))))
        )
        (pin passive line (at -10.16 -15.24 0) (length 4.064)
          (name "GPIO_6_N" (effects (font (size 1.27 1.27))))
          (number "26" (effects (font (size 1.27 1.27))))
        )
        (pin passive line (at -10.16 -17.78 0) (length 4.064)
          (name "GND" (effects (font (size 1.27 1.27))))
          (number "27" (effects (font (size 1.27 1.27))))
        )
        (pin passive line (at -10.16 -20.32 0) (length 4.064)
          (name "GPIO_7_P" (effects (font (size 1.27 1.27))))
          (number "28" (effects (font (size 1.27 1.27))))
        )
        (pin passive line (at -10.16 -22.86 0) (length 4.064)
          (name "GPIO_7_N" (effects (font (size 1.27 1.27))))
          (number "29" (effects (font (size 1.27 1.27))))
        )
        (pin passive line (at -10.16 43.18 0) (length 4.064)
          (name "V_P" (effects (font (size 1.27 1.27))))
          (number "3" (effects (font (size 1.27 1.27))))
        )
        (pin passive line (at -10.16 -25.4 0) (length 4.064)
          (name "GND" (effects (font (size 1.27 1.27))))
          (number "30" (effects (font (size 1.27 1.27))))
        )
        (pin passive line (at -10.16 -27.94 0) (length 4.064)
          (name "GPIO_8_P" (effects (font (size 1.27 1.27))))
          (number "31" (effects (font (size 1.27 1.27))))
        )
        (pin passive line (at -10.16 -30.48 0) (length 4.064)
          (name "GPIO_8_N" (effects (font (size 1.27 1.27))))
          (number "32" (effects (font (size 1.27 1.27))))
        )
        (pin passive line (at -10.16 -33.02 0) (length 4.064)
          (name "GND" (effects (font (size 1.27 1.27))))
          (number "33" (effects (font (size 1.27 1.27))))
        )
        (pin passive line (at -10.16 -35.56 0) (length 4.064)
          (name "GPIO_9_P" (effects (font (size 1.27 1.27))))
          (number "34" (effects (font (size 1.27 1.27))))
        )
        (pin passive line (at -10.16 -38.1 0) (length 4.064)
          (name "GPIO_9_N" (effects (font (size 1.27 1.27))))
          (number "35" (effects (font (size 1.27 1.27))))
        )
        (pin passive line (at -10.16 -40.64 0) (length 4.064)
          (name "GND" (effects (font (size 1.27 1.27))))
          (number "36" (effects (font (size 1.27 1.27))))
        )
        (pin passive line (at -10.16 -43.18 0) (length 4.064)
          (name "GND" (effects (font (size 1.27 1.27))))
          (number "37" (effects (font (size 1.27 1.27))))
        )
        (pin passive line (at -10.16 -45.72 0) (length 4.064)
          (name "GND" (effects (font (size 1.27 1.27))))
          (number "38" (effects (font (size 1.27 1.27))))
        )
        (pin passive line (at -10.16 -48.26 0) (length 4.064)
          (name "GND" (effects (font (size 1.27 1.27))))
          (number "39" (effects (font (size 1.27 1.27))))
        )
        (pin passive line (at -10.16 40.64 0) (length 4.064)
          (name "V_P" (effects (font (size 1.27 1.27))))
          (number "4" (effects (font (size 1.27 1.27))))
        )
        (pin passive line (at -10.16 -50.8 0) (length 4.064)
          (name "GND" (effects (font (size 1.27 1.27))))
          (number "40" (effects (font (size 1.27 1.27))))
        )
        (pin passive line (at -10.16 38.1 0) (length 4.064)
          (name "V_P" (effects (font (size 1.27 1.27))))
          (number "5" (effects (font (size 1.27 1.27))))
        )
        (pin passive line (at -10.16 35.56 0) (length 4.064)
          (name "GND" (effects (font (size 1.27 1.27))))
          (number "6" (effects (font (size 1.27 1.27))))
        )
        (pin passive line (at -10.16 33.02 0) (length 4.064)
          (name "GPIO_0_P" (effects (font (size 1.27 1.27))))
          (number "7" (effects (font (size 1.27 1.27))))
        )
        (pin passive line (at -10.16 30.48 0) (length 4.064)
          (name "GPIO_0_N" (effects (font (size 1.27 1.27))))
          (number "8" (effects (font (size 1.27 1.27))))
        )
        (pin passive line (at -10.16 27.94 0) (length 4.064)
          (name "GND" (effects (font (size 1.27 1.27))))
          (number "9" (effects (font (size 1.27 1.27))))
        )
        (pin passive line (at 0 -55.88 90) (length 3.81)
          (name "Shield" (effects (font (size 1.27 1.27))))
          (number "SH" (effects (font (size 1.27 1.27))))
        )
      )
    )
    (symbol "power:+12V" (power) (pin_names (offset 0)) (in_bom yes) (on_board yes)
      (property "Reference" "#PWR" (id 0) (at 0 -3.81 0)
        (effects (font (size 1.27 1.27)) hide)
      )
      (property "Value" "+12V" (id 1) (at 0 3.556 0)
        (effects (font (size 1.27 1.27)))
      )
      (property "Footprint" "" (id 2) (at 0 0 0)
        (effects (font (size 1.27 1.27)) hide)
      )
      (property "Datasheet" "" (id 3) (at 0 0 0)
        (effects (font (size 1.27 1.27)) hide)
      )
      (property "ki_keywords" "power-flag" (id 4) (at 0 0 0)
        (effects (font (size 1.27 1.27)) hide)
      )
      (property "ki_description" "Power symbol creates a global label with name \"+12V\"" (id 5) (at 0 0 0)
        (effects (font (size 1.27 1.27)) hide)
      )
      (symbol "+12V_0_1"
        (polyline
          (pts
            (xy -0.762 1.27)
            (xy 0 2.54)
          )
          (stroke (width 0) (type default) (color 0 0 0 0))
          (fill (type none))
        )
        (polyline
          (pts
            (xy 0 0)
            (xy 0 2.54)
          )
          (stroke (width 0) (type default) (color 0 0 0 0))
          (fill (type none))
        )
        (polyline
          (pts
            (xy 0 2.54)
            (xy 0.762 1.27)
          )
          (stroke (width 0) (type default) (color 0 0 0 0))
          (fill (type none))
        )
      )
      (symbol "+12V_1_1"
        (pin power_in line (at 0 0 90) (length 0) hide
          (name "+12V" (effects (font (size 1.27 1.27))))
          (number "1" (effects (font (size 1.27 1.27))))
        )
      )
    )
    (symbol "power:GND" (power) (pin_names (offset 0)) (in_bom yes) (on_board yes)
      (property "Reference" "#PWR" (id 0) (at 0 -6.35 0)
        (effects (font (size 1.27 1.27)) hide)
      )
      (property "Value" "GND" (id 1) (at 0 -3.81 0)
        (effects (font (size 1.27 1.27)))
      )
      (property "Footprint" "" (id 2) (at 0 0 0)
        (effects (font (size 1.27 1.27)) hide)
      )
      (property "Datasheet" "" (id 3) (at 0 0 0)
        (effects (font (size 1.27 1.27)) hide)
      )
      (property "ki_keywords" "power-flag" (id 4) (at 0 0 0)
        (effects (font (size 1.27 1.27)) hide)
      )
      (property "ki_description" "Power symbol creates a global label with name \"GND\" , ground" (id 5) (at 0 0 0)
        (effects (font (size 1.27 1.27)) hide)
      )
      (symbol "GND_0_1"
        (polyline
          (pts
            (xy 0 0)
            (xy 0 -1.27)
            (xy 1.27 -1.27)
            (xy 0 -2.54)
            (xy -1.27 -1.27)
            (xy 0 -1.27)
          )
          (stroke (width 0) (type default) (color 0 0 0 0))
          (fill (type none))
        )
      )
      (symbol "GND_1_1"
        (pin power_in line (at 0 0 270) (length 0) hide
          (name "GND" (effects (font (size 1.27 1.27))))
          (number "1" (effects (font (size 1.27 1.27))))
        )
      )
    )
    (symbol "power:PWR_FLAG" (power) (pin_numbers hide) (pin_names (offset 0) hide) (in_bom yes) (on_board yes)
      (property "Reference" "#FLG" (id 0) (at 0 1.905 0)
        (effects (font (size 1.27 1.27)) hide)
      )
      (property "Value" "PWR_FLAG" (id 1) (at 0 3.81 0)
        (effects (font (size 1.27 1.27)))
      )
      (property "Footprint" "" (id 2) (at 0 0 0)
        (effects (font (size 1.27 1.27)) hide)
      )
      (property "Datasheet" "~" (id 3) (at 0 0 0)
        (effects (font (size 1.27 1.27)) hide)
      )
      (property "ki_keywords" "power-flag" (id 4) (at 0 0 0)
        (effects (font (size 1.27 1.27)) hide)
      )
      (property "ki_description" "Special symbol for telling ERC where power comes from" (id 5) (at 0 0 0)
        (effects (font (size 1.27 1.27)) hide)
      )
      (symbol "PWR_FLAG_0_0"
        (pin power_out line (at 0 0 90) (length 0)
          (name "pwr" (effects (font (size 1.27 1.27))))
          (number "1" (effects (font (size 1.27 1.27))))
        )
      )
      (symbol "PWR_FLAG_0_1"
        (polyline
          (pts
            (xy 0 0)
            (xy 0 1.27)
            (xy -1.016 1.905)
            (xy 0 2.54)
            (xy 1.016 1.905)
            (xy 0 1.27)
          )
          (stroke (width 0) (type default) (color 0 0 0 0))
          (fill (type none))
        )
      )
    )
  )

  (junction (at 133.35 72.39) (diameter 0) (color 0 0 0 0)
    (uuid 0ba997b2-82aa-4c42-869a-ac96ab97e01d)
  )
  (junction (at 133.35 80.01) (diameter 0) (color 0 0 0 0)
    (uuid 0f20e524-6310-42f4-935d-c9b63427b6de)
  )
  (junction (at 133.35 52.07) (diameter 0) (color 0 0 0 0)
    (uuid 36342d9f-333d-4849-a53a-bc4fe505cce3)
  )
  (junction (at 133.35 140.97) (diameter 0) (color 0 0 0 0)
    (uuid 3ea036a5-bf9b-4c7b-969a-10f1c94aefa3)
  )
  (junction (at 133.35 95.25) (diameter 0) (color 0 0 0 0)
    (uuid 4018e1b7-7c1c-4ef0-83ab-859b1b78b109)
  )
  (junction (at 133.35 118.11) (diameter 0) (color 0 0 0 0)
    (uuid 494038c7-7c90-45ac-b18a-7617b42fd74b)
  )
  (junction (at 133.35 146.05) (diameter 0) (color 0 0 0 0)
    (uuid 5bbc5cd2-a0e0-4999-9a27-afae754fb5a9)
  )
  (junction (at 133.35 87.63) (diameter 0) (color 0 0 0 0)
    (uuid 615a6efc-101c-4e16-b95c-8d8b9ddbbe40)
  )
  (junction (at 133.35 125.73) (diameter 0) (color 0 0 0 0)
    (uuid 64d1f61a-d754-41ca-813c-8247ffb2093b)
  )
  (junction (at 133.35 133.35) (diameter 0) (color 0 0 0 0)
    (uuid 78ed90cd-3120-4fc1-a3e3-68a7d6ce5a0e)
  )
  (junction (at 133.35 54.61) (diameter 0) (color 0 0 0 0)
    (uuid 82dd446b-fc2c-43ba-921e-fc7b09f6cb32)
  )
  (junction (at 146.05 157.48) (diameter 0) (color 0 0 0 0)
    (uuid 833d071f-13ef-40f5-a3df-b7008088cb54)
  )
  (junction (at 133.35 151.13) (diameter 0) (color 0 0 0 0)
    (uuid 89592a2d-07a3-4ac3-95ee-d4318dfbb472)
  )
  (junction (at 133.35 102.87) (diameter 0) (color 0 0 0 0)
    (uuid 96cc3383-6782-46eb-882e-78310d271fae)
  )
  (junction (at 133.35 57.15) (diameter 0) (color 0 0 0 0)
    (uuid 9dc72f95-45c6-4962-89d6-d2e640a68668)
  )
  (junction (at 133.35 148.59) (diameter 0) (color 0 0 0 0)
    (uuid aea766fe-4243-44e9-b511-b9f2d5c6a755)
  )
  (junction (at 133.35 59.69) (diameter 0) (color 0 0 0 0)
    (uuid b94758c0-46b9-4eaf-b6e2-35a7263e95de)
  )
  (junction (at 133.35 110.49) (diameter 0) (color 0 0 0 0)
    (uuid da2c1d4f-eef9-45e2-942b-5f0485269f29)
  )
  (junction (at 44.45 39.37) (diameter 0) (color 0 0 0 0)
    (uuid e39dd6bb-ebf9-4210-96f8-f2db927484eb)
  )
  (junction (at 133.35 143.51) (diameter 0) (color 0 0 0 0)
    (uuid e54fba48-7609-4791-9d50-5ed1c785a2e0)
  )

  (no_connect (at 135.89 113.03) (uuid 02fe6080-e474-424c-9233-6826a4ed8661))
  (no_connect (at 135.89 115.57) (uuid 02fe6080-e474-424c-9233-6826a4ed8662))
  (no_connect (at 135.89 120.65) (uuid 0b546672-d4bc-47e7-afed-5c5c305f4ccb))
  (no_connect (at 135.89 123.19) (uuid 0b546672-d4bc-47e7-afed-5c5c305f4ccc))
  (no_connect (at 135.89 128.27) (uuid 0b546672-d4bc-47e7-afed-5c5c305f4ccd))
  (no_connect (at 135.89 130.81) (uuid 0b546672-d4bc-47e7-afed-5c5c305f4cce))
  (no_connect (at 135.89 135.89) (uuid 0b546672-d4bc-47e7-afed-5c5c305f4ccf))
  (no_connect (at 135.89 138.43) (uuid 0b546672-d4bc-47e7-afed-5c5c305f4cd0))

  (bus_entry (at 116.84 90.17) (size 2.54 2.54)
    (stroke (width 0) (type default) (color 0 0 0 0))
    (uuid 09deb23f-f903-4d7d-8671-a6138c400040)
  )
  (bus_entry (at 114.3 102.87) (size 2.54 2.54)
    (stroke (width 0) (type default) (color 0 0 0 0))
    (uuid 0efa966c-4cea-472d-ad11-5b00b6f0458e)
  )
  (bus_entry (at 116.84 67.31) (size 2.54 2.54)
    (stroke (width 0) (type default) (color 0 0 0 0))
    (uuid 10523188-cd63-4103-b104-0c6287b53da0)
  )
  (bus_entry (at 116.84 64.77) (size 2.54 2.54)
    (stroke (width 0) (type default) (color 0 0 0 0))
    (uuid 11a1fc49-10fa-4aa5-bae4-eb9cd422cd96)
  )
  (bus_entry (at 114.3 95.25) (size 2.54 2.54)
    (stroke (width 0) (type default) (color 0 0 0 0))
    (uuid 21f7f9f3-ddb6-49d7-b589-eb32a65fc0f4)
  )
  (bus_entry (at 116.84 82.55) (size 2.54 2.54)
    (stroke (width 0) (type default) (color 0 0 0 0))
    (uuid 52cfd9ab-2b06-4a93-b0e2-efd336d8cf63)
  )
  (bus_entry (at 114.3 105.41) (size 2.54 2.54)
    (stroke (width 0) (type default) (color 0 0 0 0))
    (uuid 58bf34fc-4766-4f85-9fc5-c7b2c9c7ae48)
  )
  (bus_entry (at 116.84 87.63) (size 2.54 2.54)
    (stroke (width 0) (type default) (color 0 0 0 0))
    (uuid 7cf795de-5a81-4c8d-a3c2-5ef4289b829b)
  )
  (bus_entry (at 116.84 72.39) (size 2.54 2.54)
    (stroke (width 0) (type default) (color 0 0 0 0))
    (uuid 81770dc6-2ba2-405a-8d58-d76f7af63053)
  )
  (bus_entry (at 116.84 80.01) (size 2.54 2.54)
    (stroke (width 0) (type default) (color 0 0 0 0))
    (uuid 8cc8e5f8-04fa-4ed0-8d66-f55117f47de3)
  )
  (bus_entry (at 116.84 74.93) (size 2.54 2.54)
    (stroke (width 0) (type default) (color 0 0 0 0))
    (uuid b0525291-9eda-4f5a-a568-2212696d435d)
  )
  (bus_entry (at 114.3 97.79) (size 2.54 2.54)
    (stroke (width 0) (type default) (color 0 0 0 0))
    (uuid f4518fc6-75aa-4d99-b71c-b3533837fe51)
  )

  (wire (pts (xy 133.35 146.05) (xy 135.89 146.05))
    (stroke (width 0) (type default) (color 0 0 0 0))
    (uuid 01371af2-46dc-44df-a8ad-28008cdb5d75)
  )
  (wire (pts (xy 101.6 38.1) (xy 101.6 40.64))
    (stroke (width 0) (type default) (color 0 0 0 0))
    (uuid 05fd42be-d262-45c1-b386-5ac921e74645)
  )
  (bus (pts (xy 116.84 67.31) (xy 116.84 72.39))
    (stroke (width 0) (type default) (color 0 0 0 0))
    (uuid 0d47b35c-23d5-41dd-a020-9f41ccc5d7bb)
  )
  (bus (pts (xy 116.84 64.77) (xy 116.84 67.31))
    (stroke (width 0) (type default) (color 0 0 0 0))
    (uuid 16319f35-4755-4941-8d52-589b1f46aadb)
  )

  (wire (pts (xy 52.07 36.83) (xy 52.07 39.37))
    (stroke (width 0) (type default) (color 0 0 0 0))
    (uuid 1a5c19f7-70a9-40f5-8733-99bdd69d7687)
  )
  (bus (pts (xy 116.84 59.69) (xy 116.84 64.77))
    (stroke (width 0) (type default) (color 0 0 0 0))
    (uuid 214e7ba8-2452-42fc-a0ad-b59bc448e71c)
  )

  (wire (pts (xy 133.35 110.49) (xy 135.89 110.49))
    (stroke (width 0) (type default) (color 0 0 0 0))
    (uuid 228a218e-34b2-4c67-9b9f-7d56d9b33133)
  )
  (bus (pts (xy 116.84 87.63) (xy 116.84 90.17))
    (stroke (width 0) (type default) (color 0 0 0 0))
    (uuid 23671197-e741-4e7f-ba5b-f23ec8785ce7)
  )

  (wire (pts (xy 133.35 57.15) (xy 133.35 59.69))
    (stroke (width 0) (type default) (color 0 0 0 0))
    (uuid 25d898f6-b605-4172-9717-7d37d1395fcd)
  )
  (wire (pts (xy 116.84 105.41) (xy 135.89 105.41))
    (stroke (width 0) (type default) (color 0 0 0 0))
    (uuid 265686f0-5082-47d8-b7ef-c7ad9f9e743a)
  )
  (wire (pts (xy 133.35 72.39) (xy 135.89 72.39))
    (stroke (width 0) (type default) (color 0 0 0 0))
    (uuid 2840890b-4111-4e13-8c2f-481faac39a20)
  )
  (wire (pts (xy 133.35 148.59) (xy 135.89 148.59))
    (stroke (width 0) (type default) (color 0 0 0 0))
    (uuid 2fd08d45-32a1-44f8-bbdc-b4176b138acf)
  )
  (wire (pts (xy 133.35 59.69) (xy 133.35 62.23))
    (stroke (width 0) (type default) (color 0 0 0 0))
    (uuid 30398fcf-ae4f-4b8c-aa97-00206b0f3912)
  )
  (wire (pts (xy 133.35 143.51) (xy 133.35 146.05))
    (stroke (width 0) (type default) (color 0 0 0 0))
    (uuid 34b6afe0-3aa6-46c7-8b7c-ab1094fd3914)
  )
  (wire (pts (xy 44.45 67.31) (xy 44.45 64.77))
    (stroke (width 0) (type default) (color 0 0 0 0))
    (uuid 35e45c53-da70-4598-befe-2e712785cf5b)
  )
  (wire (pts (xy 133.35 157.48) (xy 146.05 157.48))
    (stroke (width 0) (type default) (color 0 0 0 0))
    (uuid 36162061-612d-4e5f-86c4-7c8608161f20)
  )
  (wire (pts (xy 135.89 140.97) (xy 133.35 140.97))
    (stroke (width 0) (type default) (color 0 0 0 0))
    (uuid 367b7025-ceb8-416d-9786-f72fb5ed7390)
  )
  (wire (pts (xy 133.35 64.77) (xy 133.35 72.39))
    (stroke (width 0) (type default) (color 0 0 0 0))
    (uuid 36a8595c-3184-49cd-9cc9-517670dbc29c)
  )
  (wire (pts (xy 133.35 54.61) (xy 133.35 57.15))
    (stroke (width 0) (type default) (color 0 0 0 0))
    (uuid 378fa20c-0c82-48c4-b069-bcec646ffe29)
  )
  (wire (pts (xy 133.35 102.87) (xy 133.35 110.49))
    (stroke (width 0) (type default) (color 0 0 0 0))
    (uuid 39ff818a-e36f-4360-b542-9ce971db2b85)
  )
  (wire (pts (xy 88.9 38.1) (xy 88.9 40.64))
    (stroke (width 0) (type default) (color 0 0 0 0))
    (uuid 3a9ca116-5f17-4996-9608-286332843efb)
  )
  (bus (pts (xy 101.6 92.71) (xy 114.3 92.71))
    (stroke (width 0) (type default) (color 0 0 0 0))
    (uuid 3c2cd51d-0640-46a8-8d56-14ed3880c0ce)
  )

  (wire (pts (xy 119.38 90.17) (xy 135.89 90.17))
    (stroke (width 0) (type default) (color 0 0 0 0))
    (uuid 3c36b856-ca6c-4411-b1d0-ead8a814ff94)
  )
  (wire (pts (xy 146.05 157.48) (xy 146.05 158.75))
    (stroke (width 0) (type default) (color 0 0 0 0))
    (uuid 3f346571-9a48-4504-ae04-a712759f91ae)
  )
  (wire (pts (xy 133.35 125.73) (xy 133.35 133.35))
    (stroke (width 0) (type default) (color 0 0 0 0))
    (uuid 40f8ab50-ad70-427a-bbcd-1126f2c580a9)
  )
  (bus (pts (xy 116.84 72.39) (xy 116.84 74.93))
    (stroke (width 0) (type default) (color 0 0 0 0))
    (uuid 421c1431-fe13-4bcb-ab57-486fbcd897b1)
  )
  (bus (pts (xy 114.3 92.71) (xy 114.3 95.25))
    (stroke (width 0) (type default) (color 0 0 0 0))
    (uuid 425af250-4db4-473b-92f1-44d5825937fe)
  )

  (wire (pts (xy 116.84 107.95) (xy 135.89 107.95))
    (stroke (width 0) (type default) (color 0 0 0 0))
    (uuid 42e72f25-d29a-46df-854c-883778a183c5)
  )
  (wire (pts (xy 119.38 67.31) (xy 135.89 67.31))
    (stroke (width 0) (type default) (color 0 0 0 0))
    (uuid 43e0802d-e604-49e5-9fb4-38fd455403fb)
  )
  (wire (pts (xy 116.84 100.33) (xy 135.89 100.33))
    (stroke (width 0) (type default) (color 0 0 0 0))
    (uuid 45652549-25d2-40e5-8e56-6b0d134cdbca)
  )
  (wire (pts (xy 135.89 62.23) (xy 133.35 62.23))
    (stroke (width 0) (type default) (color 0 0 0 0))
    (uuid 552c450e-0f2e-43e8-a64b-63e9e6d812a1)
  )
  (wire (pts (xy 44.45 39.37) (xy 52.07 39.37))
    (stroke (width 0) (type default) (color 0 0 0 0))
    (uuid 553063b7-9934-45ee-a75a-2e979b7e4f18)
  )
  (wire (pts (xy 135.89 64.77) (xy 133.35 64.77))
    (stroke (width 0) (type default) (color 0 0 0 0))
    (uuid 557db4b5-d1aa-4896-9b6d-b2788dcfedc5)
  )
  (wire (pts (xy 133.35 87.63) (xy 135.89 87.63))
    (stroke (width 0) (type default) (color 0 0 0 0))
    (uuid 5641bf55-5b9f-47db-a7ba-70e14bd6084b)
  )
  (wire (pts (xy 133.35 52.07) (xy 133.35 54.61))
    (stroke (width 0) (type default) (color 0 0 0 0))
    (uuid 58e63952-9086-4e17-8e83-366402f4b1d2)
  )
  (wire (pts (xy 44.45 46.99) (xy 44.45 39.37))
    (stroke (width 0) (type default) (color 0 0 0 0))
    (uuid 591a93de-162c-4bca-b1e8-c235063df0d0)
  )
  (wire (pts (xy 133.35 125.73) (xy 135.89 125.73))
    (stroke (width 0) (type default) (color 0 0 0 0))
    (uuid 596b20b2-18cf-42a2-b9ec-cc6267d6bb0b)
  )
  (wire (pts (xy 44.45 54.61) (xy 44.45 62.23))
    (stroke (width 0) (type default) (color 0 0 0 0))
    (uuid 612648d0-5d4f-46bf-988a-e7d815111412)
  )
  (wire (pts (xy 135.89 52.07) (xy 133.35 52.07))
    (stroke (width 0) (type default) (color 0 0 0 0))
    (uuid 63b417ca-bdcb-4f97-bef5-9bd1251bee58)
  )
  (wire (pts (xy 133.35 148.59) (xy 133.35 151.13))
    (stroke (width 0) (type default) (color 0 0 0 0))
    (uuid 65b9a76a-4f9c-45eb-899a-bfc56db6987a)
  )
  (wire (pts (xy 88.9 48.26) (xy 88.9 50.8))
    (stroke (width 0) (type default) (color 0 0 0 0))
    (uuid 6a5fff46-0e23-48e0-a85d-527d0b713b5c)
  )
  (wire (pts (xy 116.84 97.79) (xy 135.89 97.79))
    (stroke (width 0) (type default) (color 0 0 0 0))
    (uuid 70abaa9e-8b52-4ac6-a51e-3abbb81dc591)
  )
  (bus (pts (xy 114.3 97.79) (xy 114.3 102.87))
    (stroke (width 0) (type default) (color 0 0 0 0))
    (uuid 70deda09-7f72-4317-b950-55c4c06e3145)
  )
  (bus (pts (xy 116.84 82.55) (xy 116.84 87.63))
    (stroke (width 0) (type default) (color 0 0 0 0))
    (uuid 74198f69-2e1e-477f-9bb0-81d672fa7a2a)
  )

  (wire (pts (xy 133.35 133.35) (xy 133.35 140.97))
    (stroke (width 0) (type default) (color 0 0 0 0))
    (uuid 74ba5c80-07d6-4342-8f62-041abbe74db3)
  )
  (wire (pts (xy 119.38 77.47) (xy 135.89 77.47))
    (stroke (width 0) (type default) (color 0 0 0 0))
    (uuid 7d9ecfc9-127e-4a1a-97a2-03240bc43b68)
  )
  (wire (pts (xy 133.35 95.25) (xy 133.35 102.87))
    (stroke (width 0) (type default) (color 0 0 0 0))
    (uuid 7ebff6ed-cc70-4a95-8812-d075e941fbb0)
  )
  (wire (pts (xy 119.38 85.09) (xy 135.89 85.09))
    (stroke (width 0) (type default) (color 0 0 0 0))
    (uuid 8579ad9b-0f4a-450b-bd0f-a27fb75b6644)
  )
  (wire (pts (xy 133.35 54.61) (xy 135.89 54.61))
    (stroke (width 0) (type default) (color 0 0 0 0))
    (uuid 895ec16d-6f5a-4d85-a506-fad1a22d1d04)
  )
  (wire (pts (xy 119.38 74.93) (xy 135.89 74.93))
    (stroke (width 0) (type default) (color 0 0 0 0))
    (uuid 896be424-41a5-452d-aaff-e74437cba378)
  )
  (wire (pts (xy 133.35 102.87) (xy 135.89 102.87))
    (stroke (width 0) (type default) (color 0 0 0 0))
    (uuid 8baf83a7-f571-42ed-ae7f-ae29529f31b9)
  )
  (bus (pts (xy 114.3 59.69) (xy 116.84 59.69))
    (stroke (width 0) (type default) (color 0 0 0 0))
    (uuid 99e7c1f3-a7e2-4b47-8376-94213b9febdd)
  )

  (wire (pts (xy 69.85 38.1) (xy 69.85 40.64))
    (stroke (width 0) (type default) (color 0 0 0 0))
    (uuid a51fcc37-d105-411f-a927-e70c4b49318a)
  )
  (bus (pts (xy 114.3 102.87) (xy 114.3 105.41))
    (stroke (width 0) (type default) (color 0 0 0 0))
    (uuid a81e6983-0498-46a5-97d0-86825ed989e9)
  )

  (wire (pts (xy 133.35 146.05) (xy 133.35 148.59))
    (stroke (width 0) (type default) (color 0 0 0 0))
    (uuid ac25861d-7607-40d2-85ee-bd0484c8c81f)
  )
  (wire (pts (xy 133.35 72.39) (xy 133.35 80.01))
    (stroke (width 0) (type default) (color 0 0 0 0))
    (uuid ad5dbf34-f12c-4fdf-a7b2-ebdd57571a06)
  )
  (wire (pts (xy 133.35 46.99) (xy 133.35 52.07))
    (stroke (width 0) (type default) (color 0 0 0 0))
    (uuid afc53baa-ae56-4ed7-a112-9797f420c897)
  )
  (wire (pts (xy 44.45 38.1) (xy 44.45 39.37))
    (stroke (width 0) (type default) (color 0 0 0 0))
    (uuid b9a56b54-3042-4dc8-8513-605c818a2147)
  )
  (wire (pts (xy 119.38 82.55) (xy 135.89 82.55))
    (stroke (width 0) (type default) (color 0 0 0 0))
    (uuid bb1ca33c-699a-4b96-9b7a-bd8b92089c7c)
  )
  (wire (pts (xy 133.35 143.51) (xy 135.89 143.51))
    (stroke (width 0) (type default) (color 0 0 0 0))
    (uuid c3193580-9c0a-43c2-af88-9ad90834acbb)
  )
  (wire (pts (xy 133.35 133.35) (xy 135.89 133.35))
    (stroke (width 0) (type default) (color 0 0 0 0))
    (uuid c426e793-4ce7-46e7-97cb-a1097d673365)
  )
  (wire (pts (xy 133.35 140.97) (xy 133.35 143.51))
    (stroke (width 0) (type default) (color 0 0 0 0))
    (uuid c9294611-5fac-48d3-9157-d3f62584e412)
  )
  (wire (pts (xy 44.45 64.77) (xy 38.1 64.77))
    (stroke (width 0) (type default) (color 0 0 0 0))
    (uuid cb1dd9b6-53c9-45ed-b056-8fbe6b70cc53)
  )
  (bus (pts (xy 116.84 80.01) (xy 116.84 82.55))
    (stroke (width 0) (type default) (color 0 0 0 0))
    (uuid cbb07a91-3b6f-4bc5-86b6-21a36b548028)
  )

  (wire (pts (xy 133.35 118.11) (xy 133.35 125.73))
    (stroke (width 0) (type default) (color 0 0 0 0))
    (uuid cd7aa83d-666d-4b98-a6a1-e5b95e1a3d76)
  )
  (wire (pts (xy 69.85 27.94) (xy 69.85 30.48))
    (stroke (width 0) (type default) (color 0 0 0 0))
    (uuid cf986e24-08de-466e-b32c-4b10b93c34a2)
  )
  (wire (pts (xy 133.35 87.63) (xy 133.35 95.25))
    (stroke (width 0) (type default) (color 0 0 0 0))
    (uuid d11c2176-8fd6-4304-80f6-a587a4c62a4b)
  )
  (wire (pts (xy 119.38 92.71) (xy 135.89 92.71))
    (stroke (width 0) (type default) (color 0 0 0 0))
    (uuid d1407ba4-4487-4596-9aff-ba59cede6c86)
  )
  (wire (pts (xy 69.85 48.26) (xy 69.85 50.8))
    (stroke (width 0) (type default) (color 0 0 0 0))
    (uuid d14dcba5-7044-484a-b093-48bf526749d6)
  )
  (wire (pts (xy 133.35 151.13) (xy 133.35 157.48))
    (stroke (width 0) (type default) (color 0 0 0 0))
    (uuid daad89c8-9daf-4b78-98c3-2a592475fabc)
  )
  (wire (pts (xy 146.05 156.21) (xy 146.05 157.48))
    (stroke (width 0) (type default) (color 0 0 0 0))
    (uuid db1c5033-a40a-4a22-aee8-e73c943d82de)
  )
  (wire (pts (xy 44.45 62.23) (xy 38.1 62.23))
    (stroke (width 0) (type default) (color 0 0 0 0))
    (uuid e222da42-2c51-4269-9a77-115ef841f0ff)
  )
  (wire (pts (xy 119.38 69.85) (xy 135.89 69.85))
    (stroke (width 0) (type default) (color 0 0 0 0))
    (uuid e68d5fd0-31ca-40cc-9e3f-b5f88dff5f78)
  )
  (wire (pts (xy 133.35 95.25) (xy 135.89 95.25))
    (stroke (width 0) (type default) (color 0 0 0 0))
    (uuid e72748a8-cc24-49e8-9f0f-10d37e2f0b07)
  )
  (bus (pts (xy 116.84 74.93) (xy 116.84 80.01))
    (stroke (width 0) (type default) (color 0 0 0 0))
    (uuid e914ec68-2b5e-400a-ae3f-91fd3a622766)
  )

  (wire (pts (xy 133.35 151.13) (xy 135.89 151.13))
    (stroke (width 0) (type default) (color 0 0 0 0))
    (uuid ebc4d426-52bf-485e-9176-d6fdb782a51b)
  )
  (wire (pts (xy 133.35 80.01) (xy 133.35 87.63))
    (stroke (width 0) (type default) (color 0 0 0 0))
    (uuid ec6e7cf3-f18d-49d0-b735-e109588b4b49)
  )
  (wire (pts (xy 133.35 57.15) (xy 135.89 57.15))
    (stroke (width 0) (type default) (color 0 0 0 0))
    (uuid ec7c37c9-324d-4abc-b80e-711062c0c552)
  )
  (wire (pts (xy 133.35 118.11) (xy 135.89 118.11))
    (stroke (width 0) (type default) (color 0 0 0 0))
    (uuid f2b317b0-37ee-439f-a938-6b169f9eba5b)
  )
  (wire (pts (xy 133.35 80.01) (xy 135.89 80.01))
    (stroke (width 0) (type default) (color 0 0 0 0))
    (uuid f32a9b49-50da-46b6-8c3e-81136a388898)
  )
  (wire (pts (xy 133.35 110.49) (xy 133.35 118.11))
    (stroke (width 0) (type default) (color 0 0 0 0))
    (uuid f358f75f-3ea5-4d6b-b87f-6f51cb925491)
  )
  (bus (pts (xy 114.3 95.25) (xy 114.3 97.79))
    (stroke (width 0) (type default) (color 0 0 0 0))
    (uuid f63a96ef-3072-4336-93bd-93efe1306e62)
  )

  (wire (pts (xy 101.6 48.26) (xy 101.6 50.8))
    (stroke (width 0) (type default) (color 0 0 0 0))
    (uuid f767f4cc-3065-43dc-a83b-6e015b834192)
  )
  (wire (pts (xy 133.35 59.69) (xy 135.89 59.69))
    (stroke (width 0) (type default) (color 0 0 0 0))
    (uuid fee8a6d3-23de-415d-be30-4e00c2aeff9c)
  )

  (label "UART.TX" (at 120.65 100.33 0)
    (effects (font (size 1.27 1.27)) (justify left bottom))
    (uuid 04138fed-9a86-427d-9434-a5bf7c71dca9)
  )
  (label "SDR_GPIO1" (at 120.65 69.85 0)
    (effects (font (size 1.27 1.27)) (justify left bottom))
    (uuid 1c0efc12-f575-4b0e-9263-f29ffaa95656)
  )
  (label "UART.CTS" (at 120.65 105.41 0)
    (effects (font (size 1.27 1.27)) (justify left bottom))
    (uuid 2b111ff1-79be-477c-88dd-f011332df4ed)
  )
  (label "SDR_GPIO2" (at 120.65 74.93 0)
    (effects (font (size 1.27 1.27)) (justify left bottom))
    (uuid 31a8b2cc-2f0e-42f1-98e9-73660d7d058e)
  )
  (label "SDR_GPIO7" (at 120.65 92.71 0)
    (effects (font (size 1.27 1.27)) (justify left bottom))
    (uuid 57eff4f0-c7dc-4b26-9176-32ae3d0774bb)
  )
  (label "SDR_GPIO4" (at 120.65 82.55 0)
    (effects (font (size 1.27 1.27)) (justify left bottom))
    (uuid 638e557f-c019-468a-941f-ca13fbcf6a04)
  )
  (label "DAMP" (at 69.85 39.37 0)
    (effects (font (size 1.27 1.27)) (justify left bottom))
    (uuid 70f1fbec-7009-4483-8023-0f9ad1d03720)
  )
  (label "UART.RX" (at 120.65 97.79 0)
    (effects (font (size 1.27 1.27)) (justify left bottom))
    (uuid 96819c9e-2714-413b-8d19-a866cfbdfc2e)
  )
  (label "12V_IN" (at 44.45 62.23 0)
    (effects (font (size 1.27 1.27)) (justify left bottom))
    (uuid b02f32fa-9069-4cbf-bcef-5e7eda1007e6)
  )
  (label "SDR_GPIO5" (at 120.65 85.09 0)
    (effects (font (size 1.27 1.27)) (justify left bottom))
    (uuid b9fffd2d-7013-4e9b-8b9d-75082f729357)
  )
  (label "UART.DTR" (at 120.65 107.95 0)
    (effects (font (size 1.27 1.27)) (justify left bottom))
    (uuid dd90d109-0486-4066-829e-063bfc2e194a)
  )
  (label "SDR_GPIO6" (at 120.65 90.17 0)
    (effects (font (size 1.27 1.27)) (justify left bottom))
    (uuid e192b4e8-8e2c-4643-b358-be84e312c05a)
  )
  (label "SDR_GPIO3" (at 120.65 77.47 0)
    (effects (font (size 1.27 1.27)) (justify left bottom))
    (uuid f7dfcfb4-7918-4a1c-834d-9204e82e9fbe)
  )
  (label "SDR_GPIO0" (at 120.65 67.31 0)
    (effects (font (size 1.27 1.27)) (justify left bottom))
    (uuid f8fb2dd0-abc8-40f4-8914-dc998802a573)
  )

  (hierarchical_label "SDR_GPIO[0..7]" (shape bidirectional) (at 114.3 59.69 180)
    (effects (font (size 1.27 1.27)) (justify right))
    (uuid 1728fa34-bca2-4c2a-8201-91421cba19eb)
  )
  (hierarchical_label "UART{RX,TX,CTS,DTR}" (shape bidirectional) (at 101.6 92.71 180)
    (effects (font (size 1.27 1.27)) (justify right))
    (uuid c7752fae-ce8c-4998-b554-197b5ff0da05)
  )

  (symbol (lib_id "power:+12V") (at 88.9 38.1 0) (unit 1)
    (in_bom yes) (on_board yes) (fields_autoplaced)
    (uuid 0e4933bc-3068-4639-9123-cf5525ae0685)
    (property "Reference" "#PWR?" (id 0) (at 88.9 41.91 0)
      (effects (font (size 1.27 1.27)) hide)
    )
    (property "Value" "+12V" (id 1) (at 88.9 33.02 0))
    (property "Footprint" "" (id 2) (at 88.9 38.1 0)
      (effects (font (size 1.27 1.27)) hide)
    )
    (property "Datasheet" "" (id 3) (at 88.9 38.1 0)
      (effects (font (size 1.27 1.27)) hide)
    )
    (pin "1" (uuid ffc8ff47-8252-41e2-a181-14744d16d5f8))
  )

  (symbol (lib_id "POWDER_FPGA_Connectors:Bottom_Interface") (at 146.05 100.33 0) (unit 1)
    (in_bom yes) (on_board yes) (fields_autoplaced)
    (uuid 13ef08b8-386e-42eb-a391-c3cfb7ce2161)
    (property "Reference" "J302" (id 0) (at 153.67 100.3299 0)
      (effects (font (size 1.27 1.27)) (justify left))
    )
    (property "Value" "Bottom_Interface" (id 1) (at 153.67 102.8699 0)
      (effects (font (size 1.27 1.27)) (justify left))
    )
    (property "Footprint" "POWDER_Connector:CVILUX_CF20_1x40-1MP_P0.50mm_Horizontal" (id 2) (at 140.97 100.33 0)
      (effects (font (size 1.27 1.27)) hide)
    )
    (property "Datasheet" "~" (id 3) (at 140.97 100.33 0)
      (effects (font (size 1.27 1.27)) hide)
    )
    (property "PartSpecification" "3000-0000001549" (id 4) (at 146.05 100.33 0)
      (effects (font (size 1.27 1.27)) hide)
    )
    (pin "1" (uuid 15f87af0-79bd-4f8a-a20b-7029f559f8d3))
    (pin "10" (uuid 31b863ea-7c32-4f6c-80cd-0af58c715b11))
    (pin "11" (uuid 4a1bdc4d-3a56-48a9-8b50-51f4da3e3c77))
    (pin "12" (uuid c9d9c9b2-d07f-45f8-83da-786b00b90085))
    (pin "13" (uuid fcd6f4d4-93f2-40a3-933b-484bd5869c33))
    (pin "14" (uuid 8a11df9b-b1c8-46bd-ad02-38e3c6faa8b1))
    (pin "15" (uuid 19736b81-d347-4f72-a169-5ed97cd5637f))
    (pin "16" (uuid 13d5c3aa-4618-425d-ae2c-a2734a1c097e))
    (pin "17" (uuid b63c8c2f-afba-40d6-a6c7-beade10034ca))
    (pin "18" (uuid f825c74d-246e-4c8b-a7c5-6ad2eb8a0636))
    (pin "19" (uuid ab070c6a-2dc5-4f49-950f-64030862e818))
    (pin "2" (uuid 4d27171a-b5f4-470a-857d-6a18ee3b1421))
    (pin "20" (uuid c8376e18-211e-4e63-b866-a26d69b11d53))
    (pin "21" (uuid 46e16a44-953f-4b5a-a54c-2cfd3ea6a261))
    (pin "22" (uuid 75ca3221-c644-44c6-894a-2fef80680837))
    (pin "23" (uuid b5383188-3970-44ad-84fe-b7cbc0011dd4))
    (pin "24" (uuid 347ae190-f6d7-4811-bf62-90fe109d3eb6))
    (pin "25" (uuid 302e58a7-cd9c-4648-866a-b6d937db4c21))
    (pin "26" (uuid 09ff1efc-616e-4171-8903-3f0295297375))
    (pin "27" (uuid 37097c58-fc8e-4383-856c-c6bab499ddee))
    (pin "28" (uuid 6659d201-823c-4b27-837b-8b2bb3477a45))
    (pin "29" (uuid f53f23ac-75d1-433f-92c4-60dfea118e88))
    (pin "3" (uuid c10f664e-b51a-4d8f-b103-7aef423e94db))
    (pin "30" (uuid 18b98943-69df-4dff-af2f-246b19692043))
    (pin "31" (uuid 584e06d7-f786-47a2-a2dc-1733dad26722))
    (pin "32" (uuid d8d66ffd-10bf-4752-9b81-c1a185ca3a34))
    (pin "33" (uuid b785b997-9964-4034-9903-fec9e2ed2207))
    (pin "34" (uuid d7d42dd2-0df7-408c-915f-2f56cb376e8a))
    (pin "35" (uuid c93c3067-34d2-4f6d-9a82-d635b429b9c1))
    (pin "36" (uuid 6116c7e7-a2e0-4562-8380-44b5f96e3999))
    (pin "37" (uuid bd0946ab-009e-43da-bddc-c14715d8a332))
    (pin "38" (uuid 6def7ffd-80c4-4eaf-bc76-b593307c3e8a))
    (pin "39" (uuid 17dcf683-60bd-45a7-a700-ffb9cb502210))
    (pin "4" (uuid 76a24f5a-f9e2-4296-b9cc-02499dad48af))
    (pin "40" (uuid 0418b008-ee1d-4b40-8be2-9e6e873343d6))
    (pin "5" (uuid b1352b23-3745-4b52-8119-b5434e7b2b2e))
    (pin "6" (uuid a218c75b-bb80-459a-830e-a9c9f66ef233))
    (pin "7" (uuid cfb80501-53e8-4d66-b717-1c583e3286f5))
    (pin "8" (uuid 922cc3bd-5806-4e17-9850-47ff11cb7c54))
    (pin "9" (uuid 8109f190-70db-4ee8-8bb8-11f32c62c0b9))
    (pin "SH" (uuid 169f43e8-e0cd-4b2b-9643-186894d526f1))
  )

  (symbol (lib_id "Device:FerriteBead") (at 44.45 50.8 0) (unit 1)
    (in_bom yes) (on_board yes) (fields_autoplaced)
    (uuid 1528786d-84ed-4b9f-b52e-1fd93f3a2be5)
    (property "Reference" "FB301" (id 0) (at 48.26 49.4791 0)
      (effects (font (size 1.27 1.27)) (justify left))
    )
    (property "Value" "FerriteBead" (id 1) (at 48.26 52.0191 0)
      (effects (font (size 1.27 1.27)) (justify left))
    )
    (property "Footprint" "Inductor_SMD:L_0805_2012Metric" (id 2) (at 42.672 50.8 90)
      (effects (font (size 1.27 1.27)) hide)
    )
    (property "Datasheet" "~" (id 3) (at 44.45 50.8 0)
      (effects (font (size 1.27 1.27)) hide)
    )
    (property "PartNumber" "742792040" (id 4) (at 44.45 50.8 0)
      (effects (font (size 1.27 1.27)) hide)
    )
    (property "Manufacturer" "Würth Elektronik" (id 5) (at 44.45 50.8 0)
      (effects (font (size 1.27 1.27)) hide)
    )
    (property "PartSpecification" "3000-0000001682" (id 6) (at 44.45 50.8 0)
      (effects (font (size 1.27 1.27)) hide)
    )
    (pin "1" (uuid c0741f1b-4473-400a-b07e-7c981e82b460))
    (pin "2" (uuid 89ab0754-e73a-4b27-9d6a-e0ea1b284f1e))
  )

  (symbol (lib_id "power:GND") (at 146.05 158.75 0) (unit 1)
    (in_bom yes) (on_board yes) (fields_autoplaced)
    (uuid 170fcd1d-43c9-42cd-b9f3-bc240fbb1bac)
    (property "Reference" "#PWR?" (id 0) (at 146.05 165.1 0)
      (effects (font (size 1.27 1.27)) hide)
    )
    (property "Value" "GND" (id 1) (at 146.05 163.83 0))
    (property "Footprint" "" (id 2) (at 146.05 158.75 0)
      (effects (font (size 1.27 1.27)) hide)
    )
    (property "Datasheet" "" (id 3) (at 146.05 158.75 0)
      (effects (font (size 1.27 1.27)) hide)
    )
    (pin "1" (uuid d8a454ca-c40c-49cc-b5f4-076b5f1f15a8))
  )

  (symbol (lib_id "Device:C_Polarized") (at 69.85 44.45 0) (unit 1)
    (in_bom yes) (on_board yes) (fields_autoplaced)
    (uuid 3d82ada4-19d6-42c2-b5d4-8aea8082d391)
    (property "Reference" "C301" (id 0) (at 73.66 42.2909 0)
      (effects (font (size 1.27 1.27)) (justify left))
    )
    (property "Value" "100uF" (id 1) (at 73.66 44.8309 0)
      (effects (font (size 1.27 1.27)) (justify left))
    )
    (property "Footprint" "Capacitor_SMD:C_Elec_6.3x5.8" (id 2) (at 70.8152 48.26 0)
      (effects (font (size 1.27 1.27)) hide)
    )
    (property "Datasheet" "~" (id 3) (at 69.85 44.45 0)
      (effects (font (size 1.27 1.27)) hide)
    )
    (property "PartNumber" "UUD1C101MCL1GS" (id 4) (at 69.85 44.45 0)
      (effects (font (size 1.27 1.27)) hide)
    )
    (property "Manufacturer" "Nichicon" (id 5) (at 69.85 44.45 0)
      (effects (font (size 1.27 1.27)) hide)
    )
    (property "PartSpecification" "3000-0000001681" (id 6) (at 69.85 44.45 0)
      (effects (font (size 1.27 1.27)) hide)
    )
    (pin "1" (uuid 8ce435f5-c7b7-4209-ab1d-087b28fd5571))
    (pin "2" (uuid 2073a7d7-25fa-47eb-9f94-d893df56e29a))
  )

  (symbol (lib_id "power:+12V") (at 101.6 38.1 0) (unit 1)
    (in_bom yes) (on_board yes) (fields_autoplaced)
    (uuid 4530a2a7-434e-490f-a28b-3bab3df2efc4)
    (property "Reference" "#PWR?" (id 0) (at 101.6 41.91 0)
      (effects (font (size 1.27 1.27)) hide)
    )
    (property "Value" "+12V" (id 1) (at 101.6 33.02 0))
    (property "Footprint" "" (id 2) (at 101.6 38.1 0)
      (effects (font (size 1.27 1.27)) hide)
    )
    (property "Datasheet" "" (id 3) (at 101.6 38.1 0)
      (effects (font (size 1.27 1.27)) hide)
    )
    (pin "1" (uuid 387ececa-c07c-4ea4-90ec-475d5b203c80))
  )

  (symbol (lib_id "power:GND") (at 44.45 67.31 0) (unit 1)
    (in_bom yes) (on_board yes) (fields_autoplaced)
    (uuid 6742ee20-f0b4-4317-82bd-589658358317)
    (property "Reference" "#PWR?" (id 0) (at 44.45 73.66 0)
      (effects (font (size 1.27 1.27)) hide)
    )
    (property "Value" "GND" (id 1) (at 44.45 72.39 0))
    (property "Footprint" "" (id 2) (at 44.45 67.31 0)
      (effects (font (size 1.27 1.27)) hide)
    )
    (property "Datasheet" "" (id 3) (at 44.45 67.31 0)
      (effects (font (size 1.27 1.27)) hide)
    )
    (pin "1" (uuid 887ca468-a321-438a-8e5d-4d632f7f5eb6))
  )

  (symbol (lib_id "power:GND") (at 69.85 50.8 0) (unit 1)
    (in_bom yes) (on_board yes) (fields_autoplaced)
    (uuid 81c59578-e6f9-40ab-a716-6d1d470bce4d)
    (property "Reference" "#PWR?" (id 0) (at 69.85 57.15 0)
      (effects (font (size 1.27 1.27)) hide)
    )
    (property "Value" "GND" (id 1) (at 69.85 55.88 0))
    (property "Footprint" "" (id 2) (at 69.85 50.8 0)
      (effects (font (size 1.27 1.27)) hide)
    )
    (property "Datasheet" "" (id 3) (at 69.85 50.8 0)
      (effects (font (size 1.27 1.27)) hide)
    )
    (pin "1" (uuid 6964826f-5bc9-4ef4-a653-76d05cee2f4c))
  )

  (symbol (lib_id "000_PreferredParts:C_10uF_0805") (at 88.9 44.45 0) (unit 1)
    (in_bom yes) (on_board yes) (fields_autoplaced)
    (uuid 86afdb63-009c-4232-90f5-824be801b4be)
    (property "Reference" "C302" (id 0) (at 92.71 41.9099 0)
      (effects (font (size 1.27 1.27)) (justify left))
    )
    (property "Value" "C_10uF_0805" (id 1) (at 89.535 46.99 0)
      (effects (font (size 1.27 1.27)) (justify left) hide)
    )
    (property "Footprint" "Capacitor_SMD:C_0805_2012Metric" (id 2) (at 89.8652 48.26 0)
      (effects (font (size 1.27 1.27)) hide)
    )
    (property "Datasheet" "~" (id 3) (at 88.9 44.45 0)
      (effects (font (size 1.27 1.27)) hide)
    )
    (property "DisplayValue" "10uF" (id 4) (at 92.71 44.4499 0)
      (effects (font (size 1.27 1.27)) (justify left))
    )
    (property "DisplayFootprint" "0805" (id 5) (at 92.71 46.9899 0)
      (effects (font (size 1.27 1.27)) (justify left))
    )
    (property "PartSpecification" "3000-0000000134" (id 6) (at 88.9 44.45 0)
      (effects (font (size 1.27 1.27)) hide)
    )
    (pin "1" (uuid be3c9658-9c47-4b98-8823-49343d4eed58))
    (pin "2" (uuid d0e44d70-4c21-415e-bd1f-4d6fa7d8c9e5))
  )

  (symbol (lib_id "power:+12V") (at 52.07 36.83 0) (unit 1)
    (in_bom yes) (on_board yes) (fields_autoplaced)
    (uuid 9477b77f-160d-4e34-83d4-71d9df3cc884)
    (property "Reference" "#PWR?" (id 0) (at 52.07 40.64 0)
      (effects (font (size 1.27 1.27)) hide)
    )
    (property "Value" "+12V" (id 1) (at 52.07 31.75 0))
    (property "Footprint" "" (id 2) (at 52.07 36.83 0)
      (effects (font (size 1.27 1.27)) hide)
    )
    (property "Datasheet" "" (id 3) (at 52.07 36.83 0)
      (effects (font (size 1.27 1.27)) hide)
    )
    (pin "1" (uuid 6bd7a96f-c5da-473c-a21a-1b758cb4fe12))
  )

  (symbol (lib_id "Device:R") (at 69.85 34.29 0) (unit 1)
    (in_bom yes) (on_board yes) (fields_autoplaced)
    (uuid 9b621a2e-820f-4471-84b7-89d7f32932ba)
    (property "Reference" "R301" (id 0) (at 72.39 33.0199 0)
      (effects (font (size 1.27 1.27)) (justify left))
    )
    (property "Value" "0.47" (id 1) (at 72.39 35.5599 0)
      (effects (font (size 1.27 1.27)) (justify left))
    )
    (property "Footprint" "Resistor_SMD:R_0603_1608Metric" (id 2) (at 68.072 34.29 90)
      (effects (font (size 1.27 1.27)) hide)
    )
    (property "Datasheet" "~" (id 3) (at 69.85 34.29 0)
      (effects (font (size 1.27 1.27)) hide)
    )
    (property "PartSpecification" "3000-0000002008" (id 4) (at 69.85 34.29 0)
      (effects (font (size 1.27 1.27)) hide)
    )
    (pin "1" (uuid 5174c08f-8008-4732-8c1b-3c3185c2d30e))
    (pin "2" (uuid e946d856-ef55-40f1-a9be-e4677e4258d6))
  )

  (symbol (lib_id "power:GND") (at 101.6 50.8 0) (unit 1)
    (in_bom yes) (on_board yes) (fields_autoplaced)
    (uuid c3d92fea-c134-471a-90e1-45d50042f99f)
    (property "Reference" "#PWR?" (id 0) (at 101.6 57.15 0)
      (effects (font (size 1.27 1.27)) hide)
    )
    (property "Value" "GND" (id 1) (at 101.6 55.88 0))
    (property "Footprint" "" (id 2) (at 101.6 50.8 0)
      (effects (font (size 1.27 1.27)) hide)
    )
    (property "Datasheet" "" (id 3) (at 101.6 50.8 0)
      (effects (font (size 1.27 1.27)) hide)
    )
    (pin "1" (uuid 594d11af-38cb-4f4b-8309-80e0aa06324c))
  )

  (symbol (lib_id "Connector:Screw_Terminal_01x02") (at 33.02 64.77 180) (unit 1)
    (in_bom yes) (on_board yes) (fields_autoplaced)
    (uuid c6c6ba25-c9f2-4880-b4ee-1d8340d38ce8)
    (property "Reference" "J301" (id 0) (at 33.02 55.88 0))
    (property "Value" "Screw_Terminal_01x02" (id 1) (at 33.02 58.42 0))
    (property "Footprint" "TerminalBlock:TerminalBlock_bornier-2_P5.08mm" (id 2) (at 33.02 64.77 0)
      (effects (font (size 1.27 1.27)) hide)
    )
    (property "Datasheet" "~" (id 3) (at 33.02 64.77 0)
      (effects (font (size 1.27 1.27)) hide)
    )
    (property "PartSpecification" "3000-0000000184" (id 4) (at 33.02 64.77 0)
      (effects (font (size 1.27 1.27)) hide)
    )
    (pin "1" (uuid 89fee1d6-ee78-452f-8e0e-be2a77ef3e31))
    (pin "2" (uuid 34f98cf3-573d-4d04-aa74-49af3e23928a))
  )

  (symbol (lib_id "power:GND") (at 88.9 50.8 0) (unit 1)
    (in_bom yes) (on_board yes) (fields_autoplaced)
    (uuid dc3337a6-0a42-4fc2-8e5f-8ba03d51b144)
    (property "Reference" "#PWR?" (id 0) (at 88.9 57.15 0)
      (effects (font (size 1.27 1.27)) hide)
    )
    (property "Value" "GND" (id 1) (at 88.9 55.88 0))
    (property "Footprint" "" (id 2) (at 88.9 50.8 0)
      (effects (font (size 1.27 1.27)) hide)
    )
    (property "Datasheet" "" (id 3) (at 88.9 50.8 0)
      (effects (font (size 1.27 1.27)) hide)
    )
    (pin "1" (uuid 11555db3-19c6-4fcd-a1cc-c350b18c0283))
  )

  (symbol (lib_id "power:PWR_FLAG") (at 44.45 38.1 0) (unit 1)
    (in_bom yes) (on_board yes) (fields_autoplaced)
    (uuid ea1cb0f7-4140-42a7-89f5-f9e229a53af9)
    (property "Reference" "#FLG?" (id 0) (at 44.45 36.195 0)
      (effects (font (size 1.27 1.27)) hide)
    )
    (property "Value" "PWR_FLAG" (id 1) (at 44.45 33.02 0))
    (property "Footprint" "" (id 2) (at 44.45 38.1 0)
      (effects (font (size 1.27 1.27)) hide)
    )
    (property "Datasheet" "~" (id 3) (at 44.45 38.1 0)
      (effects (font (size 1.27 1.27)) hide)
    )
    (pin "1" (uuid 466c718a-dc9e-4292-bc30-10e8160b0114))
  )

  (symbol (lib_id "power:+12V") (at 133.35 46.99 0) (unit 1)
    (in_bom yes) (on_board yes) (fields_autoplaced)
    (uuid f0254168-72da-4a4a-a99b-a886a76433e0)
    (property "Reference" "#PWR?" (id 0) (at 133.35 50.8 0)
      (effects (font (size 1.27 1.27)) hide)
    )
    (property "Value" "+12V" (id 1) (at 133.35 41.91 0))
    (property "Footprint" "" (id 2) (at 133.35 46.99 0)
      (effects (font (size 1.27 1.27)) hide)
    )
    (property "Datasheet" "" (id 3) (at 133.35 46.99 0)
      (effects (font (size 1.27 1.27)) hide)
    )
    (pin "1" (uuid 107e45f0-458b-4921-97e0-b26af446d264))
  )

  (symbol (lib_id "power:+12V") (at 69.85 27.94 0) (unit 1)
    (in_bom yes) (on_board yes) (fields_autoplaced)
    (uuid fbacf35f-5f1a-4170-9223-b8a8629b71c5)
    (property "Reference" "#PWR?" (id 0) (at 69.85 31.75 0)
      (effects (font (size 1.27 1.27)) hide)
    )
    (property "Value" "+12V" (id 1) (at 69.85 22.86 0))
    (property "Footprint" "" (id 2) (at 69.85 27.94 0)
      (effects (font (size 1.27 1.27)) hide)
    )
    (property "Datasheet" "" (id 3) (at 69.85 27.94 0)
      (effects (font (size 1.27 1.27)) hide)
    )
    (pin "1" (uuid 634a0bd6-2122-4184-b73f-4de78614c99b))
  )

  (symbol (lib_id "000_PreferredParts:C_10uF_0805") (at 101.6 44.45 0) (unit 1)
    (in_bom yes) (on_board yes) (fields_autoplaced)
    (uuid ff43a495-7615-49f1-a662-d902be11d252)
    (property "Reference" "C303" (id 0) (at 105.41 41.9099 0)
      (effects (font (size 1.27 1.27)) (justify left))
    )
    (property "Value" "C_10uF_0805" (id 1) (at 102.235 46.99 0)
      (effects (font (size 1.27 1.27)) (justify left) hide)
    )
    (property "Footprint" "Capacitor_SMD:C_0805_2012Metric" (id 2) (at 102.5652 48.26 0)
      (effects (font (size 1.27 1.27)) hide)
    )
    (property "Datasheet" "~" (id 3) (at 101.6 44.45 0)
      (effects (font (size 1.27 1.27)) hide)
    )
    (property "DisplayValue" "10uF" (id 4) (at 105.41 44.4499 0)
      (effects (font (size 1.27 1.27)) (justify left))
    )
    (property "DisplayFootprint" "0805" (id 5) (at 105.41 46.9899 0)
      (effects (font (size 1.27 1.27)) (justify left))
    )
    (property "PartSpecification" "3000-0000000134" (id 6) (at 101.6 44.45 0)
      (effects (font (size 1.27 1.27)) hide)
    )
    (pin "1" (uuid 228e1388-48b0-4fd4-b321-88ed3368875c))
    (pin "2" (uuid 0e109aea-deb8-448f-bdfc-e2b54884f3af))
  )
)
