LatticeXP2 132 csBGA Migration Rev 1.0,,,,,,,,,,,
Notes:,,,,,,,,,,,
(LVDS)* - Supports true LVDS. Other differential signals must be emulated with external resistors.,,,,,,,,,,,
,,XP2-5,,,,,XP2-8,,,,
Index,Pin/Ball,Pin/Ball Function,Bank,Dual Function,Differential,DQS,Pin/Ball Function,Bank,Dual Function,Differential,DQS
1,A1,PT8A,0,ULC_GPLLT_IN_A,T,,PT3A,0,ULC_GPLLT_IN_A,T,
2,A2,PT7A,0,VREF1_0,T,,PT2A,0,VREF1_0,T,
3,A3,PT7B,0,VREF2_0,C,,PT2B,0,VREF2_0,C,
4,A4,ULC_VCCPLL,-,,,,ULC_VCCPLL,-,,,
5,A5,PT9B,0,ULC_GPLLC_FB_A,C,,PT4B,0,ULC_GPLLC_FB_A,C,
6,A6,PT15A,0,,T,TDQS15,PT15A,0,,T,TDQS15
7,A7,PT15B,0,,C,TDQ15,PT15B,0,,C,TDQ15
8,A8,PT17A,0,,T,TDQ15,PT17A,0,,T,TDQ15
9,A9,PT18A,0,,T,TDQ15,PT18A,0,,T,TDQ15
10,A10,PT19B,0,PCLKC0_0,C,TDQ15,PT19B,0,PCLKC0_0,C,TDQ15
11,A11,PT20A,1,PCLKT1_0,T,,PT20A,1,PCLKT1_0,T,
12,A12,VCCIO1,1,,,,VCCIO1,1,,,
13,A13,PT28B,1,VREF2_1,C,,PT32B,1,VREF2_1,C,
14,A14,PR2A,2,VREF1_2,T,,PR2A,2,VREF1_2,T,
15,B1,PL2A,7,VREF1_7,T,,PL2A,7,VREF1_7,T,
16,B2,PL2B,7,VREF2_7,C,,PL2B,7,VREF2_7,C,
17,B3,PT8B,0,ULC_GPLLC_IN_A,C,,PT3B,0,ULC_GPLLC_IN_A,C,
18,B4,ULC_GNDPLL,-,,,,ULC_GNDPLL,-,,,
19,B5,VCCIO0,0,,,,VCCIO0,0,,,
20,B6,PT14A,0,,T,TDQ15,PT14A,0,,T,TDQ15
21,B7,VCCIO0,0,,,,VCCIO0,0,,,
22,B8,GNDIO0,-,,,,GNDIO0,-,,,
23,B9,PT17B,0,,C,TDQ15,PT17B,0,,C,TDQ15
24,B10,PT19A,0,PCLKT0_0,T,TDQ15,PT19A,0,PCLKT0_0,T,TDQ15
25,B11,VCC,-,,,,VCC,-,,,
26,B12,PT20B,1,PCLKC1_0,C,,PT20B,1,PCLKC1_0,C,
27,B13,PT28A,1,VREF1_1,T,,PT32A,1,VREF1_1,T,
28,B14,PR2B,2,VREF2_2,C,,PR2B,2,VREF2_2,C,
29,C1,GNDIO7,-,,,,GNDIO7,-,,,
30,C2,PL6A,7,PROGRAMN,T,LDQ9,PL10A,7,PROGRAMN,T,LDQ13
31,C3,VCCIO7,7,,,,VCCIO7,7,,,
32,C4,VCC,-,,,,VCC,-,,,
33,C5,PT9A,0,ULC_GPLLT_FB_A,T,,PT4A,0,ULC_GPLLT_FB_A,T,
34,C6,GNDIO0,-,,,,GNDIO0,-,,,
35,C7,PT14B,0,,C,TDQ15,PT14B,0,,C,TDQ15
36,C8,PT16A,0,,T,TDQ15,PT16A,0,,T,TDQ15
37,C9,PT16B,0,,C,TDQ15,PT16B,0,,C,TDQ15
38,C10,PT18B,0,,C,TDQ15,PT18B,0,,C,TDQ15
39,C11,VCCAUX,-,,,,VCCAUX,-,,,
40,C12,GNDIO1,-,,,,GNDIO1,-,,,
41,C13,GNDIO2,-,,,,GNDIO2,-,,,
42,C14,VCCIO2,2,,,,VCCIO2,2,,,
43,D1,PL7A,7,CFG1,T(LVDS)*,LDQ9,PL11A,7,CFG1,T(LVDS)*,LDQ13
44,D2,PL8A,7,CSSPISN,T,LDQ9,PL12A,7,CSSPISN,T,LDQ13
45,D3,PL6B,7,DONE,C,LDQ9,PL10B,7,DONE,C,LDQ13
46,D12,PR6A,2,,T,RDQ9,PR10A,2,,T,RDQ13
47,D13,PR6B,2,,C,RDQ9,PR10B,2,,C,RDQ13
48,D14,PR7A,2,,T(LVDS)*,RDQ9,PR11A,2,,T(LVDS)*,RDQ13
49,E1,PL7B,7,,C(LVDS)*,LDQ9,PL11B,7,,C(LVDS)*,LDQ13
50,E2,GNDIO7,-,,,,GNDIO7,-,,,
51,E3,PL8B,7,CSSPIN,C,LDQ9,PL12B,7,CSSPIN,C,LDQ13
52,E12,PR8A,2,,T,RDQ9,PR12A,2,,T,RDQ13
53,E13,GNDIO2,-,,,,GNDIO2,-,,,
54,E14,PR7B,2,,C(LVDS)*,RDQ9,PR11B,2,,C(LVDS)*,RDQ13
55,F1,PL9A,7,,T(LVDS)*,LDQS9,PL13A,7,,T(LVDS)*,LDQS13
56,F2,VCCIO7,7,,,,VCCIO7,7,,,
57,F3,PL10A,7,CCLK,T,LDQ9,PL14A,7,CCLK,T,LDQ13
58,F12,PR8B,2,,C,RDQ9,PR12B,2,,C,RDQ13
59,F13,VCCIO2,2,,,,VCCIO2,2,,,
60,F14,PR9A,2,,T(LVDS)*,RDQS9,PR13A,2,,T(LVDS)*,RDQS13
61,G1,PL9B,7,,C(LVDS)*,LDQ9,PL13B,7,,C(LVDS)*,LDQ13
62,G2,PL10B,7,SOSPI,C,LDQ9,PL14B,7,SOSPI,C,LDQ13
63,G3,PL11B,7,INITN,C(LVDS)*,LDQ9,PL15B,7,INITN,C(LVDS)*,LDQ13
64,G12,PR10A,2,,T,RDQ9,PR14A,2,,T,RDQ13
65,G13,PR10B,2,,C,RDQ9,PR14B,2,,C,RDQ13
66,G14,PR9B,2,,C(LVDS)*,RDQ9,PR13B,2,,C(LVDS)*,RDQ13
67,H1,PL12A,7,PCLKT7_0,T,LDQ9,PL16A,7,PCLKT7_0,T,LDQ13
68,H2,PL11A,7,SISPI,T(LVDS)*,LDQ9,PL15A,7,SISPI,T(LVDS)*,LDQ13
69,H3,PL12B,7,PCLKC7_0,C,LDQ9,PL16B,7,PCLKC7_0,C,LDQ13
70,H12,PR11B,2,,C(LVDS)*,RDQ9,PR15B,2,,C(LVDS)*,RDQ13
71,H13,PR11A,2,,T(LVDS)*,RDQ9,PR15A,2,,T(LVDS)*,RDQ13
72,H14,PR12A,2,PCLKT2_0,T,RDQ9,PR16A,2,PCLKT2_0,T,RDQ13
73,J1,GND,-,,,,GND,-,,,
74,J2,VCCAUX,-,,,,VCCAUX,-,,,
75,J3,VCC,-,,,,VCC,-,,,
76,J12,PR12B,2,PCLKC2_0,C,RDQ9,PR16B,2,PCLKC2_0,C,RDQ13
77,J13,VCC,-,,,,VCC,-,,,
78,J14,VCCAUX,-,,,,VCCAUX,-,,,
79,K1,CFG0,-,,,,CFG0,-,,,
80,K2,TOE,-,,,,TOE,-,,,
81,K3,PL15A,6,,T,,PL19A,6,,T,
82,K12,VCCJ,8,,,,VCCJ,8,,,
83,K13,TDO,8,,,,TDO,8,,,
84,K14,TCK,8,,,,TCK,8,,,
85,L1,PL14A,6,PCLKT6_0,T(LVDS)*,,PL18A,6,PCLKT6_0,T(LVDS)*,
86,L2,PL15B,6,,C,,PL19B,6,,C,
87,L3,PL14B,6,PCLKC6_0,C(LVDS)*,,PL18B,6,PCLKC6_0,C(LVDS)*,
88,L12,TMS,8,,,,TMS,8,,,
89,L13,TDI,8,,,,TDI,8,,,
90,L14,PR14A,3,PCLKT3_0,T(LVDS)*,,PR18A,3,PCLKT3_0,T(LVDS)*,
91,M1,VCCIO6,6,,,,VCCIO6,6,,,
92,M2,GNDIO6,-,,,,GNDIO6,-,,,
93,M3,VCCIO5,5,,,,VCCIO5,5,,,
94,M4,PB15B,5,,C,BDQ15,PB15B,5,,C,BDQ15
95,M5,PB16B,5,,C,BDQ15,PB16B,5,,C,BDQ15
96,M6,PB17B,5,,C,BDQ15,PB17B,5,,C,BDQ15
97,M7,PB18B,5,,C,BDQ15,PB18B,5,,C,BDQ15
98,M8,VCCAUX,-,,,,VCCAUX,-,,,
99,M9,VCCIO4,4,,,,VCCIO4,4,,,
100,M10,PB26B,4,LRC_GPLLC_IN_A,C,,PB30B,4,LRC_GPLLC_IN_A,C,
101,M11,LRC_GNDPLL,-,,,,LRC_GNDPLL,-,,,
102,M12,VCCIO3,3,,,,VCCIO3,3,,,
103,M13,PR14B,3,PCLKC3_0,C(LVDS)*,,PR18B,3,PCLKC3_0,C(LVDS)*,
104,M14,GNDIO3,-,,,,GNDIO3,-,,,
105,N1,PL25A,6,VREF1_6,T,,PL32A,6,VREF1_6,T,
106,N2,PB7B,5,VREF2_5,C,,PB2B,5,VREF2_5,C,
107,N3,PB15A,5,,T,BDQS15,PB15A,5,,T,BDQS15
108,N4,PB14B,5,,C,BDQ15,PB14B,5,,C,BDQ15
109,N5,VCCIO5,5,,,,VCCIO5,5,,,
110,N6,GNDIO5,-,,,,GNDIO5,-,,,
111,N7,PB19A,5,PCLKT5_0,T,BDQ15,PB19A,5,PCLKT5_0,T,BDQ15
112,N8,PB19B,5,PCLKC5_0,C,BDQ15,PB19B,5,PCLKC5_0,C,BDQ15
113,N9,PB20B,4,PCLKC4_0,C,,PB20B,4,PCLKC4_0,C,
114,N10,GNDIO4,-,,,,GNDIO4,-,,,
115,N11,VCC,-,,,,VCC,-,,,
116,N12,PB28A,4,VREF1_4,T,,PB32A,4,VREF1_4,T,
117,N13,PR24B,3,VREF2_3,C,,PR30B,3,VREF2_3,C,
118,N14,PR24A,3,VREF1_3,T,,PR30A,3,VREF1_3,T,
119,P1,PL25B,6,VREF2_6,C,,PL32B,6,VREF2_6,C,
120,P2,PB7A,5,VREF1_5,T,,PB2A,5,VREF1_5,T,
121,P3,GNDIO5,-,,,,GNDIO5,-,,,
122,P4,PB14A,5,,T,BDQ15,PB14A,5,,T,BDQ15
123,P5,PB16A,5,,T,BDQ15,PB16A,5,,T,BDQ15
124,P6,PB17A,5,,T,BDQ15,PB17A,5,,T,BDQ15
125,P7,PB18A,5,,T,BDQ15,PB18A,5,,T,BDQ15
126,P8,VCC,-,,,,VCC,-,,,
127,P9,PB20A,4,PCLKT4_0,T,,PB20A,4,PCLKT4_0,T,
128,P10,PB26A,4,LRC_GPLLT_IN_A,T,,PB30A,4,LRC_GPLLT_IN_A,T,
129,P11,LRC_VCCPLL,-,,,,LRC_VCCPLL,-,,,
130,P12,PB27A,4,LRC_GPLLT_FB_A,T,,PB31A,4,LRC_GPLLT_FB_A,T,
131,P13,PB27B,4,LRC_GPLLC_FB_A,C,,PB31B,4,LRC_GPLLC_FB_A,C,
132,P14,PB28B,4,VREF2_4,C,,PB32B,4,VREF2_4,C,
