{
    "": "Vdev or sim support. Enable `\"mode\": \"af_xdp\"` to enable AF_XDP mode, or `\"mode\": \"af_packet\"` to enable AF_PACKET mode, `\"mode\": \"sim\"` to generate synthetic traffic from BESS's Source module or \"mode\": \"\" when running with UP4",
    "": "mode: af_xdp",
    "": "mode: af_packet",
    "": "mode: sim",
    "mode": "",

    "table_sizes": {
        "": "Example sizes based on sim mode and 50K sessions. Customize as per your control plane",
        "": "50K per unique tuple, we send 4 unique PDR patterns",
        "pdrLookup": 50000,
        "": "4 PDRs per session",
        "flowMeasure": 200000,
        "": "there are 2 QERs and 2 entries per QER",
        "appQERLookup": 200000,
        "": "there is 1 session QER and 2 entries per session QER",
        "sessionQERLookup": 100000,
        "": "there are 3 FARs",
        "farLookup": 150000
    },

    "": "Set the log level to one of \"panic\", \"fatal\", \"error\", \"warning\", \"info\", \"debug\", \"trace\"",
    "log_level": "debug",

    "": "Use the sim block to enable simulation using either Source module or via il_trafficgen",
    "sim": {
        "": "At this point we can simulate either N3/N6 or N3/N9 traffic, so choose n6 or n9 below",
        "core": "n6",
        "max_sessions": 50000,
        "start_ue_ip": "16.0.0.1",
        "start_enb_ip": "11.1.1.129",
        "start_aupf_ip": "13.1.1.199",
        "n6_app_ip": "6.6.6.6",
        "n9_app_ip": "9.9.9.9",
        "start_n3_teid": "0x30000000",
        "start_n9_teid": "0x90000000",
        "pkt_size": 128,
        "total_flows": 5000
    },

    "": "max IP frag table entries (for IPv4 reassembly). Update the line below to `\"max_ip_defrag_flows\": 1000` to enable",
    "": "max_ip_defrag_flows: 1000",

    "": "Update the line below to `\"ip_frag_with_eth_mtu\": 1518` to enable",
    "": "ip_frag_with_eth_mtu: 1518",

    "": "Enable hardware offload of checksum. Might disable vector PMD",
    "hwcksum": false,

    "": "Enable PDU Session Container extension",
    "gtppsc": true,

    "": "Enable Intel Dynamic Device Personalization (DDP)",
    "ddp": false,

    "": "Telemetrics-See this link for details: https://github.com/NetSys/bess/blob/master/bessctl/module_tests/timestamp.py",
    "measure_upf": true,

    "": "Whether to enable flow measurement feature",
    "measure_flow": false,

    "": "Gateway interfaces",
    "access": {
        "ifname": "ens803f2"
    },

    "": "UE IP Natting. Update the line below to `\"ip_masquerade\": \"<ip> [or <ip>]\"` to enable",
    "core": {
        "ifname": "ens803f3",
        "": "ip_masquerade: 18.0.0.1 or 18.0.0.2 or 18.0.0.3"
    },

    "": "Number of worker threads. Default: 1",
    "workers": 1,

    "": "Parameters for handling outgoing requests",
    "max_req_retries": 5,
    "resp_timeout": "2s",

    "": "Whether to enable Network Token Functions",
    "enable_ntf": false,

    "": "Whether to enable End Marker Support",
    "": "enable_end_marker: false",

    "": "Whether to enable Notify BESS feature",
    "": "enable_notify_bess: false",

    "": "Whether to enable P4Runtime feature",
    "enable_p4rt": true,
    "" : "conn_timeout: 1000",
    "" : "read_timeout: 25",
    "" : "notify_sockaddr: /tmp/notifycp",
    "" : "endmarker_sockaddr: /tmp/pfcpport",

    "": "Whether to enable UPF HeartBeatTimer feature",
    "enable_hbTimer": false,
    "": "heart_beat_interval: 5s",

    "qci_qos_config": [
        {
            "": "Default values for QERs with QCI/QFI not listed below",
            "qci": 0,
            "cbs": 50000,
            "ebs": 50000,
            "pbs": 50000,
            "burst_duration_ms": 10,
            "priority": 7
        },
        {
            "qci": 9,
            "cbs": 2048,
            "ebs": 2048,
            "pbs": 2048,
            "priority": 6
        },
        {
            "qci": 8,
            "cbs": 2048,
            "ebs": 2048,
            "pbs": 2048,
            "priority": 5
        }
    ],

    "": "Optional slice-wide meter rate limits",
    "slice_rate_limit_config": {
        "": "uplink policer",
        "n6_bps": 500000000,
        "n6_burst_bytes": 625000,
        "": "downlink policer",
        "n3_bps": 500000000,
        "n3_burst_bytes": 625000
    },

    "": "Control plane controller settings",
    "cpiface": {
        "peers": ["172.21.6.42"],
        "dnn": "internet",
        "http_port": "8080",
        "enable_ue_ip_alloc": false,
        "ue_ip_pool": "12.2.1.0/24",
        "" : "use_fqdn: true",
        "" : "hostname: upf-0"
    },

    "": "p4rtc interface settings",
    "p4rtciface": {
        "": "Set the UP4 slice identifier that this PFCP Agent instance belongs to. Default: 0",
        "slice_id": 0,

        "access_ip": "172.21.23.12/32",
        "p4rtc_server": "172.21.16.102",
        "p4rtc_port": "51001",
        "": "Default TC is ELASTIC",
        "default_tc": 3,
        "": "Whether to wipe out PFCP state from UP4 datapath on UP4 restart. Default: false",
        "clear_state_on_restart": false
    }
}
