{
	"apps": {
		"org.omecproject.up4": {
			"up4": {
				"devices": [
					"device:leaf4"
				],
				"n3Addr": "172.21.23.12",
				"uePools": [
					"12.2.1.0/24"
				],
				"sliceId": 0,
				"pscEncapEnabled": true
			}
		}
	}
}
